1. 0.01 s $ /nix/store/9ypz3flqsrl5xl495mm8h645gadjsxi1-coreutils-9.11/bin/timeout --kill-after=15s 7200s /nix/store/23zk8sgzamrbmj1fday15szf7f2279s8-nix-2.34.7/bin/nix --extra-experimental-features nix-command --extra-experimental-features flakes flake clone git+https://github.com/alphal00p/gammaloop --dest /tmp/nix-ci-worker/stable-pwd/repo/
  2. 0.33 s Cloning into '/tmp/nix-ci-worker/stable-pwd/repo'...
  3. 1.25 s remote: Enumerating objects: 84275, done.
  4. 1.47 s remote: Counting objects: 0% (1/8564) remote: Counting objects: 1% (86/8564) remote: Counting objects: 2% (172/8564) remote: Counting objects: 3% (257/8564) remote: Counting objects: 4% (343/8564) remote: Counting objects: 5% (429/8564) remote: Counting objects: 6% (514/8564) remote: Counting objects: 7% (600/8564) remote: Counting objects: 8% (686/8564) remote: Counting objects: 9% (771/8564) remote: Counting objects: 10% (857/8564) remote: Counting objects: 11% (943/8564) remote: Counting objects: 12% (1028/8564) remote: Counting objects: 13% (1114/8564) remote: Counting objects: 14% (1199/8564) remote: Counting objects: 15% (1285/8564) remote: Counting objects: 16% (1371/8564) remote: Counting objects: 17% (1456/8564) remote: Counting objects: 18% (1542/8564) remote: Counting objects: 19% (1628/8564) remote: Counting objects: 20% (1713/8564) remote: Counting objects: 21% (1799/8564) remote: Counting objects: 22% (1885/8564) remote: Counting objects: 23% (1970/8564) remote: Counting objects: 24% (2056/8564) remote: Counting objects: 25% (2141/8564) remote: Counting objects: 26% (2227/8564) remote: Counting objects: 27% (2313/8564) remote: Counting objects: 28% (2398/8564) remote: Counting objects: 29% (2484/8564) remote: Counting objects: 30% (2570/8564) remote: Counting objects: 31% (2655/8564) remote: Counting objects: 32% (2741/8564) remote: Counting objects: 33% (2827/8564) remote: Counting objects: 34% (2912/8564) remote: Counting objects: 35% (2998/8564) remote: Counting objects: 36% (3084/8564) remote: Counting objects: 37% (3169/8564) remote: Counting objects: 38% (3255/8564) remote: Counting objects: 39% (3340/8564) remote: Counting objects: 40% (3426/8564) remote: Counting objects: 41% (3512/8564) remote: Counting objects: 42% (3597/8564) remote: Counting objects: 43% (3683/8564) remote: Counting objects: 44% (3769/8564) remote: Counting objects: 45% (3854/8564) remote: Counting objects: 46% (3940/8564) remote: Counting objects: 47% (4026/8564) remote: Counting objects: 48% (4111/8564) remote: Counting objects: 49% (4197/8564) remote: Counting objects: 50% (4282/8564) remote: Counting objects: 51% (4368/8564) remote: Counting objects: 52% (4454/8564) remote: Counting objects: 53% (4539/8564) remote: Counting objects: 54% (4625/8564) remote: Counting objects: 55% (4711/8564) remote: Counting objects: 56% (4796/8564) remote: Counting objects: 57% (4882/8564) remote: Counting objects: 58% (4968/8564) remote: Counting objects: 59% (5053/8564) remote: Counting objects: 60% (5139/8564) remote: Counting objects: 61% (5225/8564) remote: Counting objects: 62% (5310/8564) remote: Counting objects: 63% (5396/8564) remote: Counting objects: 64% (5481/8564) remote: Counting objects: 65% (5567/8564) remote: Counting objects: 66% (5653/8564) remote: Counting objects: 67% (5738/8564) remote: Counting objects: 68% (5824/8564) remote: Counting objects: 69% (5910/8564) remote: Counting objects: 70% (5995/8564) remote: Counting objects: 71% (6081/8564) remote: Counting objects: 72% (6167/8564) remote: Counting objects: 73% (6252/8564) remote: Counting objects: 74% (6338/8564) remote: Counting objects: 75% (6423/8564) remote: Counting objects: 76% (6509/8564) remote: Counting objects: 77% (6595/8564) remote: Counting objects: 78% (6680/8564) remote: Counting objects: 79% (6766/8564) remote: Counting objects: 80% (6852/8564) remote: Counting objects: 81% (6937/8564) remote: Counting objects: 82% (7023/8564) remote: Counting objects: 83% (7109/8564) remote: Counting objects: 84% (7194/8564) remote: Counting objects: 85% (7280/8564) remote: Counting objects: 86% (7366/8564) remote: Counting objects: 87% (7451/8564) remote: Counting objects: 88% (7537/8564) remote: Counting objects: 89% (7622/8564) remote: Counting objects: 90% (7708/8564) remote: Counting objects: 91% (7794/8564) remote: Counting objects: 92% (7879/8564) remote: Counting objects: 93% (7965/8564) remote: Counting objects: 94% (8051/8564) remote: Counting objects: 95% (8136/8564) remote: Counting objects: 96% (8222/8564) remote: Counting objects: 97% (8308/8564) remote: Counting objects: 98% (8393/8564) remote: Counting objects: 99% (8479/8564) remote: Counting objects: 100% (8564/8564) remote: Counting objects: 100% (8564/8564), done.
  5. 3.09 s remote: Compressing objects: 0% (1/1729) remote: Compressing objects: 1% (18/1729) remote: Compressing objects: 2% (35/1729) remote: Compressing objects: 3% (52/1729) remote: Compressing objects: 4% (70/1729) remote: Compressing objects: 5% (87/1729) remote: Compressing objects: 6% (104/1729) remote: Compressing objects: 7% (122/1729) remote: Compressing objects: 8% (139/1729) remote: Compressing objects: 9% (156/1729) remote: Compressing objects: 10% (173/1729) remote: Compressing objects: 11% (191/1729) remote: Compressing objects: 12% (208/1729) remote: Compressing objects: 13% (225/1729) remote: Compressing objects: 14% (243/1729) remote: Compressing objects: 15% (260/1729) remote: Compressing objects: 16% (277/1729) remote: Compressing objects: 17% (294/1729) remote: Compressing objects: 18% (312/1729) remote: Compressing objects: 19% (329/1729) remote: Compressing objects: 20% (346/1729) remote: Compressing objects: 21% (364/1729) remote: Compressing objects: 22% (381/1729) remote: Compressing objects: 23% (398/1729) remote: Compressing objects: 24% (415/1729) remote: Compressing objects: 25% (433/1729) remote: Compressing objects: 26% (450/1729) remote: Compressing objects: 27% (467/1729) remote: Compressing objects: 28% (485/1729) remote: Compressing objects: 29% (502/1729) remote: Compressing objects: 30% (519/1729) remote: Compressing objects: 31% (536/1729) remote: Compressing objects: 32% (554/1729) remote: Compressing objects: 33% (571/1729) remote: Compressing objects: 34% (588/1729) remote: Compressing objects: 35% (606/1729) remote: Compressing objects: 36% (623/1729) remote: Compressing objects: 37% (640/1729) remote: Compressing objects: 38% (658/1729) remote: Compressing objects: 39% (675/1729) remote: Compressing objects: 40% (692/1729) remote: Compressing objects: 41% (709/1729) remote: Compressing objects: 42% (727/1729) remote: Compressing objects: 43% (744/1729) remote: Compressing objects: 44% (761/1729) remote: Compressing objects: 45% (779/1729) remote: Compressing objects: 46% (796/1729) remote: Compressing objects: 47% (813/1729) remote: Compressing objects: 48% (830/1729) remote: Compressing objects: 49% (848/1729) remote: Compressing objects: 50% (865/1729) remote: Compressing objects: 51% (882/1729) remote: Compressing objects: 52% (900/1729) remote: Compressing objects: 53% (917/1729) remote: Compressing objects: 54% (934/1729) remote: Compressing objects: 55% (951/1729) remote: Compressing objects: 56% (969/1729) remote: Compressing objects: 57% (986/1729) remote: Compressing objects: 58% (1003/1729) remote: Compressing objects: 59% (1021/1729) remote: Compressing objects: 60% (1038/1729) remote: Compressing objects: 61% (1055/1729) remote: Compressing objects: 62% (1072/1729) remote: Compressing objects: 63% (1090/1729) remote: Compressing objects: 64% (1107/1729) remote: Compressing objects: 65% (1124/1729) remote: Compressing objects: 66% (1142/1729) remote: Compressing objects: 67% (1159/1729) remote: Compressing objects: 68% (1176/1729) remote: Compressing objects: 69% (1194/1729) remote: Compressing objects: 70% (1211/1729) remote: Compressing objects: 71% (1228/1729) remote: Compressing objects: 72% (1245/1729) remote: Compressing objects: 73% (1263/1729) remote: Compressing objects: 74% (1280/1729) remote: Compressing objects: 75% (1297/1729) remote: Compressing objects: 76% (1315/1729) remote: Compressing objects: 77% (1332/1729) remote: Compressing objects: 78% (1349/1729) remote: Compressing objects: 79% (1366/1729) remote: Compressing objects: 80% (1384/1729) remote: Compressing objects: 81% (1401/1729) remote: Compressing objects: 82% (1418/1729) remote: Compressing objects: 83% (1436/1729) remote: Compressing objects: 84% (1453/1729) remote: Compressing objects: 85% (1470/1729) remote: Compressing objects: 86% (1487/1729) remote: Compressing objects: 87% (1505/1729) remote: Compressing objects: 88% (1522/1729) remote: Compressing objects: 89% (1539/1729) remote: Compressing objects: 90% (1557/1729) remote: Compressing objects: 91% (1574/1729) remote: Compressing objects: 92% (1591/1729) remote: Compressing objects: 93% (1608/1729) remote: Compressing objects: 94% (1626/1729) remote: Compressing objects: 95% (1643/1729) remote: Compressing objects: 96% (1660/1729) remote: Compressing objects: 97% (1678/1729) remote: Compressing objects: 98% (1695/1729) remote: Compressing objects: 99% (1712/1729) remote: Compressing objects: 100% (1729/1729) remote: Compressing objects: 100% (1729/1729), done.
  6. 7.74 s Receiving objects: 0% (1/84275) Receiving objects: 1% (843/84275) Receiving objects: 2% (1686/84275) Receiving objects: 3% (2529/84275) Receiving objects: 4% (3371/84275) Receiving objects: 5% (4214/84275) Receiving objects: 6% (5057/84275) Receiving objects: 7% (5900/84275) Receiving objects: 8% (6742/84275) Receiving objects: 9% (7585/84275), 10.21 MiB | 20.40 MiB/s Receiving objects: 10% (8428/84275), 10.21 MiB | 20.40 MiB/s Receiving objects: 11% (9271/84275), 10.21 MiB | 20.40 MiB/s Receiving objects: 12% (10113/84275), 10.21 MiB | 20.40 MiB/s Receiving objects: 13% (10956/84275), 10.21 MiB | 20.40 MiB/s Receiving objects: 14% (11799/84275), 10.21 MiB | 20.40 MiB/s Receiving objects: 15% (12642/84275), 10.21 MiB | 20.40 MiB/s Receiving objects: 16% (13484/84275), 10.21 MiB | 20.40 MiB/s Receiving objects: 17% (14327/84275), 10.21 MiB | 20.40 MiB/s Receiving objects: 18% (15170/84275), 10.21 MiB | 20.40 MiB/s Receiving objects: 19% (16013/84275), 10.21 MiB | 20.40 MiB/s Receiving objects: 20% (16855/84275), 10.21 MiB | 20.40 MiB/s Receiving objects: 21% (17698/84275), 10.21 MiB | 20.40 MiB/s Receiving objects: 22% (18541/84275), 10.21 MiB | 20.40 MiB/s Receiving objects: 23% (19384/84275), 10.21 MiB | 20.40 MiB/s Receiving objects: 24% (20226/84275), 10.21 MiB | 20.40 MiB/s Receiving objects: 25% (21069/84275), 10.21 MiB | 20.40 MiB/s Receiving objects: 26% (21912/84275), 10.21 MiB | 20.40 MiB/s Receiving objects: 27% (22755/84275), 10.21 MiB | 20.40 MiB/s Receiving objects: 28% (23597/84275), 10.21 MiB | 20.40 MiB/s Receiving objects: 29% (24440/84275), 10.21 MiB | 20.40 MiB/s Receiving objects: 30% (25283/84275), 10.21 MiB | 20.40 MiB/s Receiving objects: 31% (26126/84275), 10.21 MiB | 20.40 MiB/s Receiving objects: 32% (26968/84275), 10.21 MiB | 20.40 MiB/s Receiving objects: 33% (27811/84275), 10.21 MiB | 20.40 MiB/s Receiving objects: 34% (28654/84275), 10.21 MiB | 20.40 MiB/s Receiving objects: 35% (29497/84275), 10.21 MiB | 20.40 MiB/s Receiving objects: 36% (30339/84275), 10.21 MiB | 20.40 MiB/s Receiving objects: 37% (31182/84275), 10.21 MiB | 20.40 MiB/s Receiving objects: 38% (32025/84275), 10.21 MiB | 20.40 MiB/s Receiving objects: 38% (32648/84275), 30.09 MiB | 30.08 MiB/s Receiving objects: 39% (32868/84275), 30.09 MiB | 30.08 MiB/s Receiving objects: 40% (33710/84275), 30.09 MiB | 30.08 MiB/s Receiving objects: 41% (34553/84275), 30.09 MiB | 30.08 MiB/s Receiving objects: 42% (35396/84275), 30.09 MiB | 30.08 MiB/s Receiving objects: 43% (36239/84275), 30.09 MiB | 30.08 MiB/s Receiving objects: 44% (37081/84275), 30.09 MiB | 30.08 MiB/s Receiving objects: 45% (37924/84275), 30.09 MiB | 30.08 MiB/s Receiving objects: 46% (38767/84275), 30.09 MiB | 30.08 MiB/s Receiving objects: 47% (39610/84275), 30.09 MiB | 30.08 MiB/s Receiving objects: 48% (40452/84275), 46.82 MiB | 31.21 MiB/s Receiving objects: 49% (41295/84275), 46.82 MiB | 31.21 MiB/s Receiving objects: 50% (42138/84275), 46.82 MiB | 31.21 MiB/s Receiving objects: 51% (42981/84275), 46.82 MiB | 31.21 MiB/s Receiving objects: 52% (43823/84275), 46.82 MiB | 31.21 MiB/s Receiving objects: 53% (44666/84275), 46.82 MiB | 31.21 MiB/s Receiving objects: 54% (45509/84275), 46.82 MiB | 31.21 MiB/s Receiving objects: 55% (46352/84275), 46.82 MiB | 31.21 MiB/s Receiving objects: 56% (47194/84275), 46.82 MiB | 31.21 MiB/s Receiving objects: 57% (48037/84275), 46.82 MiB | 31.21 MiB/s Receiving objects: 57% (48754/84275), 63.30 MiB | 31.65 MiB/s Receiving objects: 58% (48880/84275), 63.30 MiB | 31.65 MiB/s Receiving objects: 59% (49723/84275), 63.30 MiB | 31.65 MiB/s Receiving objects: 60% (50565/84275), 63.30 MiB | 31.65 MiB/s Receiving objects: 61% (51408/84275), 63.30 MiB | 31.65 MiB/s Receiving objects: 62% (52251/84275), 63.30 MiB | 31.65 MiB/s Receiving objects: 63% (53094/84275), 63.30 MiB | 31.65 MiB/s Receiving objects: 64% (53936/84275), 63.30 MiB | 31.65 MiB/s Receiving objects: 65% (54779/84275), 63.30 MiB | 31.65 MiB/s Receiving objects: 66% (55622/84275), 80.90 MiB | 32.34 MiB/s Receiving objects: 67% (56465/84275), 80.90 MiB | 32.34 MiB/s Receiving objects: 68% (57307/84275), 80.90 MiB | 32.34 MiB/s Receiving objects: 68% (57371/84275), 97.63 MiB | 32.53 MiB/s Receiving objects: 69% (58150/84275), 97.63 MiB | 32.53 MiB/s Receiving objects: 70% (58993/84275), 97.63 MiB | 32.53 MiB/s Receiving objects: 71% (59836/84275), 97.63 MiB | 32.53 MiB/s Receiving objects: 72% (60678/84275), 97.63 MiB | 32.53 MiB/s Receiving objects: 73% (61521/84275), 97.63 MiB | 32.53 MiB/s Receiving objects: 74% (62364/84275), 114.79 MiB | 32.78 MiB/s Receiving objects: 75% (63207/84275), 114.79 MiB | 32.78 MiB/s Receiving objects: 76% (64049/84275), 114.79 MiB | 32.78 MiB/s Receiving objects: 77% (64892/84275), 114.79 MiB | 32.78 MiB/s Receiving objects: 77% (65597/84275), 132.18 MiB | 32.94 MiB/s Receiving objects: 78% (65735/84275), 132.18 MiB | 32.94 MiB/s Receiving objects: 79% (66578/84275), 132.18 MiB | 32.94 MiB/s Receiving objects: 80% (67420/84275), 132.18 MiB | 32.94 MiB/s Receiving objects: 81% (68263/84275), 132.18 MiB | 32.94 MiB/s Receiving objects: 82% (69106/84275), 132.18 MiB | 32.94 MiB/s Receiving objects: 83% (69949/84275), 132.18 MiB | 32.94 MiB/s Receiving objects: 84% (70791/84275), 132.18 MiB | 32.94 MiB/s Receiving objects: 85% (71634/84275), 132.18 MiB | 32.94 MiB/s Receiving objects: 86% (72477/84275), 132.18 MiB | 32.94 MiB/s Receiving objects: 87% (73320/84275), 132.18 MiB | 32.94 MiB/s Receiving objects: 88% (74162/84275), 132.18 MiB | 32.94 MiB/s Receiving objects: 89% (75005/84275), 132.18 MiB | 32.94 MiB/s Receiving objects: 90% (75848/84275), 132.18 MiB | 32.94 MiB/s Receiving objects: 91% (76691/84275), 132.18 MiB | 32.94 MiB/s Receiving objects: 92% (77533/84275), 132.18 MiB | 32.94 MiB/s Receiving objects: 93% (78376/84275), 132.18 MiB | 32.94 MiB/s Receiving objects: 94% (79219/84275), 132.18 MiB | 32.94 MiB/s Receiving objects: 95% (80062/84275), 148.68 MiB | 32.94 MiB/s Receiving objects: 96% (80904/84275), 148.68 MiB | 32.94 MiB/s Receiving objects: 97% (81747/84275), 148.68 MiB | 32.94 MiB/s Receiving objects: 98% (82590/84275), 148.68 MiB | 32.94 MiB/s Receiving objects: 99% (83433/84275), 148.68 MiB | 32.94 MiB/s remote: Total 84275 (delta 7443), reused 6856 (delta 6833), pack-reused 75711 (from 2)
  7. 7.74 s Receiving objects: 100% (84275/84275), 148.68 MiB | 32.94 MiB/s Receiving objects: 100% (84275/84275), 153.42 MiB | 33.01 MiB/s, done.
  8. 8.90 s Resolving deltas: 0% (0/57012) Resolving deltas: 1% (574/57012) Resolving deltas: 2% (1141/57012) Resolving deltas: 3% (1711/57012) Resolving deltas: 4% (2281/57012) Resolving deltas: 5% (2851/57012) Resolving deltas: 6% (3421/57012) Resolving deltas: 7% (3991/57012) Resolving deltas: 8% (4561/57012) Resolving deltas: 9% (5132/57012) Resolving deltas: 10% (5702/57012) Resolving deltas: 11% (6272/57012) Resolving deltas: 12% (6842/57012) Resolving deltas: 13% (7412/57012) Resolving deltas: 14% (7982/57012) Resolving deltas: 15% (8553/57012) Resolving deltas: 16% (9123/57012) Resolving deltas: 17% (9693/57012) Resolving deltas: 18% (10263/57012) Resolving deltas: 19% (10833/57012) Resolving deltas: 20% (11403/57012) Resolving deltas: 21% (11973/57012) Resolving deltas: 22% (12543/57012) Resolving deltas: 23% (13113/57012) Resolving deltas: 24% (13683/57012) Resolving deltas: 25% (14254/57012) Resolving deltas: 26% (14824/57012) Resolving deltas: 27% (15394/57012) Resolving deltas: 28% (15964/57012) Resolving deltas: 29% (16534/57012) Resolving deltas: 30% (17104/57012) Resolving deltas: 31% (17674/57012) Resolving deltas: 32% (18244/57012) Resolving deltas: 33% (18814/57012) Resolving deltas: 34% (19385/57012) Resolving deltas: 35% (19955/57012) Resolving deltas: 36% (20525/57012) Resolving deltas: 37% (21095/57012) Resolving deltas: 38% (21667/57012) Resolving deltas: 39% (22236/57012) Resolving deltas: 40% (22805/57012) Resolving deltas: 41% (23375/57012) Resolving deltas: 42% (23947/57012) Resolving deltas: 43% (24516/57012) Resolving deltas: 44% (25086/57012) Resolving deltas: 45% (25656/57012) Resolving deltas: 46% (26226/57012) Resolving deltas: 47% (26800/57012) Resolving deltas: 48% (27367/57012) Resolving deltas: 49% (27936/57012) Resolving deltas: 50% (28506/57012) Resolving deltas: 51% (29077/57012) Resolving deltas: 52% (29647/57012) Resolving deltas: 53% (30217/57012) Resolving deltas: 54% (30787/57012) Resolving deltas: 55% (31357/57012) Resolving deltas: 56% (31927/57012) Resolving deltas: 57% (32497/57012) Resolving deltas: 58% (33068/57012) Resolving deltas: 59% (33638/57012) Resolving deltas: 60% (34209/57012) Resolving deltas: 61% (34778/57012) Resolving deltas: 62% (35348/57012) Resolving deltas: 63% (35918/57012) Resolving deltas: 64% (36488/57012) Resolving deltas: 65% (37058/57012) Resolving deltas: 66% (37630/57012) Resolving deltas: 67% (38200/57012) Resolving deltas: 68% (38769/57012) Resolving deltas: 69% (39339/57012) Resolving deltas: 70% (39910/57012) Resolving deltas: 71% (40479/57012) Resolving deltas: 72% (41050/57012) Resolving deltas: 73% (41620/57012) Resolving deltas: 74% (42189/57012) Resolving deltas: 75% (42759/57012) Resolving deltas: 76% (43330/57012) Resolving deltas: 77% (43900/57012) Resolving deltas: 78% (44470/57012) Resolving deltas: 79% (45040/57012) Resolving deltas: 80% (45611/57012) Resolving deltas: 81% (46180/57012) Resolving deltas: 82% (46750/57012) Resolving deltas: 83% (47320/57012) Resolving deltas: 84% (47893/57012) Resolving deltas: 84% (48105/57012) Resolving deltas: 85% (48461/57012) Resolving deltas: 86% (49031/57012) Resolving deltas: 87% (49601/57012) Resolving deltas: 88% (50171/57012) Resolving deltas: 89% (50741/57012) Resolving deltas: 90% (51311/57012) Resolving deltas: 91% (51881/57012) Resolving deltas: 92% (52452/57012) Resolving deltas: 93% (53022/57012) Resolving deltas: 94% (53592/57012) Resolving deltas: 95% (54162/57012) Resolving deltas: 96% (54732/57012) Resolving deltas: 97% (55304/57012) Resolving deltas: 98% (55872/57012) Resolving deltas: 99% (56442/57012) Resolving deltas: 100% (57012/57012) Resolving deltas: 100% (57012/57012), done.
  9. 9.30 s Fetching commit ff11577b1777f94f30ac4c8d99e2f898d5902f7b for simplify-spenso-api ...
  10. 9.30 s $ /nix/store/bcnisk3ydfgv26v2gw3zlky24g00yww2-git-2.54.0/bin/git fetch origin ff11577b1777f94f30ac4c8d99e2f898d5902f7b
  11. 9.79 s From https://github.com/alphal00p/gammaloop
  12. 9.79 s * branch ff11577b1777f94f30ac4c8d99e2f898d5902f7b -> FETCH_HEAD
  13. 9.80 s $ /nix/store/9ypz3flqsrl5xl495mm8h645gadjsxi1-coreutils-9.11/bin/timeout --kill-after=15s 7200s /nix/store/bcnisk3ydfgv26v2gw3zlky24g00yww2-git-2.54.0/bin/git -c advice.detachedHead=false checkout ff11577b1777f94f30ac4c8d99e2f898d5902f7b
  14. 10.02 s HEAD is now at ff11577b1 update Symbolica to 0084bc7c
  15. 10.02 s $ /nix/store/9ypz3flqsrl5xl495mm8h645gadjsxi1-coreutils-9.11/bin/timeout --kill-after=15s 7200s /nix/store/23zk8sgzamrbmj1fday15szf7f2279s8-nix-2.34.7/bin/nix --extra-experimental-features nix-command --extra-experimental-features flakes --log-format internal-json run .#packages.x86_64-linux.nix-ci-check-gammaloop-nextest-core --print-build-logs
  16. 15.38 s
  17. 15.50 s Downloading cached nix-ci-check-gammaloop-nextest-core from https://cache.nix-ci.com
  18. 15.68 s Downloaded cached nix-ci-check-gammaloop-nextest-core (1016 B) in 180ms
  19. 15.68 s Progress: 0 of 1 built, 1 of 1 downloaded from cache
  20. 21.69 s evaluating derivation 'g copying '/nix/store/zvcs evaluating derivation 'g copying '/nix/store/zvcs evaluating derivation 'g copying '/nix/store/zvcs evaluating derivation 'g copying '/nix/store/zvcs evaluating derivation 'g copying '/nix/store/zvcs evaluating derivation 'g querying gammaloop-nexte [0/1 built, 0.0 KiB DL] [1/0/1 built, 0.0 KiB DLgammaloop-nextest-core> Extracting 3 binaries (including 1 non-test binary), 1 build script output directory, and 2 linked paths to /build/nextest-archive-IwZeTZ
  21. 22.22 s gammaloop-nextest-core> Extracted 18 files to /build/nextest-archive-IwZeTZ in 0.54s
  22. 22.24 s gammaloop-nextest-core> ------------
  23. 22.24 s gammaloop-nextest-core> Nextest run ID 7d5f533e-a045-4abe-bd7e-40c6aebe9467 with nextest profile: ci_gammaloop
  24. 22.24 s gammaloop-nextest-core> Starting 339 tests across 2 binaries
  25. 22.73 s gammaloop-nextest-core> ------------
  26. 22.73 s gammaloop-nextest-core> Summary [ 0.490s] 339 tests run: 339 passed, 0 skipped
  27. 22.84 s gammaloop-nextest-core>
  28. 22.84 s gammaloop-nextest-core> ========== nextest test summary ==========
  29. 22.84 s gammaloop-nextest-core> report: target/nextest/ci_gammaloop/junit.xml
  30. 22.84 s gammaloop-nextest-core> tests: 339, failures: 0, errors: 0
  31. 22.84 s gammaloop-nextest-core> No failing testcases found.
  32. 22.84 s gammaloop-nextest-core> =========================================
  33. 22.86 s gammaloop-nextest-core> Extracting 1 binary and 1 linked path to /build/nextest-archive-VBou9p
  34. 22.94 s gammaloop-nextest-core> Extracted 7 files to /build/nextest-archive-VBou9p in 0.08s
  35. 22.95 s gammaloop-nextest-core> ------------
  36. 22.95 s gammaloop-nextest-core> Nextest run ID 4382703c-ea95-4a38-9d04-35e2a61aa1ee with nextest profile: ci_gammaloop
  37. 22.95 s gammaloop-nextest-core> Starting 19 tests across 1 binary
  38. 22.96 s gammaloop-nextest-core> ------------
  39. 22.96 s gammaloop-nextest-core> Summary [ 0.015s] 19 tests run: 19 passed, 0 skipped
  40. 23.01 s gammaloop-nextest-core>
  41. 23.01 s gammaloop-nextest-core> ========== nextest test summary ==========
  42. 23.01 s gammaloop-nextest-core> report: target/nextest/ci_gammaloop/junit.xml
  43. 23.01 s gammaloop-nextest-core> tests: 19, failures: 0, errors: 0
  44. 23.01 s gammaloop-nextest-core> No failing testcases found.
  45. 23.01 s gammaloop-nextest-core> =========================================
  46. 23.02 s gammaloop-nextest-core> Extracting 1 binary to /build/nextest-archive-E3XDsf
  47. 23.05 s gammaloop-nextest-core> Extracted 4 files to /build/nextest-archive-E3XDsf in 0.03s
  48. 23.06 s gammaloop-nextest-core> ------------
  49. 23.06 s gammaloop-nextest-core> Nextest run ID 9554ba5a-ef2f-456b-92b4-60a5077264ce with nextest profile: ci_gammaloop
  50. 23.06 s gammaloop-nextest-core> Starting 0 tests across 1 binary
  51. 23.06 s gammaloop-nextest-core> ------------
  52. 23.06 s gammaloop-nextest-core> Summary [ 0.000s] 0 tests run: 0 passed, 0 skipped
  53. 23.09 s gammaloop-nextest-core>
  54. 23.09 s gammaloop-nextest-core> ========== nextest test summary ==========
  55. 23.09 s gammaloop-nextest-core> report: target/nextest/ci_gammaloop/junit.xml
  56. 23.09 s gammaloop-nextest-core> tests: 0, failures: 0, errors: 0
  57. 23.09 s gammaloop-nextest-core> No failing testcases found.
  58. 23.09 s gammaloop-nextest-core> =========================================
  59. 23.11 s gammaloop-nextest-core> Extracting 4 binaries, 1 build script output directory, and 2 linked paths to /build/nextest-archive-Jw9d2T
  60. 23.67 s gammaloop-nextest-core> Extracted 18 files to /build/nextest-archive-Jw9d2T in 0.56s
  61. 23.68 s gammaloop-nextest-core> ------------
  62. 23.68 s gammaloop-nextest-core> Nextest run ID 2cefb514-dbec-4009-ad1d-a244b32f5fb6 with nextest profile: ci_gammaloop
  63. 23.68 s gammaloop-nextest-core> Starting 456 tests across 4 binaries (61 tests skipped, including 60 tests via profile.ci_gammaloop.default-filter)
  64. 24.93 s gammaloop-nextest-core> FAIL [ 0.221s] (442/456) gammalooprs::test_renormalization finit_part_ghlo
  65. 24.93 s gammaloop-nextest-core> stdout ---
  66. 24.93 s gammaloop-nextest-core>
  67. 24.93 s gammaloop-nextest-core> running 1 test
  68. 24.93 s gammaloop-nextest-core> test finit_part_ghlo ... FAILED
  69. 24.93 s gammaloop-nextest-core>
  70. 24.93 s gammaloop-nextest-core> failures:
  71. 24.93 s gammaloop-nextest-core>
  72. 24.93 s gammaloop-nextest-core> failures:
  73. 24.93 s gammaloop-nextest-core> finit_part_ghlo
  74. 24.93 s gammaloop-nextest-core>
  75. 24.93 s gammaloop-nextest-core> test result: FAILED. 0 passed; 1 failed; 0 ignored; 0 measured; 5 filtered out; finished in 0.19s
  76. 24.93 s gammaloop-nextest-core>
  77. 24.93 s gammaloop-nextest-core> stderr ---
  78. 24.93 s gammaloop-nextest-core> The application panicked (crashed).
  79. 24.93 s gammaloop-nextest-core> Message: called `Result::unwrap()` on an `Err` value:
  80. 24.93 s gammaloop-nextest-core> 0: Symbolica could not parse FORM output:
  81. 24.93 s gammaloop-nextest-core> [spenso::{antisymmetric,real,spenso::tensor}::f]([spenso::{spenso::representat\
  82. 24.93 s gammaloop-nextest-core> ion,spenso::self_dual}::coad](8,[gammalooprs::{spenso::index}::hedge](0)
  83. 24.93 s gammaloop-nextest-core> ),[spenso::{spenso::representation,spenso::self_dual}::coad](8,[gammaloo\
  84. 24.93 s gammaloop-nextest-core> prs::{spenso::index}::hedge](3)),[spenso::{spenso::representation,spenso\
  85. 24.93 s gammaloop-nextest-core> ::self_dual}::coad](8,[gammalooprs::{spenso::index}::hedge](5)))*
  86. 24.93 s gammaloop-nextest-core> [spenso::{antisymmetric,real,spenso::tensor}::f]([spenso::{spenso::repre\
  87. 24.93 s gammaloop-nextest-core> sentation,spenso::self_dual}::coad](8,[gammalooprs::{spenso::index}::hed\
  88. 24.93 s gammaloop-nextest-core> ge](1)),[spenso::{spenso::representation,spenso::self_dual}::coad](8,
  89. 24.93 s gammaloop-nextest-core> [gammalooprs::{spenso::index}::hedge](3)),[spenso::{spenso::representati\
  90. 24.93 s gammaloop-nextest-core> on,spenso::self_dual}::coad](8,[gammalooprs::{spenso::index}::hedge](5))
  91. 24.93 s gammaloop-nextest-core> )*dot(p1,p0)*[UFO::{}::GC_10]^2*rat(-1,1)
  92. 24.93 s gammaloop-nextest-core>
  93. 24.93 s gammaloop-nextest-core> Error:Symbol spenso::coad redefined with new attributes:
  94. 24.93 s gammaloop-nextest-core> - new user data specified: List([String("spenso::representation-v2"), String("self-dual"), List([String("symbol"), String("coad")]), List([String("cyclic"), Integer(1), List([List([String("symbol"), String("a")]), List([String("symbol"), String("b")]), List([String("symbol"), String("c")]), List([String("symbol"), String("d")])])]), String("top")]) vs None
  95. 24.93 s gammaloop-nextest-core>
  96. 24.93 s gammaloop-nextest-core>
  97. 24.93 s gammaloop-nextest-core> Location:
  98. 24.93 s gammaloop-nextest-core> crates/gammalooprs/src/uv/approx/integrated.rs:332
  99. 24.93 s gammaloop-nextest-core>
  100. 24.93 s gammaloop-nextest-core> ━━━━━━━━━━━━━━━━━━━━━━━━━━━━━━━━━━ BACKTRACE ━━━━━━━━━━━━━━━━━━━━━━━━━━━━━━━━━━━
  101. 24.93 s gammaloop-nextest-core> 1: <color_eyre[5722b77bc20a64cf]::config::EyreHook>::into_eyre_hook::{closure#0}<unknown>
  102. 24.93 s gammaloop-nextest-core> at <unknown source file>:<unknown line>
  103. 24.93 s gammaloop-nextest-core> 2: eyre[cb2fd339c0c40fca]::capture_handler<unknown>
  104. 24.93 s gammaloop-nextest-core> at <unknown source file>:<unknown line>
  105. 24.93 s gammaloop-nextest-core> 3: <eyre[cb2fd339c0c40fca]::Report>::from_std::<vakint[ad2b4d4b4d753fb9]::VakintError><unknown>
  106. 24.93 s gammaloop-nextest-core> at <unknown source file>:<unknown line>
  107. 24.93 s gammaloop-nextest-core> 4: <gammalooprs[4688948c89ba1ea7]::uv::approx::integrated::Integrated>::integrate::<gammalooprs[4688948c89ba1ea7]::uv::hedge_poset::ForestNode><unknown>
  108. 24.93 s gammaloop-nextest-core> at <unknown source file>:<unknown line>
  109. 24.93 s gammaloop-nextest-core> 5: <gammalooprs[4688948c89ba1ea7]::uv::approx::integrated::Integrated>::run::<gammalooprs[4688948c89ba1ea7]::uv::hedge_poset::ForestNode, gammalooprs[4688948c89ba1ea7]::uv::hedge_poset::ForestNode><unknown>
  110. 24.93 s gammaloop-nextest-core> at <unknown source file>:<unknown line>
  111. 24.93 s gammaloop-nextest-core> 6: <gammalooprs[4688948c89ba1ea7]::uv::hedge_poset::Forests>::integrate<unknown>
  112. 24.93 s gammaloop-nextest-core> at <unknown source file>:<unknown line>
  113. 24.93 s gammaloop-nextest-core> 7: gammalooprs[4688948c89ba1ea7]::uv::orchestrator::hedge_poset_renormalization_part<unknown>
  114. 24.93 s gammaloop-nextest-core> at <unknown source file>:<unknown line>
  115. 24.93 s gammaloop-nextest-core> 8: <gammalooprs[4688948c89ba1ea7]::uv::settings::UVOrchestrator>::renormalization_part<unknown>
  116. 24.93 s gammaloop-nextest-core> at <unknown source file>:<unknown line>
  117. 24.93 s gammaloop-nextest-core> 9: <gammalooprs[4688948c89ba1ea7]::processes::amplitude::AmplitudeGraph>::renormalization_part<unknown>
  118. 24.93 s gammaloop-nextest-core> at <unknown source file>:<unknown line>
  119. 24.93 s gammaloop-nextest-core> 10: <test_renormalization[c99a4cd1432bec79]::finit_part_ghlo::{closure#0} as core[940e698046960fd5]::ops::function::FnOnce<()>>::call_once<unknown>
  120. 24.93 s gammaloop-nextest-core> at <unknown source file>:<unknown line>
  121. 24.93 s gammaloop-nextest-core> 11: test[75d6903177b1d7e9]::__rust_begin_short_backtrace::<core[940e698046960fd5]::result::Result<(), alloc[2ea6bcb46fca0c42]::string::String>, fn() -> core[940e698046960fd5]::result::Result<(), alloc[2ea6bcb46fca0c42]::string::String>><unknown>
  122. 24.93 s gammaloop-nextest-core> at <unknown source file>:<unknown line>
  123. 24.93 s gammaloop-nextest-core> 12: test[75d6903177b1d7e9]::run_test::{closure#0}<unknown>
  124. 24.93 s gammaloop-nextest-core> at <unknown source file>:<unknown line>
  125. 24.93 s gammaloop-nextest-core> 13: std[bcb96dfbba0ab899]::sys::backtrace::__rust_begin_short_backtrace::<test[75d6903177b1d7e9]::run_test::{closure#1}, ()><unknown>
  126. 24.93 s gammaloop-nextest-core> at <unknown source file>:<unknown line>
  127. 24.93 s gammaloop-nextest-core> 14: <std[bcb96dfbba0ab899]::thread::lifecycle::spawn_unchecked<test[75d6903177b1d7e9]::run_test::{closure#1}, ()>::{closure#1} as core[940e698046960fd5]::ops::function::FnOnce<()>>::call_once::{shim:vtable#0}<unknown>
  128. 24.93 s gammaloop-nextest-core> at <unknown source file>:<unknown line>
  129. 24.93 s gammaloop-nextest-core> 15: <std[bcb96dfbba0ab899]::sys::thread::unix::Thread>::new::thread_start<unknown>
  130. 24.93 s gammaloop-nextest-core> at <unknown source file>:<unknown line>
  131. 24.93 s gammaloop-nextest-core> 16: start_thread<unknown>
  132. 24.93 s gammaloop-nextest-core> at <unknown source file>:<unknown line>
  133. 24.93 s gammaloop-nextest-core> 17: __clone3<unknown>
  134. 24.93 s gammaloop-nextest-core> at <unknown source file>:<unknown line>
  135. 24.93 s gammaloop-nextest-core>
  136. 24.93 s gammaloop-nextest-core> Run with COLORBT_SHOW_HIDDEN=1 environment variable to disable frame filtering.
  137. 24.93 s gammaloop-nextest-core> Run with RUST_BACKTRACE=full to include source snippets.
  138. 24.93 s gammaloop-nextest-core> Location: crates/gammalooprs/tests/test_renormalization.rs:550
  139. 24.93 s gammaloop-nextest-core>
  140. 24.93 s gammaloop-nextest-core> ━━━━━━━━━━━━━━━━━━━━━━━━━━━━━━━━━━ BACKTRACE ━━━━━━━━━━━━━━━━━━━━━━━━━━━━━━━━━━━
  141. 24.93 s gammaloop-nextest-core> 1: <color_eyre[5722b77bc20a64cf]::config::PanicHook>::panic_report<unknown>
  142. 24.93 s gammaloop-nextest-core> at <unknown source file>:<unknown line>
  143. 24.93 s gammaloop-nextest-core> 2: <color_eyre[5722b77bc20a64cf]::config::PanicHook>::into_panic_hook::{closure#0}<unknown>
  144. 24.93 s gammaloop-nextest-core> at <unknown source file>:<unknown line>
  145. 24.93 s gammaloop-nextest-core> 3: std[bcb96dfbba0ab899]::panicking::panic_with_hook<unknown>
  146. 24.93 s gammaloop-nextest-core> at <unknown source file>:<unknown line>
  147. 24.93 s gammaloop-nextest-core> 4: std[bcb96dfbba0ab899]::panicking::panic_handler::{closure#0}<unknown>
  148. 24.93 s gammaloop-nextest-core> at <unknown source file>:<unknown line>
  149. 24.93 s gammaloop-nextest-core> 5: std[bcb96dfbba0ab899]::sys::backtrace::__rust_end_short_backtrace::<std[bcb96dfbba0ab899]::panicking::panic_handler::{closure#0}, !><unknown>
  150. 24.93 s gammaloop-nextest-core> at <unknown source file>:<unknown line>
  151. 24.93 s gammaloop-nextest-core> 6: __rustc[6c289b9f9c454d21]::rust_begin_unwind<unknown>
  152. 24.93 s gammaloop-nextest-core> at <unknown source file>:<unknown line>
  153. 24.93 s gammaloop-nextest-core> 7: core[940e698046960fd5]::panicking::panic_fmt<unknown>
  154. 24.93 s gammaloop-nextest-core> at <unknown source file>:<unknown line>
  155. 24.93 s gammaloop-nextest-core> 8: core[940e698046960fd5]::result::unwrap_failed<unknown>
  156. 24.93 s gammaloop-nextest-core> at <unknown source file>:<unknown line>
  157. 24.93 s gammaloop-nextest-core> 9: <test_renormalization[c99a4cd1432bec79]::finit_part_ghlo::{closure#0} as core[940e698046960fd5]::ops::function::FnOnce<()>>::call_once<unknown>
  158. 24.93 s gammaloop-nextest-core> at <unknown source file>:<unknown line>
  159. 24.93 s gammaloop-nextest-core> 10: test[75d6903177b1d7e9]::__rust_begin_short_backtrace::<core[940e698046960fd5]::result::Result<(), alloc[2ea6bcb46fca0c42]::string::String>, fn() -> core[940e698046960fd5]::result::Result<(), alloc[2ea6bcb46fca0c42]::string::String>><unknown>
  160. 24.93 s gammaloop-nextest-core> at <unknown source file>:<unknown line>
  161. 24.93 s gammaloop-nextest-core> 11: test[75d6903177b1d7e9]::run_test::{closure#0}<unknown>
  162. 24.93 s gammaloop-nextest-core> at <unknown source file>:<unknown line>
  163. 24.93 s gammaloop-nextest-core> 12: std[bcb96dfbba0ab899]::sys::backtrace::__rust_begin_short_backtrace::<test[75d6903177b1d7e9]::run_test::{closure#1}, ()><unknown>
  164. 24.93 s gammaloop-nextest-core> at <unknown source file>:<unknown line>
  165. 24.93 s gammaloop-nextest-core> 13: <std[bcb96dfbba0ab899]::thread::lifecycle::spawn_unchecked<test[75d6903177b1d7e9]::run_test::{closure#1}, ()>::{closure#1} as core[940e698046960fd5]::ops::function::FnOnce<()>>::call_once::{shim:vtable#0}<unknown>
  166. 24.93 s gammaloop-nextest-core> at <unknown source file>:<unknown line>
  167. 24.93 s gammaloop-nextest-core> 14: <std[bcb96dfbba0ab899]::sys::thread::unix::Thread>::new::thread_start<unknown>
  168. 24.93 s gammaloop-nextest-core> at <unknown source file>:<unknown line>
  169. 24.93 s gammaloop-nextest-core> 15: start_thread<unknown>
  170. 24.93 s gammaloop-nextest-core> at <unknown source file>:<unknown line>
  171. 24.93 s gammaloop-nextest-core> 16: __clone3<unknown>
  172. 24.93 s gammaloop-nextest-core> at <unknown source file>:<unknown line>
  173. 24.93 s gammaloop-nextest-core>
  174. 24.93 s gammaloop-nextest-core> Run with COLORBT_SHOW_HIDDEN=1 environment variable to disable frame filtering.
  175. 24.93 s gammaloop-nextest-core> Run with RUST_BACKTRACE=full to include source snippets.
  176. 24.93 s gammaloop-nextest-core>
  177. 24.96 s gammaloop-nextest-core> FAIL [ 0.166s] (444/456) gammalooprs::test_renormalization finite_part_quark_lo
  178. 24.96 s gammaloop-nextest-core> stdout ---
  179. 24.96 s gammaloop-nextest-core>
  180. 24.96 s gammaloop-nextest-core> running 1 test
  181. 24.96 s gammaloop-nextest-core> test finite_part_quark_lo ... FAILED
  182. 24.96 s gammaloop-nextest-core>
  183. 24.96 s gammaloop-nextest-core> failures:
  184. 24.96 s gammaloop-nextest-core>
  185. 24.96 s gammaloop-nextest-core> failures:
  186. 24.96 s gammaloop-nextest-core> finite_part_quark_lo
  187. 24.96 s gammaloop-nextest-core>
  188. 24.96 s gammaloop-nextest-core> test result: FAILED. 0 passed; 1 failed; 0 ignored; 0 measured; 5 filtered out; finished in 0.15s
  189. 24.96 s gammaloop-nextest-core>
  190. 24.96 s gammaloop-nextest-core> stderr ---
  191. 24.96 s gammaloop-nextest-core> The application panicked (crashed).
  192. 24.96 s gammaloop-nextest-core> Message: called `Result::unwrap()` on an `Err` value: "Symbol spenso::mink redefined with new attributes:\n\t- new user data specified: List([String(\"spenso::representation-v2\"), String(\"inline-metric\"), List([String(\"symbol\"), String(\"mink\")]), List([String(\"cyclic\"), Integer(1), List([List([String(\"symbol\"), String(\"mu\")]), List([String(\"symbol\"), String(\"nu\")]), List([String(\"symbol\"), String(\"rho\")]), List([String(\"symbol\"), String(\"sigma\")])])]), String(\"top\")]) vs None\n"
  193. 24.96 s gammaloop-nextest-core> Location: crates/vakint/src/lib.rs:4766
  194. 24.96 s gammaloop-nextest-core>
  195. 24.96 s gammaloop-nextest-core> ━━━━━━━━━━━━━━━━━━━━━━━━━━━━━━━━━━ BACKTRACE ━━━━━━━━━━━━━━━━━━━━━━━━━━━━━━━━━━━
  196. 24.96 s gammaloop-nextest-core> 1: <color_eyre[5722b77bc20a64cf]::config::PanicHook>::panic_report<unknown>
  197. 24.96 s gammaloop-nextest-core> at <unknown source file>:<unknown line>
  198. 24.96 s gammaloop-nextest-core> 2: <color_eyre[5722b77bc20a64cf]::config::PanicHook>::into_panic_hook::{closure#0}<unknown>
  199. 24.96 s gammaloop-nextest-core> at <unknown source file>:<unknown line>
  200. 24.96 s gammaloop-nextest-core> 3: std[bcb96dfbba0ab899]::panicking::panic_with_hook<unknown>
  201. 24.96 s gammaloop-nextest-core> at <unknown source file>:<unknown line>
  202. 24.96 s gammaloop-nextest-core> 4: std[bcb96dfbba0ab899]::panicking::panic_handler::{closure#0}<unknown>
  203. 24.96 s gammaloop-nextest-core> at <unknown source file>:<unknown line>
  204. 24.96 s gammaloop-nextest-core> 5: std[bcb96dfbba0ab899]::sys::backtrace::__rust_end_short_backtrace::<std[bcb96dfbba0ab899]::panicking::panic_handler::{closure#0}, !><unknown>
  205. 24.96 s gammaloop-nextest-core> at <unknown source file>:<unknown line>
  206. 24.96 s gammaloop-nextest-core> 6: __rustc[6c289b9f9c454d21]::rust_begin_unwind<unknown>
  207. 24.96 s gammaloop-nextest-core> at <unknown source file>:<unknown line>
  208. 24.96 s gammaloop-nextest-core> 7: core[940e698046960fd5]::panicking::panic_fmt<unknown>
  209. 24.96 s gammaloop-nextest-core> at <unknown source file>:<unknown line>
  210. 24.96 s gammaloop-nextest-core> 8: core[940e698046960fd5]::result::unwrap_failed<unknown>
  211. 24.96 s gammaloop-nextest-core> at <unknown source file>:<unknown line>
  212. 24.96 s gammaloop-nextest-core> 9: <vakint[ad2b4d4b4d753fb9]::Vakint>::sanitize_user_expressions<unknown>
  213. 24.96 s gammaloop-nextest-core> at <unknown source file>:<unknown line>
  214. 24.96 s gammaloop-nextest-core> 10: <vakint[ad2b4d4b4d753fb9]::Vakint>::prepare_expression_for_form<unknown>
  215. 24.96 s gammaloop-nextest-core> at <unknown source file>:<unknown line>
  216. 24.96 s gammaloop-nextest-core> 11: <vakint[ad2b4d4b4d753fb9]::VakintTerm>::tensor_reduce<unknown>
  217. 24.96 s gammaloop-nextest-core> at <unknown source file>:<unknown line>
  218. 24.96 s gammaloop-nextest-core> 12: <vakint[ad2b4d4b4d753fb9]::VakintExpression>::tensor_reduce<unknown>
  219. 24.96 s gammaloop-nextest-core> at <unknown source file>:<unknown line>
  220. 24.96 s gammaloop-nextest-core> 13: <gammalooprs[4688948c89ba1ea7]::uv::approx::integrated::Integrated>::integrate::<gammalooprs[4688948c89ba1ea7]::uv::hedge_poset::ForestNode><unknown>
  221. 24.96 s gammaloop-nextest-core> at <unknown source file>:<unknown line>
  222. 24.96 s gammaloop-nextest-core> 14: <gammalooprs[4688948c89ba1ea7]::uv::approx::integrated::Integrated>::run::<gammalooprs[4688948c89ba1ea7]::uv::hedge_poset::ForestNode, gammalooprs[4688948c89ba1ea7]::uv::hedge_poset::ForestNode><unknown>
  223. 24.96 s gammaloop-nextest-core> at <unknown source file>:<unknown line>
  224. 24.96 s gammaloop-nextest-core> 15: <gammalooprs[4688948c89ba1ea7]::uv::hedge_poset::Forests>::integrate<unknown>
  225. 24.96 s gammaloop-nextest-core> at <unknown source file>:<unknown line>
  226. 24.96 s gammaloop-nextest-core> 16: gammalooprs[4688948c89ba1ea7]::uv::orchestrator::hedge_poset_renormalization_part<unknown>
  227. 24.96 s gammaloop-nextest-core> at <unknown source file>:<unknown line>
  228. 24.96 s gammaloop-nextest-core> 17: <gammalooprs[4688948c89ba1ea7]::uv::settings::UVOrchestrator>::renormalization_part<unknown>
  229. 24.96 s gammaloop-nextest-core> at <unknown source file>:<unknown line>
  230. 24.96 s gammaloop-nextest-core> 18: <gammalooprs[4688948c89ba1ea7]::processes::amplitude::AmplitudeGraph>::renormalization_part<unknown>
  231. 24.96 s gammaloop-nextest-core> at <unknown source file>:<unknown line>
  232. 24.96 s gammaloop-nextest-core> 19: <test_renormalization[c99a4cd1432bec79]::finite_part_quark_lo::{closure#0} as core[940e698046960fd5]::ops::function::FnOnce<()>>::call_once<unknown>
  233. 24.96 s gammaloop-nextest-core> at <unknown source file>:<unknown line>
  234. 24.96 s gammaloop-nextest-core> 20: test[75d6903177b1d7e9]::__rust_begin_short_backtrace::<core[940e698046960fd5]::result::Result<(), alloc[2ea6bcb46fca0c42]::string::String>, fn() -> core[940e698046960fd5]::result::Result<(), alloc[2ea6bcb46fca0c42]::string::String>><unknown>
  235. 24.96 s gammaloop-nextest-core> at <unknown source file>:<unknown line>
  236. 24.96 s gammaloop-nextest-core> 21: test[75d6903177b1d7e9]::run_test::{closure#0}<unknown>
  237. 24.96 s gammaloop-nextest-core> at <unknown source file>:<unknown line>
  238. 24.96 s gammaloop-nextest-core> 22: std[bcb96dfbba0ab899]::sys::backtrace::__rust_begin_short_backtrace::<test[75d6903177b1d7e9]::run_test::{closure#1}, ()><unknown>
  239. 24.96 s gammaloop-nextest-core> at <unknown source file>:<unknown line>
  240. 24.96 s gammaloop-nextest-core> 23: <std[bcb96dfbba0ab899]::thread::lifecycle::spawn_unchecked<test[75d6903177b1d7e9]::run_test::{closure#1}, ()>::{closure#1} as core[940e698046960fd5]::ops::function::FnOnce<()>>::call_once::{shim:vtable#0}<unknown>
  241. 24.96 s gammaloop-nextest-core> at <unknown source file>:<unknown line>
  242. 24.96 s gammaloop-nextest-core> 24: <std[bcb96dfbba0ab899]::sys::thread::unix::Thread>::new::thread_start<unknown>
  243. 24.96 s gammaloop-nextest-core> at <unknown source file>:<unknown line>
  244. 24.96 s gammaloop-nextest-core> 25: start_thread<unknown>
  245. 24.96 s gammaloop-nextest-core> at <unknown source file>:<unknown line>
  246. 24.96 s gammaloop-nextest-core> 26: __clone3<unknown>
  247. 24.96 s gammaloop-nextest-core> at <unknown source file>:<unknown line>
  248. 24.96 s gammaloop-nextest-core>
  249. 24.96 s gammaloop-nextest-core> Run with COLORBT_SHOW_HIDDEN=1 environment variable to disable frame filtering.
  250. 24.96 s gammaloop-nextest-core> Run with RUST_BACKTRACE=full to include source snippets.
  251. 24.96 s gammaloop-nextest-core>
  252. 25.13 s gammaloop-nextest-core> FAIL [ 0.379s] (447/456) gammalooprs::test_renormalization finite_part_ghost_2loop
  253. 25.13 s gammaloop-nextest-core> stdout ---
  254. 25.13 s gammaloop-nextest-core>
  255. 25.13 s gammaloop-nextest-core> running 1 test
  256. 25.13 s gammaloop-nextest-core> test finite_part_ghost_2loop ... FAILED
  257. 25.13 s gammaloop-nextest-core>
  258. 25.13 s gammaloop-nextest-core> failures:
  259. 25.13 s gammaloop-nextest-core>
  260. 25.13 s gammaloop-nextest-core> failures:
  261. 25.13 s gammaloop-nextest-core> finite_part_ghost_2loop
  262. 25.13 s gammaloop-nextest-core>
  263. 25.13 s gammaloop-nextest-core> test result: FAILED. 0 passed; 1 failed; 0 ignored; 0 measured; 5 filtered out; finished in 0.36s
  264. 25.13 s gammaloop-nextest-core>
  265. 25.13 s gammaloop-nextest-core> stderr ---
  266. 25.13 s gammaloop-nextest-core> The application panicked (crashed).
  267. 25.13 s gammaloop-nextest-core> Message: called `Result::unwrap()` on an `Err` value:
  268. 25.13 s gammaloop-nextest-core> 0: Symbolica could not parse FORM output:
  269. 25.13 s gammaloop-nextest-core> [spenso::{antisymmetric,real,spenso::tensor}::f]([spenso::{spenso::representat\
  270. 25.13 s gammaloop-nextest-core> ion,spenso::self_dual}::coad](8,[gammalooprs::{spenso::index}::hedge](0)
  271. 25.13 s gammaloop-nextest-core> ),[spenso::{spenso::representation,spenso::self_dual}::coad](8,[gammaloo\
  272. 25.13 s gammaloop-nextest-core> prs::{spenso::index}::hedge](3)),[spenso::{spenso::representation,spenso\
  273. 25.13 s gammaloop-nextest-core> ::self_dual}::coad](8,[gammalooprs::{spenso::index}::hedge](5)))*
  274. 25.13 s gammaloop-nextest-core> [spenso::{antisymmetric,real,spenso::tensor}::f]([spenso::{spenso::repre\
  275. 25.13 s gammaloop-nextest-core> sentation,spenso::self_dual}::coad](8,[gammalooprs::{spenso::index}::hed\
  276. 25.13 s gammaloop-nextest-core> ge](1)),[spenso::{spenso::representation,spenso::self_dual}::coad](8,
  277. 25.13 s gammaloop-nextest-core> [gammalooprs::{spenso::index}::hedge](11)),[spenso::{spenso::representat\
  278. 25.13 s gammaloop-nextest-core> ion,spenso::self_dual}::coad](8,[gammalooprs::{spenso::index}::hedge](7)
  279. 25.13 s gammaloop-nextest-core> ))*[spenso::{antisymmetric,real,spenso::tensor}::f]([spenso::{spenso::re\
  280. 25.13 s gammaloop-nextest-core> presentation,spenso::self_dual}::coad](8,[gammalooprs::{spenso::index}::\
  281. 25.13 s gammaloop-nextest-core> hedge](3)),[spenso::{spenso::representation,spenso::self_dual}::coad](8,
  282. 25.13 s gammaloop-nextest-core> [gammalooprs::{spenso::index}::hedge](7)),[spenso::{spenso::representati\
  283. 25.13 s gammaloop-nextest-core> on,spenso::self_dual}::coad](8,[gammalooprs::{spenso::index}::hedge](9))
  284. 25.13 s gammaloop-nextest-core> )*[spenso::{antisymmetric,real,spenso::tensor}::f]([spenso::{spenso::rep\
  285. 25.13 s gammaloop-nextest-core> resentation,spenso::self_dual}::coad](8,[gammalooprs::{spenso::index}::h\
  286. 25.13 s gammaloop-nextest-core> edge](11)),[spenso::{spenso::representation,spenso::self_dual}::coad](8,
  287. 25.13 s gammaloop-nextest-core> [gammalooprs::{spenso::index}::hedge](5)),[spenso::{spenso::representati\
  288. 25.13 s gammaloop-nextest-core> on,spenso::self_dual}::coad](8,[gammalooprs::{spenso::index}::hedge](9))
  289. 25.13 s gammaloop-nextest-core> )*dot(p4,p0)*dot(k1,k1)*dot(k2,k2)*i_*[UFO::{}::GC_10]^4*rat(-1,ep - 2)
  290. 25.13 s gammaloop-nextest-core> + [spenso::{antisymmetric,real,spenso::tensor}::f]([spenso::{spenso::re\
  291. 25.13 s gammaloop-nextest-core> presentation,spenso::self_dual}::coad](8,[gammalooprs::{spenso::index}::\
  292. 25.13 s gammaloop-nextest-core> hedge](0)),[spenso::{spenso::representation,spenso::self_dual}::coad](8,
  293. 25.13 s gammaloop-nextest-core> [gammalooprs::{spenso::index}::hedge](3)),[spenso::{spenso::representati\
  294. 25.13 s gammaloop-nextest-core> on,spenso::self_dual}::coad](8,[gammalooprs::{spenso::index}::hedge](5))
  295. 25.13 s gammaloop-nextest-core> )*[spenso::{antisymmetric,real,spenso::tensor}::f]([spenso::{spenso::rep\
  296. 25.13 s gammaloop-nextest-core> resentation,spenso::self_dual}::coad](8,[gammalooprs::{spenso::index}::h\
  297. 25.13 s gammaloop-nextest-core> edge](1)),[spenso::{spenso::representation,spenso::self_dual}::coad](8,
  298. 25.13 s gammaloop-nextest-core> [gammalooprs::{spenso::index}::hedge](11)),[spenso::{spenso::representat\
  299. 25.13 s gammaloop-nextest-core> ion,spenso::self_dual}::coad](8,[gammalooprs::{spenso::index}::hedge](7)
  300. 25.13 s gammaloop-nextest-core> ))*[spenso::{antisymmetric,real,spenso::tensor}::f]([spenso::{spenso::re\
  301. 25.13 s gammaloop-nextest-core> presentation,spenso::self_dual}::coad](8,[gammalooprs::{spenso::index}::\
  302. 25.13 s gammaloop-nextest-core> hedge](3)),[spenso::{spenso::representation,spenso::self_dual}::coad](8,
  303. 25.13 s gammaloop-nextest-core> [gammalooprs::{spenso::index}::hedge](7)),[spenso::{spenso::representati\
  304. 25.13 s gammaloop-nextest-core> on,spenso::self_dual}::coad](8,[gammalooprs::{spenso::index}::hedge](9))
  305. 25.13 s gammaloop-nextest-core> )*[spenso::{antisymmetric,real,spenso::tensor}::f]([spenso::{spenso::rep\
  306. 25.13 s gammaloop-nextest-core> resentation,spenso::self_dual}::coad](8,[gammalooprs::{spenso::index}::h\
  307. 25.13 s gammaloop-nextest-core> edge](11)),[spenso::{spenso::representation,spenso::self_dual}::coad](8,
  308. 25.13 s gammaloop-nextest-core> [gammalooprs::{spenso::index}::hedge](5)),[spenso::{spenso::representati\
  309. 25.13 s gammaloop-nextest-core> on,spenso::self_dual}::coad](8,[gammalooprs::{spenso::index}::hedge](9))
  310. 25.13 s gammaloop-nextest-core> )*dot(p4,p0)*dot(k1,k2)^2*i_*[UFO::{}::GC_10]^4*rat(1,ep - 2)
  311. 25.13 s gammaloop-nextest-core>
  312. 25.13 s gammaloop-nextest-core> Error:Symbol spenso::coad redefined with new attributes:
  313. 25.13 s gammaloop-nextest-core> - new user data specified: List([String("spenso::representation-v2"), String("self-dual"), List([String("symbol"), String("coad")]), List([String("cyclic"), Integer(1), List([List([String("symbol"), String("a")]), List([String("symbol"), String("b")]), List([String("symbol"), String("c")]), List([String("symbol"), String("d")])])]), String("top")]) vs None
  314. 25.13 s gammaloop-nextest-core>
  315. 25.13 s gammaloop-nextest-core>
  316. 25.13 s gammaloop-nextest-core> Location:
  317. 25.13 s gammaloop-nextest-core> crates/gammalooprs/src/uv/approx/integrated.rs:332
  318. 25.13 s gammaloop-nextest-core>
  319. 25.13 s gammaloop-nextest-core> ━━━━━━━━━━━━━━━━━━━━━━━━━━━━━━━━━━ BACKTRACE ━━━━━━━━━━━━━━━━━━━━━━━━━━━━━━━━━━━
  320. 25.13 s gammaloop-nextest-core> 1: <color_eyre[5722b77bc20a64cf]::config::EyreHook>::into_eyre_hook::{closure#0}<unknown>
  321. 25.13 s gammaloop-nextest-core> at <unknown source file>:<unknown line>
  322. 25.13 s gammaloop-nextest-core> 2: eyre[cb2fd339c0c40fca]::capture_handler<unknown>
  323. 25.13 s gammaloop-nextest-core> at <unknown source file>:<unknown line>
  324. 25.13 s gammaloop-nextest-core> 3: <eyre[cb2fd339c0c40fca]::Report>::from_std::<vakint[ad2b4d4b4d753fb9]::VakintError><unknown>
  325. 25.13 s gammaloop-nextest-core> at <unknown source file>:<unknown line>
  326. 25.13 s gammaloop-nextest-core> 4: <gammalooprs[4688948c89ba1ea7]::uv::approx::integrated::Integrated>::integrate::<gammalooprs[4688948c89ba1ea7]::uv::approx::Approximation><unknown>
  327. 25.13 s gammaloop-nextest-core> at <unknown source file>:<unknown line>
  328. 25.13 s gammaloop-nextest-core> 5: <gammalooprs[4688948c89ba1ea7]::uv::forest::Forest>::compute<unknown>
  329. 25.13 s gammaloop-nextest-core> at <unknown source file>:<unknown line>
  330. 25.13 s gammaloop-nextest-core> 6: gammalooprs[4688948c89ba1ea7]::uv::orchestrator::legacy_renormalization_part<unknown>
  331. 25.13 s gammaloop-nextest-core> at <unknown source file>:<unknown line>
  332. 25.13 s gammaloop-nextest-core> 7: <gammalooprs[4688948c89ba1ea7]::uv::settings::UVOrchestrator>::renormalization_part<unknown>
  333. 25.13 s gammaloop-nextest-core> at <unknown source file>:<unknown line>
  334. 25.13 s gammaloop-nextest-core> 8: <gammalooprs[4688948c89ba1ea7]::processes::amplitude::AmplitudeGraph>::renormalization_part<unknown>
  335. 25.13 s gammaloop-nextest-core> at <unknown source file>:<unknown line>
  336. 25.13 s gammaloop-nextest-core> 9: test_renormalization[c99a4cd1432bec79]::finite_part_ghost_2loop<unknown>
  337. 25.13 s gammaloop-nextest-core> at <unknown source file>:<unknown line>
  338. 25.13 s gammaloop-nextest-core> 10: <test_renormalization[c99a4cd1432bec79]::finite_part_ghost_2loop::{closure#0} as core[940e698046960fd5]::ops::function::FnOnce<()>>::call_once<unknown>
  339. 25.13 s gammaloop-nextest-core> at <unknown source file>:<unknown line>
  340. 25.13 s gammaloop-nextest-core> 11: test[75d6903177b1d7e9]::__rust_begin_short_backtrace::<core[940e698046960fd5]::result::Result<(), alloc[2ea6bcb46fca0c42]::string::String>, fn() -> core[940e698046960fd5]::result::Result<(), alloc[2ea6bcb46fca0c42]::string::String>><unknown>
  341. 25.13 s gammaloop-nextest-core> at <unknown source file>:<unknown line>
  342. 25.13 s gammaloop-nextest-core> 12: test[75d6903177b1d7e9]::run_test::{closure#0}<unknown>
  343. 25.13 s gammaloop-nextest-core> at <unknown source file>:<unknown line>
  344. 25.13 s gammaloop-nextest-core> 13: std[bcb96dfbba0ab899]::sys::backtrace::__rust_begin_short_backtrace::<test[75d6903177b1d7e9]::run_test::{closure#1}, ()><unknown>
  345. 25.13 s gammaloop-nextest-core> at <unknown source file>:<unknown line>
  346. 25.13 s gammaloop-nextest-core> 14: <std[bcb96dfbba0ab899]::thread::lifecycle::spawn_unchecked<test[75d6903177b1d7e9]::run_test::{closure#1}, ()>::{closure#1} as core[940e698046960fd5]::ops::function::FnOnce<()>>::call_once::{shim:vtable#0}<unknown>
  347. 25.13 s gammaloop-nextest-core> at <unknown source file>:<unknown line>
  348. 25.13 s gammaloop-nextest-core> 15: <std[bcb96dfbba0ab899]::sys::thread::unix::Thread>::new::thread_start<unknown>
  349. 25.13 s gammaloop-nextest-core> at <unknown source file>:<unknown line>
  350. 25.13 s gammaloop-nextest-core> 16: start_thread<unknown>
  351. 25.13 s gammaloop-nextest-core> at <unknown source file>:<unknown line>
  352. 25.13 s gammaloop-nextest-core> 17: __clone3<unknown>
  353. 25.13 s gammaloop-nextest-core> at <unknown source file>:<unknown line>
  354. 25.13 s gammaloop-nextest-core>
  355. 25.13 s gammaloop-nextest-core> Run with COLORBT_SHOW_HIDDEN=1 environment variable to disable frame filtering.
  356. 25.13 s gammaloop-nextest-core> Run with RUST_BACKTRACE=full to include source snippets.
  357. 25.14 s gammaloop-nextest-core> Location: crates/gammalooprs/tests/test_renormalization.rs:445
  358. 25.14 s gammaloop-nextest-core>
  359. 25.14 s gammaloop-nextest-core> ━━━━━━━━━━━━━━━━━━━━━━━━━━━━━━━━━━ BACKTRACE ━━━━━━━━━━━━━━━━━━━━━━━━━━━━━━━━━━━
  360. 25.14 s gammaloop-nextest-core> 1: <color_eyre[5722b77bc20a64cf]::config::PanicHook>::panic_report<unknown>
  361. 25.14 s gammaloop-nextest-core> at <unknown source file>:<unknown line>
  362. 25.14 s gammaloop-nextest-core> 2: <color_eyre[5722b77bc20a64cf]::config::PanicHook>::into_panic_hook::{closure#0}<unknown>
  363. 25.14 s gammaloop-nextest-core> at <unknown source file>:<unknown line>
  364. 25.14 s gammaloop-nextest-core> 3: std[bcb96dfbba0ab899]::panicking::panic_with_hook<unknown>
  365. 25.14 s gammaloop-nextest-core> at <unknown source file>:<unknown line>
  366. 25.14 s gammaloop-nextest-core> 4: std[bcb96dfbba0ab899]::panicking::panic_handler::{closure#0}<unknown>
  367. 25.14 s gammaloop-nextest-core> at <unknown source file>:<unknown line>
  368. 25.14 s gammaloop-nextest-core> 5: std[bcb96dfbba0ab899]::sys::backtrace::__rust_end_short_backtrace::<std[bcb96dfbba0ab899]::panicking::panic_handler::{closure#0}, !><unknown>
  369. 25.14 s gammaloop-nextest-core> at <unknown source file>:<unknown line>
  370. 25.14 s gammaloop-nextest-core> 6: __rustc[6c289b9f9c454d21]::rust_begin_unwind<unknown>
  371. 25.14 s gammaloop-nextest-core> at <unknown source file>:<unknown line>
  372. 25.14 s gammaloop-nextest-core> 7: core[940e698046960fd5]::panicking::panic_fmt<unknown>
  373. 25.14 s gammaloop-nextest-core> at <unknown source file>:<unknown line>
  374. 25.14 s gammaloop-nextest-core> 8: core[940e698046960fd5]::result::unwrap_failed<unknown>
  375. 25.14 s gammaloop-nextest-core> at <unknown source file>:<unknown line>
  376. 25.14 s gammaloop-nextest-core> 9: test_renormalization[c99a4cd1432bec79]::finite_part_ghost_2loop<unknown>
  377. 25.14 s gammaloop-nextest-core> at <unknown source file>:<unknown line>
  378. 25.14 s gammaloop-nextest-core> 10: <test_renormalization[c99a4cd1432bec79]::finite_part_ghost_2loop::{closure#0} as core[940e698046960fd5]::ops::function::FnOnce<()>>::call_once<unknown>
  379. 25.14 s gammaloop-nextest-core> at <unknown source file>:<unknown line>
  380. 25.14 s gammaloop-nextest-core> 11: test[75d6903177b1d7e9]::__rust_begin_short_backtrace::<core[940e698046960fd5]::result::Result<(), alloc[2ea6bcb46fca0c42]::string::String>, fn() -> core[940e698046960fd5]::result::Result<(), alloc[2ea6bcb46fca0c42]::string::String>><unknown>
  381. 25.14 s gammaloop-nextest-core> at <unknown source file>:<unknown line>
  382. 25.14 s gammaloop-nextest-core> 12: test[75d6903177b1d7e9]::run_test::{closure#0}<unknown>
  383. 25.14 s gammaloop-nextest-core> at <unknown source file>:<unknown line>
  384. 25.14 s gammaloop-nextest-core> 13: std[bcb96dfbba0ab899]::sys::backtrace::__rust_begin_short_backtrace::<test[75d6903177b1d7e9]::run_test::{closure#1}, ()><unknown>
  385. 25.14 s gammaloop-nextest-core> at <unknown source file>:<unknown line>
  386. 25.14 s gammaloop-nextest-core> 14: <std[bcb96dfbba0ab899]::thread::lifecycle::spawn_unchecked<test[75d6903177b1d7e9]::run_test::{closure#1}, ()>::{closure#1} as core[940e698046960fd5]::ops::function::FnOnce<()>>::call_once::{shim:vtable#0}<unknown>
  387. 25.14 s gammaloop-nextest-core> at <unknown source file>:<unknown line>
  388. 25.14 s gammaloop-nextest-core> 15: <std[bcb96dfbba0ab899]::sys::thread::unix::Thread>::new::thread_start<unknown>
  389. 25.14 s gammaloop-nextest-core> at <unknown source file>:<unknown line>
  390. 25.14 s gammaloop-nextest-core> 16: start_thread<unknown>
  391. 25.14 s gammaloop-nextest-core> at <unknown source file>:<unknown line>
  392. 25.14 s gammaloop-nextest-core> 17: __clone3<unknown>
  393. 25.14 s gammaloop-nextest-core> at <unknown source file>:<unknown line>
  394. 25.14 s gammaloop-nextest-core>
  395. 25.14 s gammaloop-nextest-core> Run with COLORBT_SHOW_HIDDEN=1 environment variable to disable frame filtering.
  396. 25.14 s gammaloop-nextest-core> Run with RUST_BACKTRACE=full to include source snippets.
  397. 25.14 s gammaloop-nextest-core>
  398. 32.20 s gammaloop-nextest-core> ------------
  399. 32.20 s gammaloop-nextest-core> Summary [ 8.520s] 456 tests run: 453 passed, 3 failed, 61 skipped
  400. 32.20 s gammaloop-nextest-core> FAIL [ 0.221s] (442/456) gammalooprs::test_renormalization finit_part_ghlo
  401. 32.20 s gammaloop-nextest-core> stdout ---
  402. 32.20 s gammaloop-nextest-core>
  403. 32.20 s gammaloop-nextest-core> running 1 test
  404. 32.20 s gammaloop-nextest-core> test finit_part_ghlo ... FAILED
  405. 32.20 s gammaloop-nextest-core>
  406. 32.20 s gammaloop-nextest-core> failures:
  407. 32.20 s gammaloop-nextest-core>
  408. 32.20 s gammaloop-nextest-core> failures:
  409. 32.20 s gammaloop-nextest-core> finit_part_ghlo
  410. 32.20 s gammaloop-nextest-core>
  411. 32.20 s gammaloop-nextest-core> test result: FAILED. 0 passed; 1 failed; 0 ignored; 0 measured; 5 filtered out; finished in 0.19s
  412. 32.20 s gammaloop-nextest-core>
  413. 32.20 s gammaloop-nextest-core> stderr ---
  414. 32.20 s gammaloop-nextest-core> The application panicked (crashed).
  415. 32.20 s gammaloop-nextest-core> Message: called `Result::unwrap()` on an `Err` value:
  416. 32.20 s gammaloop-nextest-core> 0: Symbolica could not parse FORM output:
  417. 32.20 s gammaloop-nextest-core> [spenso::{antisymmetric,real,spenso::tensor}::f]([spenso::{spenso::representat\
  418. 32.20 s gammaloop-nextest-core> ion,spenso::self_dual}::coad](8,[gammalooprs::{spenso::index}::hedge](0)
  419. 32.20 s gammaloop-nextest-core> ),[spenso::{spenso::representation,spenso::self_dual}::coad](8,[gammaloo\
  420. 32.20 s gammaloop-nextest-core> prs::{spenso::index}::hedge](3)),[spenso::{spenso::representation,spenso\
  421. 32.20 s gammaloop-nextest-core> ::self_dual}::coad](8,[gammalooprs::{spenso::index}::hedge](5)))*
  422. 32.20 s gammaloop-nextest-core> [spenso::{antisymmetric,real,spenso::tensor}::f]([spenso::{spenso::repre\
  423. 32.20 s gammaloop-nextest-core> sentation,spenso::self_dual}::coad](8,[gammalooprs::{spenso::index}::hed\
  424. 32.20 s gammaloop-nextest-core> ge](1)),[spenso::{spenso::representation,spenso::self_dual}::coad](8,
  425. 32.20 s gammaloop-nextest-core> [gammalooprs::{spenso::index}::hedge](3)),[spenso::{spenso::representati\
  426. 32.20 s gammaloop-nextest-core> on,spenso::self_dual}::coad](8,[gammalooprs::{spenso::index}::hedge](5))
  427. 32.20 s gammaloop-nextest-core> )*dot(p1,p0)*[UFO::{}::GC_10]^2*rat(-1,1)
  428. 32.20 s gammaloop-nextest-core>
  429. 32.20 s gammaloop-nextest-core> Error:Symbol spenso::coad redefined with new attributes:
  430. 32.20 s gammaloop-nextest-core> - new user data specified: List([String("spenso::representation-v2"), String("self-dual"), List([String("symbol"), String("coad")]), List([String("cyclic"), Integer(1), List([List([String("symbol"), String("a")]), List([String("symbol"), String("b")]), List([String("symbol"), String("c")]), List([String("symbol"), String("d")])])]), String("top")]) vs None
  431. 32.20 s gammaloop-nextest-core>
  432. 32.20 s gammaloop-nextest-core>
  433. 32.20 s gammaloop-nextest-core> Location:
  434. 32.20 s gammaloop-nextest-core> crates/gammalooprs/src/uv/approx/integrated.rs:332
  435. 32.20 s gammaloop-nextest-core>
  436. 32.20 s gammaloop-nextest-core> ━━━━━━━━━━━━━━━━━━━━━━━━━━━━━━━━━━ BACKTRACE ━━━━━━━━━━━━━━━━━━━━━━━━━━━━━━━━━━━
  437. 32.20 s gammaloop-nextest-core> 1: <color_eyre[5722b77bc20a64cf]::config::EyreHook>::into_eyre_hook::{closure#0}<unknown>
  438. 32.20 s gammaloop-nextest-core> at <unknown source file>:<unknown line>
  439. 32.20 s gammaloop-nextest-core> 2: eyre[cb2fd339c0c40fca]::capture_handler<unknown>
  440. 32.20 s gammaloop-nextest-core> at <unknown source file>:<unknown line>
  441. 32.20 s gammaloop-nextest-core> 3: <eyre[cb2fd339c0c40fca]::Report>::from_std::<vakint[ad2b4d4b4d753fb9]::VakintError><unknown>
  442. 32.20 s gammaloop-nextest-core> at <unknown source file>:<unknown line>
  443. 32.20 s gammaloop-nextest-core> 4: <gammalooprs[4688948c89ba1ea7]::uv::approx::integrated::Integrated>::integrate::<gammalooprs[4688948c89ba1ea7]::uv::hedge_poset::ForestNode><unknown>
  444. 32.20 s gammaloop-nextest-core> at <unknown source file>:<unknown line>
  445. 32.20 s gammaloop-nextest-core> 5: <gammalooprs[4688948c89ba1ea7]::uv::approx::integrated::Integrated>::run::<gammalooprs[4688948c89ba1ea7]::uv::hedge_poset::ForestNode, gammalooprs[4688948c89ba1ea7]::uv::hedge_poset::ForestNode><unknown>
  446. 32.20 s gammaloop-nextest-core> at <unknown source file>:<unknown line>
  447. 32.20 s gammaloop-nextest-core> 6: <gammalooprs[4688948c89ba1ea7]::uv::hedge_poset::Forests>::integrate<unknown>
  448. 32.20 s gammaloop-nextest-core> at <unknown source file>:<unknown line>
  449. 32.20 s gammaloop-nextest-core> 7: gammalooprs[4688948c89ba1ea7]::uv::orchestrator::hedge_poset_renormalization_part<unknown>
  450. 32.20 s gammaloop-nextest-core> at <unknown source file>:<unknown line>
  451. 32.20 s gammaloop-nextest-core> 8: <gammalooprs[4688948c89ba1ea7]::uv::settings::UVOrchestrator>::renormalization_part<unknown>
  452. 32.20 s gammaloop-nextest-core> at <unknown source file>:<unknown line>
  453. 32.20 s gammaloop-nextest-core> 9: <gammalooprs[4688948c89ba1ea7]::processes::amplitude::AmplitudeGraph>::renormalization_part<unknown>
  454. 32.20 s gammaloop-nextest-core> at <unknown source file>:<unknown line>
  455. 32.20 s gammaloop-nextest-core> 10: <test_renormalization[c99a4cd1432bec79]::finit_part_ghlo::{closure#0} as core[940e698046960fd5]::ops::function::FnOnce<()>>::call_once<unknown>
  456. 32.20 s gammaloop-nextest-core> at <unknown source file>:<unknown line>
  457. 32.20 s gammaloop-nextest-core> 11: test[75d6903177b1d7e9]::__rust_begin_short_backtrace::<core[940e698046960fd5]::result::Result<(), alloc[2ea6bcb46fca0c42]::string::String>, fn() -> core[940e698046960fd5]::result::Result<(), alloc[2ea6bcb46fca0c42]::string::String>><unknown>
  458. 32.20 s gammaloop-nextest-core> at <unknown source file>:<unknown line>
  459. 32.20 s gammaloop-nextest-core> 12: test[75d6903177b1d7e9]::run_test::{closure#0}<unknown>
  460. 32.20 s gammaloop-nextest-core> at <unknown source file>:<unknown line>
  461. 32.20 s gammaloop-nextest-core> 13: std[bcb96dfbba0ab899]::sys::backtrace::__rust_begin_short_backtrace::<test[75d6903177b1d7e9]::run_test::{closure#1}, ()><unknown>
  462. 32.20 s gammaloop-nextest-core> at <unknown source file>:<unknown line>
  463. 32.20 s gammaloop-nextest-core> 14: <std[bcb96dfbba0ab899]::thread::lifecycle::spawn_unchecked<test[75d6903177b1d7e9]::run_test::{closure#1}, ()>::{closure#1} as core[940e698046960fd5]::ops::function::FnOnce<()>>::call_once::{shim:vtable#0}<unknown>
  464. 32.20 s gammaloop-nextest-core> at <unknown source file>:<unknown line>
  465. 32.20 s gammaloop-nextest-core> 15: <std[bcb96dfbba0ab899]::sys::thread::unix::Thread>::new::thread_start<unknown>
  466. 32.20 s gammaloop-nextest-core> at <unknown source file>:<unknown line>
  467. 32.20 s gammaloop-nextest-core> 16: start_thread<unknown>
  468. 32.20 s gammaloop-nextest-core> at <unknown source file>:<unknown line>
  469. 32.20 s gammaloop-nextest-core> 17: __clone3<unknown>
  470. 32.20 s gammaloop-nextest-core> at <unknown source file>:<unknown line>
  471. 32.20 s gammaloop-nextest-core>
  472. 32.20 s gammaloop-nextest-core> Run with COLORBT_SHOW_HIDDEN=1 environment variable to disable frame filtering.
  473. 32.20 s gammaloop-nextest-core> Run with RUST_BACKTRACE=full to include source snippets.
  474. 32.20 s gammaloop-nextest-core> Location: crates/gammalooprs/tests/test_renormalization.rs:550
  475. 32.20 s gammaloop-nextest-core>
  476. 32.20 s gammaloop-nextest-core> ━━━━━━━━━━━━━━━━━━━━━━━━━━━━━━━━━━ BACKTRACE ━━━━━━━━━━━━━━━━━━━━━━━━━━━━━━━━━━━
  477. 32.20 s gammaloop-nextest-core> 1: <color_eyre[5722b77bc20a64cf]::config::PanicHook>::panic_report<unknown>
  478. 32.20 s gammaloop-nextest-core> at <unknown source file>:<unknown line>
  479. 32.20 s gammaloop-nextest-core> 2: <color_eyre[5722b77bc20a64cf]::config::PanicHook>::into_panic_hook::{closure#0}<unknown>
  480. 32.20 s gammaloop-nextest-core> at <unknown source file>:<unknown line>
  481. 32.20 s gammaloop-nextest-core> 3: std[bcb96dfbba0ab899]::panicking::panic_with_hook<unknown>
  482. 32.20 s gammaloop-nextest-core> at <unknown source file>:<unknown line>
  483. 32.20 s gammaloop-nextest-core> 4: std[bcb96dfbba0ab899]::panicking::panic_handler::{closure#0}<unknown>
  484. 32.20 s gammaloop-nextest-core> at <unknown source file>:<unknown line>
  485. 32.20 s gammaloop-nextest-core> 5: std[bcb96dfbba0ab899]::sys::backtrace::__rust_end_short_backtrace::<std[bcb96dfbba0ab899]::panicking::panic_handler::{closure#0}, !><unknown>
  486. 32.20 s gammaloop-nextest-core> at <unknown source file>:<unknown line>
  487. 32.20 s gammaloop-nextest-core> 6: __rustc[6c289b9f9c454d21]::rust_begin_unwind<unknown>
  488. 32.20 s gammaloop-nextest-core> at <unknown source file>:<unknown line>
  489. 32.20 s gammaloop-nextest-core> 7: core[940e698046960fd5]::panicking::panic_fmt<unknown>
  490. 32.20 s gammaloop-nextest-core> at <unknown source file>:<unknown line>
  491. 32.20 s gammaloop-nextest-core> 8: core[940e698046960fd5]::result::unwrap_failed<unknown>
  492. 32.20 s gammaloop-nextest-core> at <unknown source file>:<unknown line>
  493. 32.20 s gammaloop-nextest-core> 9: <test_renormalization[c99a4cd1432bec79]::finit_part_ghlo::{closure#0} as core[940e698046960fd5]::ops::function::FnOnce<()>>::call_once<unknown>
  494. 32.20 s gammaloop-nextest-core> at <unknown source file>:<unknown line>
  495. 32.20 s gammaloop-nextest-core> 10: test[75d6903177b1d7e9]::__rust_begin_short_backtrace::<core[940e698046960fd5]::result::Result<(), alloc[2ea6bcb46fca0c42]::string::String>, fn() -> core[940e698046960fd5]::result::Result<(), alloc[2ea6bcb46fca0c42]::string::String>><unknown>
  496. 32.20 s gammaloop-nextest-core> at <unknown source file>:<unknown line>
  497. 32.20 s gammaloop-nextest-core> 11: test[75d6903177b1d7e9]::run_test::{closure#0}<unknown>
  498. 32.20 s gammaloop-nextest-core> at <unknown source file>:<unknown line>
  499. 32.20 s gammaloop-nextest-core> 12: std[bcb96dfbba0ab899]::sys::backtrace::__rust_begin_short_backtrace::<test[75d6903177b1d7e9]::run_test::{closure#1}, ()><unknown>
  500. 32.20 s gammaloop-nextest-core> at <unknown source file>:<unknown line>
  501. 32.20 s gammaloop-nextest-core> 13: <std[bcb96dfbba0ab899]::thread::lifecycle::spawn_unchecked<test[75d6903177b1d7e9]::run_test::{closure#1}, ()>::{closure#1} as core[940e698046960fd5]::ops::function::FnOnce<()>>::call_once::{shim:vtable#0}<unknown>
  502. 32.20 s gammaloop-nextest-core> at <unknown source file>:<unknown line>
  503. 32.20 s gammaloop-nextest-core> 14: <std[bcb96dfbba0ab899]::sys::thread::unix::Thread>::new::thread_start<unknown>
  504. 32.20 s gammaloop-nextest-core> at <unknown source file>:<unknown line>
  505. 32.20 s gammaloop-nextest-core> 15: start_thread<unknown>
  506. 32.20 s gammaloop-nextest-core> at <unknown source file>:<unknown line>
  507. 32.20 s gammaloop-nextest-core> 16: __clone3<unknown>
  508. 32.20 s gammaloop-nextest-core> at <unknown source file>:<unknown line>
  509. 32.20 s gammaloop-nextest-core>
  510. 32.20 s gammaloop-nextest-core> Run with COLORBT_SHOW_HIDDEN=1 environment variable to disable frame filtering.
  511. 32.20 s gammaloop-nextest-core> Run with RUST_BACKTRACE=full to include source snippets.
  512. 32.20 s gammaloop-nextest-core>
  513. 32.20 s gammaloop-nextest-core> FAIL [ 0.166s] (444/456) gammalooprs::test_renormalization finite_part_quark_lo
  514. 32.20 s gammaloop-nextest-core> stdout ---
  515. 32.20 s gammaloop-nextest-core>
  516. 32.20 s gammaloop-nextest-core> running 1 test
  517. 32.20 s gammaloop-nextest-core> test finite_part_quark_lo ... FAILED
  518. 32.20 s gammaloop-nextest-core>
  519. 32.20 s gammaloop-nextest-core> failures:
  520. 32.20 s gammaloop-nextest-core>
  521. 32.20 s gammaloop-nextest-core> failures:
  522. 32.20 s gammaloop-nextest-core> finite_part_quark_lo
  523. 32.20 s gammaloop-nextest-core>
  524. 32.20 s gammaloop-nextest-core> test result: FAILED. 0 passed; 1 failed; 0 ignored; 0 measured; 5 filtered out; finished in 0.15s
  525. 32.20 s gammaloop-nextest-core>
  526. 32.20 s gammaloop-nextest-core> stderr ---
  527. 32.20 s gammaloop-nextest-core> The application panicked (crashed).
  528. 32.20 s gammaloop-nextest-core> Message: called `Result::unwrap()` on an `Err` value: "Symbol spenso::mink redefined with new attributes:\n\t- new user data specified: List([String(\"spenso::representation-v2\"), String(\"inline-metric\"), List([String(\"symbol\"), String(\"mink\")]), List([String(\"cyclic\"), Integer(1), List([List([String(\"symbol\"), String(\"mu\")]), List([String(\"symbol\"), String(\"nu\")]), List([String(\"symbol\"), String(\"rho\")]), List([String(\"symbol\"), String(\"sigma\")])])]), String(\"top\")]) vs None\n"
  529. 32.20 s gammaloop-nextest-core> Location: crates/vakint/src/lib.rs:4766
  530. 32.20 s gammaloop-nextest-core>
  531. 32.20 s gammaloop-nextest-core> ━━━━━━━━━━━━━━━━━━━━━━━━━━━━━━━━━━ BACKTRACE ━━━━━━━━━━━━━━━━━━━━━━━━━━━━━━━━━━━
  532. 32.20 s gammaloop-nextest-core> 1: <color_eyre[5722b77bc20a64cf]::config::PanicHook>::panic_report<unknown>
  533. 32.20 s gammaloop-nextest-core> at <unknown source file>:<unknown line>
  534. 32.20 s gammaloop-nextest-core> 2: <color_eyre[5722b77bc20a64cf]::config::PanicHook>::into_panic_hook::{closure#0}<unknown>
  535. 32.20 s gammaloop-nextest-core> at <unknown source file>:<unknown line>
  536. 32.20 s gammaloop-nextest-core> 3: std[bcb96dfbba0ab899]::panicking::panic_with_hook<unknown>
  537. 32.20 s gammaloop-nextest-core> at <unknown source file>:<unknown line>
  538. 32.20 s gammaloop-nextest-core> 4: std[bcb96dfbba0ab899]::panicking::panic_handler::{closure#0}<unknown>
  539. 32.20 s gammaloop-nextest-core> at <unknown source file>:<unknown line>
  540. 32.20 s gammaloop-nextest-core> 5: std[bcb96dfbba0ab899]::sys::backtrace::__rust_end_short_backtrace::<std[bcb96dfbba0ab899]::panicking::panic_handler::{closure#0}, !><unknown>
  541. 32.20 s gammaloop-nextest-core> at <unknown source file>:<unknown line>
  542. 32.20 s gammaloop-nextest-core> 6: __rustc[6c289b9f9c454d21]::rust_begin_unwind<unknown>
  543. 32.20 s gammaloop-nextest-core> at <unknown source file>:<unknown line>
  544. 32.20 s gammaloop-nextest-core> 7: core[940e698046960fd5]::panicking::panic_fmt<unknown>
  545. 32.20 s gammaloop-nextest-core> at <unknown source file>:<unknown line>
  546. 32.20 s gammaloop-nextest-core> 8: core[940e698046960fd5]::result::unwrap_failed<unknown>
  547. 32.20 s gammaloop-nextest-core> at <unknown source file>:<unknown line>
  548. 32.20 s gammaloop-nextest-core> 9: <vakint[ad2b4d4b4d753fb9]::Vakint>::sanitize_user_expressions<unknown>
  549. 32.20 s gammaloop-nextest-core> at <unknown source file>:<unknown line>
  550. 32.20 s gammaloop-nextest-core> 10: <vakint[ad2b4d4b4d753fb9]::Vakint>::prepare_expression_for_form<unknown>
  551. 32.20 s gammaloop-nextest-core> at <unknown source file>:<unknown line>
  552. 32.20 s gammaloop-nextest-core> 11: <vakint[ad2b4d4b4d753fb9]::VakintTerm>::tensor_reduce<unknown>
  553. 32.20 s gammaloop-nextest-core> at <unknown source file>:<unknown line>
  554. 32.20 s gammaloop-nextest-core> 12: <vakint[ad2b4d4b4d753fb9]::VakintExpression>::tensor_reduce<unknown>
  555. 32.20 s gammaloop-nextest-core> at <unknown source file>:<unknown line>
  556. 32.20 s gammaloop-nextest-core> 13: <gammalooprs[4688948c89ba1ea7]::uv::approx::integrated::Integrated>::integrate::<gammalooprs[4688948c89ba1ea7]::uv::hedge_poset::ForestNode><unknown>
  557. 32.20 s gammaloop-nextest-core> at <unknown source file>:<unknown line>
  558. 32.20 s gammaloop-nextest-core> 14: <gammalooprs[4688948c89ba1ea7]::uv::approx::integrated::Integrated>::run::<gammalooprs[4688948c89ba1ea7]::uv::hedge_poset::ForestNode, gammalooprs[4688948c89ba1ea7]::uv::hedge_poset::ForestNode><unknown>
  559. 32.20 s gammaloop-nextest-core> at <unknown source file>:<unknown line>
  560. 32.20 s gammaloop-nextest-core> 15: <gammalooprs[4688948c89ba1ea7]::uv::hedge_poset::Forests>::integrate<unknown>
  561. 32.20 s gammaloop-nextest-core> at <unknown source file>:<unknown line>
  562. 32.20 s gammaloop-nextest-core> 16: gammalooprs[4688948c89ba1ea7]::uv::orchestrator::hedge_poset_renormalization_part<unknown>
  563. 32.20 s gammaloop-nextest-core> at <unknown source file>:<unknown line>
  564. 32.20 s gammaloop-nextest-core> 17: <gammalooprs[4688948c89ba1ea7]::uv::settings::UVOrchestrator>::renormalization_part<unknown>
  565. 32.20 s gammaloop-nextest-core> at <unknown source file>:<unknown line>
  566. 32.20 s gammaloop-nextest-core> 18: <gammalooprs[4688948c89ba1ea7]::processes::amplitude::AmplitudeGraph>::renormalization_part<unknown>
  567. 32.20 s gammaloop-nextest-core> at <unknown source file>:<unknown line>
  568. 32.20 s gammaloop-nextest-core> 19: <test_renormalization[c99a4cd1432bec79]::finite_part_quark_lo::{closure#0} as core[940e698046960fd5]::ops::function::FnOnce<()>>::call_once<unknown>
  569. 32.20 s gammaloop-nextest-core> at <unknown source file>:<unknown line>
  570. 32.20 s gammaloop-nextest-core> 20: test[75d6903177b1d7e9]::__rust_begin_short_backtrace::<core[940e698046960fd5]::result::Result<(), alloc[2ea6bcb46fca0c42]::string::String>, fn() -> core[940e698046960fd5]::result::Result<(), alloc[2ea6bcb46fca0c42]::string::String>><unknown>
  571. 32.20 s gammaloop-nextest-core> at <unknown source file>:<unknown line>
  572. 32.20 s gammaloop-nextest-core> 21: test[75d6903177b1d7e9]::run_test::{closure#0}<unknown>
  573. 32.20 s gammaloop-nextest-core> at <unknown source file>:<unknown line>
  574. 32.20 s gammaloop-nextest-core> 22: std[bcb96dfbba0ab899]::sys::backtrace::__rust_begin_short_backtrace::<test[75d6903177b1d7e9]::run_test::{closure#1}, ()><unknown>
  575. 32.20 s gammaloop-nextest-core> at <unknown source file>:<unknown line>
  576. 32.20 s gammaloop-nextest-core> 23: <std[bcb96dfbba0ab899]::thread::lifecycle::spawn_unchecked<test[75d6903177b1d7e9]::run_test::{closure#1}, ()>::{closure#1} as core[940e698046960fd5]::ops::function::FnOnce<()>>::call_once::{shim:vtable#0}<unknown>
  577. 32.20 s gammaloop-nextest-core> at <unknown source file>:<unknown line>
  578. 32.20 s gammaloop-nextest-core> 24: <std[bcb96dfbba0ab899]::sys::thread::unix::Thread>::new::thread_start<unknown>
  579. 32.20 s gammaloop-nextest-core> at <unknown source file>:<unknown line>
  580. 32.20 s gammaloop-nextest-core> 25: start_thread<unknown>
  581. 32.20 s gammaloop-nextest-core> at <unknown source file>:<unknown line>
  582. 32.20 s gammaloop-nextest-core> 26: __clone3<unknown>
  583. 32.20 s gammaloop-nextest-core> at <unknown source file>:<unknown line>
  584. 32.20 s gammaloop-nextest-core>
  585. 32.20 s gammaloop-nextest-core> Run with COLORBT_SHOW_HIDDEN=1 environment variable to disable frame filtering.
  586. 32.20 s gammaloop-nextest-core> Run with RUST_BACKTRACE=full to include source snippets.
  587. 32.20 s gammaloop-nextest-core>
  588. 32.20 s gammaloop-nextest-core> FAIL [ 0.379s] (447/456) gammalooprs::test_renormalization finite_part_ghost_2loop
  589. 32.20 s gammaloop-nextest-core> stdout ---
  590. 32.20 s gammaloop-nextest-core>
  591. 32.20 s gammaloop-nextest-core> running 1 test
  592. 32.20 s gammaloop-nextest-core> test finite_part_ghost_2loop ... FAILED
  593. 32.20 s gammaloop-nextest-core>
  594. 32.20 s gammaloop-nextest-core> failures:
  595. 32.20 s gammaloop-nextest-core>
  596. 32.20 s gammaloop-nextest-core> failures:
  597. 32.20 s gammaloop-nextest-core> finite_part_ghost_2loop
  598. 32.20 s gammaloop-nextest-core>
  599. 32.20 s gammaloop-nextest-core> test result: FAILED. 0 passed; 1 failed; 0 ignored; 0 measured; 5 filtered out; finished in 0.36s
  600. 32.20 s gammaloop-nextest-core>
  601. 32.20 s gammaloop-nextest-core> stderr ---
  602. 32.20 s gammaloop-nextest-core> The application panicked (crashed).
  603. 32.20 s gammaloop-nextest-core> Message: called `Result::unwrap()` on an `Err` value:
  604. 32.20 s gammaloop-nextest-core> 0: Symbolica could not parse FORM output:
  605. 32.20 s gammaloop-nextest-core> [spenso::{antisymmetric,real,spenso::tensor}::f]([spenso::{spenso::representat\
  606. 32.20 s gammaloop-nextest-core> ion,spenso::self_dual}::coad](8,[gammalooprs::{spenso::index}::hedge](0)
  607. 32.20 s gammaloop-nextest-core> ),[spenso::{spenso::representation,spenso::self_dual}::coad](8,[gammaloo\
  608. 32.20 s gammaloop-nextest-core> prs::{spenso::index}::hedge](3)),[spenso::{spenso::representation,spenso\
  609. 32.20 s gammaloop-nextest-core> ::self_dual}::coad](8,[gammalooprs::{spenso::index}::hedge](5)))*
  610. 32.20 s gammaloop-nextest-core> [spenso::{antisymmetric,real,spenso::tensor}::f]([spenso::{spenso::repre\
  611. 32.20 s gammaloop-nextest-core> sentation,spenso::self_dual}::coad](8,[gammalooprs::{spenso::index}::hed\
  612. 32.20 s gammaloop-nextest-core> ge](1)),[spenso::{spenso::representation,spenso::self_dual}::coad](8,
  613. 32.20 s gammaloop-nextest-core> [gammalooprs::{spenso::index}::hedge](11)),[spenso::{spenso::representat\
  614. 32.20 s gammaloop-nextest-core> ion,spenso::self_dual}::coad](8,[gammalooprs::{spenso::index}::hedge](7)
  615. 32.20 s gammaloop-nextest-core> ))*[spenso::{antisymmetric,real,spenso::tensor}::f]([spenso::{spenso::re\
  616. 32.20 s gammaloop-nextest-core> presentation,spenso::self_dual}::coad](8,[gammalooprs::{spenso::index}::\
  617. 32.20 s gammaloop-nextest-core> hedge](3)),[spenso::{spenso::representation,spenso::self_dual}::coad](8,
  618. 32.20 s gammaloop-nextest-core> [gammalooprs::{spenso::index}::hedge](7)),[spenso::{spenso::representati\
  619. 32.20 s gammaloop-nextest-core> on,spenso::self_dual}::coad](8,[gammalooprs::{spenso::index}::hedge](9))
  620. 32.20 s gammaloop-nextest-core> )*[spenso::{antisymmetric,real,spenso::tensor}::f]([spenso::{spenso::rep\
  621. 32.20 s gammaloop-nextest-core> resentation,spenso::self_dual}::coad](8,[gammalooprs::{spenso::index}::h\
  622. 32.20 s gammaloop-nextest-core> edge](11)),[spenso::{spenso::representation,spenso::self_dual}::coad](8,
  623. 32.21 s gammaloop-nextest-core> [gammalooprs::{spenso::index}::hedge](5)),[spenso::{spenso::representati\
  624. 32.21 s gammaloop-nextest-core> on,spenso::self_dual}::coad](8,[gammalooprs::{spenso::index}::hedge](9))
  625. 32.21 s gammaloop-nextest-core> )*dot(p4,p0)*dot(k1,k1)*dot(k2,k2)*i_*[UFO::{}::GC_10]^4*rat(-1,ep - 2)
  626. 32.21 s gammaloop-nextest-core> + [spenso::{antisymmetric,real,spenso::tensor}::f]([spenso::{spenso::re\
  627. 32.21 s gammaloop-nextest-core> presentation,spenso::self_dual}::coad](8,[gammalooprs::{spenso::index}::\
  628. 32.21 s gammaloop-nextest-core> hedge](0)),[spenso::{spenso::representation,spenso::self_dual}::coad](8,
  629. 32.21 s gammaloop-nextest-core> [gammalooprs::{spenso::index}::hedge](3)),[spenso::{spenso::representati\
  630. 32.21 s gammaloop-nextest-core> on,spenso::self_dual}::coad](8,[gammalooprs::{spenso::index}::hedge](5))
  631. 32.21 s gammaloop-nextest-core> )*[spenso::{antisymmetric,real,spenso::tensor}::f]([spenso::{spenso::rep\
  632. 32.21 s gammaloop-nextest-core> resentation,spenso::self_dual}::coad](8,[gammalooprs::{spenso::index}::h\
  633. 32.21 s gammaloop-nextest-core> edge](1)),[spenso::{spenso::representation,spenso::self_dual}::coad](8,
  634. 32.21 s gammaloop-nextest-core> [gammalooprs::{spenso::index}::hedge](11)),[spenso::{spenso::representat\
  635. 32.21 s gammaloop-nextest-core> ion,spenso::self_dual}::coad](8,[gammalooprs::{spenso::index}::hedge](7)
  636. 32.21 s gammaloop-nextest-core> ))*[spenso::{antisymmetric,real,spenso::tensor}::f]([spenso::{spenso::re\
  637. 32.21 s gammaloop-nextest-core> presentation,spenso::self_dual}::coad](8,[gammalooprs::{spenso::index}::\
  638. 32.21 s gammaloop-nextest-core> hedge](3)),[spenso::{spenso::representation,spenso::self_dual}::coad](8,
  639. 32.21 s gammaloop-nextest-core> [gammalooprs::{spenso::index}::hedge](7)),[spenso::{spenso::representati\
  640. 32.21 s gammaloop-nextest-core> on,spenso::self_dual}::coad](8,[gammalooprs::{spenso::index}::hedge](9))
  641. 32.21 s gammaloop-nextest-core> )*[spenso::{antisymmetric,real,spenso::tensor}::f]([spenso::{spenso::rep\
  642. 32.21 s gammaloop-nextest-core> resentation,spenso::self_dual}::coad](8,[gammalooprs::{spenso::index}::h\
  643. 32.21 s gammaloop-nextest-core> edge](11)),[spenso::{spenso::representation,spenso::self_dual}::coad](8,
  644. 32.21 s gammaloop-nextest-core> [gammalooprs::{spenso::index}::hedge](5)),[spenso::{spenso::representati\
  645. 32.21 s gammaloop-nextest-core> on,spenso::self_dual}::coad](8,[gammalooprs::{spenso::index}::hedge](9))
  646. 32.21 s gammaloop-nextest-core> )*dot(p4,p0)*dot(k1,k2)^2*i_*[UFO::{}::GC_10]^4*rat(1,ep - 2)
  647. 32.21 s gammaloop-nextest-core>
  648. 32.21 s gammaloop-nextest-core> Error:Symbol spenso::coad redefined with new attributes:
  649. 32.21 s gammaloop-nextest-core> - new user data specified: List([String("spenso::representation-v2"), String("self-dual"), List([String("symbol"), String("coad")]), List([String("cyclic"), Integer(1), List([List([String("symbol"), String("a")]), List([String("symbol"), String("b")]), List([String("symbol"), String("c")]), List([String("symbol"), String("d")])])]), String("top")]) vs None
  650. 32.21 s gammaloop-nextest-core>
  651. 32.21 s gammaloop-nextest-core>
  652. 32.21 s gammaloop-nextest-core> Location:
  653. 32.21 s gammaloop-nextest-core> crates/gammalooprs/src/uv/approx/integrated.rs:332
  654. 32.21 s gammaloop-nextest-core>
  655. 32.21 s gammaloop-nextest-core> ━━━━━━━━━━━━━━━━━━━━━━━━━━━━━━━━━━ BACKTRACE ━━━━━━━━━━━━━━━━━━━━━━━━━━━━━━━━━━━
  656. 32.21 s gammaloop-nextest-core> 1: <color_eyre[5722b77bc20a64cf]::config::EyreHook>::into_eyre_hook::{closure#0}<unknown>
  657. 32.21 s gammaloop-nextest-core> at <unknown source file>:<unknown line>
  658. 32.21 s gammaloop-nextest-core> 2: eyre[cb2fd339c0c40fca]::capture_handler<unknown>
  659. 32.21 s gammaloop-nextest-core> at <unknown source file>:<unknown line>
  660. 32.21 s gammaloop-nextest-core> 3: <eyre[cb2fd339c0c40fca]::Report>::from_std::<vakint[ad2b4d4b4d753fb9]::VakintError><unknown>
  661. 32.21 s gammaloop-nextest-core> at <unknown source file>:<unknown line>
  662. 32.21 s gammaloop-nextest-core> 4: <gammalooprs[4688948c89ba1ea7]::uv::approx::integrated::Integrated>::integrate::<gammalooprs[4688948c89ba1ea7]::uv::approx::Approximation><unknown>
  663. 32.21 s gammaloop-nextest-core> at <unknown source file>:<unknown line>
  664. 32.21 s gammaloop-nextest-core> 5: <gammalooprs[4688948c89ba1ea7]::uv::forest::Forest>::compute<unknown>
  665. 32.21 s gammaloop-nextest-core> at <unknown source file>:<unknown line>
  666. 32.21 s gammaloop-nextest-core> 6: gammalooprs[4688948c89ba1ea7]::uv::orchestrator::legacy_renormalization_part<unknown>
  667. 32.21 s gammaloop-nextest-core> at <unknown source file>:<unknown line>
  668. 32.21 s gammaloop-nextest-core> 7: <gammalooprs[4688948c89ba1ea7]::uv::settings::UVOrchestrator>::renormalization_part<unknown>
  669. 32.21 s gammaloop-nextest-core> at <unknown source file>:<unknown line>
  670. 32.21 s gammaloop-nextest-core> 8: <gammalooprs[4688948c89ba1ea7]::processes::amplitude::AmplitudeGraph>::renormalization_part<unknown>
  671. 32.21 s gammaloop-nextest-core> at <unknown source file>:<unknown line>
  672. 32.21 s gammaloop-nextest-core> 9: test_renormalization[c99a4cd1432bec79]::finite_part_ghost_2loop<unknown>
  673. 32.21 s gammaloop-nextest-core> at <unknown source file>:<unknown line>
  674. 32.21 s gammaloop-nextest-core> 10: <test_renormalization[c99a4cd1432bec79]::finite_part_ghost_2loop::{closure#0} as core[940e698046960fd5]::ops::function::FnOnce<()>>::call_once<unknown>
  675. 32.21 s gammaloop-nextest-core> at <unknown source file>:<unknown line>
  676. 32.21 s gammaloop-nextest-core> 11: test[75d6903177b1d7e9]::__rust_begin_short_backtrace::<core[940e698046960fd5]::result::Result<(), alloc[2ea6bcb46fca0c42]::string::String>, fn() -> core[940e698046960fd5]::result::Result<(), alloc[2ea6bcb46fca0c42]::string::String>><unknown>
  677. 32.21 s gammaloop-nextest-core> at <unknown source file>:<unknown line>
  678. 32.21 s gammaloop-nextest-core> 12: test[75d6903177b1d7e9]::run_test::{closure#0}<unknown>
  679. 32.21 s gammaloop-nextest-core> at <unknown source file>:<unknown line>
  680. 32.21 s gammaloop-nextest-core> 13: std[bcb96dfbba0ab899]::sys::backtrace::__rust_begin_short_backtrace::<test[75d6903177b1d7e9]::run_test::{closure#1}, ()><unknown>
  681. 32.21 s gammaloop-nextest-core> at <unknown source file>:<unknown line>
  682. 32.21 s gammaloop-nextest-core> 14: <std[bcb96dfbba0ab899]::thread::lifecycle::spawn_unchecked<test[75d6903177b1d7e9]::run_test::{closure#1}, ()>::{closure#1} as core[940e698046960fd5]::ops::function::FnOnce<()>>::call_once::{shim:vtable#0}<unknown>
  683. 32.21 s gammaloop-nextest-core> at <unknown source file>:<unknown line>
  684. 32.21 s gammaloop-nextest-core> 15: <std[bcb96dfbba0ab899]::sys::thread::unix::Thread>::new::thread_start<unknown>
  685. 32.21 s gammaloop-nextest-core> at <unknown source file>:<unknown line>
  686. 32.21 s gammaloop-nextest-core> 16: start_thread<unknown>
  687. 32.21 s gammaloop-nextest-core> at <unknown source file>:<unknown line>
  688. 32.21 s gammaloop-nextest-core> 17: __clone3<unknown>
  689. 32.21 s gammaloop-nextest-core> at <unknown source file>:<unknown line>
  690. 32.21 s gammaloop-nextest-core>
  691. 32.21 s gammaloop-nextest-core> Run with COLORBT_SHOW_HIDDEN=1 environment variable to disable frame filtering.
  692. 32.21 s gammaloop-nextest-core> Run with RUST_BACKTRACE=full to include source snippets.
  693. 32.21 s gammaloop-nextest-core> Location: crates/gammalooprs/tests/test_renormalization.rs:445
  694. 32.21 s gammaloop-nextest-core>
  695. 32.21 s gammaloop-nextest-core> ━━━━━━━━━━━━━━━━━━━━━━━━━━━━━━━━━━ BACKTRACE ━━━━━━━━━━━━━━━━━━━━━━━━━━━━━━━━━━━
  696. 32.21 s gammaloop-nextest-core> 1: <color_eyre[5722b77bc20a64cf]::config::PanicHook>::panic_report<unknown>
  697. 32.21 s gammaloop-nextest-core> at <unknown source file>:<unknown line>
  698. 32.21 s gammaloop-nextest-core> 2: <color_eyre[5722b77bc20a64cf]::config::PanicHook>::into_panic_hook::{closure#0}<unknown>
  699. 32.21 s gammaloop-nextest-core> at <unknown source file>:<unknown line>
  700. 32.21 s gammaloop-nextest-core> 3: std[bcb96dfbba0ab899]::panicking::panic_with_hook<unknown>
  701. 32.21 s gammaloop-nextest-core> at <unknown source file>:<unknown line>
  702. 32.21 s gammaloop-nextest-core> 4: std[bcb96dfbba0ab899]::panicking::panic_handler::{closure#0}<unknown>
  703. 32.21 s gammaloop-nextest-core> at <unknown source file>:<unknown line>
  704. 32.21 s gammaloop-nextest-core> 5: std[bcb96dfbba0ab899]::sys::backtrace::__rust_end_short_backtrace::<std[bcb96dfbba0ab899]::panicking::panic_handler::{closure#0}, !><unknown>
  705. 32.21 s gammaloop-nextest-core> at <unknown source file>:<unknown line>
  706. 32.21 s gammaloop-nextest-core> 6: __rustc[6c289b9f9c454d21]::rust_begin_unwind<unknown>
  707. 32.21 s gammaloop-nextest-core> at <unknown source file>:<unknown line>
  708. 32.21 s gammaloop-nextest-core> 7: core[940e698046960fd5]::panicking::panic_fmt<unknown>
  709. 32.21 s gammaloop-nextest-core> at <unknown source file>:<unknown line>
  710. 32.21 s gammaloop-nextest-core> 8: core[940e698046960fd5]::result::unwrap_failed<unknown>
  711. 32.21 s gammaloop-nextest-core> at <unknown source file>:<unknown line>
  712. 32.21 s gammaloop-nextest-core> 9: test_renormalization[c99a4cd1432bec79]::finite_part_ghost_2loop<unknown>
  713. 32.21 s gammaloop-nextest-core> at <unknown source file>:<unknown line>
  714. 32.21 s gammaloop-nextest-core> 10: <test_renormalization[c99a4cd1432bec79]::finite_part_ghost_2loop::{closure#0} as core[940e698046960fd5]::ops::function::FnOnce<()>>::call_once<unknown>
  715. 32.21 s gammaloop-nextest-core> at <unknown source file>:<unknown line>
  716. 32.21 s gammaloop-nextest-core> 11: test[75d6903177b1d7e9]::__rust_begin_short_backtrace::<core[940e698046960fd5]::result::Result<(), alloc[2ea6bcb46fca0c42]::string::String>, fn() -> core[940e698046960fd5]::result::Result<(), alloc[2ea6bcb46fca0c42]::string::String>><unknown>
  717. 32.21 s gammaloop-nextest-core> at <unknown source file>:<unknown line>
  718. 32.21 s gammaloop-nextest-core> 12: test[75d6903177b1d7e9]::run_test::{closure#0}<unknown>
  719. 32.21 s gammaloop-nextest-core> at <unknown source file>:<unknown line>
  720. 32.21 s gammaloop-nextest-core> 13: std[bcb96dfbba0ab899]::sys::backtrace::__rust_begin_short_backtrace::<test[75d6903177b1d7e9]::run_test::{closure#1}, ()><unknown>
  721. 32.21 s gammaloop-nextest-core> at <unknown source file>:<unknown line>
  722. 32.21 s gammaloop-nextest-core> 14: <std[bcb96dfbba0ab899]::thread::lifecycle::spawn_unchecked<test[75d6903177b1d7e9]::run_test::{closure#1}, ()>::{closure#1} as core[940e698046960fd5]::ops::function::FnOnce<()>>::call_once::{shim:vtable#0}<unknown>
  723. 32.21 s gammaloop-nextest-core> at <unknown source file>:<unknown line>
  724. 32.21 s gammaloop-nextest-core> 15: <std[bcb96dfbba0ab899]::sys::thread::unix::Thread>::new::thread_start<unknown>
  725. 32.21 s gammaloop-nextest-core> at <unknown source file>:<unknown line>
  726. 32.21 s gammaloop-nextest-core> 16: start_thread<unknown>
  727. 32.21 s gammaloop-nextest-core> at <unknown source file>:<unknown line>
  728. 32.21 s gammaloop-nextest-core> 17: __clone3<unknown>
  729. 32.21 s gammaloop-nextest-core> at <unknown source file>:<unknown line>
  730. 32.21 s gammaloop-nextest-core>
  731. 32.21 s gammaloop-nextest-core> Run with COLORBT_SHOW_HIDDEN=1 environment variable to disable frame filtering.
  732. 32.21 s gammaloop-nextest-core> Run with RUST_BACKTRACE=full to include source snippets.
  733. 32.21 s gammaloop-nextest-core>
  734. 32.28 s gammaloop-nextest-core> error: test run failed
  735. 32.31 s gammaloop-nextest-core>
  736. 32.31 s gammaloop-nextest-core> ========== nextest test summary ==========
  737. 32.31 s gammaloop-nextest-core> report: target/nextest/ci_gammaloop/junit.xml
  738. 32.31 s gammaloop-nextest-core> tests: 456, failures: 3, errors: 0
  739. 32.31 s gammaloop-nextest-core>
  740. 32.31 s gammaloop-nextest-core> 1. gammalooprs::test_renormalization::finit_part_ghlo
  741. 32.31 s gammaloop-nextest-core> failure: test failure with exit code 101
  742. 32.31 s gammaloop-nextest-core> system-out
  743. 32.31 s gammaloop-nextest-core> running 1 test
  744. 32.31 s gammaloop-nextest-core> test finit_part_ghlo ... FAILED
  745. 32.31 s gammaloop-nextest-core>
  746. 32.31 s gammaloop-nextest-core> failures:
  747. 32.31 s gammaloop-nextest-core>
  748. 32.31 s gammaloop-nextest-core> failures:
  749. 32.31 s gammaloop-nextest-core> finit_part_ghlo
  750. 32.31 s gammaloop-nextest-core>
  751. 32.31 s gammaloop-nextest-core> test result: FAILED. 0 passed; 1 failed; 0 ignored; 0 measured; 5 filtered out; finished in 0.19s
  752. 32.31 s gammaloop-nextest-core> system-err
  753. 32.31 s gammaloop-nextest-core> The application panicked (crashed).
  754. 32.31 s gammaloop-nextest-core> Message: called `Result::unwrap()` on an `Err` value:
  755. 32.31 s gammaloop-nextest-core> 0: Symbolica could not parse FORM output:
  756. 32.31 s gammaloop-nextest-core> [spenso::{antisymmetric,real,spenso::tensor}::f]([spenso::{spenso::representat\
  757. 32.31 s gammaloop-nextest-core> ion,spenso::self_dual}::coad](8,[gammalooprs::{spenso::index}::hedge](0)
  758. 32.31 s gammaloop-nextest-core> ),[spenso::{spenso::representation,spenso::self_dual}::coad](8,[gammaloo\
  759. 32.31 s gammaloop-nextest-core> prs::{spenso::index}::hedge](3)),[spenso::{spenso::representation,spenso\
  760. 32.31 s gammaloop-nextest-core> ::self_dual}::coad](8,[gammalooprs::{spenso::index}::hedge](5)))*
  761. 32.31 s gammaloop-nextest-core> [spenso::{antisymmetric,real,spenso::tensor}::f]([spenso::{spenso::repre\
  762. 32.31 s gammaloop-nextest-core> sentation,spenso::self_dual}::coad](8,[gammalooprs::{spenso::index}::hed\
  763. 32.31 s gammaloop-nextest-core> ge](1)),[spenso::{spenso::representation,spenso::self_dual}::coad](8,
  764. 32.31 s gammaloop-nextest-core> [gammalooprs::{spenso::index}::hedge](3)),[spenso::{spenso::representati\
  765. 32.31 s gammaloop-nextest-core> on,spenso::self_dual}::coad](8,[gammalooprs::{spenso::index}::hedge](5))
  766. 32.31 s gammaloop-nextest-core> )*dot(p1,p0)*[UFO::{}::GC_10]^2*rat(-1,1)
  767. 32.31 s gammaloop-nextest-core>
  768. 32.31 s gammaloop-nextest-core> Error:Symbol spenso::coad redefined with new attributes:
  769. 32.31 s gammaloop-nextest-core> - new user data specified: List([String("spenso::representation-v2"), String("self-dual"), List([String("symbol"), String("coad")]), List([String("cyclic"), Integer(1), List([List([String("symbol"), String("a")]), List([String("symbol"), String("b")]), List([String("symbol"), String("c")]), List([String("symbol"), String("d")])])]), String("top")]) vs None
  770. 32.31 s gammaloop-nextest-core>
  771. 32.31 s gammaloop-nextest-core>
  772. 32.31 s gammaloop-nextest-core> Location:
  773. 32.31 s gammaloop-nextest-core> crates/gammalooprs/src/uv/approx/integrated.rs:332
  774. 32.31 s gammaloop-nextest-core>
  775. 32.31 s gammaloop-nextest-core> ━━━━━━━━━━━━━━━━━━━━━━━━━━━━━━━━━━ BACKTRACE ━━━━━━━━━━━━━━━━━━━━━━━━━━━━━━━━━━━
  776. 32.31 s gammaloop-nextest-core> 1: <color_eyre[5722b77bc20a64cf]::config::EyreHook>::into_eyre_hook::{closure#0}<unknown>
  777. 32.31 s gammaloop-nextest-core> at <unknown source file>:<unknown line>
  778. 32.31 s gammaloop-nextest-core> 2: eyre[cb2fd339c0c40fca]::capture_handler<unknown>
  779. 32.31 s gammaloop-nextest-core> at <unknown source file>:<unknown line>
  780. 32.31 s gammaloop-nextest-core> 3: <eyre[cb2fd339c0c40fca]::Report>::from_std::<vakint[ad2b4d4b4d753fb9]::VakintError><unknown>
  781. 32.31 s gammaloop-nextest-core> at <unknown source file>:<unknown line>
  782. 32.31 s gammaloop-nextest-core> 4: <gammalooprs[4688948c89ba1ea7]::uv::approx::integrated::Integrated>::integrate::<gammalooprs[4688948c89ba1ea7]::uv::hedge_poset::ForestNode><unknown>
  783. 32.31 s gammaloop-nextest-core> at <unknown source file>:<unknown line>
  784. 32.31 s gammaloop-nextest-core> 5: <gammalooprs[4688948c89ba1ea7]::uv::approx::integrated::Integrated>::run::<gammalooprs[4688948c89ba1ea7]::uv::hedge_poset::ForestNode, gammalooprs[4688948c89ba1ea7]::uv::hedge_poset::ForestNode><unknown>
  785. 32.31 s gammaloop-nextest-core> at <unknown source file>:<unknown line>
  786. 32.31 s gammaloop-nextest-core> 6: <gammalooprs[4688948c89ba1ea7]::uv::hedge_poset::Forests>::integrate<unknown>
  787. 32.31 s gammaloop-nextest-core> at <unknown source file>:<unknown line>
  788. 32.31 s gammaloop-nextest-core> 7: gammalooprs[4688948c89ba1ea7]::uv::orchestrator::hedge_poset_renormalization_part<unknown>
  789. 32.31 s gammaloop-nextest-core> at <unknown source file>:<unknown line>
  790. 32.31 s gammaloop-nextest-core> 8: <gammalooprs[4688948c89ba1ea7]::uv::settings::UVOrchestrator>::renormalization_part<unknown>
  791. 32.31 s gammaloop-nextest-core> at <unknown source file>:<unknown line>
  792. 32.31 s gammaloop-nextest-core> 9: <gammalooprs[4688948c89ba1ea7]::processes::amplitude::AmplitudeGraph>::renormalization_part<unknown>
  793. 32.31 s gammaloop-nextest-core> at <unknown source file>:<unknown line>
  794. 32.31 s gammaloop-nextest-core> 10: <test_renormalization[c99a4cd1432bec79]::finit_part_ghlo::{closure#0} as core[940e698046960fd5]::ops::function::FnOnce<()>>::call_once<unknown>
  795. 32.31 s gammaloop-nextest-core> at <unknown source file>:<unknown line>
  796. 32.31 s gammaloop-nextest-core> 11: test[75d6903177b1d7e9]::__rust_begin_short_backtrace::<core[940e698046960fd5]::result::Result<(), alloc[2ea6bcb46fca0c42]::string::String>, fn() -> core[940e698046960fd5]::result::Result<(), alloc[2ea6bcb46fca0c42]::string::String>><unknown>
  797. 32.31 s gammaloop-nextest-core> at <unknown source file>:<unknown line>
  798. 32.31 s gammaloop-nextest-core> 12: test[75d6903177b1d7e9]::run_test::{closure#0}<unknown>
  799. 32.31 s gammaloop-nextest-core> at <unknown source file>:<unknown line>
  800. 32.31 s gammaloop-nextest-core> 13: std[bcb96dfbba0ab899]::sys::backtrace::__rust_begin_short_backtrace::<test[75d6903177b1d7e9]::run_test::{closure#1}, ()><unknown>
  801. 32.31 s gammaloop-nextest-core> at <unknown source file>:<unknown line>
  802. 32.31 s gammaloop-nextest-core> 14: <std[bcb96dfbba0ab899]::thread::lifecycle::spawn_unchecked<test[75d6903177b1d7e9]::run_test::{closure#1}, ()>::{closure#1} as core[940e698046960fd5]::ops::function::FnOnce<()>>::call_once::{shim:vtable#0}<unknown>
  803. 32.31 s gammaloop-nextest-core> at <unknown source file>:<unknown line>
  804. 32.31 s gammaloop-nextest-core> 15: <std[bcb96dfbba0ab899]::sys::thread::unix::Thread>::new::thread_start<unknown>
  805. 32.31 s gammaloop-nextest-core> at <unknown source file>:<unknown line>
  806. 32.31 s gammaloop-nextest-core> 16: start_thread<unknown>
  807. 32.31 s gammaloop-nextest-core> at <unknown source file>:<unknown line>
  808. 32.31 s gammaloop-nextest-core> 17: __clone3<unknown>
  809. 32.31 s gammaloop-nextest-core> at <unknown source file>:<unknown line>
  810. 32.31 s gammaloop-nextest-core>
  811. 32.31 s gammaloop-nextest-core> Run with COLORBT_SHOW_HIDDEN=1 environment variable to disable frame filtering.
  812. 32.31 s gammaloop-nextest-core> Run with RUST_BACKTRACE=full to include source snippets.
  813. 32.31 s gammaloop-nextest-core> Location: crates/gammalooprs/tests/test_renormalization.rs:550
  814. 32.31 s gammaloop-nextest-core>
  815. 32.31 s gammaloop-nextest-core> ━━━━━━━━━━━━━━━━━━━━━━━━━━━━━━━━━━ BACKTRACE ━━━━━━━━━━━━━━━━━━━━━━━━━━━━━━━━━━━
  816. 32.31 s gammaloop-nextest-core> 1: <color_eyre[5722b77bc20a64cf]::config::PanicHook>::panic_report<unknown>
  817. 32.31 s gammaloop-nextest-core> at <unknown source file>:<unknown line>
  818. 32.31 s gammaloop-nextest-core> 2: <color_eyre[5722b77bc20a64cf]::config::PanicHook>::into_panic_hook::{closure#0}<unknown>
  819. 32.31 s gammaloop-nextest-core> at <unknown source file>:<unknown line>
  820. 32.31 s gammaloop-nextest-core> 3: std[bcb96dfbba0ab899]::panicking::panic_with_hook<unknown>
  821. 32.31 s gammaloop-nextest-core> at <unknown source file>:<unknown line>
  822. 32.31 s gammaloop-nextest-core> 4: std[bcb96dfbba0ab899]::panicking::panic_handler::{closure#0}<unknown>
  823. 32.31 s gammaloop-nextest-core> at <unknown source file>:<unknown line>
  824. 32.31 s gammaloop-nextest-core> 5: std[bcb96dfbba0ab899]::sys::backtrace::__rust_end_short_backtrace::<std[bcb96dfbba0ab899]::panicking::panic_handler::{closure#0}, !><unknown>
  825. 32.31 s gammaloop-nextest-core> at <unknown source file>:<unknown line>
  826. 32.31 s gammaloop-nextest-core> 6: __rustc[6c289b9f9c454d21]::rust_begin_unwind<unknown>
  827. 32.31 s gammaloop-nextest-core> at <unknown source file>:<unknown line>
  828. 32.31 s gammaloop-nextest-core> 7: core[940e698046960fd5]::panicking::panic_fmt<unknown>
  829. 32.31 s gammaloop-nextest-core> at <unknown source file>:<unknown line>
  830. 32.31 s gammaloop-nextest-core> 8: core[940e698046960fd5]::result::unwrap_failed<unknown>
  831. 32.31 s gammaloop-nextest-core> at <unknown source file>:<unknown line>
  832. 32.31 s gammaloop-nextest-core> 9: <test_renormalization[c99a4cd1432bec79]::finit_part_ghlo::{closure#0} as core[940e698046960fd5]::ops::function::FnOnce<()>>::call_once<unknown>
  833. 32.31 s gammaloop-nextest-core> at <unknown source file>:<unknown line>
  834. 32.31 s gammaloop-nextest-core> 10: test[75d6903177b1d7e9]::__rust_begin_short_backtrace::<core[940e698046960fd5]::result::Result<(), alloc[2ea6bcb46fca0c42]::string::String>, fn() -> core[940e698046960fd5]::result::Result<(), alloc[2ea6bcb46fca0c42]::string::String>><unknown>
  835. 32.31 s gammaloop-nextest-core> at <unknown source file>:<unknown line>
  836. 32.31 s gammaloop-nextest-core> 11: test[75d6903177b1d7e9]::run_test::{closure#0}<unknown>
  837. 32.31 s gammaloop-nextest-core> at <unknown source file>:<unknown line>
  838. 32.31 s gammaloop-nextest-core> 12: std[bcb96dfbba0ab899]::sys::backtrace::__rust_begin_short_backtrace::<test[75d6903177b1d7e9]::run_test::{closure#1}, ()><unknown>
  839. 32.31 s gammaloop-nextest-core> at <unknown source file>:<unknown line>
  840. 32.31 s gammaloop-nextest-core> 13: <std[bcb96dfbba0ab899]::thread::lifecycle::spawn_unchecked<test[75d6903177b1d7e9]::run_test::{closure#1}, ()>::{closure#1} as core[940e698046960fd5]::ops::function::FnOnce<()>>::call_once::{shim:vtable#0}<unknown>
  841. 32.31 s gammaloop-nextest-core> at <unknown source file>:<unknown line>
  842. 32.31 s gammaloop-nextest-core> 14: <std[bcb96dfbba0ab899]::sys::thread::unix::Thread>::new::thread_start<unknown>
  843. 32.31 s gammaloop-nextest-core> at <unknown source file>:<unknown line>
  844. 32.31 s gammaloop-nextest-core> 15: start_thread<unknown>
  845. 32.31 s gammaloop-nextest-core> at <unknown source file>:<unknown line>
  846. 32.31 s gammaloop-nextest-core> 16: __clone3<unknown>
  847. 32.31 s gammaloop-nextest-core> at <unknown source file>:<unknown line>
  848. 32.31 s gammaloop-nextest-core>
  849. 32.31 s gammaloop-nextest-core> Run with COLORBT_SHOW_HIDDEN=1 environment variable to disable frame filtering.
  850. 32.31 s gammaloop-nextest-core> Run with RUST_BACKTRACE=full to include source snippets.
  851. 32.31 s gammaloop-nextest-core>
  852. 32.31 s gammaloop-nextest-core> 2. gammalooprs::test_renormalization::finite_part_quark_lo
  853. 32.31 s gammaloop-nextest-core> failure: test failure with exit code 101
  854. 32.31 s gammaloop-nextest-core> system-out
  855. 32.31 s gammaloop-nextest-core> running 1 test
  856. 32.31 s gammaloop-nextest-core> test finite_part_quark_lo ... FAILED
  857. 32.31 s gammaloop-nextest-core>
  858. 32.31 s gammaloop-nextest-core> failures:
  859. 32.31 s gammaloop-nextest-core>
  860. 32.31 s gammaloop-nextest-core> failures:
  861. 32.31 s gammaloop-nextest-core> finite_part_quark_lo
  862. 32.31 s gammaloop-nextest-core>
  863. 32.31 s gammaloop-nextest-core> test result: FAILED. 0 passed; 1 failed; 0 ignored; 0 measured; 5 filtered out; finished in 0.15s
  864. 32.31 s gammaloop-nextest-core> system-err
  865. 32.31 s gammaloop-nextest-core> The application panicked (crashed).
  866. 32.31 s gammaloop-nextest-core> Message: called `Result::unwrap()` on an `Err` value: "Symbol spenso::mink redefined with new attributes:\n\t- new user data specified: List([String(\"spenso::representation-v2\"), String(\"inline-metric\"), List([String(\"symbol\"), String(\"mink\")]), List([String(\"cyclic\"), Integer(1), List([List([String(\"symbol\"), String(\"mu\")]), List([String(\"symbol\"), String(\"nu\")]), List([String(\"symbol\"), String(\"rho\")]), List([String(\"symbol\"), String(\"sigma\")])])]), String(\"top\")]) vs None\n"
  867. 32.31 s gammaloop-nextest-core> Location: crates/vakint/src/lib.rs:4766
  868. 32.31 s gammaloop-nextest-core>
  869. 32.31 s gammaloop-nextest-core> ━━━━━━━━━━━━━━━━━━━━━━━━━━━━━━━━━━ BACKTRACE ━━━━━━━━━━━━━━━━━━━━━━━━━━━━━━━━━━━
  870. 32.31 s gammaloop-nextest-core> 1: <color_eyre[5722b77bc20a64cf]::config::PanicHook>::panic_report<unknown>
  871. 32.31 s gammaloop-nextest-core> at <unknown source file>:<unknown line>
  872. 32.31 s gammaloop-nextest-core> 2: <color_eyre[5722b77bc20a64cf]::config::PanicHook>::into_panic_hook::{closure#0}<unknown>
  873. 32.31 s gammaloop-nextest-core> at <unknown source file>:<unknown line>
  874. 32.31 s gammaloop-nextest-core> 3: std[bcb96dfbba0ab899]::panicking::panic_with_hook<unknown>
  875. 32.31 s gammaloop-nextest-core> at <unknown source file>:<unknown line>
  876. 32.31 s gammaloop-nextest-core> 4: std[bcb96dfbba0ab899]::panicking::panic_handler::{closure#0}<unknown>
  877. 32.31 s gammaloop-nextest-core> at <unknown source file>:<unknown line>
  878. 32.31 s gammaloop-nextest-core> 5: std[bcb96dfbba0ab899]::sys::backtrace::__rust_end_short_backtrace::<std[bcb96dfbba0ab899]::panicking::panic_handler::{closure#0}, !><unknown>
  879. 32.31 s gammaloop-nextest-core> at <unknown source file>:<unknown line>
  880. 32.31 s gammaloop-nextest-core> 6: __rustc[6c289b9f9c454d21]::rust_begin_unwind<unknown>
  881. 32.31 s gammaloop-nextest-core> at <unknown source file>:<unknown line>
  882. 32.31 s gammaloop-nextest-core> 7: core[940e698046960fd5]::panicking::panic_fmt<unknown>
  883. 32.31 s gammaloop-nextest-core> at <unknown source file>:<unknown line>
  884. 32.31 s gammaloop-nextest-core> 8: core[940e698046960fd5]::result::unwrap_failed<unknown>
  885. 32.31 s gammaloop-nextest-core> at <unknown source file>:<unknown line>
  886. 32.31 s gammaloop-nextest-core> 9: <vakint[ad2b4d4b4d753fb9]::Vakint>::sanitize_user_expressions<unknown>
  887. 32.31 s gammaloop-nextest-core> at <unknown source file>:<unknown line>
  888. 32.31 s gammaloop-nextest-core> 10: <vakint[ad2b4d4b4d753fb9]::Vakint>::prepare_expression_for_form<unknown>
  889. 32.31 s gammaloop-nextest-core> at <unknown source file>:<unknown line>
  890. 32.31 s gammaloop-nextest-core> 11: <vakint[ad2b4d4b4d753fb9]::VakintTerm>::tensor_reduce<unknown>
  891. 32.31 s gammaloop-nextest-core> at <unknown source file>:<unknown line>
  892. 32.31 s gammaloop-nextest-core> 12: <vakint[ad2b4d4b4d753fb9]::VakintExpression>::tensor_reduce<unknown>
  893. 32.31 s gammaloop-nextest-core> at <unknown source file>:<unknown line>
  894. 32.31 s gammaloop-nextest-core> 13: <gammalooprs[4688948c89ba1ea7]::uv::approx::integrated::Integrated>::integrate::<gammalooprs[4688948c89ba1ea7]::uv::hedge_poset::ForestNode><unknown>
  895. 32.31 s gammaloop-nextest-core> at <unknown source file>:<unknown line>
  896. 32.31 s gammaloop-nextest-core> 14: <gammalooprs[4688948c89ba1ea7]::uv::approx::integrated::Integrated>::run::<gammalooprs[4688948c89ba1ea7]::uv::hedge_poset::ForestNode, gammalooprs[4688948c89ba1ea7]::uv::hedge_poset::ForestNode><unknown>
  897. 32.31 s gammaloop-nextest-core> at <unknown source file>:<unknown line>
  898. 32.31 s gammaloop-nextest-core> 15: <gammalooprs[4688948c89ba1ea7]::uv::hedge_poset::Forests>::integrate<unknown>
  899. 32.31 s gammaloop-nextest-core> at <unknown source file>:<unknown line>
  900. 32.31 s gammaloop-nextest-core> 16: gammalooprs[4688948c89ba1ea7]::uv::orchestrator::hedge_poset_renormalization_part<unknown>
  901. 32.31 s gammaloop-nextest-core> at <unknown source file>:<unknown line>
  902. 32.31 s gammaloop-nextest-core> 17: <gammalooprs[4688948c89ba1ea7]::uv::settings::UVOrchestrator>::renormalization_part<unknown>
  903. 32.31 s gammaloop-nextest-core> at <unknown source file>:<unknown line>
  904. 32.31 s gammaloop-nextest-core> 18: <gammalooprs[4688948c89ba1ea7]::processes::amplitude::AmplitudeGraph>::renormalization_part<unknown>
  905. 32.31 s gammaloop-nextest-core> at <unknown source file>:<unknown line>
  906. 32.31 s gammaloop-nextest-core> 19: <test_renormalization[c99a4cd1432bec79]::finite_part_quark_lo::{closure#0} as core[940e698046960fd5]::ops::function::FnOnce<()>>::call_once<unknown>
  907. 32.31 s gammaloop-nextest-core> at <unknown source file>:<unknown line>
  908. 32.31 s gammaloop-nextest-core> 20: test[75d6903177b1d7e9]::__rust_begin_short_backtrace::<core[940e698046960fd5]::result::Result<(), alloc[2ea6bcb46fca0c42]::string::String>, fn() -> core[940e698046960fd5]::result::Result<(), alloc[2ea6bcb46fca0c42]::string::String>><unknown>
  909. 32.31 s gammaloop-nextest-core> at <unknown source file>:<unknown line>
  910. 32.31 s gammaloop-nextest-core> 21: test[75d6903177b1d7e9]::run_test::{closure#0}<unknown>
  911. 32.31 s gammaloop-nextest-core> at <unknown source file>:<unknown line>
  912. 32.31 s gammaloop-nextest-core> 22: std[bcb96dfbba0ab899]::sys::backtrace::__rust_begin_short_backtrace::<test[75d6903177b1d7e9]::run_test::{closure#1}, ()><unknown>
  913. 32.31 s gammaloop-nextest-core> at <unknown source file>:<unknown line>
  914. 32.31 s gammaloop-nextest-core> 23: <std[bcb96dfbba0ab899]::thread::lifecycle::spawn_unchecked<test[75d6903177b1d7e9]::run_test::{closure#1}, ()>::{closure#1} as core[940e698046960fd5]::ops::function::FnOnce<()>>::call_once::{shim:vtable#0}<unknown>
  915. 32.31 s gammaloop-nextest-core> at <unknown source file>:<unknown line>
  916. 32.31 s gammaloop-nextest-core> 24: <std[bcb96dfbba0ab899]::sys::thread::unix::Thread>::new::thread_start<unknown>
  917. 32.31 s gammaloop-nextest-core> at <unknown source file>:<unknown line>
  918. 32.31 s gammaloop-nextest-core> 25: start_thread<unknown>
  919. 32.31 s gammaloop-nextest-core> at <unknown source file>:<unknown line>
  920. 32.31 s gammaloop-nextest-core> 26: __clone3<unknown>
  921. 32.31 s gammaloop-nextest-core> at <unknown source file>:<unknown line>
  922. 32.31 s gammaloop-nextest-core>
  923. 32.31 s gammaloop-nextest-core> Run with COLORBT_SHOW_HIDDEN=1 environment variable to disable frame filtering.
  924. 32.31 s gammaloop-nextest-core> Run with RUST_BACKTRACE=full to include source snippets.
  925. 32.31 s gammaloop-nextest-core>
  926. 32.31 s gammaloop-nextest-core> 3. gammalooprs::test_renormalization::finite_part_ghost_2loop
  927. 32.31 s gammaloop-nextest-core> failure: test failure with exit code 101
  928. 32.31 s gammaloop-nextest-core> system-out
  929. 32.31 s gammaloop-nextest-core> running 1 test
  930. 32.31 s gammaloop-nextest-core> test finite_part_ghost_2loop ... FAILED
  931. 32.31 s gammaloop-nextest-core>
  932. 32.31 s gammaloop-nextest-core> failures:
  933. 32.31 s gammaloop-nextest-core>
  934. 32.31 s gammaloop-nextest-core> failures:
  935. 32.31 s gammaloop-nextest-core> finite_part_ghost_2loop
  936. 32.31 s gammaloop-nextest-core>
  937. 32.31 s gammaloop-nextest-core> test result: FAILED. 0 passed; 1 failed; 0 ignored; 0 measured; 5 filtered out; finished in 0.36s
  938. 32.31 s gammaloop-nextest-core> system-err
  939. 32.31 s gammaloop-nextest-core> The application panicked (crashed).
  940. 32.31 s gammaloop-nextest-core> Message: called `Result::unwrap()` on an `Err` value:
  941. 32.31 s gammaloop-nextest-core> 0: Symbolica could not parse FORM output:
  942. 32.31 s gammaloop-nextest-core> [spenso::{antisymmetric,real,spenso::tensor}::f]([spenso::{spenso::representat\
  943. 32.31 s gammaloop-nextest-core> ion,spenso::self_dual}::coad](8,[gammalooprs::{spenso::index}::hedge](0)
  944. 32.31 s gammaloop-nextest-core> ),[spenso::{spenso::representation,spenso::self_dual}::coad](8,[gammaloo\
  945. 32.31 s gammaloop-nextest-core> prs::{spenso::index}::hedge](3)),[spenso::{spenso::representation,spenso\
  946. 32.31 s gammaloop-nextest-core> ::self_dual}::coad](8,[gammalooprs::{spenso::index}::hedge](5)))*
  947. 32.31 s gammaloop-nextest-core> [spenso::{antisymmetric,real,spenso::tensor}::f]([spenso::{spenso::repre\
  948. 32.31 s gammaloop-nextest-core> sentation,spenso::self_dual}::coad](8,[gammalooprs::{spenso::index}::hed\
  949. 32.31 s gammaloop-nextest-core> ge](1)),[spenso::{spenso::representation,spenso::self_dual}::coad](8,
  950. 32.31 s gammaloop-nextest-core> [gammalooprs::{spenso::index}::hedge](11)),[spenso::{spenso::representat\
  951. 32.31 s gammaloop-nextest-core> ion,spenso::self_dual}::coad](8,[gammalooprs::{spenso::index}::hedge](7)
  952. 32.31 s gammaloop-nextest-core> ))*[spenso::{antisymmetric,real,spenso::tensor}::f]([spenso::{spenso::re\
  953. 32.31 s gammaloop-nextest-core> presentation,spenso::self_dual}::coad](8,[gammalooprs::{spenso::index}::\
  954. 32.31 s gammaloop-nextest-core> hedge](3)),[spenso::{spenso::representation,spenso::self_dual}::coad](8,
  955. 32.31 s gammaloop-nextest-core> [gammalooprs::{spenso::index}::hedge](7)),[spenso::{spenso::representati\
  956. 32.31 s gammaloop-nextest-core> on,spenso::self_dual}::coad](8,[gammalooprs::{spenso::index}::hedge](9))
  957. 32.31 s gammaloop-nextest-core> )*[spenso::{antisymmetric,real,spenso::tensor}::f]([spenso::{spenso::rep\
  958. 32.31 s gammaloop-nextest-core> resentation,spenso::self_dual}::coad](8,[gammalooprs::{spenso::index}::h\
  959. 32.31 s gammaloop-nextest-core> edge](11)),[spenso::{spenso::representation,spenso::self_dual}::coad](8,
  960. 32.31 s gammaloop-nextest-core> [gammalooprs::{spenso::index}::hedge](5)),[spenso::{spenso::representati\
  961. 32.31 s gammaloop-nextest-core> on,spenso::self_dual}::coad](8,[gammalooprs::{spenso::index}::hedge](9))
  962. 32.31 s gammaloop-nextest-core> )*dot(p4,p0)*dot(k1,k1)*dot(k2,k2)*i_*[UFO::{}::GC_10]^4*rat(-1,ep - 2)
  963. 32.31 s gammaloop-nextest-core> + [spenso::{antisymmetric,real,spenso::tensor}::f]([spenso::{spenso::re\
  964. 32.31 s gammaloop-nextest-core> presentation,spenso::self_dual}::coad](8,[gammalooprs::{spenso::index}::\
  965. 32.31 s gammaloop-nextest-core> hedge](0)),[spenso::{spenso::representation,spenso::self_dual}::coad](8,
  966. 32.31 s gammaloop-nextest-core> [gammalooprs::{spenso::index}::hedge](3)),[spenso::{spenso::representati\
  967. 32.31 s gammaloop-nextest-core> on,spenso::self_dual}::coad](8,[gammalooprs::{spenso::index}::hedge](5))
  968. 32.31 s gammaloop-nextest-core> )*[spenso::{antisymmetric,real,spenso::tensor}::f]([spenso::{spenso::rep\
  969. 32.31 s gammaloop-nextest-core> resentation,spenso::self_dual}::coad](8,[gammalooprs::{spenso::index}::h\
  970. 32.31 s gammaloop-nextest-core> edge](1)),[spenso::{spenso::representation,spenso::self_dual}::coad](8,
  971. 32.31 s gammaloop-nextest-core> [gammalooprs::{spenso::index}::hedge](11)),[spenso::{spenso::representat\
  972. 32.31 s gammaloop-nextest-core> ion,spenso::self_dual}::coad](8,[gammalooprs::{spenso::index}::hedge](7)
  973. 32.31 s gammaloop-nextest-core> ))*[spenso::{antisymmetric,real,spenso::tensor}::f]([spenso::{spenso::re\
  974. 32.31 s gammaloop-nextest-core> presentation,spenso::self_dual}::coad](8,[gammalooprs::{spenso::index}::\
  975. 32.31 s gammaloop-nextest-core> hedge](3)),[spenso::{spenso::representation,spenso::self_dual}::coad](8,
  976. 32.31 s gammaloop-nextest-core> [gammalooprs::{spenso::index}::hedge](7)),[spenso::{spenso::representati\
  977. 32.31 s gammaloop-nextest-core> on,spenso::self_dual}::coad](8,[gammalooprs::{spenso::index}::hedge](9))
  978. 32.31 s gammaloop-nextest-core> )*[spenso::{antisymmetric,real,spenso::tensor}::f]([spenso::{spenso::rep\
  979. 32.31 s gammaloop-nextest-core> resentation,spenso::self_dual}::coad](8,[gammalooprs::{spenso::index}::h\
  980. 32.31 s gammaloop-nextest-core> edge](11)),[spenso::{spenso::representation,spenso::self_dual}::coad](8,
  981. 32.31 s gammaloop-nextest-core> [gammalooprs::{spenso::index}::hedge](5)),[spenso::{spenso::representati\
  982. 32.31 s gammaloop-nextest-core> on,spenso::self_dual}::coad](8,[gammalooprs::{spenso::index}::hedge](9))
  983. 32.31 s gammaloop-nextest-core> )*dot(p4,p0)*dot(k1,k2)^2*i_*[UFO::{}::GC_10]^4*rat(1,ep - 2)
  984. 32.31 s gammaloop-nextest-core>
  985. 32.31 s gammaloop-nextest-core> Error:Symbol spenso::coad redefined with new attributes:
  986. 32.31 s gammaloop-nextest-core> - new user data specified: List([String("spenso::representation-v2"), String("self-dual"), List([String("symbol"), String("coad")]), List([String("cyclic"), Integer(1), List([List([String("symbol"), String("a")]), List([String("symbol"), String("b")]), List([String("symbol"), String("c")]), List([String("symbol"), String("d")])])]), String("top")]) vs None
  987. 32.31 s gammaloop-nextest-core>
  988. 32.31 s gammaloop-nextest-core>
  989. 32.31 s gammaloop-nextest-core> Location:
  990. 32.31 s gammaloop-nextest-core> crates/gammalooprs/src/uv/approx/integrated.rs:332
  991. 32.31 s gammaloop-nextest-core>
  992. 32.31 s gammaloop-nextest-core> ━━━━━━━━━━━━━━━━━━━━━━━━━━━━━━━━━━ BACKTRACE ━━━━━━━━━━━━━━━━━━━━━━━━━━━━━━━━━━━
  993. 32.31 s gammaloop-nextest-core> 1: <color_eyre[5722b77bc20a64cf]::config::EyreHook>::into_eyre_hook::{closure#0}<unknown>
  994. 32.31 s gammaloop-nextest-core> at <unknown source file>:<unknown line>
  995. 32.31 s gammaloop-nextest-core> 2: eyre[cb2fd339c0c40fca]::capture_handler<unknown>
  996. 32.31 s gammaloop-nextest-core> at <unknown source file>:<unknown line>
  997. 32.31 s gammaloop-nextest-core> 3: <eyre[cb2fd339c0c40fca]::Report>::from_std::<vakint[ad2b4d4b4d753fb9]::VakintError><unknown>
  998. 32.31 s gammaloop-nextest-core> at <unknown source file>:<unknown line>
  999. 32.31 s gammaloop-nextest-core> 4: <gammalooprs[4688948c89ba1ea7]::uv::approx::integrated::Integrated>::integrate::<gammalooprs[4688948c89ba1ea7]::uv::approx::Approximation><unknown>
  1000. 32.31 s gammaloop-nextest-core> at <unknown source file>:<unknown line>
  1001. 32.31 s gammaloop-nextest-core> 5: <gammalooprs[4688948c89ba1ea7]::uv::forest::Forest>::compute<unknown>
  1002. 32.31 s gammaloop-nextest-core> at <unknown source file>:<unknown line>
  1003. 32.31 s gammaloop-nextest-core> 6: gammalooprs[4688948c89ba1ea7]::uv::orchestrator::legacy_renormalization_part<unknown>
  1004. 32.31 s gammaloop-nextest-core> at <unknown source file>:<unknown line>
  1005. 32.31 s gammaloop-nextest-core> 7: <gammalooprs[4688948c89ba1ea7]::uv::settings::UVOrchestrator>::renormalization_part<unknown>
  1006. 32.31 s gammaloop-nextest-core> at <unknown source file>:<unknown line>
  1007. 32.31 s gammaloop-nextest-core> 8: <gammalooprs[4688948c89ba1ea7]::processes::amplitude::AmplitudeGraph>::renormalization_part<unknown>
  1008. 32.31 s gammaloop-nextest-core> at <unknown source file>:<unknown line>
  1009. 32.31 s gammaloop-nextest-core> 9: test_renormalization[c99a4cd1432bec79]::finite_part_ghost_2loop<unknown>
  1010. 32.31 s gammaloop-nextest-core> at <unknown source file>:<unknown line>
  1011. 32.31 s gammaloop-nextest-core> 10: <test_renormalization[c99a4cd1432bec79]::finite_part_ghost_2loop::{closure#0} as core[940e698046960fd5]::ops::function::FnOnce<()>>::call_once<unknown>
  1012. 32.31 s gammaloop-nextest-core> at <unknown source file>:<unknown line>
  1013. 32.31 s gammaloop-nextest-core> 11: test[75d6903177b1d7e9]::__rust_begin_short_backtrace::<core[940e698046960fd5]::result::Result<(), alloc[2ea6bcb46fca0c42]::string::String>, fn() -> core[940e698046960fd5]::result::Result<(), alloc[2ea6bcb46fca0c42]::string::String>><unknown>
  1014. 32.31 s gammaloop-nextest-core> at <unknown source file>:<unknown line>
  1015. 32.31 s gammaloop-nextest-core> 12: test[75d6903177b1d7e9]::run_test::{closure#0}<unknown>
  1016. 32.31 s gammaloop-nextest-core> at <unknown source file>:<unknown line>
  1017. 32.31 s gammaloop-nextest-core> 13: std[bcb96dfbba0ab899]::sys::backtrace::__rust_begin_short_backtrace::<test[75d6903177b1d7e9]::run_test::{closure#1}, ()><unknown>
  1018. 32.31 s gammaloop-nextest-core> at <unknown source file>:<unknown line>
  1019. 32.31 s gammaloop-nextest-core> 14: <std[bcb96dfbba0ab899]::thread::lifecycle::spawn_unchecked<test[75d6903177b1d7e9]::run_test::{closure#1}, ()>::{closure#1} as core[940e698046960fd5]::ops::function::FnOnce<()>>::call_once::{shim:vtable#0}<unknown>
  1020. 32.31 s gammaloop-nextest-core> at <unknown source file>:<unknown line>
  1021. 32.31 s gammaloop-nextest-core> 15: <std[bcb96dfbba0ab899]::sys::thread::unix::Thread>::new::thread_start<unknown>
  1022. 32.31 s gammaloop-nextest-core> at <unknown source file>:<unknown line>
  1023. 32.31 s gammaloop-nextest-core> 16: start_thread<unknown>
  1024. 32.31 s gammaloop-nextest-core> at <unknown source file>:<unknown line>
  1025. 32.31 s gammaloop-nextest-core> 17: __clone3<unknown>
  1026. 32.31 s gammaloop-nextest-core> at <unknown source file>:<unknown line>
  1027. 32.31 s gammaloop-nextest-core>
  1028. 32.31 s gammaloop-nextest-core> Run with COLORBT_SHOW_HIDDEN=1 environment variable to disable frame filtering.
  1029. 32.31 s gammaloop-nextest-core> Run with RUST_BACKTRACE=full to include source snippets.
  1030. 32.31 s gammaloop-nextest-core> Location: crates/gammalooprs/tests/test_renormalization.rs:445
  1031. 32.31 s gammaloop-nextest-core>
  1032. 32.31 s gammaloop-nextest-core> ━━━━━━━━━━━━━━━━━━━━━━━━━━━━━━━━━━ BACKTRACE ━━━━━━━━━━━━━━━━━━━━━━━━━━━━━━━━━━━
  1033. 32.31 s gammaloop-nextest-core> 1: <color_eyre[5722b77bc20a64cf]::config::PanicHook>::panic_report<unknown>
  1034. 32.31 s gammaloop-nextest-core> at <unknown source file>:<unknown line>
  1035. 32.31 s gammaloop-nextest-core> 2: <color_eyre[5722b77bc20a64cf]::config::PanicHook>::into_panic_hook::{closure#0}<unknown>
  1036. 32.31 s gammaloop-nextest-core> at <unknown source file>:<unknown line>
  1037. 32.31 s gammaloop-nextest-core> 3: std[bcb96dfbba0ab899]::panicking::panic_with_hook<unknown>
  1038. 32.31 s gammaloop-nextest-core> at <unknown source file>:<unknown line>
  1039. 32.31 s gammaloop-nextest-core> 4: std[bcb96dfbba0ab899]::panicking::panic_handler::{closure#0}<unknown>
  1040. 32.31 s gammaloop-nextest-core> at <unknown source file>:<unknown line>
  1041. 32.31 s gammaloop-nextest-core> 5: std[bcb96dfbba0ab899]::sys::backtrace::__rust_end_short_backtrace::<std[bcb96dfbba0ab899]::panicking::panic_handler::{closure#0}, !><unknown>
  1042. 32.31 s gammaloop-nextest-core> at <unknown source file>:<unknown line>
  1043. 32.31 s gammaloop-nextest-core> 6: __rustc[6c289b9f9c454d21]::rust_begin_unwind<unknown>
  1044. 32.31 s gammaloop-nextest-core> at <unknown source file>:<unknown line>
  1045. 32.31 s gammaloop-nextest-core> 7: core[940e698046960fd5]::panicking::panic_fmt<unknown>
  1046. 32.31 s gammaloop-nextest-core> at <unknown source file>:<unknown line>
  1047. 32.31 s gammaloop-nextest-core> 8: core[940e698046960fd5]::result::unwrap_failed<unknown>
  1048. 32.31 s gammaloop-nextest-core> at <unknown source file>:<unknown line>
  1049. 32.31 s gammaloop-nextest-core> 9: test_renormalization[c99a4cd1432bec79]::finite_part_ghost_2loop<unknown>
  1050. 32.31 s gammaloop-nextest-core> at <unknown source file>:<unknown line>
  1051. 32.31 s gammaloop-nextest-core> 10: <test_renormalization[c99a4cd1432bec79]::finite_part_ghost_2loop::{closure#0} as core[940e698046960fd5]::ops::function::FnOnce<()>>::call_once<unknown>
  1052. 32.31 s gammaloop-nextest-core> at <unknown source file>:<unknown line>
  1053. 32.31 s gammaloop-nextest-core> 11: test[75d6903177b1d7e9]::__rust_begin_short_backtrace::<core[940e698046960fd5]::result::Result<(), alloc[2ea6bcb46fca0c42]::string::String>, fn() -> core[940e698046960fd5]::result::Result<(), alloc[2ea6bcb46fca0c42]::string::String>><unknown>
  1054. 32.31 s gammaloop-nextest-core> at <unknown source file>:<unknown line>
  1055. 32.31 s gammaloop-nextest-core> 12: test[75d6903177b1d7e9]::run_test::{closure#0}<unknown>
  1056. 32.31 s gammaloop-nextest-core> at <unknown source file>:<unknown line>
  1057. 32.31 s gammaloop-nextest-core> 13: std[bcb96dfbba0ab899]::sys::backtrace::__rust_begin_short_backtrace::<test[75d6903177b1d7e9]::run_test::{closure#1}, ()><unknown>
  1058. 32.31 s gammaloop-nextest-core> ... omitted 12 more lines; see full nextest output above
  1059. 32.31 s gammaloop-nextest-core> =========================================
  1060. 32.36 s [0 built (1 failed), 0.0error: Cannot build '/nix/store/kdk12m3q1h6h241yxlkx2wvsy9l2g283-gammaloop-nextest-core.drv'.
  1061. 32.36 s Reason: builder failed with exit code 100.
  1062. 32.36 s Output paths:
  1063. 32.36 s /nix/store/szb4f97yp556knm1315zv5fcq4in56nv-gammaloop-nextest-core
  1064. 32.36 s Last 1040 log lines:
  1065. 32.36 s > Extracting 3 binaries (including 1 non-test binary), 1 build script output directory, and 2 linked paths to /build/nextest-archive-IwZeTZ
  1066. 32.36 s > Extracted 18 files to /build/nextest-archive-IwZeTZ in 0.54s
  1067. 32.36 s > ------------
  1068. 32.36 s > Nextest run ID 7d5f533e-a045-4abe-bd7e-40c6aebe9467 with nextest profile: ci_gammaloop
  1069. 32.36 s > Starting 339 tests across 2 binaries
  1070. 32.36 s > ------------
  1071. 32.36 s > Summary [ 0.490s] 339 tests run: 339 passed, 0 skipped
  1072. 32.36 s >
  1073. 32.36 s > ========== nextest test summary ==========
  1074. 32.36 s > report: target/nextest/ci_gammaloop/junit.xml
  1075. 32.36 s > tests: 339, failures: 0, errors: 0
  1076. 32.36 s > No failing testcases found.
  1077. 32.36 s > =========================================
  1078. 32.36 s > Extracting 1 binary and 1 linked path to /build/nextest-archive-VBou9p
  1079. 32.36 s > Extracted 7 files to /build/nextest-archive-VBou9p in 0.08s
  1080. 32.36 s > ------------
  1081. 32.36 s > Nextest run ID 4382703c-ea95-4a38-9d04-35e2a61aa1ee with nextest profile: ci_gammaloop
  1082. 32.36 s > Starting 19 tests across 1 binary
  1083. 32.36 s > ------------
  1084. 32.36 s > Summary [ 0.015s] 19 tests run: 19 passed, 0 skipped
  1085. 32.36 s >
  1086. 32.36 s > ========== nextest test summary ==========
  1087. 32.36 s > report: target/nextest/ci_gammaloop/junit.xml
  1088. 32.36 s > tests: 19, failures: 0, errors: 0
  1089. 32.36 s > No failing testcases found.
  1090. 32.36 s > =========================================
  1091. 32.36 s > Extracting 1 binary to /build/nextest-archive-E3XDsf
  1092. 32.36 s > Extracted 4 files to /build/nextest-archive-E3XDsf in 0.03s
  1093. 32.36 s > ------------
  1094. 32.36 s > Nextest run ID 9554ba5a-ef2f-456b-92b4-60a5077264ce with nextest profile: ci_gammaloop
  1095. 32.36 s > Starting 0 tests across 1 binary
  1096. 32.36 s > ------------
  1097. 32.36 s > Summary [ 0.000s] 0 tests run: 0 passed, 0 skipped
  1098. 32.36 s >
  1099. 32.36 s > ========== nextest test summary ==========
  1100. 32.36 s > report: target/nextest/ci_gammaloop/junit.xml
  1101. 32.36 s > tests: 0, failures: 0, errors: 0
  1102. 32.36 s > No failing testcases found.
  1103. 32.36 s > =========================================
  1104. 32.36 s > Extracting 4 binaries, 1 build script output directory, and 2 linked paths to /build/nextest-archive-Jw9d2T
  1105. 32.36 s > Extracted 18 files to /build/nextest-archive-Jw9d2T in 0.56s
  1106. 32.36 s > ------------
  1107. 32.36 s > Nextest run ID 2cefb514-dbec-4009-ad1d-a244b32f5fb6 with nextest profile: ci_gammaloop
  1108. 32.36 s > Starting 456 tests across 4 binaries (61 tests skipped, including 60 tests via profile.ci_gammaloop.default-filter)
  1109. 32.36 s > FAIL [ 0.221s] (442/456) gammalooprs::test_renormalization finit_part_ghlo
  1110. 32.36 s > stdout ---
  1111. 32.36 s >
  1112. 32.36 s > running 1 test
  1113. 32.36 s > test finit_part_ghlo ... FAILED
  1114. 32.36 s >
  1115. 32.36 s > failures:
  1116. 32.36 s >
  1117. 32.36 s > failures:
  1118. 32.36 s > finit_part_ghlo
  1119. 32.36 s >
  1120. 32.36 s > test result: FAILED. 0 passed; 1 failed; 0 ignored; 0 measured; 5 filtered out; finished in 0.19s
  1121. 32.36 s >
  1122. 32.36 s > stderr ---
  1123. 32.36 s > The application panicked (crashed).
  1124. 32.36 s > Message: called `Result::unwrap()` on an `Err` value:
  1125. 32.36 s > 0: Symbolica could not parse FORM output:
  1126. 32.36 s > [spenso::{antisymmetric,real,spenso::tensor}::f]([spenso::{spenso::representat\
  1127. 32.36 s > ion,spenso::self_dual}::coad](8,[gammalooprs::{spenso::index}::hedge](0)
  1128. 32.36 s > ),[spenso::{spenso::representation,spenso::self_dual}::coad](8,[gammaloo\
  1129. 32.36 s > prs::{spenso::index}::hedge](3)),[spenso::{spenso::representation,spenso\
  1130. 32.36 s > ::self_dual}::coad](8,[gammalooprs::{spenso::index}::hedge](5)))*
  1131. 32.36 s > [spenso::{antisymmetric,real,spenso::tensor}::f]([spenso::{spenso::repre\
  1132. 32.36 s > sentation,spenso::self_dual}::coad](8,[gammalooprs::{spenso::index}::hed\
  1133. 32.36 s > ge](1)),[spenso::{spenso::representation,spenso::self_dual}::coad](8,
  1134. 32.36 s > [gammalooprs::{spenso::index}::hedge](3)),[spenso::{spenso::representati\
  1135. 32.36 s > on,spenso::self_dual}::coad](8,[gammalooprs::{spenso::index}::hedge](5))
  1136. 32.36 s > )*dot(p1,p0)*[UFO::{}::GC_10]^2*rat(-1,1)
  1137. 32.36 s >
  1138. 32.36 s > Error:Symbol spenso::coad redefined with new attributes:
  1139. 32.36 s > - new user data specified: List([String("spenso::representation-v2"), String("self-dual"), List([String("symbol"), String("coad")]), List([String("cyclic"), Integer(1), List([List([String("symbol"), String("a")]), List([String("symbol"), String("b")]), List([String("symbol"), String("c")]), List([String("symbol"), String("d")])])]), String("top")]) vs None
  1140. 32.36 s >
  1141. 32.36 s >
  1142. 32.36 s > Location:
  1143. 32.36 s > crates/gammalooprs/src/uv/approx/integrated.rs:332
  1144. 32.36 s >
  1145. 32.36 s > ━━━━━━━━━━━━━━━━━━━━━━━━━━━━━━━━━━ BACKTRACE ━━━━━━━━━━━━━━━━━━━━━━━━━━━━━━━━━━━
  1146. 32.36 s > 1: <color_eyre[5722b77bc20a64cf]::config::EyreHook>::into_eyre_hook::{closure#0}<unknown>
  1147. 32.36 s > at <unknown source file>:<unknown line>
  1148. 32.36 s > 2: eyre[cb2fd339c0c40fca]::capture_handler<unknown>
  1149. 32.36 s > at <unknown source file>:<unknown line>
  1150. 32.36 s > 3: <eyre[cb2fd339c0c40fca]::Report>::from_std::<vakint[ad2b4d4b4d753fb9]::VakintError><unknown>
  1151. 32.36 s > at <unknown source file>:<unknown line>
  1152. 32.36 s > 4: <gammalooprs[4688948c89ba1ea7]::uv::approx::integrated::Integrated>::integrate::<gammalooprs[4688948c89ba1ea7]::uv::hedge_poset::ForestNode><unknown>
  1153. 32.36 s > at <unknown source file>:<unknown line>
  1154. 32.36 s > 5: <gammalooprs[4688948c89ba1ea7]::uv::approx::integrated::Integrated>::run::<gammalooprs[4688948c89ba1ea7]::uv::hedge_poset::ForestNode, gammalooprs[4688948c89ba1ea7]::uv::hedge_poset::ForestNode><unknown>
  1155. 32.36 s > at <unknown source file>:<unknown line>
  1156. 32.36 s > 6: <gammalooprs[4688948c89ba1ea7]::uv::hedge_poset::Forests>::integrate<unknown>
  1157. 32.36 s > at <unknown source file>:<unknown line>
  1158. 32.36 s > 7: gammalooprs[4688948c89ba1ea7]::uv::orchestrator::hedge_poset_renormalization_part<unknown>
  1159. 32.36 s > at <unknown source file>:<unknown line>
  1160. 32.36 s > 8: <gammalooprs[4688948c89ba1ea7]::uv::settings::UVOrchestrator>::renormalization_part<unknown>
  1161. 32.36 s > at <unknown source file>:<unknown line>
  1162. 32.36 s > 9: <gammalooprs[4688948c89ba1ea7]::processes::amplitude::AmplitudeGraph>::renormalization_part<unknown>
  1163. 32.36 s > at <unknown source file>:<unknown line>
  1164. 32.36 s > 10: <test_renormalization[c99a4cd1432bec79]::finit_part_ghlo::{closure#0} as core[940e698046960fd5]::ops::function::FnOnce<()>>::call_once<unknown>
  1165. 32.36 s > at <unknown source file>:<unknown line>
  1166. 32.36 s > 11: test[75d6903177b1d7e9]::__rust_begin_short_backtrace::<core[940e698046960fd5]::result::Result<(), alloc[2ea6bcb46fca0c42]::string::String>, fn() -> core[940e698046960fd5]::result::Result<(), alloc[2ea6bcb46fca0c42]::string::String>><unknown>
  1167. 32.36 s > at <unknown source file>:<unknown line>
  1168. 32.36 s > 12: test[75d6903177b1d7e9]::run_test::{closure#0}<unknown>
  1169. 32.36 s > at <unknown source file>:<unknown line>
  1170. 32.36 s > 13: std[bcb96dfbba0ab899]::sys::backtrace::__rust_begin_short_backtrace::<test[75d6903177b1d7e9]::run_test::{closure#1}, ()><unknown>
  1171. 32.36 s > at <unknown source file>:<unknown line>
  1172. 32.36 s > 14: <std[bcb96dfbba0ab899]::thread::lifecycle::spawn_unchecked<test[75d6903177b1d7e9]::run_test::{closure#1}, ()>::{closure#1} as core[940e698046960fd5]::ops::function::FnOnce<()>>::call_once::{shim:vtable#0}<unknown>
  1173. 32.36 s > at <unknown source file>:<unknown line>
  1174. 32.36 s > 15: <std[bcb96dfbba0ab899]::sys::thread::unix::Thread>::new::thread_start<unknown>
  1175. 32.36 s > at <unknown source file>:<unknown line>
  1176. 32.36 s > 16: start_thread<unknown>
  1177. 32.36 s > at <unknown source file>:<unknown line>
  1178. 32.36 s > 17: __clone3<unknown>
  1179. 32.36 s > at <unknown source file>:<unknown line>
  1180. 32.36 s >
  1181. 32.36 s > Run with COLORBT_SHOW_HIDDEN=1 environment variable to disable frame filtering.
  1182. 32.36 s > Run with RUST_BACKTRACE=full to include source snippets.
  1183. 32.36 s > Location: crates/gammalooprs/tests/test_renormalization.rs:550
  1184. 32.36 s >
  1185. 32.36 s > ━━━━━━━━━━━━━━━━━━━━━━━━━━━━━━━━━━ BACKTRACE ━━━━━━━━━━━━━━━━━━━━━━━━━━━━━━━━━━━
  1186. 32.36 s > 1: <color_eyre[5722b77bc20a64cf]::config::PanicHook>::panic_report<unknown>
  1187. 32.36 s > at <unknown source file>:<unknown line>
  1188. 32.36 s > 2: <color_eyre[5722b77bc20a64cf]::config::PanicHook>::into_panic_hook::{closure#0}<unknown>
  1189. 32.36 s > at <unknown source file>:<unknown line>
  1190. 32.36 s > 3: std[bcb96dfbba0ab899]::panicking::panic_with_hook<unknown>
  1191. 32.36 s > at <unknown source file>:<unknown line>
  1192. 32.36 s > 4: std[bcb96dfbba0ab899]::panicking::panic_handler::{closure#0}<unknown>
  1193. 32.36 s > at <unknown source file>:<unknown line>
  1194. 32.36 s > 5: std[bcb96dfbba0ab899]::sys::backtrace::__rust_end_short_backtrace::<std[bcb96dfbba0ab899]::panicking::panic_handler::{closure#0}, !><unknown>
  1195. 32.36 s > at <unknown source file>:<unknown line>
  1196. 32.36 s > 6: __rustc[6c289b9f9c454d21]::rust_begin_unwind<unknown>
  1197. 32.36 s > at <unknown source file>:<unknown line>
  1198. 32.36 s > 7: core[940e698046960fd5]::panicking::panic_fmt<unknown>
  1199. 32.36 s > at <unknown source file>:<unknown line>
  1200. 32.36 s > 8: core[940e698046960fd5]::result::unwrap_failed<unknown>
  1201. 32.36 s > at <unknown source file>:<unknown line>
  1202. 32.36 s > 9: <test_renormalization[c99a4cd1432bec79]::finit_part_ghlo::{closure#0} as core[940e698046960fd5]::ops::function::FnOnce<()>>::call_once<unknown>
  1203. 32.36 s > at <unknown source file>:<unknown line>
  1204. 32.36 s > 10: test[75d6903177b1d7e9]::__rust_begin_short_backtrace::<core[940e698046960fd5]::result::Result<(), alloc[2ea6bcb46fca0c42]::string::String>, fn() -> core[940e698046960fd5]::result::Result<(), alloc[2ea6bcb46fca0c42]::string::String>><unknown>
  1205. 32.36 s > at <unknown source file>:<unknown line>
  1206. 32.36 s > 11: test[75d6903177b1d7e9]::run_test::{closure#0}<unknown>
  1207. 32.36 s > at <unknown source file>:<unknown line>
  1208. 32.36 s > 12: std[bcb96dfbba0ab899]::sys::backtrace::__rust_begin_short_backtrace::<test[75d6903177b1d7e9]::run_test::{closure#1}, ()><unknown>
  1209. 32.36 s > at <unknown source file>:<unknown line>
  1210. 32.36 s > 13: <std[bcb96dfbba0ab899]::thread::lifecycle::spawn_unchecked<test[75d6903177b1d7e9]::run_test::{closure#1}, ()>::{closure#1} as core[940e698046960fd5]::ops::function::FnOnce<()>>::call_once::{shim:vtable#0}<unknown>
  1211. 32.36 s > at <unknown source file>:<unknown line>
  1212. 32.36 s > 14: <std[bcb96dfbba0ab899]::sys::thread::unix::Thread>::new::thread_start<unknown>
  1213. 32.36 s > at <unknown source file>:<unknown line>
  1214. 32.36 s > 15: start_thread<unknown>
  1215. 32.36 s > at <unknown source file>:<unknown line>
  1216. 32.36 s > 16: __clone3<unknown>
  1217. 32.36 s > at <unknown source file>:<unknown line>
  1218. 32.36 s >
  1219. 32.36 s > Run with COLORBT_SHOW_HIDDEN=1 environment variable to disable frame filtering.
  1220. 32.36 s > Run with RUST_BACKTRACE=full to include source snippets.
  1221. 32.36 s >
  1222. 32.36 s > FAIL [ 0.166s] (444/456) gammalooprs::test_renormalization finite_part_quark_lo
  1223. 32.36 s > stdout ---
  1224. 32.36 s >
  1225. 32.36 s > running 1 test
  1226. 32.36 s > test finite_part_quark_lo ... FAILED
  1227. 32.36 s >
  1228. 32.36 s > failures:
  1229. 32.36 s >
  1230. 32.36 s > failures:
  1231. 32.36 s > finite_part_quark_lo
  1232. 32.36 s >
  1233. 32.36 s > test result: FAILED. 0 passed; 1 failed; 0 ignored; 0 measured; 5 filtered out; finished in 0.15s
  1234. 32.36 s >
  1235. 32.36 s > stderr ---
  1236. 32.36 s > The application panicked (crashed).
  1237. 32.36 s > Message: called `Result::unwrap()` on an `Err` value: "Symbol spenso::mink redefined with new attributes:\n\t- new user data specified: List([String(\"spenso::representation-v2\"), String(\"inline-metric\"), List([String(\"symbol\"), String(\"mink\")]), List([String(\"cyclic\"), Integer(1), List([List([String(\"symbol\"), String(\"mu\")]), List([String(\"symbol\"), String(\"nu\")]), List([String(\"symbol\"), String(\"rho\")]), List([String(\"symbol\"), String(\"sigma\")])])]), String(\"top\")]) vs None\n"
  1238. 32.36 s > Location: crates/vakint/src/lib.rs:4766
  1239. 32.36 s >
  1240. 32.36 s > ━━━━━━━━━━━━━━━━━━━━━━━━━━━━━━━━━━ BACKTRACE ━━━━━━━━━━━━━━━━━━━━━━━━━━━━━━━━━━━
  1241. 32.36 s > 1: <color_eyre[5722b77bc20a64cf]::config::PanicHook>::panic_report<unknown>
  1242. 32.36 s > at <unknown source file>:<unknown line>
  1243. 32.36 s > 2: <color_eyre[5722b77bc20a64cf]::config::PanicHook>::into_panic_hook::{closure#0}<unknown>
  1244. 32.36 s > at <unknown source file>:<unknown line>
  1245. 32.36 s > 3: std[bcb96dfbba0ab899]::panicking::panic_with_hook<unknown>
  1246. 32.36 s > at <unknown source file>:<unknown line>
  1247. 32.36 s > 4: std[bcb96dfbba0ab899]::panicking::panic_handler::{closure#0}<unknown>
  1248. 32.36 s > at <unknown source file>:<unknown line>
  1249. 32.36 s > 5: std[bcb96dfbba0ab899]::sys::backtrace::__rust_end_short_backtrace::<std[bcb96dfbba0ab899]::panicking::panic_handler::{closure#0}, !><unknown>
  1250. 32.36 s > at <unknown source file>:<unknown line>
  1251. 32.36 s > 6: __rustc[6c289b9f9c454d21]::rust_begin_unwind<unknown>
  1252. 32.36 s > at <unknown source file>:<unknown line>
  1253. 32.36 s > 7: core[940e698046960fd5]::panicking::panic_fmt<unknown>
  1254. 32.36 s > at <unknown source file>:<unknown line>
  1255. 32.36 s > 8: core[940e698046960fd5]::result::unwrap_failed<unknown>
  1256. 32.36 s > at <unknown source file>:<unknown line>
  1257. 32.36 s > 9: <vakint[ad2b4d4b4d753fb9]::Vakint>::sanitize_user_expressions<unknown>
  1258. 32.36 s > at <unknown source file>:<unknown line>
  1259. 32.36 s > 10: <vakint[ad2b4d4b4d753fb9]::Vakint>::prepare_expression_for_form<unknown>
  1260. 32.36 s > at <unknown source file>:<unknown line>
  1261. 32.36 s > 11: <vakint[ad2b4d4b4d753fb9]::VakintTerm>::tensor_reduce<unknown>
  1262. 32.36 s > at <unknown source file>:<unknown line>
  1263. 32.36 s > 12: <vakint[ad2b4d4b4d753fb9]::VakintExpression>::tensor_reduce<unknown>
  1264. 32.36 s > at <unknown source file>:<unknown line>
  1265. 32.36 s > 13: <gammalooprs[4688948c89ba1ea7]::uv::approx::integrated::Integrated>::integrate::<gammalooprs[4688948c89ba1ea7]::uv::hedge_poset::ForestNode><unknown>
  1266. 32.36 s > at <unknown source file>:<unknown line>
  1267. 32.36 s > 14: <gammalooprs[4688948c89ba1ea7]::uv::approx::integrated::Integrated>::run::<gammalooprs[4688948c89ba1ea7]::uv::hedge_poset::ForestNode, gammalooprs[4688948c89ba1ea7]::uv::hedge_poset::ForestNode><unknown>
  1268. 32.36 s > at <unknown source file>:<unknown line>
  1269. 32.36 s > 15: <gammalooprs[4688948c89ba1ea7]::uv::hedge_poset::Forests>::integrate<unknown>
  1270. 32.36 s > at <unknown source file>:<unknown line>
  1271. 32.36 s > 16: gammalooprs[4688948c89ba1ea7]::uv::orchestrator::hedge_poset_renormalization_part<unknown>
  1272. 32.36 s > at <unknown source file>:<unknown line>
  1273. 32.36 s > 17: <gammalooprs[4688948c89ba1ea7]::uv::settings::UVOrchestrator>::renormalization_part<unknown>
  1274. 32.36 s > at <unknown source file>:<unknown line>
  1275. 32.36 s > 18: <gammalooprs[4688948c89ba1ea7]::processes::amplitude::AmplitudeGraph>::renormalization_part<unknown>
  1276. 32.36 s > at <unknown source file>:<unknown line>
  1277. 32.36 s > 19: <test_renormalization[c99a4cd1432bec79]::finite_part_quark_lo::{closure#0} as core[940e698046960fd5]::ops::function::FnOnce<()>>::call_once<unknown>
  1278. 32.36 s > at <unknown source file>:<unknown line>
  1279. 32.36 s > 20: test[75d6903177b1d7e9]::__rust_begin_short_backtrace::<core[940e698046960fd5]::result::Result<(), alloc[2ea6bcb46fca0c42]::string::String>, fn() -> core[940e698046960fd5]::result::Result<(), alloc[2ea6bcb46fca0c42]::string::String>><unknown>
  1280. 32.36 s > at <unknown source file>:<unknown line>
  1281. 32.36 s > 21: test[75d6903177b1d7e9]::run_test::{closure#0}<unknown>
  1282. 32.36 s > at <unknown source file>:<unknown line>
  1283. 32.36 s > 22: std[bcb96dfbba0ab899]::sys::backtrace::__rust_begin_short_backtrace::<test[75d6903177b1d7e9]::run_test::{closure#1}, ()><unknown>
  1284. 32.36 s > at <unknown source file>:<unknown line>
  1285. 32.36 s > 23: <std[bcb96dfbba0ab899]::thread::lifecycle::spawn_unchecked<test[75d6903177b1d7e9]::run_test::{closure#1}, ()>::{closure#1} as core[940e698046960fd5]::ops::function::FnOnce<()>>::call_once::{shim:vtable#0}<unknown>
  1286. 32.36 s > at <unknown source file>:<unknown line>
  1287. 32.36 s > 24: <std[bcb96dfbba0ab899]::sys::thread::unix::Thread>::new::thread_start<unknown>
  1288. 32.36 s > at <unknown source file>:<unknown line>
  1289. 32.36 s > 25: start_thread<unknown>
  1290. 32.36 s > at <unknown source file>:<unknown line>
  1291. 32.36 s > 26: __clone3<unknown>
  1292. 32.36 s > at <unknown source file>:<unknown line>
  1293. 32.36 s >
  1294. 32.36 s > Run with COLORBT_SHOW_HIDDEN=1 environment variable to disable frame filtering.
  1295. 32.36 s > Run with RUST_BACKTRACE=full to include source snippets.
  1296. 32.36 s >
  1297. 32.36 s > FAIL [ 0.379s] (447/456) gammalooprs::test_renormalization finite_part_ghost_2loop
  1298. 32.36 s > stdout ---
  1299. 32.36 s >
  1300. 32.36 s > running 1 test
  1301. 32.36 s > test finite_part_ghost_2loop ... FAILED
  1302. 32.36 s >
  1303. 32.36 s > failures:
  1304. 32.36 s >
  1305. 32.36 s > failures:
  1306. 32.36 s > finite_part_ghost_2loop
  1307. 32.36 s >
  1308. 32.36 s > test result: FAILED. 0 passed; 1 failed; 0 ignored; 0 measured; 5 filtered out; finished in 0.36s
  1309. 32.36 s >
  1310. 32.36 s > stderr ---
  1311. 32.36 s > The application panicked (crashed).
  1312. 32.36 s > Message: called `Result::unwrap()` on an `Err` value:
  1313. 32.36 s > 0: Symbolica could not parse FORM output:
  1314. 32.36 s > [spenso::{antisymmetric,real,spenso::tensor}::f]([spenso::{spenso::representat\
  1315. 32.36 s > ion,spenso::self_dual}::coad](8,[gammalooprs::{spenso::index}::hedge](0)
  1316. 32.36 s > ),[spenso::{spenso::representation,spenso::self_dual}::coad](8,[gammaloo\
  1317. 32.36 s > prs::{spenso::index}::hedge](3)),[spenso::{spenso::representation,spenso\
  1318. 32.36 s > ::self_dual}::coad](8,[gammalooprs::{spenso::index}::hedge](5)))*
  1319. 32.36 s > [spenso::{antisymmetric,real,spenso::tensor}::f]([spenso::{spenso::repre\
  1320. 32.36 s > sentation,spenso::self_dual}::coad](8,[gammalooprs::{spenso::index}::hed\
  1321. 32.36 s > ge](1)),[spenso::{spenso::representation,spenso::self_dual}::coad](8,
  1322. 32.36 s > [gammalooprs::{spenso::index}::hedge](11)),[spenso::{spenso::representat\
  1323. 32.36 s > ion,spenso::self_dual}::coad](8,[gammalooprs::{spenso::index}::hedge](7)
  1324. 32.36 s > ))*[spenso::{antisymmetric,real,spenso::tensor}::f]([spenso::{spenso::re\
  1325. 32.36 s > presentation,spenso::self_dual}::coad](8,[gammalooprs::{spenso::index}::\
  1326. 32.36 s > hedge](3)),[spenso::{spenso::representation,spenso::self_dual}::coad](8,
  1327. 32.36 s > [gammalooprs::{spenso::index}::hedge](7)),[spenso::{spenso::representati\
  1328. 32.36 s > on,spenso::self_dual}::coad](8,[gammalooprs::{spenso::index}::hedge](9))
  1329. 32.36 s > )*[spenso::{antisymmetric,real,spenso::tensor}::f]([spenso::{spenso::rep\
  1330. 32.36 s > resentation,spenso::self_dual}::coad](8,[gammalooprs::{spenso::index}::h\
  1331. 32.36 s > edge](11)),[spenso::{spenso::representation,spenso::self_dual}::coad](8,
  1332. 32.36 s > [gammalooprs::{spenso::index}::hedge](5)),[spenso::{spenso::representati\
  1333. 32.36 s > on,spenso::self_dual}::coad](8,[gammalooprs::{spenso::index}::hedge](9))
  1334. 32.36 s > )*dot(p4,p0)*dot(k1,k1)*dot(k2,k2)*i_*[UFO::{}::GC_10]^4*rat(-1,ep - 2)
  1335. 32.36 s > + [spenso::{antisymmetric,real,spenso::tensor}::f]([spenso::{spenso::re\
  1336. 32.36 s > presentation,spenso::self_dual}::coad](8,[gammalooprs::{spenso::index}::\
  1337. 32.36 s > hedge](0)),[spenso::{spenso::representation,spenso::self_dual}::coad](8,
  1338. 32.36 s > [gammalooprs::{spenso::index}::hedge](3)),[spenso::{spenso::representati\
  1339. 32.36 s > on,spenso::self_dual}::coad](8,[gammalooprs::{spenso::index}::hedge](5))
  1340. 32.36 s > )*[spenso::{antisymmetric,real,spenso::tensor}::f]([spenso::{spenso::rep\
  1341. 32.36 s > resentation,spenso::self_dual}::coad](8,[gammalooprs::{spenso::index}::h\
  1342. 32.36 s > edge](1)),[spenso::{spenso::representation,spenso::self_dual}::coad](8,
  1343. 32.36 s > [gammalooprs::{spenso::index}::hedge](11)),[spenso::{spenso::representat\
  1344. 32.36 s > ion,spenso::self_dual}::coad](8,[gammalooprs::{spenso::index}::hedge](7)
  1345. 32.36 s > ))*[spenso::{antisymmetric,real,spenso::tensor}::f]([spenso::{spenso::re\
  1346. 32.36 s > presentation,spenso::self_dual}::coad](8,[gammalooprs::{spenso::index}::\
  1347. 32.36 s > hedge](3)),[spenso::{spenso::representation,spenso::self_dual}::coad](8,
  1348. 32.36 s > [gammalooprs::{spenso::index}::hedge](7)),[spenso::{spenso::representati\
  1349. 32.36 s > on,spenso::self_dual}::coad](8,[gammalooprs::{spenso::index}::hedge](9))
  1350. 32.36 s > )*[spenso::{antisymmetric,real,spenso::tensor}::f]([spenso::{spenso::rep\
  1351. 32.36 s > resentation,spenso::self_dual}::coad](8,[gammalooprs::{spenso::index}::h\
  1352. 32.36 s > edge](11)),[spenso::{spenso::representation,spenso::self_dual}::coad](8,
  1353. 32.36 s > [gammalooprs::{spenso::index}::hedge](5)),[spenso::{spenso::representati\
  1354. 32.36 s > on,spenso::self_dual}::coad](8,[gammalooprs::{spenso::index}::hedge](9))
  1355. 32.36 s > )*dot(p4,p0)*dot(k1,k2)^2*i_*[UFO::{}::GC_10]^4*rat(1,ep - 2)
  1356. 32.36 s >
  1357. 32.36 s > Error:Symbol spenso::coad redefined with new attributes:
  1358. 32.36 s > - new user data specified: List([String("spenso::representation-v2"), String("self-dual"), List([String("symbol"), String("coad")]), List([String("cyclic"), Integer(1), List([List([String("symbol"), String("a")]), List([String("symbol"), String("b")]), List([String("symbol"), String("c")]), List([String("symbol"), String("d")])])]), String("top")]) vs None
  1359. 32.36 s >
  1360. 32.36 s >
  1361. 32.36 s > Location:
  1362. 32.36 s > crates/gammalooprs/src/uv/approx/integrated.rs:332
  1363. 32.36 s >
  1364. 32.36 s > ━━━━━━━━━━━━━━━━━━━━━━━━━━━━━━━━━━ BACKTRACE ━━━━━━━━━━━━━━━━━━━━━━━━━━━━━━━━━━━
  1365. 32.36 s > 1: <color_eyre[5722b77bc20a64cf]::config::EyreHook>::into_eyre_hook::{closure#0}<unknown>
  1366. 32.36 s > at <unknown source file>:<unknown line>
  1367. 32.36 s > 2: eyre[cb2fd339c0c40fca]::capture_handler<unknown>
  1368. 32.36 s > at <unknown source file>:<unknown line>
  1369. 32.36 s > 3: <eyre[cb2fd339c0c40fca]::Report>::from_std::<vakint[ad2b4d4b4d753fb9]::VakintError><unknown>
  1370. 32.36 s > at <unknown source file>:<unknown line>
  1371. 32.36 s > 4: <gammalooprs[4688948c89ba1ea7]::uv::approx::integrated::Integrated>::integrate::<gammalooprs[4688948c89ba1ea7]::uv::approx::Approximation><unknown>
  1372. 32.36 s > at <unknown source file>:<unknown line>
  1373. 32.36 s > 5: <gammalooprs[4688948c89ba1ea7]::uv::forest::Forest>::compute<unknown>
  1374. 32.36 s > at <unknown source file>:<unknown line>
  1375. 32.36 s > 6: gammalooprs[4688948c89ba1ea7]::uv::orchestrator::legacy_renormalization_part<unknown>
  1376. 32.36 s > at <unknown source file>:<unknown line>
  1377. 32.36 s > 7: <gammalooprs[4688948c89ba1ea7]::uv::settings::UVOrchestrator>::renormalization_part<unknown>
  1378. 32.36 s > at <unknown source file>:<unknown line>
  1379. 32.36 s > 8: <gammalooprs[4688948c89ba1ea7]::processes::amplitude::AmplitudeGraph>::renormalization_part<unknown>
  1380. 32.36 s > at <unknown source file>:<unknown line>
  1381. 32.36 s > 9: test_renormalization[c99a4cd1432bec79]::finite_part_ghost_2loop<unknown>
  1382. 32.36 s > at <unknown source file>:<unknown line>
  1383. 32.36 s > 10: <test_renormalization[c99a4cd1432bec79]::finite_part_ghost_2loop::{closure#0} as core[940e698046960fd5]::ops::function::FnOnce<()>>::call_once<unknown>
  1384. 32.36 s > at <unknown source file>:<unknown line>
  1385. 32.36 s > 11: test[75d6903177b1d7e9]::__rust_begin_short_backtrace::<core[940e698046960fd5]::result::Result<(), alloc[2ea6bcb46fca0c42]::string::String>, fn() -> core[940e698046960fd5]::result::Result<(), alloc[2ea6bcb46fca0c42]::string::String>><unknown>
  1386. 32.36 s > at <unknown source file>:<unknown line>
  1387. 32.36 s > 12: test[75d6903177b1d7e9]::run_test::{closure#0}<unknown>
  1388. 32.36 s > at <unknown source file>:<unknown line>
  1389. 32.36 s > 13: std[bcb96dfbba0ab899]::sys::backtrace::__rust_begin_short_backtrace::<test[75d6903177b1d7e9]::run_test::{closure#1}, ()><unknown>
  1390. 32.36 s > at <unknown source file>:<unknown line>
  1391. 32.36 s > 14: <std[bcb96dfbba0ab899]::thread::lifecycle::spawn_unchecked<test[75d6903177b1d7e9]::run_test::{closure#1}, ()>::{closure#1} as core[940e698046960fd5]::ops::function::FnOnce<()>>::call_once::{shim:vtable#0}<unknown>
  1392. 32.36 s > at <unknown source file>:<unknown line>
  1393. 32.36 s > 15: <std[bcb96dfbba0ab899]::sys::thread::unix::Thread>::new::thread_start<unknown>
  1394. 32.36 s > at <unknown source file>:<unknown line>
  1395. 32.36 s > 16: start_thread<unknown>
  1396. 32.36 s > at <unknown source file>:<unknown line>
  1397. 32.36 s > 17: __clone3<unknown>
  1398. 32.36 s > at <unknown source file>:<unknown line>
  1399. 32.36 s >
  1400. 32.36 s > Run with COLORBT_SHOW_HIDDEN=1 environment variable to disable frame filtering.
  1401. 32.36 s > Run with RUST_BACKTRACE=full to include source snippets.
  1402. 32.36 s > Location: crates/gammalooprs/tests/test_renormalization.rs:445
  1403. 32.36 s >
  1404. 32.36 s > ━━━━━━━━━━━━━━━━━━━━━━━━━━━━━━━━━━ BACKTRACE ━━━━━━━━━━━━━━━━━━━━━━━━━━━━━━━━━━━
  1405. 32.36 s > 1: <color_eyre[5722b77bc20a64cf]::config::PanicHook>::panic_report<unknown>
  1406. 32.36 s > at <unknown source file>:<unknown line>
  1407. 32.36 s > 2: <color_eyre[5722b77bc20a64cf]::config::PanicHook>::into_panic_hook::{closure#0}<unknown>
  1408. 32.36 s > at <unknown source file>:<unknown line>
  1409. 32.36 s > 3: std[bcb96dfbba0ab899]::panicking::panic_with_hook<unknown>
  1410. 32.36 s > at <unknown source file>:<unknown line>
  1411. 32.36 s > 4: std[bcb96dfbba0ab899]::panicking::panic_handler::{closure#0}<unknown>
  1412. 32.36 s > at <unknown source file>:<unknown line>
  1413. 32.36 s > 5: std[bcb96dfbba0ab899]::sys::backtrace::__rust_end_short_backtrace::<std[bcb96dfbba0ab899]::panicking::panic_handler::{closure#0}, !><unknown>
  1414. 32.36 s > at <unknown source file>:<unknown line>
  1415. 32.36 s > 6: __rustc[6c289b9f9c454d21]::rust_begin_unwind<unknown>
  1416. 32.36 s > at <unknown source file>:<unknown line>
  1417. 32.36 s > 7: core[940e698046960fd5]::panicking::panic_fmt<unknown>
  1418. 32.36 s > at <unknown source file>:<unknown line>
  1419. 32.36 s > 8: core[940e698046960fd5]::result::unwrap_failed<unknown>
  1420. 32.36 s > at <unknown source file>:<unknown line>
  1421. 32.36 s > 9: test_renormalization[c99a4cd1432bec79]::finite_part_ghost_2loop<unknown>
  1422. 32.36 s > at <unknown source file>:<unknown line>
  1423. 32.36 s > 10: <test_renormalization[c99a4cd1432bec79]::finite_part_ghost_2loop::{closure#0} as core[940e698046960fd5]::ops::function::FnOnce<()>>::call_once<unknown>
  1424. 32.36 s > at <unknown source file>:<unknown line>
  1425. 32.36 s > 11: test[75d6903177b1d7e9]::__rust_begin_short_backtrace::<core[940e698046960fd5]::result::Result<(), alloc[2ea6bcb46fca0c42]::string::String>, fn() -> core[940e698046960fd5]::result::Result<(), alloc[2ea6bcb46fca0c42]::string::String>><unknown>
  1426. 32.36 s > at <unknown source file>:<unknown line>
  1427. 32.36 s > 12: test[75d6903177b1d7e9]::run_test::{closure#0}<unknown>
  1428. 32.36 s > at <unknown source file>:<unknown line>
  1429. 32.36 s > 13: std[bcb96dfbba0ab899]::sys::backtrace::__rust_begin_short_backtrace::<test[75d6903177b1d7e9]::run_test::{closure#1}, ()><unknown>
  1430. 32.36 s > at <unknown source file>:<unknown line>
  1431. 32.36 s > 14: <std[bcb96dfbba0ab899]::thread::lifecycle::spawn_unchecked<test[75d6903177b1d7e9]::run_test::{closure#1}, ()>::{closure#1} as core[940e698046960fd5]::ops::function::FnOnce<()>>::call_once::{shim:vtable#0}<unknown>
  1432. 32.36 s > at <unknown source file>:<unknown line>
  1433. 32.36 s > 15: <std[bcb96dfbba0ab899]::sys::thread::unix::Thread>::new::thread_start<unknown>
  1434. 32.36 s > at <unknown source file>:<unknown line>
  1435. 32.36 s > 16: start_thread<unknown>
  1436. 32.36 s > at <unknown source file>:<unknown line>
  1437. 32.36 s > 17: __clone3<unknown>
  1438. 32.36 s > at <unknown source file>:<unknown line>
  1439. 32.36 s >
  1440. 32.36 s > Run with COLORBT_SHOW_HIDDEN=1 environment variable to disable frame filtering.
  1441. 32.36 s > Run with RUST_BACKTRACE=full to include source snippets.
  1442. 32.36 s >
  1443. 32.36 s > ------------
  1444. 32.36 s > Summary [ 8.520s] 456 tests run: 453 passed, 3 failed, 61 skipped
  1445. 32.36 s > FAIL [ 0.221s] (442/456) gammalooprs::test_renormalization finit_part_ghlo
  1446. 32.36 s > stdout ---
  1447. 32.36 s >
  1448. 32.36 s > running 1 test
  1449. 32.36 s > test finit_part_ghlo ... FAILED
  1450. 32.36 s >
  1451. 32.36 s > failures:
  1452. 32.36 s >
  1453. 32.36 s > failures:
  1454. 32.36 s > finit_part_ghlo
  1455. 32.36 s >
  1456. 32.36 s > test result: FAILED. 0 passed; 1 failed; 0 ignored; 0 measured; 5 filtered out; finished in 0.19s
  1457. 32.36 s >
  1458. 32.36 s > stderr ---
  1459. 32.36 s > The application panicked (crashed).
  1460. 32.36 s > Message: called `Result::unwrap()` on an `Err` value:
  1461. 32.36 s > 0: Symbolica could not parse FORM output:
  1462. 32.36 s > [spenso::{antisymmetric,real,spenso::tensor}::f]([spenso::{spenso::representat\
  1463. 32.36 s > ion,spenso::self_dual}::coad](8,[gammalooprs::{spenso::index}::hedge](0)
  1464. 32.36 s > ),[spenso::{spenso::representation,spenso::self_dual}::coad](8,[gammaloo\
  1465. 32.36 s > prs::{spenso::index}::hedge](3)),[spenso::{spenso::representation,spenso\
  1466. 32.36 s > ::self_dual}::coad](8,[gammalooprs::{spenso::index}::hedge](5)))*
  1467. 32.36 s > [spenso::{antisymmetric,real,spenso::tensor}::f]([spenso::{spenso::repre\
  1468. 32.36 s > sentation,spenso::self_dual}::coad](8,[gammalooprs::{spenso::index}::hed\
  1469. 32.36 s > ge](1)),[spenso::{spenso::representation,spenso::self_dual}::coad](8,
  1470. 32.36 s > [gammalooprs::{spenso::index}::hedge](3)),[spenso::{spenso::representati\
  1471. 32.36 s > on,spenso::self_dual}::coad](8,[gammalooprs::{spenso::index}::hedge](5))
  1472. 32.36 s > )*dot(p1,p0)*[UFO::{}::GC_10]^2*rat(-1,1)
  1473. 32.36 s >
  1474. 32.36 s > Error:Symbol spenso::coad redefined with new attributes:
  1475. 32.36 s > - new user data specified: List([String("spenso::representation-v2"), String("self-dual"), List([String("symbol"), String("coad")]), List([String("cyclic"), Integer(1), List([List([String("symbol"), String("a")]), List([String("symbol"), String("b")]), List([String("symbol"), String("c")]), List([String("symbol"), String("d")])])]), String("top")]) vs None
  1476. 32.36 s >
  1477. 32.36 s >
  1478. 32.36 s > Location:
  1479. 32.36 s > crates/gammalooprs/src/uv/approx/integrated.rs:332
  1480. 32.36 s >
  1481. 32.36 s > ━━━━━━━━━━━━━━━━━━━━━━━━━━━━━━━━━━ BACKTRACE ━━━━━━━━━━━━━━━━━━━━━━━━━━━━━━━━━━━
  1482. 32.36 s > 1: <color_eyre[5722b77bc20a64cf]::config::EyreHook>::into_eyre_hook::{closure#0}<unknown>
  1483. 32.36 s > at <unknown source file>:<unknown line>
  1484. 32.36 s > 2: eyre[cb2fd339c0c40fca]::capture_handler<unknown>
  1485. 32.36 s > at <unknown source file>:<unknown line>
  1486. 32.36 s > 3: <eyre[cb2fd339c0c40fca]::Report>::from_std::<vakint[ad2b4d4b4d753fb9]::VakintError><unknown>
  1487. 32.36 s > at <unknown source file>:<unknown line>
  1488. 32.36 s > 4: <gammalooprs[4688948c89ba1ea7]::uv::approx::integrated::Integrated>::integrate::<gammalooprs[4688948c89ba1ea7]::uv::hedge_poset::ForestNode><unknown>
  1489. 32.36 s > at <unknown source file>:<unknown line>
  1490. 32.36 s > 5: <gammalooprs[4688948c89ba1ea7]::uv::approx::integrated::Integrated>::run::<gammalooprs[4688948c89ba1ea7]::uv::hedge_poset::ForestNode, gammalooprs[4688948c89ba1ea7]::uv::hedge_poset::ForestNode><unknown>
  1491. 32.36 s > at <unknown source file>:<unknown line>
  1492. 32.36 s > 6: <gammalooprs[4688948c89ba1ea7]::uv::hedge_poset::Forests>::integrate<unknown>
  1493. 32.36 s > at <unknown source file>:<unknown line>
  1494. 32.36 s > 7: gammalooprs[4688948c89ba1ea7]::uv::orchestrator::hedge_poset_renormalization_part<unknown>
  1495. 32.36 s > at <unknown source file>:<unknown line>
  1496. 32.36 s > 8: <gammalooprs[4688948c89ba1ea7]::uv::settings::UVOrchestrator>::renormalization_part<unknown>
  1497. 32.36 s > at <unknown source file>:<unknown line>
  1498. 32.36 s > 9: <gammalooprs[4688948c89ba1ea7]::processes::amplitude::AmplitudeGraph>::renormalization_part<unknown>
  1499. 32.36 s > at <unknown source file>:<unknown line>
  1500. 32.36 s > 10: <test_renormalization[c99a4cd1432bec79]::finit_part_ghlo::{closure#0} as core[940e698046960fd5]::ops::function::FnOnce<()>>::call_once<unknown>
  1501. 32.36 s > at <unknown source file>:<unknown line>
  1502. 32.36 s > 11: test[75d6903177b1d7e9]::__rust_begin_short_backtrace::<core[940e698046960fd5]::result::Result<(), alloc[2ea6bcb46fca0c42]::string::String>, fn() -> core[940e698046960fd5]::result::Result<(), alloc[2ea6bcb46fca0c42]::string::String>><unknown>
  1503. 32.36 s > at <unknown source file>:<unknown line>
  1504. 32.36 s > 12: test[75d6903177b1d7e9]::run_test::{closure#0}<unknown>
  1505. 32.36 s > at <unknown source file>:<unknown line>
  1506. 32.36 s > 13: std[bcb96dfbba0ab899]::sys::backtrace::__rust_begin_short_backtrace::<test[75d6903177b1d7e9]::run_test::{closure#1}, ()><unknown>
  1507. 32.36 s > at <unknown source file>:<unknown line>
  1508. 32.36 s > 14: <std[bcb96dfbba0ab899]::thread::lifecycle::spawn_unchecked<test[75d6903177b1d7e9]::run_test::{closure#1}, ()>::{closure#1} as core[940e698046960fd5]::ops::function::FnOnce<()>>::call_once::{shim:vtable#0}<unknown>
  1509. 32.36 s > at <unknown source file>:<unknown line>
  1510. 32.36 s > 15: <std[bcb96dfbba0ab899]::sys::thread::unix::Thread>::new::thread_start<unknown>
  1511. 32.36 s > at <unknown source file>:<unknown line>
  1512. 32.36 s > 16: start_thread<unknown>
  1513. 32.36 s > at <unknown source file>:<unknown line>
  1514. 32.36 s > 17: __clone3<unknown>
  1515. 32.36 s > at <unknown source file>:<unknown line>
  1516. 32.36 s >
  1517. 32.36 s > Run with COLORBT_SHOW_HIDDEN=1 environment variable to disable frame filtering.
  1518. 32.36 s > Run with RUST_BACKTRACE=full to include source snippets.
  1519. 32.36 s > Location: crates/gammalooprs/tests/test_renormalization.rs:550
  1520. 32.36 s >
  1521. 32.36 s > ━━━━━━━━━━━━━━━━━━━━━━━━━━━━━━━━━━ BACKTRACE ━━━━━━━━━━━━━━━━━━━━━━━━━━━━━━━━━━━
  1522. 32.36 s > 1: <color_eyre[5722b77bc20a64cf]::config::PanicHook>::panic_report<unknown>
  1523. 32.36 s > at <unknown source file>:<unknown line>
  1524. 32.36 s > 2: <color_eyre[5722b77bc20a64cf]::config::PanicHook>::into_panic_hook::{closure#0}<unknown>
  1525. 32.36 s > at <unknown source file>:<unknown line>
  1526. 32.36 s > 3: std[bcb96dfbba0ab899]::panicking::panic_with_hook<unknown>
  1527. 32.36 s > at <unknown source file>:<unknown line>
  1528. 32.36 s > 4: std[bcb96dfbba0ab899]::panicking::panic_handler::{closure#0}<unknown>
  1529. 32.36 s > at <unknown source file>:<unknown line>
  1530. 32.36 s > 5: std[bcb96dfbba0ab899]::sys::backtrace::__rust_end_short_backtrace::<std[bcb96dfbba0ab899]::panicking::panic_handler::{closure#0}, !><unknown>
  1531. 32.36 s > at <unknown source file>:<unknown line>
  1532. 32.36 s > 6: __rustc[6c289b9f9c454d21]::rust_begin_unwind<unknown>
  1533. 32.36 s > at <unknown source file>:<unknown line>
  1534. 32.36 s > 7: core[940e698046960fd5]::panicking::panic_fmt<unknown>
  1535. 32.36 s > at <unknown source file>:<unknown line>
  1536. 32.36 s > 8: core[940e698046960fd5]::result::unwrap_failed<unknown>
  1537. 32.36 s > at <unknown source file>:<unknown line>
  1538. 32.36 s > 9: <test_renormalization[c99a4cd1432bec79]::finit_part_ghlo::{closure#0} as core[940e698046960fd5]::ops::function::FnOnce<()>>::call_once<unknown>
  1539. 32.36 s > at <unknown source file>:<unknown line>
  1540. 32.36 s > 10: test[75d6903177b1d7e9]::__rust_begin_short_backtrace::<core[940e698046960fd5]::result::Result<(), alloc[2ea6bcb46fca0c42]::string::String>, fn() -> core[940e698046960fd5]::result::Result<(), alloc[2ea6bcb46fca0c42]::string::String>><unknown>
  1541. 32.36 s > at <unknown source file>:<unknown line>
  1542. 32.36 s > 11: test[75d6903177b1d7e9]::run_test::{closure#0}<unknown>
  1543. 32.36 s > at <unknown source file>:<unknown line>
  1544. 32.36 s > 12: std[bcb96dfbba0ab899]::sys::backtrace::__rust_begin_short_backtrace::<test[75d6903177b1d7e9]::run_test::{closure#1}, ()><unknown>
  1545. 32.36 s > at <unknown source file>:<unknown line>
  1546. 32.36 s > 13: <std[bcb96dfbba0ab899]::thread::lifecycle::spawn_unchecked<test[75d6903177b1d7e9]::run_test::{closure#1}, ()>::{closure#1} as core[940e698046960fd5]::ops::function::FnOnce<()>>::call_once::{shim:vtable#0}<unknown>
  1547. 32.36 s > at <unknown source file>:<unknown line>
  1548. 32.36 s > 14: <std[bcb96dfbba0ab899]::sys::thread::unix::Thread>::new::thread_start<unknown>
  1549. 32.36 s > at <unknown source file>:<unknown line>
  1550. 32.36 s > 15: start_thread<unknown>
  1551. 32.36 s > at <unknown source file>:<unknown line>
  1552. 32.36 s > 16: __clone3<unknown>
  1553. 32.36 s > at <unknown source file>:<unknown line>
  1554. 32.36 s >
  1555. 32.36 s > Run with COLORBT_SHOW_HIDDEN=1 environment variable to disable frame filtering.
  1556. 32.36 s > Run with RUST_BACKTRACE=full to include source snippets.
  1557. 32.36 s >
  1558. 32.36 s > FAIL [ 0.166s] (444/456) gammalooprs::test_renormalization finite_part_quark_lo
  1559. 32.36 s > stdout ---
  1560. 32.36 s >
  1561. 32.36 s > running 1 test
  1562. 32.36 s > test finite_part_quark_lo ... FAILED
  1563. 32.36 s >
  1564. 32.36 s > failures:
  1565. 32.36 s >
  1566. 32.36 s > failures:
  1567. 32.36 s > finite_part_quark_lo
  1568. 32.36 s >
  1569. 32.36 s > test result: FAILED. 0 passed; 1 failed; 0 ignored; 0 measured; 5 filtered out; finished in 0.15s
  1570. 32.36 s >
  1571. 32.36 s > stderr ---
  1572. 32.36 s > The application panicked (crashed).
  1573. 32.36 s > Message: called `Result::unwrap()` on an `Err` value: "Symbol spenso::mink redefined with new attributes:\n\t- new user data specified: List([String(\"spenso::representation-v2\"), String(\"inline-metric\"), List([String(\"symbol\"), String(\"mink\")]), List([String(\"cyclic\"), Integer(1), List([List([String(\"symbol\"), String(\"mu\")]), List([String(\"symbol\"), String(\"nu\")]), List([String(\"symbol\"), String(\"rho\")]), List([String(\"symbol\"), String(\"sigma\")])])]), String(\"top\")]) vs None\n"
  1574. 32.36 s > Location: crates/vakint/src/lib.rs:4766
  1575. 32.36 s >
  1576. 32.36 s > ━━━━━━━━━━━━━━━━━━━━━━━━━━━━━━━━━━ BACKTRACE ━━━━━━━━━━━━━━━━━━━━━━━━━━━━━━━━━━━
  1577. 32.36 s > 1: <color_eyre[5722b77bc20a64cf]::config::PanicHook>::panic_report<unknown>
  1578. 32.36 s > at <unknown source file>:<unknown line>
  1579. 32.36 s > 2: <color_eyre[5722b77bc20a64cf]::config::PanicHook>::into_panic_hook::{closure#0}<unknown>
  1580. 32.36 s > at <unknown source file>:<unknown line>
  1581. 32.36 s > 3: std[bcb96dfbba0ab899]::panicking::panic_with_hook<unknown>
  1582. 32.36 s > at <unknown source file>:<unknown line>
  1583. 32.36 s > 4: std[bcb96dfbba0ab899]::panicking::panic_handler::{closure#0}<unknown>
  1584. 32.36 s > at <unknown source file>:<unknown line>
  1585. 32.36 s > 5: std[bcb96dfbba0ab899]::sys::backtrace::__rust_end_short_backtrace::<std[bcb96dfbba0ab899]::panicking::panic_handler::{closure#0}, !><unknown>
  1586. 32.36 s > at <unknown source file>:<unknown line>
  1587. 32.36 s > 6: __rustc[6c289b9f9c454d21]::rust_begin_unwind<unknown>
  1588. 32.36 s > at <unknown source file>:<unknown line>
  1589. 32.36 s > 7: core[940e698046960fd5]::panicking::panic_fmt<unknown>
  1590. 32.36 s > at <unknown source file>:<unknown line>
  1591. 32.36 s > 8: core[940e698046960fd5]::result::unwrap_failed<unknown>
  1592. 32.36 s > at <unknown source file>:<unknown line>
  1593. 32.36 s > 9: <vakint[ad2b4d4b4d753fb9]::Vakint>::sanitize_user_expressions<unknown>
  1594. 32.36 s > at <unknown source file>:<unknown line>
  1595. 32.36 s > 10: <vakint[ad2b4d4b4d753fb9]::Vakint>::prepare_expression_for_form<unknown>
  1596. 32.36 s > at <unknown source file>:<unknown line>
  1597. 32.36 s > 11: <vakint[ad2b4d4b4d753fb9]::VakintTerm>::tensor_reduce<unknown>
  1598. 32.36 s > at <unknown source file>:<unknown line>
  1599. 32.36 s > 12: <vakint[ad2b4d4b4d753fb9]::VakintExpression>::tensor_reduce<unknown>
  1600. 32.36 s > at <unknown source file>:<unknown line>
  1601. 32.36 s > 13: <gammalooprs[4688948c89ba1ea7]::uv::approx::integrated::Integrated>::integrate::<gammalooprs[4688948c89ba1ea7]::uv::hedge_poset::ForestNode><unknown>
  1602. 32.36 s > at <unknown source file>:<unknown line>
  1603. 32.36 s > 14: <gammalooprs[4688948c89ba1ea7]::uv::approx::integrated::Integrated>::run::<gammalooprs[4688948c89ba1ea7]::uv::hedge_poset::ForestNode, gammalooprs[4688948c89ba1ea7]::uv::hedge_poset::ForestNode><unknown>
  1604. 32.36 s > at <unknown source file>:<unknown line>
  1605. 32.36 s > 15: <gammalooprs[4688948c89ba1ea7]::uv::hedge_poset::Forests>::integrate<unknown>
  1606. 32.36 s > at <unknown source file>:<unknown line>
  1607. 32.36 s > 16: gammalooprs[4688948c89ba1ea7]::uv::orchestrator::hedge_poset_renormalization_part<unknown>
  1608. 32.36 s > at <unknown source file>:<unknown line>
  1609. 32.36 s > 17: <gammalooprs[4688948c89ba1ea7]::uv::settings::UVOrchestrator>::renormalization_part<unknown>
  1610. 32.36 s > at <unknown source file>:<unknown line>
  1611. 32.36 s > 18: <gammalooprs[4688948c89ba1ea7]::processes::amplitude::AmplitudeGraph>::renormalization_part<unknown>
  1612. 32.36 s > at <unknown source file>:<unknown line>
  1613. 32.36 s > 19: <test_renormalization[c99a4cd1432bec79]::finite_part_quark_lo::{closure#0} as core[940e698046960fd5]::ops::function::FnOnce<()>>::call_once<unknown>
  1614. 32.36 s > at <unknown source file>:<unknown line>
  1615. 32.36 s > 20: test[75d6903177b1d7e9]::__rust_begin_short_backtrace::<core[940e698046960fd5]::result::Result<(), alloc[2ea6bcb46fca0c42]::string::String>, fn() -> core[940e698046960fd5]::result::Result<(), alloc[2ea6bcb46fca0c42]::string::String>><unknown>
  1616. 32.36 s > at <unknown source file>:<unknown line>
  1617. 32.36 s > 21: test[75d6903177b1d7e9]::run_test::{closure#0}<unknown>
  1618. 32.36 s > at <unknown source file>:<unknown line>
  1619. 32.36 s > 22: std[bcb96dfbba0ab899]::sys::backtrace::__rust_begin_short_backtrace::<test[75d6903177b1d7e9]::run_test::{closure#1}, ()><unknown>
  1620. 32.36 s > at <unknown source file>:<unknown line>
  1621. 32.36 s > 23: <std[bcb96dfbba0ab899]::thread::lifecycle::spawn_unchecked<test[75d6903177b1d7e9]::run_test::{closure#1}, ()>::{closure#1} as core[940e698046960fd5]::ops::function::FnOnce<()>>::call_once::{shim:vtable#0}<unknown>
  1622. 32.36 s > at <unknown source file>:<unknown line>
  1623. 32.36 s > 24: <std[bcb96dfbba0ab899]::sys::thread::unix::Thread>::new::thread_start<unknown>
  1624. 32.36 s > at <unknown source file>:<unknown line>
  1625. 32.36 s > 25: start_thread<unknown>
  1626. 32.36 s > at <unknown source file>:<unknown line>
  1627. 32.36 s > 26: __clone3<unknown>
  1628. 32.36 s > at <unknown source file>:<unknown line>
  1629. 32.36 s >
  1630. 32.36 s > Run with COLORBT_SHOW_HIDDEN=1 environment variable to disable frame filtering.
  1631. 32.36 s > Run with RUST_BACKTRACE=full to include source snippets.
  1632. 32.36 s >
  1633. 32.36 s > FAIL [ 0.379s] (447/456) gammalooprs::test_renormalization finite_part_ghost_2loop
  1634. 32.36 s > stdout ---
  1635. 32.36 s >
  1636. 32.36 s > running 1 test
  1637. 32.36 s > test finite_part_ghost_2loop ... FAILED
  1638. 32.36 s >
  1639. 32.36 s > failures:
  1640. 32.36 s >
  1641. 32.36 s > failures:
  1642. 32.36 s > finite_part_ghost_2loop
  1643. 32.36 s >
  1644. 32.36 s > test result: FAILED. 0 passed; 1 failed; 0 ignored; 0 measured; 5 filtered out; finished in 0.36s
  1645. 32.36 s >
  1646. 32.36 s > stderr ---
  1647. 32.36 s > The application panicked (crashed).
  1648. 32.36 s > Message: called `Result::unwrap()` on an `Err` value:
  1649. 32.36 s > 0: Symbolica could not parse FORM output:
  1650. 32.36 s > [spenso::{antisymmetric,real,spenso::tensor}::f]([spenso::{spenso::representat\
  1651. 32.36 s > ion,spenso::self_dual}::coad](8,[gammalooprs::{spenso::index}::hedge](0)
  1652. 32.36 s > ),[spenso::{spenso::representation,spenso::self_dual}::coad](8,[gammaloo\
  1653. 32.36 s > prs::{spenso::index}::hedge](3)),[spenso::{spenso::representation,spenso\
  1654. 32.36 s > ::self_dual}::coad](8,[gammalooprs::{spenso::index}::hedge](5)))*
  1655. 32.36 s > [spenso::{antisymmetric,real,spenso::tensor}::f]([spenso::{spenso::repre\
  1656. 32.36 s > sentation,spenso::self_dual}::coad](8,[gammalooprs::{spenso::index}::hed\
  1657. 32.36 s > ge](1)),[spenso::{spenso::representation,spenso::self_dual}::coad](8,
  1658. 32.36 s > [gammalooprs::{spenso::index}::hedge](11)),[spenso::{spenso::representat\
  1659. 32.36 s > ion,spenso::self_dual}::coad](8,[gammalooprs::{spenso::index}::hedge](7)
  1660. 32.36 s > ))*[spenso::{antisymmetric,real,spenso::tensor}::f]([spenso::{spenso::re\
  1661. 32.36 s > presentation,spenso::self_dual}::coad](8,[gammalooprs::{spenso::index}::\
  1662. 32.36 s > hedge](3)),[spenso::{spenso::representation,spenso::self_dual}::coad](8,
  1663. 32.36 s > [gammalooprs::{spenso::index}::hedge](7)),[spenso::{spenso::representati\
  1664. 32.36 s > on,spenso::self_dual}::coad](8,[gammalooprs::{spenso::index}::hedge](9))
  1665. 32.36 s > )*[spenso::{antisymmetric,real,spenso::tensor}::f]([spenso::{spenso::rep\
  1666. 32.36 s > resentation,spenso::self_dual}::coad](8,[gammalooprs::{spenso::index}::h\
  1667. 32.36 s > edge](11)),[spenso::{spenso::representation,spenso::self_dual}::coad](8,
  1668. 32.36 s > [gammalooprs::{spenso::index}::hedge](5)),[spenso::{spenso::representati\
  1669. 32.36 s > on,spenso::self_dual}::coad](8,[gammalooprs::{spenso::index}::hedge](9))
  1670. 32.36 s > )*dot(p4,p0)*dot(k1,k1)*dot(k2,k2)*i_*[UFO::{}::GC_10]^4*rat(-1,ep - 2)
  1671. 32.36 s > + [spenso::{antisymmetric,real,spenso::tensor}::f]([spenso::{spenso::re\
  1672. 32.36 s > presentation,spenso::self_dual}::coad](8,[gammalooprs::{spenso::index}::\
  1673. 32.36 s > hedge](0)),[spenso::{spenso::representation,spenso::self_dual}::coad](8,
  1674. 32.36 s > [gammalooprs::{spenso::index}::hedge](3)),[spenso::{spenso::representati\
  1675. 32.36 s > on,spenso::self_dual}::coad](8,[gammalooprs::{spenso::index}::hedge](5))
  1676. 32.36 s > )*[spenso::{antisymmetric,real,spenso::tensor}::f]([spenso::{spenso::rep\
  1677. 32.36 s > resentation,spenso::self_dual}::coad](8,[gammalooprs::{spenso::index}::h\
  1678. 32.36 s > edge](1)),[spenso::{spenso::representation,spenso::self_dual}::coad](8,
  1679. 32.36 s > [gammalooprs::{spenso::index}::hedge](11)),[spenso::{spenso::representat\
  1680. 32.36 s > ion,spenso::self_dual}::coad](8,[gammalooprs::{spenso::index}::hedge](7)
  1681. 32.36 s > ))*[spenso::{antisymmetric,real,spenso::tensor}::f]([spenso::{spenso::re\
  1682. 32.36 s > presentation,spenso::self_dual}::coad](8,[gammalooprs::{spenso::index}::\
  1683. 32.36 s > hedge](3)),[spenso::{spenso::representation,spenso::self_dual}::coad](8,
  1684. 32.36 s > [gammalooprs::{spenso::index}::hedge](7)),[spenso::{spenso::representati\
  1685. 32.36 s > on,spenso::self_dual}::coad](8,[gammalooprs::{spenso::index}::hedge](9))
  1686. 32.36 s > )*[spenso::{antisymmetric,real,spenso::tensor}::f]([spenso::{spenso::rep\
  1687. 32.36 s > resentation,spenso::self_dual}::coad](8,[gammalooprs::{spenso::index}::h\
  1688. 32.36 s > edge](11)),[spenso::{spenso::representation,spenso::self_dual}::coad](8,
  1689. 32.36 s > [gammalooprs::{spenso::index}::hedge](5)),[spenso::{spenso::representati\
  1690. 32.36 s > on,spenso::self_dual}::coad](8,[gammalooprs::{spenso::index}::hedge](9))
  1691. 32.36 s > )*dot(p4,p0)*dot(k1,k2)^2*i_*[UFO::{}::GC_10]^4*rat(1,ep - 2)
  1692. 32.36 s >
  1693. 32.36 s > Error:Symbol spenso::coad redefined with new attributes:
  1694. 32.36 s > - new user data specified: List([String("spenso::representation-v2"), String("self-dual"), List([String("symbol"), String("coad")]), List([String("cyclic"), Integer(1), List([List([String("symbol"), String("a")]), List([String("symbol"), String("b")]), List([String("symbol"), String("c")]), List([String("symbol"), String("d")])])]), String("top")]) vs None
  1695. 32.36 s >
  1696. 32.36 s >
  1697. 32.36 s > Location:
  1698. 32.36 s > crates/gammalooprs/src/uv/approx/integrated.rs:332
  1699. 32.36 s >
  1700. 32.36 s > ━━━━━━━━━━━━━━━━━━━━━━━━━━━━━━━━━━ BACKTRACE ━━━━━━━━━━━━━━━━━━━━━━━━━━━━━━━━━━━
  1701. 32.36 s > 1: <color_eyre[5722b77bc20a64cf]::config::EyreHook>::into_eyre_hook::{closure#0}<unknown>
  1702. 32.36 s > at <unknown source file>:<unknown line>
  1703. 32.36 s > 2: eyre[cb2fd339c0c40fca]::capture_handler<unknown>
  1704. 32.36 s > at <unknown source file>:<unknown line>
  1705. 32.36 s > 3: <eyre[cb2fd339c0c40fca]::Report>::from_std::<vakint[ad2b4d4b4d753fb9]::VakintError><unknown>
  1706. 32.36 s > at <unknown source file>:<unknown line>
  1707. 32.36 s > 4: <gammalooprs[4688948c89ba1ea7]::uv::approx::integrated::Integrated>::integrate::<gammalooprs[4688948c89ba1ea7]::uv::approx::Approximation><unknown>
  1708. 32.36 s > at <unknown source file>:<unknown line>
  1709. 32.36 s > 5: <gammalooprs[4688948c89ba1ea7]::uv::forest::Forest>::compute<unknown>
  1710. 32.36 s > at <unknown source file>:<unknown line>
  1711. 32.36 s > 6: gammalooprs[4688948c89ba1ea7]::uv::orchestrator::legacy_renormalization_part<unknown>
  1712. 32.36 s > at <unknown source file>:<unknown line>
  1713. 32.36 s > 7: <gammalooprs[4688948c89ba1ea7]::uv::settings::UVOrchestrator>::renormalization_part<unknown>
  1714. 32.36 s > at <unknown source file>:<unknown line>
  1715. 32.36 s > 8: <gammalooprs[4688948c89ba1ea7]::processes::amplitude::AmplitudeGraph>::renormalization_part<unknown>
  1716. 32.36 s > at <unknown source file>:<unknown line>
  1717. 32.36 s > 9: test_renormalization[c99a4cd1432bec79]::finite_part_ghost_2loop<unknown>
  1718. 32.36 s > at <unknown source file>:<unknown line>
  1719. 32.36 s > 10: <test_renormalization[c99a4cd1432bec79]::finite_part_ghost_2loop::{closure#0} as core[940e698046960fd5]::ops::function::FnOnce<()>>::call_once<unknown>
  1720. 32.36 s > at <unknown source file>:<unknown line>
  1721. 32.36 s > 11: test[75d6903177b1d7e9]::__rust_begin_short_backtrace::<core[940e698046960fd5]::result::Result<(), alloc[2ea6bcb46fca0c42]::string::String>, fn() -> core[940e698046960fd5]::result::Result<(), alloc[2ea6bcb46fca0c42]::string::String>><unknown>
  1722. 32.36 s > at <unknown source file>:<unknown line>
  1723. 32.36 s > 12: test[75d6903177b1d7e9]::run_test::{closure#0}<unknown>
  1724. 32.36 s > at <unknown source file>:<unknown line>
  1725. 32.36 s > 13: std[bcb96dfbba0ab899]::sys::backtrace::__rust_begin_short_backtrace::<test[75d6903177b1d7e9]::run_test::{closure#1}, ()><unknown>
  1726. 32.36 s > at <unknown source file>:<unknown line>
  1727. 32.36 s > 14: <std[bcb96dfbba0ab899]::thread::lifecycle::spawn_unchecked<test[75d6903177b1d7e9]::run_test::{closure#1}, ()>::{closure#1} as core[940e698046960fd5]::ops::function::FnOnce<()>>::call_once::{shim:vtable#0}<unknown>
  1728. 32.36 s > at <unknown source file>:<unknown line>
  1729. 32.36 s > 15: <std[bcb96dfbba0ab899]::sys::thread::unix::Thread>::new::thread_start<unknown>
  1730. 32.36 s > at <unknown source file>:<unknown line>
  1731. 32.36 s > 16: start_thread<unknown>
  1732. 32.36 s > at <unknown source file>:<unknown line>
  1733. 32.36 s > 17: __clone3<unknown>
  1734. 32.36 s > at <unknown source file>:<unknown line>
  1735. 32.36 s >
  1736. 32.36 s > Run with COLORBT_SHOW_HIDDEN=1 environment variable to disable frame filtering.
  1737. 32.36 s > Run with RUST_BACKTRACE=full to include source snippets.
  1738. 32.36 s > Location: crates/gammalooprs/tests/test_renormalization.rs:445
  1739. 32.36 s >
  1740. 32.36 s > ━━━━━━━━━━━━━━━━━━━━━━━━━━━━━━━━━━ BACKTRACE ━━━━━━━━━━━━━━━━━━━━━━━━━━━━━━━━━━━
  1741. 32.36 s > 1: <color_eyre[5722b77bc20a64cf]::config::PanicHook>::panic_report<unknown>
  1742. 32.36 s > at <unknown source file>:<unknown line>
  1743. 32.36 s > 2: <color_eyre[5722b77bc20a64cf]::config::PanicHook>::into_panic_hook::{closure#0}<unknown>
  1744. 32.36 s > at <unknown source file>:<unknown line>
  1745. 32.36 s > 3: std[bcb96dfbba0ab899]::panicking::panic_with_hook<unknown>
  1746. 32.36 s > at <unknown source file>:<unknown line>
  1747. 32.36 s > 4: std[bcb96dfbba0ab899]::panicking::panic_handler::{closure#0}<unknown>
  1748. 32.36 s > at <unknown source file>:<unknown line>
  1749. 32.36 s > 5: std[bcb96dfbba0ab899]::sys::backtrace::__rust_end_short_backtrace::<std[bcb96dfbba0ab899]::panicking::panic_handler::{closure#0}, !><unknown>
  1750. 32.36 s > at <unknown source file>:<unknown line>
  1751. 32.36 s > 6: __rustc[6c289b9f9c454d21]::rust_begin_unwind<unknown>
  1752. 32.36 s > at <unknown source file>:<unknown line>
  1753. 32.36 s > 7: core[940e698046960fd5]::panicking::panic_fmt<unknown>
  1754. 32.36 s > at <unknown source file>:<unknown line>
  1755. 32.36 s > 8: core[940e698046960fd5]::result::unwrap_failed<unknown>
  1756. 32.36 s > at <unknown source file>:<unknown line>
  1757. 32.36 s > 9: test_renormalization[c99a4cd1432bec79]::finite_part_ghost_2loop<unknown>
  1758. 32.36 s > at <unknown source file>:<unknown line>
  1759. 32.36 s > 10: <test_renormalization[c99a4cd1432bec79]::finite_part_ghost_2loop::{closure#0} as core[940e698046960fd5]::ops::function::FnOnce<()>>::call_once<unknown>
  1760. 32.36 s > at <unknown source file>:<unknown line>
  1761. 32.36 s > 11: test[75d6903177b1d7e9]::__rust_begin_short_backtrace::<core[940e698046960fd5]::result::Result<(), alloc[2ea6bcb46fca0c42]::string::String>, fn() -> core[940e698046960fd5]::result::Result<(), alloc[2ea6bcb46fca0c42]::string::String>><unknown>
  1762. 32.36 s > at <unknown source file>:<unknown line>
  1763. 32.36 s > 12: test[75d6903177b1d7e9]::run_test::{closure#0}<unknown>
  1764. 32.36 s > at <unknown source file>:<unknown line>
  1765. 32.36 s > 13: std[bcb96dfbba0ab899]::sys::backtrace::__rust_begin_short_backtrace::<test[75d6903177b1d7e9]::run_test::{closure#1}, ()><unknown>
  1766. 32.36 s > at <unknown source file>:<unknown line>
  1767. 32.36 s > 14: <std[bcb96dfbba0ab899]::thread::lifecycle::spawn_unchecked<test[75d6903177b1d7e9]::run_test::{closure#1}, ()>::{closure#1} as core[940e698046960fd5]::ops::function::FnOnce<()>>::call_once::{shim:vtable#0}<unknown>
  1768. 32.36 s > at <unknown source file>:<unknown line>
  1769. 32.36 s > 15: <std[bcb96dfbba0ab899]::sys::thread::unix::Thread>::new::thread_start<unknown>
  1770. 32.36 s > at <unknown source file>:<unknown line>
  1771. 32.36 s > 16: start_thread<unknown>
  1772. 32.36 s > at <unknown source file>:<unknown line>
  1773. 32.36 s > 17: __clone3<unknown>
  1774. 32.36 s > at <unknown source file>:<unknown line>
  1775. 32.36 s >
  1776. 32.36 s > Run with COLORBT_SHOW_HIDDEN=1 environment variable to disable frame filtering.
  1777. 32.36 s > Run with RUST_BACKTRACE=full to include source snippets.
  1778. 32.36 s >
  1779. 32.36 s > error: test run failed
  1780. 32.36 s >
  1781. 32.36 s > ========== nextest test summary ==========
  1782. 32.36 s > report: target/nextest/ci_gammaloop/junit.xml
  1783. 32.36 s > tests: 456, failures: 3, errors: 0
  1784. 32.36 s >
  1785. 32.36 s > 1. gammalooprs::test_renormalization::finit_part_ghlo
  1786. 32.36 s > failure: test failure with exit code 101
  1787. 32.36 s > system-out
  1788. 32.36 s > running 1 test
  1789. 32.36 s > test finit_part_ghlo ... FAILED
  1790. 32.36 s >
  1791. 32.36 s > failures:
  1792. 32.36 s >
  1793. 32.36 s > failures:
  1794. 32.36 s > finit_part_ghlo
  1795. 32.36 s >
  1796. 32.36 s > test result: FAILED. 0 passed; 1 failed; 0 ignored; 0 measured; 5 filtered out; finished in 0.19s
  1797. 32.36 s > system-err
  1798. 32.36 s > The application panicked (crashed).
  1799. 32.36 s > Message: called `Result::unwrap()` on an `Err` value:
  1800. 32.36 s > 0: Symbolica could not parse FORM output:
  1801. 32.36 s > [spenso::{antisymmetric,real,spenso::tensor}::f]([spenso::{spenso::representat\
  1802. 32.36 s > ion,spenso::self_dual}::coad](8,[gammalooprs::{spenso::index}::hedge](0)
  1803. 32.36 s > ),[spenso::{spenso::representation,spenso::self_dual}::coad](8,[gammaloo\
  1804. 32.36 s > prs::{spenso::index}::hedge](3)),[spenso::{spenso::representation,spenso\
  1805. 32.36 s > ::self_dual}::coad](8,[gammalooprs::{spenso::index}::hedge](5)))*
  1806. 32.36 s > [spenso::{antisymmetric,real,spenso::tensor}::f]([spenso::{spenso::repre\
  1807. 32.36 s > sentation,spenso::self_dual}::coad](8,[gammalooprs::{spenso::index}::hed\
  1808. 32.36 s > ge](1)),[spenso::{spenso::representation,spenso::self_dual}::coad](8,
  1809. 32.36 s > [gammalooprs::{spenso::index}::hedge](3)),[spenso::{spenso::representati\
  1810. 32.36 s > on,spenso::self_dual}::coad](8,[gammalooprs::{spenso::index}::hedge](5))
  1811. 32.36 s > )*dot(p1,p0)*[UFO::{}::GC_10]^2*rat(-1,1)
  1812. 32.36 s >
  1813. 32.36 s > Error:Symbol spenso::coad redefined with new attributes:
  1814. 32.36 s > - new user data specified: List([String("spenso::representation-v2"), String("self-dual"), List([String("symbol"), String("coad")]), List([String("cyclic"), Integer(1), List([List([String("symbol"), String("a")]), List([String("symbol"), String("b")]), List([String("symbol"), String("c")]), List([String("symbol"), String("d")])])]), String("top")]) vs None
  1815. 32.36 s >
  1816. 32.36 s >
  1817. 32.36 s > Location:
  1818. 32.36 s > crates/gammalooprs/src/uv/approx/integrated.rs:332
  1819. 32.36 s >
  1820. 32.36 s > ━━━━━━━━━━━━━━━━━━━━━━━━━━━━━━━━━━ BACKTRACE ━━━━━━━━━━━━━━━━━━━━━━━━━━━━━━━━━━━
  1821. 32.36 s > 1: <color_eyre[5722b77bc20a64cf]::config::EyreHook>::into_eyre_hook::{closure#0}<unknown>
  1822. 32.36 s > at <unknown source file>:<unknown line>
  1823. 32.36 s > 2: eyre[cb2fd339c0c40fca]::capture_handler<unknown>
  1824. 32.36 s > at <unknown source file>:<unknown line>
  1825. 32.36 s > 3: <eyre[cb2fd339c0c40fca]::Report>::from_std::<vakint[ad2b4d4b4d753fb9]::VakintError><unknown>
  1826. 32.36 s > at <unknown source file>:<unknown line>
  1827. 32.36 s > 4: <gammalooprs[4688948c89ba1ea7]::uv::approx::integrated::Integrated>::integrate::<gammalooprs[4688948c89ba1ea7]::uv::hedge_poset::ForestNode><unknown>
  1828. 32.36 s > at <unknown source file>:<unknown line>
  1829. 32.36 s > 5: <gammalooprs[4688948c89ba1ea7]::uv::approx::integrated::Integrated>::run::<gammalooprs[4688948c89ba1ea7]::uv::hedge_poset::ForestNode, gammalooprs[4688948c89ba1ea7]::uv::hedge_poset::ForestNode><unknown>
  1830. 32.36 s > at <unknown source file>:<unknown line>
  1831. 32.36 s > 6: <gammalooprs[4688948c89ba1ea7]::uv::hedge_poset::Forests>::integrate<unknown>
  1832. 32.36 s > at <unknown source file>:<unknown line>
  1833. 32.36 s > 7: gammalooprs[4688948c89ba1ea7]::uv::orchestrator::hedge_poset_renormalization_part<unknown>
  1834. 32.36 s > at <unknown source file>:<unknown line>
  1835. 32.36 s > 8: <gammalooprs[4688948c89ba1ea7]::uv::settings::UVOrchestrator>::renormalization_part<unknown>
  1836. 32.36 s > at <unknown source file>:<unknown line>
  1837. 32.36 s > 9: <gammalooprs[4688948c89ba1ea7]::processes::amplitude::AmplitudeGraph>::renormalization_part<unknown>
  1838. 32.36 s > at <unknown source file>:<unknown line>
  1839. 32.36 s > 10: <test_renormalization[c99a4cd1432bec79]::finit_part_ghlo::{closure#0} as core[940e698046960fd5]::ops::function::FnOnce<()>>::call_once<unknown>
  1840. 32.36 s > at <unknown source file>:<unknown line>
  1841. 32.36 s > 11: test[75d6903177b1d7e9]::__rust_begin_short_backtrace::<core[940e698046960fd5]::result::Result<(), alloc[2ea6bcb46fca0c42]::string::String>, fn() -> core[940e698046960fd5]::result::Result<(), alloc[2ea6bcb46fca0c42]::string::String>><unknown>
  1842. 32.36 s > at <unknown source file>:<unknown line>
  1843. 32.36 s > 12: test[75d6903177b1d7e9]::run_test::{closure#0}<unknown>
  1844. 32.36 s > at <unknown source file>:<unknown line>
  1845. 32.36 s > 13: std[bcb96dfbba0ab899]::sys::backtrace::__rust_begin_short_backtrace::<test[75d6903177b1d7e9]::run_test::{closure#1}, ()><unknown>
  1846. 32.36 s > at <unknown source file>:<unknown line>
  1847. 32.36 s > 14: <std[bcb96dfbba0ab899]::thread::lifecycle::spawn_unchecked<test[75d6903177b1d7e9]::run_test::{closure#1}, ()>::{closure#1} as core[940e698046960fd5]::ops::function::FnOnce<()>>::call_once::{shim:vtable#0}<unknown>
  1848. 32.36 s > at <unknown source file>:<unknown line>
  1849. 32.36 s > 15: <std[bcb96dfbba0ab899]::sys::thread::unix::Thread>::new::thread_start<unknown>
  1850. 32.36 s > at <unknown source file>:<unknown line>
  1851. 32.36 s > 16: start_thread<unknown>
  1852. 32.36 s > at <unknown source file>:<unknown line>
  1853. 32.36 s > 17: __clone3<unknown>
  1854. 32.36 s > at <unknown source file>:<unknown line>
  1855. 32.36 s >
  1856. 32.36 s > Run with COLORBT_SHOW_HIDDEN=1 environment variable to disable frame filtering.
  1857. 32.36 s > Run with RUST_BACKTRACE=full to include source snippets.
  1858. 32.36 s > Location: crates/gammalooprs/tests/test_renormalization.rs:550
  1859. 32.36 s >
  1860. 32.36 s > ━━━━━━━━━━━━━━━━━━━━━━━━━━━━━━━━━━ BACKTRACE ━━━━━━━━━━━━━━━━━━━━━━━━━━━━━━━━━━━
  1861. 32.36 s > 1: <color_eyre[5722b77bc20a64cf]::config::PanicHook>::panic_report<unknown>
  1862. 32.36 s > at <unknown source file>:<unknown line>
  1863. 32.36 s > 2: <color_eyre[5722b77bc20a64cf]::config::PanicHook>::into_panic_hook::{closure#0}<unknown>
  1864. 32.36 s > at <unknown source file>:<unknown line>
  1865. 32.36 s > 3: std[bcb96dfbba0ab899]::panicking::panic_with_hook<unknown>
  1866. 32.36 s > at <unknown source file>:<unknown line>
  1867. 32.36 s > 4: std[bcb96dfbba0ab899]::panicking::panic_handler::{closure#0}<unknown>
  1868. 32.36 s > at <unknown source file>:<unknown line>
  1869. 32.36 s > 5: std[bcb96dfbba0ab899]::sys::backtrace::__rust_end_short_backtrace::<std[bcb96dfbba0ab899]::panicking::panic_handler::{closure#0}, !><unknown>
  1870. 32.36 s > at <unknown source file>:<unknown line>
  1871. 32.36 s > 6: __rustc[6c289b9f9c454d21]::rust_begin_unwind<unknown>
  1872. 32.36 s > at <unknown source file>:<unknown line>
  1873. 32.36 s > 7: core[940e698046960fd5]::panicking::panic_fmt<unknown>
  1874. 32.36 s > at <unknown source file>:<unknown line>
  1875. 32.36 s > 8: core[940e698046960fd5]::result::unwrap_failed<unknown>
  1876. 32.36 s > at <unknown source file>:<unknown line>
  1877. 32.36 s > 9: <test_renormalization[c99a4cd1432bec79]::finit_part_ghlo::{closure#0} as core[940e698046960fd5]::ops::function::FnOnce<()>>::call_once<unknown>
  1878. 32.36 s > at <unknown source file>:<unknown line>
  1879. 32.36 s > 10: test[75d6903177b1d7e9]::__rust_begin_short_backtrace::<core[940e698046960fd5]::result::Result<(), alloc[2ea6bcb46fca0c42]::string::String>, fn() -> core[940e698046960fd5]::result::Result<(), alloc[2ea6bcb46fca0c42]::string::String>><unknown>
  1880. 32.36 s > at <unknown source file>:<unknown line>
  1881. 32.36 s > 11: test[75d6903177b1d7e9]::run_test::{closure#0}<unknown>
  1882. 32.36 s > at <unknown source file>:<unknown line>
  1883. 32.36 s > 12: std[bcb96dfbba0ab899]::sys::backtrace::__rust_begin_short_backtrace::<test[75d6903177b1d7e9]::run_test::{closure#1}, ()><unknown>
  1884. 32.36 s > at <unknown source file>:<unknown line>
  1885. 32.36 s > 13: <std[bcb96dfbba0ab899]::thread::lifecycle::spawn_unchecked<test[75d6903177b1d7e9]::run_test::{closure#1}, ()>::{closure#1} as core[940e698046960fd5]::ops::function::FnOnce<()>>::call_once::{shim:vtable#0}<unknown>
  1886. 32.36 s > at <unknown source file>:<unknown line>
  1887. 32.36 s > 14: <std[bcb96dfbba0ab899]::sys::thread::unix::Thread>::new::thread_start<unknown>
  1888. 32.36 s > at <unknown source file>:<unknown line>
  1889. 32.36 s > 15: start_thread<unknown>
  1890. 32.36 s > at <unknown source file>:<unknown line>
  1891. 32.36 s > 16: __clone3<unknown>
  1892. 32.36 s > at <unknown source file>:<unknown line>
  1893. 32.36 s >
  1894. 32.36 s > Run with COLORBT_SHOW_HIDDEN=1 environment variable to disable frame filtering.
  1895. 32.36 s > Run with RUST_BACKTRACE=full to include source snippets.
  1896. 32.36 s >
  1897. 32.36 s > 2. gammalooprs::test_renormalization::finite_part_quark_lo
  1898. 32.36 s > failure: test failure with exit code 101
  1899. 32.36 s > system-out
  1900. 32.36 s > running 1 test
  1901. 32.36 s > test finite_part_quark_lo ... FAILED
  1902. 32.36 s >
  1903. 32.36 s > failures:
  1904. 32.36 s >
  1905. 32.36 s > failures:
  1906. 32.36 s > finite_part_quark_lo
  1907. 32.36 s >
  1908. 32.36 s > test result: FAILED. 0 passed; 1 failed; 0 ignored; 0 measured; 5 filtered out; finished in 0.15s
  1909. 32.36 s > system-err
  1910. 32.36 s > The application panicked (crashed).
  1911. 32.36 s > Message: called `Result::unwrap()` on an `Err` value: "Symbol spenso::mink redefined with new attributes:\n\t- new user data specified: List([String(\"spenso::representation-v2\"), String(\"inline-metric\"), List([String(\"symbol\"), String(\"mink\")]), List([String(\"cyclic\"), Integer(1), List([List([String(\"symbol\"), String(\"mu\")]), List([String(\"symbol\"), String(\"nu\")]), List([String(\"symbol\"), String(\"rho\")]), List([String(\"symbol\"), String(\"sigma\")])])]), String(\"top\")]) vs None\n"
  1912. 32.36 s > Location: crates/vakint/src/lib.rs:4766
  1913. 32.36 s >
  1914. 32.36 s > ━━━━━━━━━━━━━━━━━━━━━━━━━━━━━━━━━━ BACKTRACE ━━━━━━━━━━━━━━━━━━━━━━━━━━━━━━━━━━━
  1915. 32.36 s > 1: <color_eyre[5722b77bc20a64cf]::config::PanicHook>::panic_report<unknown>
  1916. 32.36 s > at <unknown source file>:<unknown line>
  1917. 32.36 s > 2: <color_eyre[5722b77bc20a64cf]::config::PanicHook>::into_panic_hook::{closure#0}<unknown>
  1918. 32.36 s > at <unknown source file>:<unknown line>
  1919. 32.36 s > 3: std[bcb96dfbba0ab899]::panicking::panic_with_hook<unknown>
  1920. 32.36 s > at <unknown source file>:<unknown line>
  1921. 32.36 s > 4: std[bcb96dfbba0ab899]::panicking::panic_handler::{closure#0}<unknown>
  1922. 32.36 s > at <unknown source file>:<unknown line>
  1923. 32.36 s > 5: std[bcb96dfbba0ab899]::sys::backtrace::__rust_end_short_backtrace::<std[bcb96dfbba0ab899]::panicking::panic_handler::{closure#0}, !><unknown>
  1924. 32.36 s > at <unknown source file>:<unknown line>
  1925. 32.36 s > 6: __rustc[6c289b9f9c454d21]::rust_begin_unwind<unknown>
  1926. 32.36 s > at <unknown source file>:<unknown line>
  1927. 32.36 s > 7: core[940e698046960fd5]::panicking::panic_fmt<unknown>
  1928. 32.36 s > at <unknown source file>:<unknown line>
  1929. 32.36 s > 8: core[940e698046960fd5]::result::unwrap_failed<unknown>
  1930. 32.36 s > at <unknown source file>:<unknown line>
  1931. 32.36 s > 9: <vakint[ad2b4d4b4d753fb9]::Vakint>::sanitize_user_expressions<unknown>
  1932. 32.36 s > at <unknown source file>:<unknown line>
  1933. 32.36 s > 10: <vakint[ad2b4d4b4d753fb9]::Vakint>::prepare_expression_for_form<unknown>
  1934. 32.36 s > at <unknown source file>:<unknown line>
  1935. 32.36 s > 11: <vakint[ad2b4d4b4d753fb9]::VakintTerm>::tensor_reduce<unknown>
  1936. 32.36 s > at <unknown source file>:<unknown line>
  1937. 32.36 s > 12: <vakint[ad2b4d4b4d753fb9]::VakintExpression>::tensor_reduce<unknown>
  1938. 32.36 s > at <unknown source file>:<unknown line>
  1939. 32.36 s > 13: <gammalooprs[4688948c89ba1ea7]::uv::approx::integrated::Integrated>::integrate::<gammalooprs[4688948c89ba1ea7]::uv::hedge_poset::ForestNode><unknown>
  1940. 32.36 s > at <unknown source file>:<unknown line>
  1941. 32.36 s > 14: <gammalooprs[4688948c89ba1ea7]::uv::approx::integrated::Integrated>::run::<gammalooprs[4688948c89ba1ea7]::uv::hedge_poset::ForestNode, gammalooprs[4688948c89ba1ea7]::uv::hedge_poset::ForestNode><unknown>
  1942. 32.36 s > at <unknown source file>:<unknown line>
  1943. 32.36 s > 15: <gammalooprs[4688948c89ba1ea7]::uv::hedge_poset::Forests>::integrate<unknown>
  1944. 32.36 s > at <unknown source file>:<unknown line>
  1945. 32.36 s > 16: gammalooprs[4688948c89ba1ea7]::uv::orchestrator::hedge_poset_renormalization_part<unknown>
  1946. 32.36 s > at <unknown source file>:<unknown line>
  1947. 32.36 s > 17: <gammalooprs[4688948c89ba1ea7]::uv::settings::UVOrchestrator>::renormalization_part<unknown>
  1948. 32.36 s > at <unknown source file>:<unknown line>
  1949. 32.36 s > 18: <gammalooprs[4688948c89ba1ea7]::processes::amplitude::AmplitudeGraph>::renormalization_part<unknown>
  1950. 32.36 s > at <unknown source file>:<unknown line>
  1951. 32.36 s > 19: <test_renormalization[c99a4cd1432bec79]::finite_part_quark_lo::{closure#0} as core[940e698046960fd5]::ops::function::FnOnce<()>>::call_once<unknown>
  1952. 32.36 s > at <unknown source file>:<unknown line>
  1953. 32.36 s > 20: test[75d6903177b1d7e9]::__rust_begin_short_backtrace::<core[940e698046960fd5]::result::Result<(), alloc[2ea6bcb46fca0c42]::string::String>, fn() -> core[940e698046960fd5]::result::Result<(), alloc[2ea6bcb46fca0c42]::string::String>><unknown>
  1954. 32.36 s > at <unknown source file>:<unknown line>
  1955. 32.36 s > 21: test[75d6903177b1d7e9]::run_test::{closure#0}<unknown>
  1956. 32.36 s > at <unknown source file>:<unknown line>
  1957. 32.36 s > 22: std[bcb96dfbba0ab899]::sys::backtrace::__rust_begin_short_backtrace::<test[75d6903177b1d7e9]::run_test::{closure#1}, ()><unknown>
  1958. 32.36 s > at <unknown source file>:<unknown line>
  1959. 32.36 s > 23: <std[bcb96dfbba0ab899]::thread::lifecycle::spawn_unchecked<test[75d6903177b1d7e9]::run_test::{closure#1}, ()>::{closure#1} as core[940e698046960fd5]::ops::function::FnOnce<()>>::call_once::{shim:vtable#0}<unknown>
  1960. 32.36 s > at <unknown source file>:<unknown line>
  1961. 32.36 s > 24: <std[bcb96dfbba0ab899]::sys::thread::unix::Thread>::new::thread_start<unknown>
  1962. 32.36 s > at <unknown source file>:<unknown line>
  1963. 32.36 s > 25: start_thread<unknown>
  1964. 32.36 s > at <unknown source file>:<unknown line>
  1965. 32.36 s > 26: __clone3<unknown>
  1966. 32.36 s > at <unknown source file>:<unknown line>
  1967. 32.36 s >
  1968. 32.36 s > Run with COLORBT_SHOW_HIDDEN=1 environment variable to disable frame filtering.
  1969. 32.36 s > Run with RUST_BACKTRACE=full to include source snippets.
  1970. 32.36 s >
  1971. 32.36 s > 3. gammalooprs::test_renormalization::finite_part_ghost_2loop
  1972. 32.36 s > failure: test failure with exit code 101
  1973. 32.36 s > system-out
  1974. 32.36 s > running 1 test
  1975. 32.36 s > test finite_part_ghost_2loop ... FAILED
  1976. 32.36 s >
  1977. 32.36 s > failures:
  1978. 32.36 s >
  1979. 32.36 s > failures:
  1980. 32.36 s > finite_part_ghost_2loop
  1981. 32.36 s >
  1982. 32.36 s > test result: FAILED. 0 passed; 1 failed; 0 ignored; 0 measured; 5 filtered out; finished in 0.36s
  1983. 32.36 s > system-err
  1984. 32.36 s > The application panicked (crashed).
  1985. 32.36 s > Message: called `Result::unwrap()` on an `Err` value:
  1986. 32.36 s > 0: Symbolica could not parse FORM output:
  1987. 32.36 s > [spenso::{antisymmetric,real,spenso::tensor}::f]([spenso::{spenso::representat\
  1988. 32.36 s > ion,spenso::self_dual}::coad](8,[gammalooprs::{spenso::index}::hedge](0)
  1989. 32.36 s > ),[spenso::{spenso::representation,spenso::self_dual}::coad](8,[gammaloo\
  1990. 32.36 s > prs::{spenso::index}::hedge](3)),[spenso::{spenso::representation,spenso\
  1991. 32.36 s > ::self_dual}::coad](8,[gammalooprs::{spenso::index}::hedge](5)))*
  1992. 32.36 s > [spenso::{antisymmetric,real,spenso::tensor}::f]([spenso::{spenso::repre\
  1993. 32.36 s > sentation,spenso::self_dual}::coad](8,[gammalooprs::{spenso::index}::hed\
  1994. 32.36 s > ge](1)),[spenso::{spenso::representation,spenso::self_dual}::coad](8,
  1995. 32.36 s > [gammalooprs::{spenso::index}::hedge](11)),[spenso::{spenso::representat\
  1996. 32.36 s > ion,spenso::self_dual}::coad](8,[gammalooprs::{spenso::index}::hedge](7)
  1997. 32.36 s > ))*[spenso::{antisymmetric,real,spenso::tensor}::f]([spenso::{spenso::re\
  1998. 32.36 s > presentation,spenso::self_dual}::coad](8,[gammalooprs::{spenso::index}::\
  1999. 32.36 s > hedge](3)),[spenso::{spenso::representation,spenso::self_dual}::coad](8,
  2000. 32.36 s > [gammalooprs::{spenso::index}::hedge](7)),[spenso::{spenso::representati\
  2001. 32.36 s > on,spenso::self_dual}::coad](8,[gammalooprs::{spenso::index}::hedge](9))
  2002. 32.36 s > )*[spenso::{antisymmetric,real,spenso::tensor}::f]([spenso::{spenso::rep\
  2003. 32.36 s > resentation,spenso::self_dual}::coad](8,[gammalooprs::{spenso::index}::h\
  2004. 32.36 s > edge](11)),[spenso::{spenso::representation,spenso::self_dual}::coad](8,
  2005. 32.36 s > [gammalooprs::{spenso::index}::hedge](5)),[spenso::{spenso::representati\
  2006. 32.36 s > on,spenso::self_dual}::coad](8,[gammalooprs::{spenso::index}::hedge](9))
  2007. 32.36 s > )*dot(p4,p0)*dot(k1,k1)*dot(k2,k2)*i_*[UFO::{}::GC_10]^4*rat(-1,ep - 2)
  2008. 32.36 s > + [spenso::{antisymmetric,real,spenso::tensor}::f]([spenso::{spenso::re\
  2009. 32.36 s > presentation,spenso::self_dual}::coad](8,[gammalooprs::{spenso::index}::\
  2010. 32.36 s > hedge](0)),[spenso::{spenso::representation,spenso::self_dual}::coad](8,
  2011. 32.36 s > [gammalooprs::{spenso::index}::hedge](3)),[spenso::{spenso::representati\
  2012. 32.36 s > on,spenso::self_dual}::coad](8,[gammalooprs::{spenso::index}::hedge](5))
  2013. 32.36 s > )*[spenso::{antisymmetric,real,spenso::tensor}::f]([spenso::{spenso::rep\
  2014. 32.36 s > resentation,spenso::self_dual}::coad](8,[gammalooprs::{spenso::index}::h\
  2015. 32.36 s > edge](1)),[spenso::{spenso::representation,spenso::self_dual}::coad](8,
  2016. 32.36 s > [gammalooprs::{spenso::index}::hedge](11)),[spenso::{spenso::representat\
  2017. 32.36 s > ion,spenso::self_dual}::coad](8,[gammalooprs::{spenso::index}::hedge](7)
  2018. 32.36 s > ))*[spenso::{antisymmetric,real,spenso::tensor}::f]([spenso::{spenso::re\
  2019. 32.36 s > presentation,spenso::self_dual}::coad](8,[gammalooprs::{spenso::index}::\
  2020. 32.36 s > hedge](3)),[spenso::{spenso::representation,spenso::self_dual}::coad](8,
  2021. 32.36 s > [gammalooprs::{spenso::index}::hedge](7)),[spenso::{spenso::representati\
  2022. 32.36 s > on,spenso::self_dual}::coad](8,[gammalooprs::{spenso::index}::hedge](9))
  2023. 32.36 s > )*[spenso::{antisymmetric,real,spenso::tensor}::f]([spenso::{spenso::rep\
  2024. 32.36 s > resentation,spenso::self_dual}::coad](8,[gammalooprs::{spenso::index}::h\
  2025. 32.36 s > edge](11)),[spenso::{spenso::representation,spenso::self_dual}::coad](8,
  2026. 32.36 s > [gammalooprs::{spenso::index}::hedge](5)),[spenso::{spenso::representati\
  2027. 32.36 s > on,spenso::self_dual}::coad](8,[gammalooprs::{spenso::index}::hedge](9))
  2028. 32.36 s > )*dot(p4,p0)*dot(k1,k2)^2*i_*[UFO::{}::GC_10]^4*rat(1,ep - 2)
  2029. 32.36 s >
  2030. 32.36 s > Error:Symbol spenso::coad redefined with new attributes:
  2031. 32.36 s > - new user data specified: List([String("spenso::representation-v2"), String("self-dual"), List([String("symbol"), String("coad")]), List([String("cyclic"), Integer(1), List([List([String("symbol"), String("a")]), List([String("symbol"), String("b")]), List([String("symbol"), String("c")]), List([String("symbol"), String("d")])])]), String("top")]) vs None
  2032. 32.36 s >
  2033. 32.36 s >
  2034. 32.36 s > Location:
  2035. 32.36 s > crates/gammalooprs/src/uv/approx/integrated.rs:332
  2036. 32.36 s >
  2037. 32.36 s > ━━━━━━━━━━━━━━━━━━━━━━━━━━━━━━━━━━ BACKTRACE ━━━━━━━━━━━━━━━━━━━━━━━━━━━━━━━━━━━
  2038. 32.36 s > 1: <color_eyre[5722b77bc20a64cf]::config::EyreHook>::into_eyre_hook::{closure#0}<unknown>
  2039. 32.36 s > at <unknown source file>:<unknown line>
  2040. 32.36 s > 2: eyre[cb2fd339c0c40fca]::capture_handler<unknown>
  2041. 32.36 s > at <unknown source file>:<unknown line>
  2042. 32.36 s > 3: <eyre[cb2fd339c0c40fca]::Report>::from_std::<vakint[ad2b4d4b4d753fb9]::VakintError><unknown>
  2043. 32.36 s > at <unknown source file>:<unknown line>
  2044. 32.36 s > 4: <gammalooprs[4688948c89ba1ea7]::uv::approx::integrated::Integrated>::integrate::<gammalooprs[4688948c89ba1ea7]::uv::approx::Approximation><unknown>
  2045. 32.36 s > at <unknown source file>:<unknown line>
  2046. 32.36 s > 5: <gammalooprs[4688948c89ba1ea7]::uv::forest::Forest>::compute<unknown>
  2047. 32.36 s > at <unknown source file>:<unknown line>
  2048. 32.36 s > 6: gammalooprs[4688948c89ba1ea7]::uv::orchestrator::legacy_renormalization_part<unknown>
  2049. 32.36 s > at <unknown source file>:<unknown line>
  2050. 32.36 s > 7: <gammalooprs[4688948c89ba1ea7]::uv::settings::UVOrchestrator>::renormalization_part<unknown>
  2051. 32.36 s > at <unknown source file>:<unknown line>
  2052. 32.36 s > 8: <gammalooprs[4688948c89ba1ea7]::processes::amplitude::AmplitudeGraph>::renormalization_part<unknown>
  2053. 32.36 s > at <unknown source file>:<unknown line>
  2054. 32.36 s > 9: test_renormalization[c99a4cd1432bec79]::finite_part_ghost_2loop<unknown>
  2055. 32.36 s > at <unknown source file>:<unknown line>
  2056. 32.36 s > 10: <test_renormalization[c99a4cd1432bec79]::finite_part_ghost_2loop::{closure#0} as core[940e698046960fd5]::ops::function::FnOnce<()>>::call_once<unknown>
  2057. 32.36 s > at <unknown source file>:<unknown line>
  2058. 32.36 s > 11: test[75d6903177b1d7e9]::__rust_begin_short_backtrace::<core[940e698046960fd5]::result::Result<(), alloc[2ea6bcb46fca0c42]::string::String>, fn() -> core[940e698046960fd5]::result::Result<(), alloc[2ea6bcb46fca0c42]::string::String>><unknown>
  2059. 32.36 s > at <unknown source file>:<unknown line>
  2060. 32.36 s > 12: test[75d6903177b1d7e9]::run_test::{closure#0}<unknown>
  2061. 32.36 s > at <unknown source file>:<unknown line>
  2062. 32.36 s > 13: std[bcb96dfbba0ab899]::sys::backtrace::__rust_begin_short_backtrace::<test[75d6903177b1d7e9]::run_test::{closure#1}, ()><unknown>
  2063. 32.36 s > at <unknown source file>:<unknown line>
  2064. 32.36 s > 14: <std[bcb96dfbba0ab899]::thread::lifecycle::spawn_unchecked<test[75d6903177b1d7e9]::run_test::{closure#1}, ()>::{closure#1} as core[940e698046960fd5]::ops::function::FnOnce<()>>::call_once::{shim:vtable#0}<unknown>
  2065. 32.36 s > at <unknown source file>:<unknown line>
  2066. 32.36 s > 15: <std[bcb96dfbba0ab899]::sys::thread::unix::Thread>::new::thread_start<unknown>
  2067. 32.36 s > at <unknown source file>:<unknown line>
  2068. 32.36 s > 16: start_thread<unknown>
  2069. 32.36 s > at <unknown source file>:<unknown line>
  2070. 32.36 s > 17: __clone3<unknown>
  2071. 32.36 s > at <unknown source file>:<unknown line>
  2072. 32.36 s >
  2073. 32.36 s > Run with COLORBT_SHOW_HIDDEN=1 environment variable to disable frame filtering.
  2074. 32.36 s > Run with RUST_BACKTRACE=full to include source snippets.
  2075. 32.36 s > Location: crates/gammalooprs/tests/test_renormalization.rs:445
  2076. 32.36 s >
  2077. 32.36 s > ━━━━━━━━━━━━━━━━━━━━━━━━━━━━━━━━━━ BACKTRACE ━━━━━━━━━━━━━━━━━━━━━━━━━━━━━━━━━━━
  2078. 32.36 s > 1: <color_eyre[5722b77bc20a64cf]::config::PanicHook>::panic_report<unknown>
  2079. 32.36 s > at <unknown source file>:<unknown line>
  2080. 32.36 s > 2: <color_eyre[5722b77bc20a64cf]::config::PanicHook>::into_panic_hook::{closure#0}<unknown>
  2081. 32.36 s > at <unknown source file>:<unknown line>
  2082. 32.36 s > 3: std[bcb96dfbba0ab899]::panicking::panic_with_hook<unknown>
  2083. 32.36 s > at <unknown source file>:<unknown line>
  2084. 32.36 s > 4: std[bcb96dfbba0ab899]::panicking::panic_handler::{closure#0}<unknown>
  2085. 32.36 s > at <unknown source file>:<unknown line>
  2086. 32.36 s > 5: std[bcb96dfbba0ab899]::sys::backtrace::__rust_end_short_backtrace::<std[bcb96dfbba0ab899]::panicking::panic_handler::{closure#0}, !><unknown>
  2087. 32.36 s > at <unknown source file>:<unknown line>
  2088. 32.36 s > 6: __rustc[6c289b9f9c454d21]::rust_begin_unwind<unknown>
  2089. 32.36 s > at <unknown source file>:<unknown line>
  2090. 32.36 s > 7: core[940e698046960fd5]::panicking::panic_fmt<unknown>
  2091. 32.36 s > at <unknown source file>:<unknown line>
  2092. 32.36 s > 8: core[940e698046960fd5]::result::unwrap_failed<unknown>
  2093. 32.36 s > at <unknown source file>:<unknown line>
  2094. 32.36 s > 9: test_renormalization[c99a4cd1432bec79]::finite_part_ghost_2loop<unknown>
  2095. 32.36 s > at <unknown source file>:<unknown line>
  2096. 32.36 s > 10: <test_renormalization[c99a4cd1432bec79]::finite_part_ghost_2loop::{closure#0} as core[940e698046960fd5]::ops::function::FnOnce<()>>::call_once<unknown>
  2097. 32.36 s > at <unknown source file>:<unknown line>
  2098. 32.36 s > 11: test[75d6903177b1d7e9]::__rust_begin_short_backtrace::<core[940e698046960fd5]::result::Result<(), alloc[2ea6bcb46fca0c42]::string::String>, fn() -> core[940e698046960fd5]::result::Result<(), alloc[2ea6bcb46fca0c42]::string::String>><unknown>
  2099. 32.36 s > at <unknown source file>:<unknown line>
  2100. 32.36 s > 12: test[75d6903177b1d7e9]::run_test::{closure#0}<unknown>
  2101. 32.36 s > at <unknown source file>:<unknown line>
  2102. 32.36 s > 13: std[bcb96dfbba0ab899]::sys::backtrace::__rust_begin_short_backtrace::<test[75d6903177b1d7e9]::run_test::{closure#1}, ()><unknown>
  2103. 32.36 s > ... omitted 12 more lines; see full nextest output above
  2104. 32.36 s > =========================================
  2105. 32.36 s For full logs, run:
  2106. 32.36 s nix log /nix/store/kdk12m3q1h6h241yxlkx2wvsy9l2g283-gammaloop-nextest-core.drv
  2107. 32.48 s Run failed.