test packages.x86_64-linux.nix-ci-check-gammaloop-nextest-core

Reproduce this run
Original Run
  1. 0.00 s $ /nix/store/9ypz3flqsrl5xl495mm8h645gadjsxi1-coreutils-9.11/bin/timeout --kill-after=15s 7200s /nix/store/23zk8sgzamrbmj1fday15szf7f2279s8-nix-2.34.7/bin/nix --extra-experimental-features nix-command --extra-experimental-features flakes flake clone git+https://github.com/alphal00p/gammaloop --dest /tmp/nix-ci-worker/stable-pwd/repo/
  2. 0.07 s Cloning into '/tmp/nix-ci-worker/stable-pwd/repo'...
  3. 0.77 s remote: Enumerating objects: 84275, done.
  4. 0.89 s remote: Counting objects: 0% (1/8564) remote: Counting objects: 1% (86/8564) remote: Counting objects: 2% (172/8564) remote: Counting objects: 3% (257/8564) remote: Counting objects: 4% (343/8564) remote: Counting objects: 5% (429/8564) remote: Counting objects: 6% (514/8564) remote: Counting objects: 7% (600/8564) remote: Counting objects: 8% (686/8564) remote: Counting objects: 9% (771/8564) remote: Counting objects: 10% (857/8564) remote: Counting objects: 11% (943/8564) remote: Counting objects: 12% (1028/8564) remote: Counting objects: 13% (1114/8564) remote: Counting objects: 14% (1199/8564) remote: Counting objects: 15% (1285/8564) remote: Counting objects: 16% (1371/8564) remote: Counting objects: 17% (1456/8564) remote: Counting objects: 18% (1542/8564) remote: Counting objects: 19% (1628/8564) remote: Counting objects: 20% (1713/8564) remote: Counting objects: 21% (1799/8564) remote: Counting objects: 22% (1885/8564) remote: Counting objects: 23% (1970/8564) remote: Counting objects: 24% (2056/8564) remote: Counting objects: 25% (2141/8564) remote: Counting objects: 26% (2227/8564) remote: Counting objects: 27% (2313/8564) remote: Counting objects: 28% (2398/8564) remote: Counting objects: 29% (2484/8564) remote: Counting objects: 30% (2570/8564) remote: Counting objects: 31% (2655/8564) remote: Counting objects: 32% (2741/8564) remote: Counting objects: 33% (2827/8564) remote: Counting objects: 34% (2912/8564) remote: Counting objects: 35% (2998/8564) remote: Counting objects: 36% (3084/8564) remote: Counting objects: 37% (3169/8564) remote: Counting objects: 38% (3255/8564) remote: Counting objects: 39% (3340/8564) remote: Counting objects: 40% (3426/8564) remote: Counting objects: 41% (3512/8564) remote: Counting objects: 42% (3597/8564) remote: Counting objects: 43% (3683/8564) remote: Counting objects: 44% (3769/8564) remote: Counting objects: 45% (3854/8564) remote: Counting objects: 46% (3940/8564) remote: Counting objects: 47% (4026/8564) remote: Counting objects: 48% (4111/8564) remote: Counting objects: 49% (4197/8564) remote: Counting objects: 50% (4282/8564) remote: Counting objects: 51% (4368/8564) remote: Counting objects: 52% (4454/8564) remote: Counting objects: 53% (4539/8564) remote: Counting objects: 54% (4625/8564) remote: Counting objects: 55% (4711/8564) remote: Counting objects: 56% (4796/8564) remote: Counting objects: 57% (4882/8564) remote: Counting objects: 58% (4968/8564) remote: Counting objects: 59% (5053/8564) remote: Counting objects: 60% (5139/8564) remote: Counting objects: 61% (5225/8564) remote: Counting objects: 62% (5310/8564) remote: Counting objects: 63% (5396/8564) remote: Counting objects: 64% (5481/8564) remote: Counting objects: 65% (5567/8564) remote: Counting objects: 66% (5653/8564) remote: Counting objects: 67% (5738/8564) remote: Counting objects: 68% (5824/8564) remote: Counting objects: 69% (5910/8564) remote: Counting objects: 70% (5995/8564) remote: Counting objects: 71% (6081/8564) remote: Counting objects: 72% (6167/8564) remote: Counting objects: 73% (6252/8564) remote: Counting objects: 74% (6338/8564) remote: Counting objects: 75% (6423/8564) remote: Counting objects: 76% (6509/8564) remote: Counting objects: 77% (6595/8564) remote: Counting objects: 78% (6680/8564) remote: Counting objects: 79% (6766/8564) remote: Counting objects: 80% (6852/8564) remote: Counting objects: 81% (6937/8564) remote: Counting objects: 82% (7023/8564) remote: Counting objects: 83% (7109/8564) remote: Counting objects: 84% (7194/8564) remote: Counting objects: 85% (7280/8564) remote: Counting objects: 86% (7366/8564) remote: Counting objects: 87% (7451/8564) remote: Counting objects: 88% (7537/8564) remote: Counting objects: 89% (7622/8564) remote: Counting objects: 90% (7708/8564) remote: Counting objects: 91% (7794/8564) remote: Counting objects: 92% (7879/8564) remote: Counting objects: 93% (7965/8564) remote: Counting objects: 94% (8051/8564) remote: Counting objects: 95% (8136/8564) remote: Counting objects: 96% (8222/8564) remote: Counting objects: 97% (8308/8564) remote: Counting objects: 98% (8393/8564) remote: Counting objects: 99% (8479/8564) remote: Counting objects: 100% (8564/8564) remote: Counting objects: 100% (8564/8564), done.
  5. 2.64 s remote: Compressing objects: 0% (1/1729) remote: Compressing objects: 1% (18/1729) remote: Compressing objects: 2% (35/1729) remote: Compressing objects: 3% (52/1729) remote: Compressing objects: 4% (70/1729) remote: Compressing objects: 5% (87/1729) remote: Compressing objects: 6% (104/1729) remote: Compressing objects: 7% (122/1729) remote: Compressing objects: 8% (139/1729) remote: Compressing objects: 9% (156/1729) remote: Compressing objects: 10% (173/1729) remote: Compressing objects: 10% (179/1729) remote: Compressing objects: 11% (191/1729) remote: Compressing objects: 12% (208/1729) remote: Compressing objects: 13% (225/1729) remote: Compressing objects: 14% (243/1729) remote: Compressing objects: 15% (260/1729) remote: Compressing objects: 16% (277/1729) remote: Compressing objects: 17% (294/1729) remote: Compressing objects: 18% (312/1729) remote: Compressing objects: 19% (329/1729) remote: Compressing objects: 20% (346/1729) remote: Compressing objects: 21% (364/1729) remote: Compressing objects: 22% (381/1729) remote: Compressing objects: 23% (398/1729) remote: Compressing objects: 24% (415/1729) remote: Compressing objects: 25% (433/1729) remote: Compressing objects: 26% (450/1729) remote: Compressing objects: 27% (467/1729) remote: Compressing objects: 28% (485/1729) remote: Compressing objects: 29% (502/1729) remote: Compressing objects: 30% (519/1729) remote: Compressing objects: 31% (536/1729) remote: Compressing objects: 32% (554/1729) remote: Compressing objects: 33% (571/1729) remote: Compressing objects: 34% (588/1729) remote: Compressing objects: 35% (606/1729) remote: Compressing objects: 36% (623/1729) remote: Compressing objects: 37% (640/1729) remote: Compressing objects: 38% (658/1729) remote: Compressing objects: 39% (675/1729) remote: Compressing objects: 40% (692/1729) remote: Compressing objects: 41% (709/1729) remote: Compressing objects: 42% (727/1729) remote: Compressing objects: 43% (744/1729) remote: Compressing objects: 44% (761/1729) remote: Compressing objects: 45% (779/1729) remote: Compressing objects: 46% (796/1729) remote: Compressing objects: 47% (813/1729) remote: Compressing objects: 48% (830/1729) remote: Compressing objects: 49% (848/1729) remote: Compressing objects: 50% (865/1729) remote: Compressing objects: 51% (882/1729) remote: Compressing objects: 52% (900/1729) remote: Compressing objects: 53% (917/1729) remote: Compressing objects: 54% (934/1729) remote: Compressing objects: 55% (951/1729) remote: Compressing objects: 56% (969/1729) remote: Compressing objects: 57% (986/1729) remote: Compressing objects: 58% (1003/1729) remote: Compressing objects: 59% (1021/1729) remote: Compressing objects: 60% (1038/1729) remote: Compressing objects: 61% (1055/1729) remote: Compressing objects: 62% (1072/1729) remote: Compressing objects: 63% (1090/1729) remote: Compressing objects: 64% (1107/1729) remote: Compressing objects: 65% (1124/1729) remote: Compressing objects: 66% (1142/1729) remote: Compressing objects: 67% (1159/1729) remote: Compressing objects: 68% (1176/1729) remote: Compressing objects: 69% (1194/1729) remote: Compressing objects: 70% (1211/1729) remote: Compressing objects: 71% (1228/1729) remote: Compressing objects: 72% (1245/1729) remote: Compressing objects: 73% (1263/1729) remote: Compressing objects: 74% (1280/1729) remote: Compressing objects: 75% (1297/1729) remote: Compressing objects: 76% (1315/1729) remote: Compressing objects: 77% (1332/1729) remote: Compressing objects: 78% (1349/1729) remote: Compressing objects: 79% (1366/1729) remote: Compressing objects: 80% (1384/1729) remote: Compressing objects: 81% (1401/1729) remote: Compressing objects: 82% (1418/1729) remote: Compressing objects: 83% (1436/1729) remote: Compressing objects: 84% (1453/1729) remote: Compressing objects: 85% (1470/1729) remote: Compressing objects: 86% (1487/1729) remote: Compressing objects: 87% (1505/1729) remote: Compressing objects: 88% (1522/1729) remote: Compressing objects: 89% (1539/1729) remote: Compressing objects: 90% (1557/1729) remote: Compressing objects: 91% (1574/1729) remote: Compressing objects: 92% (1591/1729) remote: Compressing objects: 93% (1608/1729) remote: Compressing objects: 94% (1626/1729) remote: Compressing objects: 95% (1643/1729) remote: Compressing objects: 96% (1660/1729) remote: Compressing objects: 97% (1678/1729) remote: Compressing objects: 98% (1695/1729) remote: Compressing objects: 99% (1712/1729) remote: Compressing objects: 100% (1729/1729) remote: Compressing objects: 100% (1729/1729), done.
  6. 7.23 s Receiving objects: 0% (1/84275) Receiving objects: 1% (843/84275) Receiving objects: 2% (1686/84275) Receiving objects: 3% (2529/84275) Receiving objects: 4% (3371/84275) Receiving objects: 5% (4214/84275) Receiving objects: 6% (5057/84275) Receiving objects: 7% (5900/84275) Receiving objects: 8% (6742/84275) Receiving objects: 9% (7585/84275), 15.87 MiB | 31.73 MiB/s Receiving objects: 10% (8428/84275), 15.87 MiB | 31.73 MiB/s Receiving objects: 11% (9271/84275), 15.87 MiB | 31.73 MiB/s Receiving objects: 12% (10113/84275), 15.87 MiB | 31.73 MiB/s Receiving objects: 13% (10956/84275), 15.87 MiB | 31.73 MiB/s Receiving objects: 14% (11799/84275), 15.87 MiB | 31.73 MiB/s Receiving objects: 15% (12642/84275), 15.87 MiB | 31.73 MiB/s Receiving objects: 16% (13484/84275), 15.87 MiB | 31.73 MiB/s Receiving objects: 17% (14327/84275), 15.87 MiB | 31.73 MiB/s Receiving objects: 18% (15170/84275), 15.87 MiB | 31.73 MiB/s Receiving objects: 19% (16013/84275), 15.87 MiB | 31.73 MiB/s Receiving objects: 20% (16855/84275), 15.87 MiB | 31.73 MiB/s Receiving objects: 21% (17698/84275), 15.87 MiB | 31.73 MiB/s Receiving objects: 22% (18541/84275), 15.87 MiB | 31.73 MiB/s Receiving objects: 23% (19384/84275), 15.87 MiB | 31.73 MiB/s Receiving objects: 24% (20226/84275), 15.87 MiB | 31.73 MiB/s Receiving objects: 25% (21069/84275), 15.87 MiB | 31.73 MiB/s Receiving objects: 26% (21912/84275), 15.87 MiB | 31.73 MiB/s Receiving objects: 27% (22755/84275), 15.87 MiB | 31.73 MiB/s Receiving objects: 28% (23597/84275), 15.87 MiB | 31.73 MiB/s Receiving objects: 29% (24440/84275), 15.87 MiB | 31.73 MiB/s Receiving objects: 30% (25283/84275), 15.87 MiB | 31.73 MiB/s Receiving objects: 31% (26126/84275), 15.87 MiB | 31.73 MiB/s Receiving objects: 32% (26968/84275), 15.87 MiB | 31.73 MiB/s Receiving objects: 33% (27811/84275), 15.87 MiB | 31.73 MiB/s Receiving objects: 34% (28654/84275), 15.87 MiB | 31.73 MiB/s Receiving objects: 35% (29497/84275), 15.87 MiB | 31.73 MiB/s Receiving objects: 36% (30339/84275), 15.87 MiB | 31.73 MiB/s Receiving objects: 37% (31182/84275), 15.87 MiB | 31.73 MiB/s Receiving objects: 38% (32025/84275), 15.87 MiB | 31.73 MiB/s Receiving objects: 39% (32868/84275), 15.87 MiB | 31.73 MiB/s Receiving objects: 40% (33710/84275), 15.87 MiB | 31.73 MiB/s Receiving objects: 40% (34510/84275), 33.56 MiB | 32.88 MiB/s Receiving objects: 41% (34553/84275), 33.56 MiB | 32.88 MiB/s Receiving objects: 42% (35396/84275), 33.56 MiB | 32.88 MiB/s Receiving objects: 43% (36239/84275), 33.56 MiB | 32.88 MiB/s Receiving objects: 44% (37081/84275), 33.56 MiB | 32.88 MiB/s Receiving objects: 45% (37924/84275), 33.56 MiB | 32.88 MiB/s Receiving objects: 46% (38767/84275), 33.56 MiB | 32.88 MiB/s Receiving objects: 47% (39610/84275), 33.56 MiB | 32.88 MiB/s Receiving objects: 48% (40452/84275), 33.56 MiB | 32.88 MiB/s Receiving objects: 49% (41295/84275), 33.56 MiB | 32.88 MiB/s Receiving objects: 50% (42138/84275), 50.15 MiB | 32.98 MiB/s Receiving objects: 51% (42981/84275), 50.15 MiB | 32.98 MiB/s Receiving objects: 52% (43823/84275), 50.15 MiB | 32.98 MiB/s Receiving objects: 53% (44666/84275), 50.15 MiB | 32.98 MiB/s Receiving objects: 54% (45509/84275), 50.15 MiB | 32.98 MiB/s Receiving objects: 55% (46352/84275), 50.15 MiB | 32.98 MiB/s Receiving objects: 56% (47194/84275), 50.15 MiB | 32.98 MiB/s Receiving objects: 57% (48037/84275), 50.15 MiB | 32.98 MiB/s Receiving objects: 57% (48755/84275), 50.15 MiB | 32.98 MiB/s Receiving objects: 58% (48880/84275), 50.15 MiB | 32.98 MiB/s Receiving objects: 59% (49723/84275), 67.82 MiB | 33.56 MiB/s Receiving objects: 60% (50565/84275), 67.82 MiB | 33.56 MiB/s Receiving objects: 61% (51408/84275), 67.82 MiB | 33.56 MiB/s Receiving objects: 62% (52251/84275), 67.82 MiB | 33.56 MiB/s Receiving objects: 63% (53094/84275), 67.82 MiB | 33.56 MiB/s Receiving objects: 64% (53936/84275), 67.82 MiB | 33.56 MiB/s Receiving objects: 65% (54779/84275), 67.82 MiB | 33.56 MiB/s Receiving objects: 66% (55622/84275), 67.82 MiB | 33.56 MiB/s Receiving objects: 67% (56465/84275), 67.82 MiB | 33.56 MiB/s Receiving objects: 68% (57307/84275), 67.82 MiB | 33.56 MiB/s Receiving objects: 68% (57371/84275), 100.79 MiB | 33.19 MiB/s Receiving objects: 69% (58150/84275), 100.79 MiB | 33.19 MiB/s Receiving objects: 70% (58993/84275), 100.79 MiB | 33.19 MiB/s Receiving objects: 71% (59836/84275), 100.79 MiB | 33.19 MiB/s Receiving objects: 72% (60678/84275), 100.79 MiB | 33.19 MiB/s Receiving objects: 73% (61521/84275), 100.79 MiB | 33.19 MiB/s Receiving objects: 74% (62364/84275), 100.79 MiB | 33.19 MiB/s Receiving objects: 75% (63207/84275), 100.79 MiB | 33.19 MiB/s Receiving objects: 76% (64049/84275), 118.06 MiB | 33.38 MiB/s Receiving objects: 77% (64892/84275), 118.06 MiB | 33.38 MiB/s Receiving objects: 78% (65735/84275), 118.06 MiB | 33.38 MiB/s Receiving objects: 79% (66578/84275), 118.06 MiB | 33.38 MiB/s Receiving objects: 80% (67420/84275), 118.06 MiB | 33.38 MiB/s Receiving objects: 80% (67757/84275), 118.06 MiB | 33.38 MiB/s Receiving objects: 81% (68263/84275), 118.06 MiB | 33.38 MiB/s Receiving objects: 82% (69106/84275), 134.43 MiB | 33.17 MiB/s Receiving objects: 83% (69949/84275), 134.43 MiB | 33.17 MiB/s Receiving objects: 84% (70791/84275), 134.43 MiB | 33.17 MiB/s Receiving objects: 85% (71634/84275), 134.43 MiB | 33.17 MiB/s Receiving objects: 86% (72477/84275), 134.43 MiB | 33.17 MiB/s Receiving objects: 87% (73320/84275), 134.43 MiB | 33.17 MiB/s Receiving objects: 88% (74162/84275), 134.43 MiB | 33.17 MiB/s Receiving objects: 89% (75005/84275), 134.43 MiB | 33.17 MiB/s Receiving objects: 90% (75848/84275), 134.43 MiB | 33.17 MiB/s Receiving objects: 91% (76691/84275), 134.43 MiB | 33.17 MiB/s Receiving objects: 92% (77533/84275), 134.43 MiB | 33.17 MiB/s Receiving objects: 93% (78376/84275), 134.43 MiB | 33.17 MiB/s Receiving objects: 94% (79219/84275), 134.43 MiB | 33.17 MiB/s Receiving objects: 95% (80062/84275), 134.43 MiB | 33.17 MiB/s Receiving objects: 96% (80904/84275), 134.43 MiB | 33.17 MiB/s Receiving objects: 97% (81747/84275), 134.43 MiB | 33.17 MiB/s Receiving objects: 98% (82590/84275), 134.43 MiB | 33.17 MiB/s Receiving objects: 99% (83433/84275), 151.26 MiB | 33.23 MiB/s remote: Total 84275 (delta 7443), reused 6856 (delta 6833), pack-reused 75711 (from 2)
  7. 7.23 s Receiving objects: 100% (84275/84275), 151.26 MiB | 33.23 MiB/s Receiving objects: 100% (84275/84275), 153.42 MiB | 33.40 MiB/s, done.
  8. 8.20 s Resolving deltas: 0% (0/57012) Resolving deltas: 1% (571/57012) Resolving deltas: 2% (1141/57012) Resolving deltas: 3% (1711/57012) Resolving deltas: 4% (2281/57012) Resolving deltas: 5% (2851/57012) Resolving deltas: 6% (3421/57012) Resolving deltas: 7% (3991/57012) Resolving deltas: 8% (4561/57012) Resolving deltas: 9% (5132/57012) Resolving deltas: 10% (5702/57012) Resolving deltas: 11% (6272/57012) Resolving deltas: 12% (6842/57012) Resolving deltas: 13% (7412/57012) Resolving deltas: 14% (7982/57012) Resolving deltas: 15% (8552/57012) Resolving deltas: 16% (9123/57012) Resolving deltas: 17% (9693/57012) Resolving deltas: 18% (10266/57012) Resolving deltas: 19% (10834/57012) Resolving deltas: 20% (11403/57012) Resolving deltas: 21% (11973/57012) Resolving deltas: 22% (12543/57012) Resolving deltas: 23% (13113/57012) Resolving deltas: 24% (13684/57012) Resolving deltas: 25% (14254/57012) Resolving deltas: 26% (14826/57012) Resolving deltas: 27% (15394/57012) Resolving deltas: 28% (15964/57012) Resolving deltas: 29% (16534/57012) Resolving deltas: 30% (17104/57012) Resolving deltas: 31% (17674/57012) Resolving deltas: 32% (18244/57012) Resolving deltas: 33% (18814/57012) Resolving deltas: 34% (19385/57012) Resolving deltas: 35% (19955/57012) Resolving deltas: 36% (20525/57012) Resolving deltas: 37% (21096/57012) Resolving deltas: 38% (21665/57012) Resolving deltas: 39% (22235/57012) Resolving deltas: 40% (22806/57012) Resolving deltas: 41% (23375/57012) Resolving deltas: 42% (23947/57012) Resolving deltas: 43% (24516/57012) Resolving deltas: 44% (25086/57012) Resolving deltas: 45% (25658/57012) Resolving deltas: 46% (26226/57012) Resolving deltas: 47% (26796/57012) Resolving deltas: 48% (27366/57012) Resolving deltas: 49% (27936/57012) Resolving deltas: 50% (28506/57012) Resolving deltas: 51% (29077/57012) Resolving deltas: 52% (29647/57012) Resolving deltas: 53% (30217/57012) Resolving deltas: 54% (30787/57012) Resolving deltas: 55% (31357/57012) Resolving deltas: 56% (31927/57012) Resolving deltas: 57% (32497/57012) Resolving deltas: 58% (33067/57012) Resolving deltas: 59% (33638/57012) Resolving deltas: 60% (34208/57012) Resolving deltas: 61% (34778/57012) Resolving deltas: 62% (35348/57012) Resolving deltas: 63% (35918/57012) Resolving deltas: 64% (36490/57012) Resolving deltas: 65% (37058/57012) Resolving deltas: 66% (37628/57012) Resolving deltas: 67% (38200/57012) Resolving deltas: 68% (38769/57012) Resolving deltas: 69% (39341/57012) Resolving deltas: 70% (39910/57012) Resolving deltas: 71% (40479/57012) Resolving deltas: 72% (41049/57012) Resolving deltas: 73% (41619/57012) Resolving deltas: 74% (42190/57012) Resolving deltas: 75% (42759/57012) Resolving deltas: 76% (43331/57012) Resolving deltas: 77% (43900/57012) Resolving deltas: 78% (44470/57012) Resolving deltas: 79% (45041/57012) Resolving deltas: 80% (45610/57012) Resolving deltas: 81% (46180/57012) Resolving deltas: 82% (46750/57012) Resolving deltas: 83% (47320/57012) Resolving deltas: 84% (47891/57012) Resolving deltas: 85% (48462/57012) Resolving deltas: 86% (49031/57012) Resolving deltas: 87% (49602/57012) Resolving deltas: 88% (50172/57012) Resolving deltas: 89% (50741/57012) Resolving deltas: 90% (51311/57012) Resolving deltas: 91% (51881/57012) Resolving deltas: 92% (52452/57012) Resolving deltas: 93% (53022/57012) Resolving deltas: 94% (53592/57012) Resolving deltas: 95% (54162/57012) Resolving deltas: 96% (54732/57012) Resolving deltas: 97% (55302/57012) Resolving deltas: 98% (55873/57012) Resolving deltas: 99% (56442/57012) Resolving deltas: 100% (57012/57012) Resolving deltas: 100% (57012/57012), done.
  9. 8.59 s Fetching commit ff11577b1777f94f30ac4c8d99e2f898d5902f7b for simplify-spenso-api ...
  10. 8.59 s $ /nix/store/bcnisk3ydfgv26v2gw3zlky24g00yww2-git-2.54.0/bin/git fetch origin ff11577b1777f94f30ac4c8d99e2f898d5902f7b
  11. 9.01 s From https://github.com/alphal00p/gammaloop
  12. 9.01 s * branch ff11577b1777f94f30ac4c8d99e2f898d5902f7b -> FETCH_HEAD
  13. 9.02 s $ /nix/store/9ypz3flqsrl5xl495mm8h645gadjsxi1-coreutils-9.11/bin/timeout --kill-after=15s 7200s /nix/store/bcnisk3ydfgv26v2gw3zlky24g00yww2-git-2.54.0/bin/git -c advice.detachedHead=false checkout ff11577b1777f94f30ac4c8d99e2f898d5902f7b
  14. 9.21 s HEAD is now at ff11577b1 update Symbolica to 0084bc7c
  15. 9.22 s $ /nix/store/9ypz3flqsrl5xl495mm8h645gadjsxi1-coreutils-9.11/bin/timeout --kill-after=15s 7200s /nix/store/23zk8sgzamrbmj1fday15szf7f2279s8-nix-2.34.7/bin/nix --extra-experimental-features nix-command --extra-experimental-features flakes --log-format internal-json run .#packages.x86_64-linux.nix-ci-check-gammaloop-nextest-core --print-build-logs
  16. 13.75 s
  17. 19.21 s evaluating derivation 'g copying '/nix/store/zvcs evaluating derivation 'g copying '/nix/store/zvcs evaluating derivation 'g copying '/nix/store/zvcs evaluating derivation 'g copying '/nix/store/zvcs evaluating derivation 'g querying gammaloop-nexte [0/1 built, 0.0 KiB DL] [1/0/1 built, 0.0 KiB DLgammaloop-nextest-core> Extracting 3 binaries (including 1 non-test binary), 1 build script output directory, and 2 linked paths to /build/nextest-archive-J2hD1a
  18. 19.68 s gammaloop-nextest-core> Extracted 18 files to /build/nextest-archive-J2hD1a in 0.47s
  19. 19.69 s gammaloop-nextest-core> ------------
  20. 19.69 s gammaloop-nextest-core> Nextest run ID dfe87a58-8321-47cf-ba83-41def9feaba0 with nextest profile: ci_gammaloop
  21. 19.69 s gammaloop-nextest-core> Starting 339 tests across 2 binaries
  22. 20.11 s gammaloop-nextest-core> ------------
  23. 20.11 s gammaloop-nextest-core> Summary [ 0.426s] 339 tests run: 339 passed, 0 skipped
  24. 20.22 s gammaloop-nextest-core>
  25. 20.22 s gammaloop-nextest-core> ========== nextest test summary ==========
  26. 20.22 s gammaloop-nextest-core> report: target/nextest/ci_gammaloop/junit.xml
  27. 20.22 s gammaloop-nextest-core> tests: 339, failures: 0, errors: 0
  28. 20.22 s gammaloop-nextest-core> No failing testcases found.
  29. 20.22 s gammaloop-nextest-core> =========================================
  30. 20.24 s gammaloop-nextest-core> Extracting 1 binary and 1 linked path to /build/nextest-archive-vE5ucr
  31. 20.30 s gammaloop-nextest-core> Extracted 7 files to /build/nextest-archive-vE5ucr in 0.07s
  32. 20.31 s gammaloop-nextest-core> ------------
  33. 20.31 s gammaloop-nextest-core> Nextest run ID c3ad5222-1652-48ab-986c-4cad1d5509e1 with nextest profile: ci_gammaloop
  34. 20.31 s gammaloop-nextest-core> Starting 19 tests across 1 binary
  35. 20.32 s gammaloop-nextest-core> ------------
  36. 20.32 s gammaloop-nextest-core> Summary [ 0.010s] 19 tests run: 19 passed, 0 skipped
  37. 20.36 s gammaloop-nextest-core>
  38. 20.36 s gammaloop-nextest-core> ========== nextest test summary ==========
  39. 20.36 s gammaloop-nextest-core> report: target/nextest/ci_gammaloop/junit.xml
  40. 20.36 s gammaloop-nextest-core> tests: 19, failures: 0, errors: 0
  41. 20.36 s gammaloop-nextest-core> No failing testcases found.
  42. 20.36 s gammaloop-nextest-core> =========================================
  43. 20.37 s gammaloop-nextest-core> Extracting 1 binary to /build/nextest-archive-PhfCUd
  44. 20.41 s gammaloop-nextest-core> Extracted 4 files to /build/nextest-archive-PhfCUd in 0.03s
  45. 20.41 s gammaloop-nextest-core> ------------
  46. 20.41 s gammaloop-nextest-core> Nextest run ID db193ff1-0d6a-4b60-ac49-197ca11641f8 with nextest profile: ci_gammaloop
  47. 20.41 s gammaloop-nextest-core> Starting 0 tests across 1 binary
  48. 20.41 s gammaloop-nextest-core> ------------
  49. 20.41 s gammaloop-nextest-core> Summary [ 0.000s] 0 tests run: 0 passed, 0 skipped
  50. 20.44 s gammaloop-nextest-core>
  51. 20.44 s gammaloop-nextest-core> ========== nextest test summary ==========
  52. 20.44 s gammaloop-nextest-core> report: target/nextest/ci_gammaloop/junit.xml
  53. 20.44 s gammaloop-nextest-core> tests: 0, failures: 0, errors: 0
  54. 20.44 s gammaloop-nextest-core> No failing testcases found.
  55. 20.44 s gammaloop-nextest-core> =========================================
  56. 20.46 s gammaloop-nextest-core> Extracting 4 binaries, 1 build script output directory, and 2 linked paths to /build/nextest-archive-D47jz8
  57. 20.98 s gammaloop-nextest-core> Extracted 18 files to /build/nextest-archive-D47jz8 in 0.53s
  58. 21.00 s gammaloop-nextest-core> ------------
  59. 21.00 s gammaloop-nextest-core> Nextest run ID 5e6a32cc-649e-4fbb-8f6b-bc87531c138b with nextest profile: ci_gammaloop
  60. 21.00 s gammaloop-nextest-core> Starting 456 tests across 4 binaries (61 tests skipped, including 60 tests via profile.ci_gammaloop.default-filter)
  61. 21.98 s gammaloop-nextest-core> FAIL [ 0.111s] (442/456) gammalooprs::test_renormalization finit_part_ghlo
  62. 21.98 s gammaloop-nextest-core> stdout ---
  63. 21.98 s gammaloop-nextest-core>
  64. 21.98 s gammaloop-nextest-core> running 1 test
  65. 21.98 s gammaloop-nextest-core> test finit_part_ghlo ... FAILED
  66. 21.98 s gammaloop-nextest-core>
  67. 21.98 s gammaloop-nextest-core> failures:
  68. 21.98 s gammaloop-nextest-core>
  69. 21.98 s gammaloop-nextest-core> failures:
  70. 21.98 s gammaloop-nextest-core> finit_part_ghlo
  71. 21.98 s gammaloop-nextest-core>
  72. 21.98 s gammaloop-nextest-core> test result: FAILED. 0 passed; 1 failed; 0 ignored; 0 measured; 5 filtered out; finished in 0.10s
  73. 21.98 s gammaloop-nextest-core>
  74. 21.98 s gammaloop-nextest-core> stderr ---
  75. 21.98 s gammaloop-nextest-core> The application panicked (crashed).
  76. 21.98 s gammaloop-nextest-core> Message: called `Result::unwrap()` on an `Err` value:
  77. 21.98 s gammaloop-nextest-core> 0: Symbolica could not parse FORM output:
  78. 21.98 s gammaloop-nextest-core> [spenso::{antisymmetric,real,spenso::tensor}::f]([spenso::{spenso::representat\
  79. 21.98 s gammaloop-nextest-core> ion,spenso::self_dual}::coad](8,[gammalooprs::{spenso::index}::hedge](0)
  80. 21.98 s gammaloop-nextest-core> ),[spenso::{spenso::representation,spenso::self_dual}::coad](8,[gammaloo\
  81. 21.98 s gammaloop-nextest-core> prs::{spenso::index}::hedge](3)),[spenso::{spenso::representation,spenso\
  82. 21.98 s gammaloop-nextest-core> ::self_dual}::coad](8,[gammalooprs::{spenso::index}::hedge](5)))*
  83. 21.98 s gammaloop-nextest-core> [spenso::{antisymmetric,real,spenso::tensor}::f]([spenso::{spenso::repre\
  84. 21.98 s gammaloop-nextest-core> sentation,spenso::self_dual}::coad](8,[gammalooprs::{spenso::index}::hed\
  85. 21.98 s gammaloop-nextest-core> ge](1)),[spenso::{spenso::representation,spenso::self_dual}::coad](8,
  86. 21.98 s gammaloop-nextest-core> [gammalooprs::{spenso::index}::hedge](3)),[spenso::{spenso::representati\
  87. 21.98 s gammaloop-nextest-core> on,spenso::self_dual}::coad](8,[gammalooprs::{spenso::index}::hedge](5))
  88. 21.98 s gammaloop-nextest-core> )*dot(p1,p0)*dot(k1,k1)*[UFO::{}::GC_10]^2*rat(-1,ep - 2)
  89. 21.98 s gammaloop-nextest-core>
  90. 21.98 s gammaloop-nextest-core> Error:Symbol spenso::coad redefined with new attributes:
  91. 21.98 s gammaloop-nextest-core> - new user data specified: List([String("spenso::representation-v2"), String("self-dual"), List([String("symbol"), String("coad")]), List([String("cyclic"), Integer(1), List([List([String("symbol"), String("a")]), List([String("symbol"), String("b")]), List([String("symbol"), String("c")]), List([String("symbol"), String("d")])])]), String("top")]) vs None
  92. 21.98 s gammaloop-nextest-core>
  93. 21.98 s gammaloop-nextest-core>
  94. 21.98 s gammaloop-nextest-core> Location:
  95. 21.98 s gammaloop-nextest-core> crates/gammalooprs/src/uv/approx/integrated.rs:332
  96. 21.98 s gammaloop-nextest-core>
  97. 21.98 s gammaloop-nextest-core> ━━━━━━━━━━━━━━━━━━━━━━━━━━━━━━━━━━ BACKTRACE ━━━━━━━━━━━━━━━━━━━━━━━━━━━━━━━━━━━
  98. 21.98 s gammaloop-nextest-core> 1: <color_eyre[5722b77bc20a64cf]::config::EyreHook>::into_eyre_hook::{closure#0}<unknown>
  99. 21.98 s gammaloop-nextest-core> at <unknown source file>:<unknown line>
  100. 21.98 s gammaloop-nextest-core> 2: eyre[cb2fd339c0c40fca]::capture_handler<unknown>
  101. 21.98 s gammaloop-nextest-core> at <unknown source file>:<unknown line>
  102. 21.98 s gammaloop-nextest-core> 3: <eyre[cb2fd339c0c40fca]::Report>::from_std::<vakint[ad2b4d4b4d753fb9]::VakintError><unknown>
  103. 21.98 s gammaloop-nextest-core> at <unknown source file>:<unknown line>
  104. 21.98 s gammaloop-nextest-core> 4: <gammalooprs[4688948c89ba1ea7]::uv::approx::integrated::Integrated>::integrate::<gammalooprs[4688948c89ba1ea7]::uv::hedge_poset::ForestNode><unknown>
  105. 21.98 s gammaloop-nextest-core> at <unknown source file>:<unknown line>
  106. 21.98 s gammaloop-nextest-core> 5: <gammalooprs[4688948c89ba1ea7]::uv::approx::integrated::Integrated>::run::<gammalooprs[4688948c89ba1ea7]::uv::hedge_poset::ForestNode, gammalooprs[4688948c89ba1ea7]::uv::hedge_poset::ForestNode><unknown>
  107. 21.98 s gammaloop-nextest-core> at <unknown source file>:<unknown line>
  108. 21.98 s gammaloop-nextest-core> 6: <gammalooprs[4688948c89ba1ea7]::uv::hedge_poset::Forests>::integrate<unknown>
  109. 21.98 s gammaloop-nextest-core> at <unknown source file>:<unknown line>
  110. 21.98 s gammaloop-nextest-core> 7: gammalooprs[4688948c89ba1ea7]::uv::orchestrator::hedge_poset_renormalization_part<unknown>
  111. 21.98 s gammaloop-nextest-core> at <unknown source file>:<unknown line>
  112. 21.98 s gammaloop-nextest-core> 8: <gammalooprs[4688948c89ba1ea7]::uv::settings::UVOrchestrator>::renormalization_part<unknown>
  113. 21.98 s gammaloop-nextest-core> at <unknown source file>:<unknown line>
  114. 21.98 s gammaloop-nextest-core> 9: <gammalooprs[4688948c89ba1ea7]::processes::amplitude::AmplitudeGraph>::renormalization_part<unknown>
  115. 21.98 s gammaloop-nextest-core> at <unknown source file>:<unknown line>
  116. 21.98 s gammaloop-nextest-core> 10: <test_renormalization[c99a4cd1432bec79]::finit_part_ghlo::{closure#0} as core[940e698046960fd5]::ops::function::FnOnce<()>>::call_once<unknown>
  117. 21.98 s gammaloop-nextest-core> at <unknown source file>:<unknown line>
  118. 21.98 s gammaloop-nextest-core> 11: test[75d6903177b1d7e9]::__rust_begin_short_backtrace::<core[940e698046960fd5]::result::Result<(), alloc[2ea6bcb46fca0c42]::string::String>, fn() -> core[940e698046960fd5]::result::Result<(), alloc[2ea6bcb46fca0c42]::string::String>><unknown>
  119. 21.98 s gammaloop-nextest-core> at <unknown source file>:<unknown line>
  120. 21.98 s gammaloop-nextest-core> 12: test[75d6903177b1d7e9]::run_test::{closure#0}<unknown>
  121. 21.98 s gammaloop-nextest-core> at <unknown source file>:<unknown line>
  122. 21.98 s gammaloop-nextest-core> 13: std[bcb96dfbba0ab899]::sys::backtrace::__rust_begin_short_backtrace::<test[75d6903177b1d7e9]::run_test::{closure#1}, ()><unknown>
  123. 21.98 s gammaloop-nextest-core> at <unknown source file>:<unknown line>
  124. 21.98 s gammaloop-nextest-core> 14: <std[bcb96dfbba0ab899]::thread::lifecycle::spawn_unchecked<test[75d6903177b1d7e9]::run_test::{closure#1}, ()>::{closure#1} as core[940e698046960fd5]::ops::function::FnOnce<()>>::call_once::{shim:vtable#0}<unknown>
  125. 21.98 s gammaloop-nextest-core> at <unknown source file>:<unknown line>
  126. 21.98 s gammaloop-nextest-core> 15: <std[bcb96dfbba0ab899]::sys::thread::unix::Thread>::new::thread_start<unknown>
  127. 21.98 s gammaloop-nextest-core> at <unknown source file>:<unknown line>
  128. 21.98 s gammaloop-nextest-core> 16: start_thread<unknown>
  129. 21.98 s gammaloop-nextest-core> at <unknown source file>:<unknown line>
  130. 21.98 s gammaloop-nextest-core> 17: __clone3<unknown>
  131. 21.98 s gammaloop-nextest-core> at <unknown source file>:<unknown line>
  132. 21.98 s gammaloop-nextest-core>
  133. 21.98 s gammaloop-nextest-core> Run with COLORBT_SHOW_HIDDEN=1 environment variable to disable frame filtering.
  134. 21.98 s gammaloop-nextest-core> Run with RUST_BACKTRACE=full to include source snippets.
  135. 21.98 s gammaloop-nextest-core> Location: crates/gammalooprs/tests/test_renormalization.rs:550
  136. 21.98 s gammaloop-nextest-core>
  137. 21.98 s gammaloop-nextest-core> ━━━━━━━━━━━━━━━━━━━━━━━━━━━━━━━━━━ BACKTRACE ━━━━━━━━━━━━━━━━━━━━━━━━━━━━━━━━━━━
  138. 21.98 s gammaloop-nextest-core> 1: <color_eyre[5722b77bc20a64cf]::config::PanicHook>::panic_report<unknown>
  139. 21.98 s gammaloop-nextest-core> at <unknown source file>:<unknown line>
  140. 21.98 s gammaloop-nextest-core> 2: <color_eyre[5722b77bc20a64cf]::config::PanicHook>::into_panic_hook::{closure#0}<unknown>
  141. 21.98 s gammaloop-nextest-core> at <unknown source file>:<unknown line>
  142. 21.98 s gammaloop-nextest-core> 3: std[bcb96dfbba0ab899]::panicking::panic_with_hook<unknown>
  143. 21.98 s gammaloop-nextest-core> at <unknown source file>:<unknown line>
  144. 21.98 s gammaloop-nextest-core> 4: std[bcb96dfbba0ab899]::panicking::panic_handler::{closure#0}<unknown>
  145. 21.98 s gammaloop-nextest-core> at <unknown source file>:<unknown line>
  146. 21.98 s gammaloop-nextest-core> 5: std[bcb96dfbba0ab899]::sys::backtrace::__rust_end_short_backtrace::<std[bcb96dfbba0ab899]::panicking::panic_handler::{closure#0}, !><unknown>
  147. 21.98 s gammaloop-nextest-core> at <unknown source file>:<unknown line>
  148. 21.98 s gammaloop-nextest-core> 6: __rustc[6c289b9f9c454d21]::rust_begin_unwind<unknown>
  149. 21.98 s gammaloop-nextest-core> at <unknown source file>:<unknown line>
  150. 21.98 s gammaloop-nextest-core> 7: core[940e698046960fd5]::panicking::panic_fmt<unknown>
  151. 21.98 s gammaloop-nextest-core> at <unknown source file>:<unknown line>
  152. 21.98 s gammaloop-nextest-core> 8: core[940e698046960fd5]::result::unwrap_failed<unknown>
  153. 21.98 s gammaloop-nextest-core> at <unknown source file>:<unknown line>
  154. 21.98 s gammaloop-nextest-core> 9: <test_renormalization[c99a4cd1432bec79]::finit_part_ghlo::{closure#0} as core[940e698046960fd5]::ops::function::FnOnce<()>>::call_once<unknown>
  155. 21.98 s gammaloop-nextest-core> at <unknown source file>:<unknown line>
  156. 21.98 s gammaloop-nextest-core> 10: test[75d6903177b1d7e9]::__rust_begin_short_backtrace::<core[940e698046960fd5]::result::Result<(), alloc[2ea6bcb46fca0c42]::string::String>, fn() -> core[940e698046960fd5]::result::Result<(), alloc[2ea6bcb46fca0c42]::string::String>><unknown>
  157. 21.98 s gammaloop-nextest-core> at <unknown source file>:<unknown line>
  158. 21.98 s gammaloop-nextest-core> 11: test[75d6903177b1d7e9]::run_test::{closure#0}<unknown>
  159. 21.98 s gammaloop-nextest-core> at <unknown source file>:<unknown line>
  160. 21.98 s gammaloop-nextest-core> 12: std[bcb96dfbba0ab899]::sys::backtrace::__rust_begin_short_backtrace::<test[75d6903177b1d7e9]::run_test::{closure#1}, ()><unknown>
  161. 21.98 s gammaloop-nextest-core> at <unknown source file>:<unknown line>
  162. 21.98 s gammaloop-nextest-core> 13: <std[bcb96dfbba0ab899]::thread::lifecycle::spawn_unchecked<test[75d6903177b1d7e9]::run_test::{closure#1}, ()>::{closure#1} as core[940e698046960fd5]::ops::function::FnOnce<()>>::call_once::{shim:vtable#0}<unknown>
  163. 21.98 s gammaloop-nextest-core> at <unknown source file>:<unknown line>
  164. 21.98 s gammaloop-nextest-core> 14: <std[bcb96dfbba0ab899]::sys::thread::unix::Thread>::new::thread_start<unknown>
  165. 21.98 s gammaloop-nextest-core> at <unknown source file>:<unknown line>
  166. 21.98 s gammaloop-nextest-core> 15: start_thread<unknown>
  167. 21.98 s gammaloop-nextest-core> at <unknown source file>:<unknown line>
  168. 21.98 s gammaloop-nextest-core> 16: __clone3<unknown>
  169. 21.98 s gammaloop-nextest-core> at <unknown source file>:<unknown line>
  170. 21.98 s gammaloop-nextest-core>
  171. 21.98 s gammaloop-nextest-core> Run with COLORBT_SHOW_HIDDEN=1 environment variable to disable frame filtering.
  172. 21.98 s gammaloop-nextest-core> Run with RUST_BACKTRACE=full to include source snippets.
  173. 21.98 s gammaloop-nextest-core>
  174. 22.09 s gammaloop-nextest-core> FAIL [ 0.195s] (443/456) gammalooprs::test_renormalization finite_part_quark_lo
  175. 22.09 s gammaloop-nextest-core> stdout ---
  176. 22.09 s gammaloop-nextest-core>
  177. 22.09 s gammaloop-nextest-core> running 1 test
  178. 22.09 s gammaloop-nextest-core> test finite_part_quark_lo ... FAILED
  179. 22.09 s gammaloop-nextest-core>
  180. 22.09 s gammaloop-nextest-core> failures:
  181. 22.09 s gammaloop-nextest-core>
  182. 22.09 s gammaloop-nextest-core> failures:
  183. 22.09 s gammaloop-nextest-core> finite_part_quark_lo
  184. 22.09 s gammaloop-nextest-core>
  185. 22.09 s gammaloop-nextest-core> test result: FAILED. 0 passed; 1 failed; 0 ignored; 0 measured; 5 filtered out; finished in 0.18s
  186. 22.09 s gammaloop-nextest-core>
  187. 22.09 s gammaloop-nextest-core> stderr ---
  188. 22.09 s gammaloop-nextest-core> The application panicked (crashed).
  189. 22.09 s gammaloop-nextest-core> Message: called `Result::unwrap()` on an `Err` value: "Symbol spenso::mink redefined with new attributes:\n\t- new user data specified: List([String(\"spenso::representation-v2\"), String(\"inline-metric\"), List([String(\"symbol\"), String(\"mink\")]), List([String(\"cyclic\"), Integer(1), List([List([String(\"symbol\"), String(\"mu\")]), List([String(\"symbol\"), String(\"nu\")]), List([String(\"symbol\"), String(\"rho\")]), List([String(\"symbol\"), String(\"sigma\")])])]), String(\"top\")]) vs None\n"
  190. 22.09 s gammaloop-nextest-core> Location: crates/vakint/src/lib.rs:4766
  191. 22.09 s gammaloop-nextest-core>
  192. 22.09 s gammaloop-nextest-core> ━━━━━━━━━━━━━━━━━━━━━━━━━━━━━━━━━━ BACKTRACE ━━━━━━━━━━━━━━━━━━━━━━━━━━━━━━━━━━━
  193. 22.09 s gammaloop-nextest-core> 1: <color_eyre[5722b77bc20a64cf]::config::PanicHook>::panic_report<unknown>
  194. 22.09 s gammaloop-nextest-core> at <unknown source file>:<unknown line>
  195. 22.09 s gammaloop-nextest-core> 2: <color_eyre[5722b77bc20a64cf]::config::PanicHook>::into_panic_hook::{closure#0}<unknown>
  196. 22.09 s gammaloop-nextest-core> at <unknown source file>:<unknown line>
  197. 22.09 s gammaloop-nextest-core> 3: std[bcb96dfbba0ab899]::panicking::panic_with_hook<unknown>
  198. 22.09 s gammaloop-nextest-core> at <unknown source file>:<unknown line>
  199. 22.09 s gammaloop-nextest-core> 4: std[bcb96dfbba0ab899]::panicking::panic_handler::{closure#0}<unknown>
  200. 22.09 s gammaloop-nextest-core> at <unknown source file>:<unknown line>
  201. 22.09 s gammaloop-nextest-core> 5: std[bcb96dfbba0ab899]::sys::backtrace::__rust_end_short_backtrace::<std[bcb96dfbba0ab899]::panicking::panic_handler::{closure#0}, !><unknown>
  202. 22.09 s gammaloop-nextest-core> at <unknown source file>:<unknown line>
  203. 22.09 s gammaloop-nextest-core> 6: __rustc[6c289b9f9c454d21]::rust_begin_unwind<unknown>
  204. 22.09 s gammaloop-nextest-core> at <unknown source file>:<unknown line>
  205. 22.09 s gammaloop-nextest-core> 7: core[940e698046960fd5]::panicking::panic_fmt<unknown>
  206. 22.09 s gammaloop-nextest-core> at <unknown source file>:<unknown line>
  207. 22.09 s gammaloop-nextest-core> 8: core[940e698046960fd5]::result::unwrap_failed<unknown>
  208. 22.09 s gammaloop-nextest-core> at <unknown source file>:<unknown line>
  209. 22.09 s gammaloop-nextest-core> 9: <vakint[ad2b4d4b4d753fb9]::Vakint>::sanitize_user_expressions<unknown>
  210. 22.09 s gammaloop-nextest-core> at <unknown source file>:<unknown line>
  211. 22.09 s gammaloop-nextest-core> 10: <vakint[ad2b4d4b4d753fb9]::Vakint>::prepare_expression_for_form<unknown>
  212. 22.09 s gammaloop-nextest-core> at <unknown source file>:<unknown line>
  213. 22.09 s gammaloop-nextest-core> 11: <vakint[ad2b4d4b4d753fb9]::VakintTerm>::tensor_reduce<unknown>
  214. 22.09 s gammaloop-nextest-core> at <unknown source file>:<unknown line>
  215. 22.09 s gammaloop-nextest-core> 12: <vakint[ad2b4d4b4d753fb9]::VakintExpression>::tensor_reduce<unknown>
  216. 22.09 s gammaloop-nextest-core> at <unknown source file>:<unknown line>
  217. 22.09 s gammaloop-nextest-core> 13: <gammalooprs[4688948c89ba1ea7]::uv::approx::integrated::Integrated>::integrate::<gammalooprs[4688948c89ba1ea7]::uv::hedge_poset::ForestNode><unknown>
  218. 22.09 s gammaloop-nextest-core> at <unknown source file>:<unknown line>
  219. 22.09 s gammaloop-nextest-core> 14: <gammalooprs[4688948c89ba1ea7]::uv::approx::integrated::Integrated>::run::<gammalooprs[4688948c89ba1ea7]::uv::hedge_poset::ForestNode, gammalooprs[4688948c89ba1ea7]::uv::hedge_poset::ForestNode><unknown>
  220. 22.09 s gammaloop-nextest-core> at <unknown source file>:<unknown line>
  221. 22.09 s gammaloop-nextest-core> 15: <gammalooprs[4688948c89ba1ea7]::uv::hedge_poset::Forests>::integrate<unknown>
  222. 22.09 s gammaloop-nextest-core> at <unknown source file>:<unknown line>
  223. 22.09 s gammaloop-nextest-core> 16: gammalooprs[4688948c89ba1ea7]::uv::orchestrator::hedge_poset_renormalization_part<unknown>
  224. 22.09 s gammaloop-nextest-core> at <unknown source file>:<unknown line>
  225. 22.09 s gammaloop-nextest-core> 17: <gammalooprs[4688948c89ba1ea7]::uv::settings::UVOrchestrator>::renormalization_part<unknown>
  226. 22.09 s gammaloop-nextest-core> at <unknown source file>:<unknown line>
  227. 22.09 s gammaloop-nextest-core> 18: <gammalooprs[4688948c89ba1ea7]::processes::amplitude::AmplitudeGraph>::renormalization_part<unknown>
  228. 22.09 s gammaloop-nextest-core> at <unknown source file>:<unknown line>
  229. 22.09 s gammaloop-nextest-core> 19: <test_renormalization[c99a4cd1432bec79]::finite_part_quark_lo::{closure#0} as core[940e698046960fd5]::ops::function::FnOnce<()>>::call_once<unknown>
  230. 22.09 s gammaloop-nextest-core> at <unknown source file>:<unknown line>
  231. 22.09 s gammaloop-nextest-core> 20: test[75d6903177b1d7e9]::__rust_begin_short_backtrace::<core[940e698046960fd5]::result::Result<(), alloc[2ea6bcb46fca0c42]::string::String>, fn() -> core[940e698046960fd5]::result::Result<(), alloc[2ea6bcb46fca0c42]::string::String>><unknown>
  232. 22.09 s gammaloop-nextest-core> at <unknown source file>:<unknown line>
  233. 22.09 s gammaloop-nextest-core> 21: test[75d6903177b1d7e9]::run_test::{closure#0}<unknown>
  234. 22.09 s gammaloop-nextest-core> at <unknown source file>:<unknown line>
  235. 22.09 s gammaloop-nextest-core> 22: std[bcb96dfbba0ab899]::sys::backtrace::__rust_begin_short_backtrace::<test[75d6903177b1d7e9]::run_test::{closure#1}, ()><unknown>
  236. 22.09 s gammaloop-nextest-core> at <unknown source file>:<unknown line>
  237. 22.09 s gammaloop-nextest-core> 23: <std[bcb96dfbba0ab899]::thread::lifecycle::spawn_unchecked<test[75d6903177b1d7e9]::run_test::{closure#1}, ()>::{closure#1} as core[940e698046960fd5]::ops::function::FnOnce<()>>::call_once::{shim:vtable#0}<unknown>
  238. 22.09 s gammaloop-nextest-core> at <unknown source file>:<unknown line>
  239. 22.09 s gammaloop-nextest-core> 24: <std[bcb96dfbba0ab899]::sys::thread::unix::Thread>::new::thread_start<unknown>
  240. 22.09 s gammaloop-nextest-core> at <unknown source file>:<unknown line>
  241. 22.09 s gammaloop-nextest-core> 25: start_thread<unknown>
  242. 22.09 s gammaloop-nextest-core> at <unknown source file>:<unknown line>
  243. 22.09 s gammaloop-nextest-core> 26: __clone3<unknown>
  244. 22.09 s gammaloop-nextest-core> at <unknown source file>:<unknown line>
  245. 22.09 s gammaloop-nextest-core>
  246. 22.09 s gammaloop-nextest-core> Run with COLORBT_SHOW_HIDDEN=1 environment variable to disable frame filtering.
  247. 22.09 s gammaloop-nextest-core> Run with RUST_BACKTRACE=full to include source snippets.
  248. 22.09 s gammaloop-nextest-core>
  249. 22.17 s gammaloop-nextest-core> FAIL [ 0.298s] (446/456) gammalooprs::test_renormalization finite_part_ghost_2loop
  250. 22.17 s gammaloop-nextest-core> stdout ---
  251. 22.17 s gammaloop-nextest-core>
  252. 22.17 s gammaloop-nextest-core> running 1 test
  253. 22.17 s gammaloop-nextest-core> test finite_part_ghost_2loop ... FAILED
  254. 22.17 s gammaloop-nextest-core>
  255. 22.17 s gammaloop-nextest-core> failures:
  256. 22.17 s gammaloop-nextest-core>
  257. 22.17 s gammaloop-nextest-core> failures:
  258. 22.17 s gammaloop-nextest-core> finite_part_ghost_2loop
  259. 22.17 s gammaloop-nextest-core>
  260. 22.17 s gammaloop-nextest-core> test result: FAILED. 0 passed; 1 failed; 0 ignored; 0 measured; 5 filtered out; finished in 0.29s
  261. 22.17 s gammaloop-nextest-core>
  262. 22.17 s gammaloop-nextest-core> stderr ---
  263. 22.17 s gammaloop-nextest-core> The application panicked (crashed).
  264. 22.17 s gammaloop-nextest-core> Message: called `Result::unwrap()` on an `Err` value:
  265. 22.17 s gammaloop-nextest-core> 0: Symbolica could not parse FORM output:
  266. 22.17 s gammaloop-nextest-core> [spenso::{antisymmetric,real,spenso::tensor}::f]([spenso::{spenso::representat\
  267. 22.17 s gammaloop-nextest-core> ion,spenso::self_dual}::coad](8,[gammalooprs::{spenso::index}::hedge](0)
  268. 22.17 s gammaloop-nextest-core> ),[spenso::{spenso::representation,spenso::self_dual}::coad](8,[gammaloo\
  269. 22.17 s gammaloop-nextest-core> prs::{spenso::index}::hedge](3)),[spenso::{spenso::representation,spenso\
  270. 22.17 s gammaloop-nextest-core> ::self_dual}::coad](8,[gammalooprs::{spenso::index}::hedge](5)))*
  271. 22.17 s gammaloop-nextest-core> [spenso::{antisymmetric,real,spenso::tensor}::f]([spenso::{spenso::repre\
  272. 22.17 s gammaloop-nextest-core> sentation,spenso::self_dual}::coad](8,[gammalooprs::{spenso::index}::hed\
  273. 22.17 s gammaloop-nextest-core> ge](1)),[spenso::{spenso::representation,spenso::self_dual}::coad](8,
  274. 22.17 s gammaloop-nextest-core> [gammalooprs::{spenso::index}::hedge](11)),[spenso::{spenso::representat\
  275. 22.17 s gammaloop-nextest-core> ion,spenso::self_dual}::coad](8,[gammalooprs::{spenso::index}::hedge](7)
  276. 22.17 s gammaloop-nextest-core> ))*[spenso::{antisymmetric,real,spenso::tensor}::f]([spenso::{spenso::re\
  277. 22.17 s gammaloop-nextest-core> presentation,spenso::self_dual}::coad](8,[gammalooprs::{spenso::index}::\
  278. 22.17 s gammaloop-nextest-core> hedge](3)),[spenso::{spenso::representation,spenso::self_dual}::coad](8,
  279. 22.17 s gammaloop-nextest-core> [gammalooprs::{spenso::index}::hedge](7)),[spenso::{spenso::representati\
  280. 22.17 s gammaloop-nextest-core> on,spenso::self_dual}::coad](8,[gammalooprs::{spenso::index}::hedge](9))
  281. 22.17 s gammaloop-nextest-core> )*[spenso::{antisymmetric,real,spenso::tensor}::f]([spenso::{spenso::rep\
  282. 22.17 s gammaloop-nextest-core> resentation,spenso::self_dual}::coad](8,[gammalooprs::{spenso::index}::h\
  283. 22.17 s gammaloop-nextest-core> edge](11)),[spenso::{spenso::representation,spenso::self_dual}::coad](8,
  284. 22.17 s gammaloop-nextest-core> [gammalooprs::{spenso::index}::hedge](5)),[spenso::{spenso::representati\
  285. 22.17 s gammaloop-nextest-core> on,spenso::self_dual}::coad](8,[gammalooprs::{spenso::index}::hedge](9))
  286. 22.17 s gammaloop-nextest-core> )*dot(p4,p0)*dot(k1,k1)*dot(k2,k2)*i_*[UFO::{}::GC_10]^4*rat(1,ep - 2)
  287. 22.17 s gammaloop-nextest-core> + [spenso::{antisymmetric,real,spenso::tensor}::f]([spenso::{spenso::re\
  288. 22.17 s gammaloop-nextest-core> presentation,spenso::self_dual}::coad](8,[gammalooprs::{spenso::index}::\
  289. 22.17 s gammaloop-nextest-core> hedge](0)),[spenso::{spenso::representation,spenso::self_dual}::coad](8,
  290. 22.17 s gammaloop-nextest-core> [gammalooprs::{spenso::index}::hedge](3)),[spenso::{spenso::representati\
  291. 22.17 s gammaloop-nextest-core> on,spenso::self_dual}::coad](8,[gammalooprs::{spenso::index}::hedge](5))
  292. 22.17 s gammaloop-nextest-core> )*[spenso::{antisymmetric,real,spenso::tensor}::f]([spenso::{spenso::rep\
  293. 22.17 s gammaloop-nextest-core> resentation,spenso::self_dual}::coad](8,[gammalooprs::{spenso::index}::h\
  294. 22.17 s gammaloop-nextest-core> edge](1)),[spenso::{spenso::representation,spenso::self_dual}::coad](8,
  295. 22.17 s gammaloop-nextest-core> [gammalooprs::{spenso::index}::hedge](11)),[spenso::{spenso::representat\
  296. 22.17 s gammaloop-nextest-core> ion,spenso::self_dual}::coad](8,[gammalooprs::{spenso::index}::hedge](7)
  297. 22.17 s gammaloop-nextest-core> ))*[spenso::{antisymmetric,real,spenso::tensor}::f]([spenso::{spenso::re\
  298. 22.17 s gammaloop-nextest-core> presentation,spenso::self_dual}::coad](8,[gammalooprs::{spenso::index}::\
  299. 22.17 s gammaloop-nextest-core> hedge](3)),[spenso::{spenso::representation,spenso::self_dual}::coad](8,
  300. 22.17 s gammaloop-nextest-core> [gammalooprs::{spenso::index}::hedge](7)),[spenso::{spenso::representati\
  301. 22.17 s gammaloop-nextest-core> on,spenso::self_dual}::coad](8,[gammalooprs::{spenso::index}::hedge](9))
  302. 22.17 s gammaloop-nextest-core> )*[spenso::{antisymmetric,real,spenso::tensor}::f]([spenso::{spenso::rep\
  303. 22.17 s gammaloop-nextest-core> resentation,spenso::self_dual}::coad](8,[gammalooprs::{spenso::index}::h\
  304. 22.17 s gammaloop-nextest-core> edge](11)),[spenso::{spenso::representation,spenso::self_dual}::coad](8,
  305. 22.17 s gammaloop-nextest-core> [gammalooprs::{spenso::index}::hedge](5)),[spenso::{spenso::representati\
  306. 22.17 s gammaloop-nextest-core> on,spenso::self_dual}::coad](8,[gammalooprs::{spenso::index}::hedge](9))
  307. 22.17 s gammaloop-nextest-core> )*dot(p4,p0)*dot(k1,k2)^2*i_*[UFO::{}::GC_10]^4*rat(-1,ep - 2)
  308. 22.17 s gammaloop-nextest-core>
  309. 22.17 s gammaloop-nextest-core> Error:Symbol spenso::coad redefined with new attributes:
  310. 22.17 s gammaloop-nextest-core> - new user data specified: List([String("spenso::representation-v2"), String("self-dual"), List([String("symbol"), String("coad")]), List([String("cyclic"), Integer(1), List([List([String("symbol"), String("a")]), List([String("symbol"), String("b")]), List([String("symbol"), String("c")]), List([String("symbol"), String("d")])])]), String("top")]) vs None
  311. 22.17 s gammaloop-nextest-core>
  312. 22.17 s gammaloop-nextest-core>
  313. 22.17 s gammaloop-nextest-core> Location:
  314. 22.17 s gammaloop-nextest-core> crates/gammalooprs/src/uv/approx/integrated.rs:332
  315. 22.17 s gammaloop-nextest-core>
  316. 22.17 s gammaloop-nextest-core> ━━━━━━━━━━━━━━━━━━━━━━━━━━━━━━━━━━ BACKTRACE ━━━━━━━━━━━━━━━━━━━━━━━━━━━━━━━━━━━
  317. 22.17 s gammaloop-nextest-core> 1: <color_eyre[5722b77bc20a64cf]::config::EyreHook>::into_eyre_hook::{closure#0}<unknown>
  318. 22.17 s gammaloop-nextest-core> at <unknown source file>:<unknown line>
  319. 22.17 s gammaloop-nextest-core> 2: eyre[cb2fd339c0c40fca]::capture_handler<unknown>
  320. 22.17 s gammaloop-nextest-core> at <unknown source file>:<unknown line>
  321. 22.17 s gammaloop-nextest-core> 3: <eyre[cb2fd339c0c40fca]::Report>::from_std::<vakint[ad2b4d4b4d753fb9]::VakintError><unknown>
  322. 22.17 s gammaloop-nextest-core> at <unknown source file>:<unknown line>
  323. 22.17 s gammaloop-nextest-core> 4: <gammalooprs[4688948c89ba1ea7]::uv::approx::integrated::Integrated>::integrate::<gammalooprs[4688948c89ba1ea7]::uv::approx::Approximation><unknown>
  324. 22.17 s gammaloop-nextest-core> at <unknown source file>:<unknown line>
  325. 22.17 s gammaloop-nextest-core> 5: <gammalooprs[4688948c89ba1ea7]::uv::forest::Forest>::compute<unknown>
  326. 22.17 s gammaloop-nextest-core> at <unknown source file>:<unknown line>
  327. 22.17 s gammaloop-nextest-core> 6: gammalooprs[4688948c89ba1ea7]::uv::orchestrator::legacy_renormalization_part<unknown>
  328. 22.17 s gammaloop-nextest-core> at <unknown source file>:<unknown line>
  329. 22.17 s gammaloop-nextest-core> 7: <gammalooprs[4688948c89ba1ea7]::uv::settings::UVOrchestrator>::renormalization_part<unknown>
  330. 22.17 s gammaloop-nextest-core> at <unknown source file>:<unknown line>
  331. 22.17 s gammaloop-nextest-core> 8: <gammalooprs[4688948c89ba1ea7]::processes::amplitude::AmplitudeGraph>::renormalization_part<unknown>
  332. 22.17 s gammaloop-nextest-core> at <unknown source file>:<unknown line>
  333. 22.17 s gammaloop-nextest-core> 9: test_renormalization[c99a4cd1432bec79]::finite_part_ghost_2loop<unknown>
  334. 22.17 s gammaloop-nextest-core> at <unknown source file>:<unknown line>
  335. 22.17 s gammaloop-nextest-core> 10: <test_renormalization[c99a4cd1432bec79]::finite_part_ghost_2loop::{closure#0} as core[940e698046960fd5]::ops::function::FnOnce<()>>::call_once<unknown>
  336. 22.17 s gammaloop-nextest-core> at <unknown source file>:<unknown line>
  337. 22.17 s gammaloop-nextest-core> 11: test[75d6903177b1d7e9]::__rust_begin_short_backtrace::<core[940e698046960fd5]::result::Result<(), alloc[2ea6bcb46fca0c42]::string::String>, fn() -> core[940e698046960fd5]::result::Result<(), alloc[2ea6bcb46fca0c42]::string::String>><unknown>
  338. 22.17 s gammaloop-nextest-core> at <unknown source file>:<unknown line>
  339. 22.17 s gammaloop-nextest-core> 12: test[75d6903177b1d7e9]::run_test::{closure#0}<unknown>
  340. 22.17 s gammaloop-nextest-core> at <unknown source file>:<unknown line>
  341. 22.17 s gammaloop-nextest-core> 13: std[bcb96dfbba0ab899]::sys::backtrace::__rust_begin_short_backtrace::<test[75d6903177b1d7e9]::run_test::{closure#1}, ()><unknown>
  342. 22.17 s gammaloop-nextest-core> at <unknown source file>:<unknown line>
  343. 22.17 s gammaloop-nextest-core> 14: <std[bcb96dfbba0ab899]::thread::lifecycle::spawn_unchecked<test[75d6903177b1d7e9]::run_test::{closure#1}, ()>::{closure#1} as core[940e698046960fd5]::ops::function::FnOnce<()>>::call_once::{shim:vtable#0}<unknown>
  344. 22.17 s gammaloop-nextest-core> at <unknown source file>:<unknown line>
  345. 22.17 s gammaloop-nextest-core> 15: <std[bcb96dfbba0ab899]::sys::thread::unix::Thread>::new::thread_start<unknown>
  346. 22.17 s gammaloop-nextest-core> at <unknown source file>:<unknown line>
  347. 22.17 s gammaloop-nextest-core> 16: start_thread<unknown>
  348. 22.17 s gammaloop-nextest-core> at <unknown source file>:<unknown line>
  349. 22.17 s gammaloop-nextest-core> 17: __clone3<unknown>
  350. 22.17 s gammaloop-nextest-core> at <unknown source file>:<unknown line>
  351. 22.17 s gammaloop-nextest-core>
  352. 22.17 s gammaloop-nextest-core> Run with COLORBT_SHOW_HIDDEN=1 environment variable to disable frame filtering.
  353. 22.17 s gammaloop-nextest-core> Run with RUST_BACKTRACE=full to include source snippets.
  354. 22.17 s gammaloop-nextest-core> Location: crates/gammalooprs/tests/test_renormalization.rs:445
  355. 22.17 s gammaloop-nextest-core>
  356. 22.17 s gammaloop-nextest-core> ━━━━━━━━━━━━━━━━━━━━━━━━━━━━━━━━━━ BACKTRACE ━━━━━━━━━━━━━━━━━━━━━━━━━━━━━━━━━━━
  357. 22.17 s gammaloop-nextest-core> 1: <color_eyre[5722b77bc20a64cf]::config::PanicHook>::panic_report<unknown>
  358. 22.17 s gammaloop-nextest-core> at <unknown source file>:<unknown line>
  359. 22.17 s gammaloop-nextest-core> 2: <color_eyre[5722b77bc20a64cf]::config::PanicHook>::into_panic_hook::{closure#0}<unknown>
  360. 22.17 s gammaloop-nextest-core> at <unknown source file>:<unknown line>
  361. 22.17 s gammaloop-nextest-core> 3: std[bcb96dfbba0ab899]::panicking::panic_with_hook<unknown>
  362. 22.17 s gammaloop-nextest-core> at <unknown source file>:<unknown line>
  363. 22.17 s gammaloop-nextest-core> 4: std[bcb96dfbba0ab899]::panicking::panic_handler::{closure#0}<unknown>
  364. 22.17 s gammaloop-nextest-core> at <unknown source file>:<unknown line>
  365. 22.17 s gammaloop-nextest-core> 5: std[bcb96dfbba0ab899]::sys::backtrace::__rust_end_short_backtrace::<std[bcb96dfbba0ab899]::panicking::panic_handler::{closure#0}, !><unknown>
  366. 22.17 s gammaloop-nextest-core> at <unknown source file>:<unknown line>
  367. 22.17 s gammaloop-nextest-core> 6: __rustc[6c289b9f9c454d21]::rust_begin_unwind<unknown>
  368. 22.17 s gammaloop-nextest-core> at <unknown source file>:<unknown line>
  369. 22.17 s gammaloop-nextest-core> 7: core[940e698046960fd5]::panicking::panic_fmt<unknown>
  370. 22.17 s gammaloop-nextest-core> at <unknown source file>:<unknown line>
  371. 22.17 s gammaloop-nextest-core> 8: core[940e698046960fd5]::result::unwrap_failed<unknown>
  372. 22.17 s gammaloop-nextest-core> at <unknown source file>:<unknown line>
  373. 22.17 s gammaloop-nextest-core> 9: test_renormalization[c99a4cd1432bec79]::finite_part_ghost_2loop<unknown>
  374. 22.17 s gammaloop-nextest-core> at <unknown source file>:<unknown line>
  375. 22.17 s gammaloop-nextest-core> 10: <test_renormalization[c99a4cd1432bec79]::finite_part_ghost_2loop::{closure#0} as core[940e698046960fd5]::ops::function::FnOnce<()>>::call_once<unknown>
  376. 22.17 s gammaloop-nextest-core> at <unknown source file>:<unknown line>
  377. 22.17 s gammaloop-nextest-core> 11: test[75d6903177b1d7e9]::__rust_begin_short_backtrace::<core[940e698046960fd5]::result::Result<(), alloc[2ea6bcb46fca0c42]::string::String>, fn() -> core[940e698046960fd5]::result::Result<(), alloc[2ea6bcb46fca0c42]::string::String>><unknown>
  378. 22.17 s gammaloop-nextest-core> at <unknown source file>:<unknown line>
  379. 22.17 s gammaloop-nextest-core> 12: test[75d6903177b1d7e9]::run_test::{closure#0}<unknown>
  380. 22.17 s gammaloop-nextest-core> at <unknown source file>:<unknown line>
  381. 22.17 s gammaloop-nextest-core> 13: std[bcb96dfbba0ab899]::sys::backtrace::__rust_begin_short_backtrace::<test[75d6903177b1d7e9]::run_test::{closure#1}, ()><unknown>
  382. 22.17 s gammaloop-nextest-core> at <unknown source file>:<unknown line>
  383. 22.17 s gammaloop-nextest-core> 14: <std[bcb96dfbba0ab899]::thread::lifecycle::spawn_unchecked<test[75d6903177b1d7e9]::run_test::{closure#1}, ()>::{closure#1} as core[940e698046960fd5]::ops::function::FnOnce<()>>::call_once::{shim:vtable#0}<unknown>
  384. 22.17 s gammaloop-nextest-core> at <unknown source file>:<unknown line>
  385. 22.17 s gammaloop-nextest-core> 15: <std[bcb96dfbba0ab899]::sys::thread::unix::Thread>::new::thread_start<unknown>
  386. 22.17 s gammaloop-nextest-core> at <unknown source file>:<unknown line>
  387. 22.17 s gammaloop-nextest-core> 16: start_thread<unknown>
  388. 22.17 s gammaloop-nextest-core> at <unknown source file>:<unknown line>
  389. 22.17 s gammaloop-nextest-core> 17: __clone3<unknown>
  390. 22.17 s gammaloop-nextest-core> at <unknown source file>:<unknown line>
  391. 22.17 s gammaloop-nextest-core>
  392. 22.17 s gammaloop-nextest-core> Run with COLORBT_SHOW_HIDDEN=1 environment variable to disable frame filtering.
  393. 22.17 s gammaloop-nextest-core> Run with RUST_BACKTRACE=full to include source snippets.
  394. 22.17 s gammaloop-nextest-core>
  395. 29.14 s gammaloop-nextest-core> ------------
  396. 29.14 s gammaloop-nextest-core> Summary [ 8.140s] 456 tests run: 453 passed, 3 failed, 61 skipped
  397. 29.14 s gammaloop-nextest-core> FAIL [ 0.111s] (442/456) gammalooprs::test_renormalization finit_part_ghlo
  398. 29.14 s gammaloop-nextest-core> stdout ---
  399. 29.14 s gammaloop-nextest-core>
  400. 29.14 s gammaloop-nextest-core> running 1 test
  401. 29.14 s gammaloop-nextest-core> test finit_part_ghlo ... FAILED
  402. 29.14 s gammaloop-nextest-core>
  403. 29.14 s gammaloop-nextest-core> failures:
  404. 29.14 s gammaloop-nextest-core>
  405. 29.14 s gammaloop-nextest-core> failures:
  406. 29.14 s gammaloop-nextest-core> finit_part_ghlo
  407. 29.14 s gammaloop-nextest-core>
  408. 29.14 s gammaloop-nextest-core> test result: FAILED. 0 passed; 1 failed; 0 ignored; 0 measured; 5 filtered out; finished in 0.10s
  409. 29.14 s gammaloop-nextest-core>
  410. 29.14 s gammaloop-nextest-core> stderr ---
  411. 29.14 s gammaloop-nextest-core> The application panicked (crashed).
  412. 29.14 s gammaloop-nextest-core> Message: called `Result::unwrap()` on an `Err` value:
  413. 29.14 s gammaloop-nextest-core> 0: Symbolica could not parse FORM output:
  414. 29.14 s gammaloop-nextest-core> [spenso::{antisymmetric,real,spenso::tensor}::f]([spenso::{spenso::representat\
  415. 29.14 s gammaloop-nextest-core> ion,spenso::self_dual}::coad](8,[gammalooprs::{spenso::index}::hedge](0)
  416. 29.14 s gammaloop-nextest-core> ),[spenso::{spenso::representation,spenso::self_dual}::coad](8,[gammaloo\
  417. 29.14 s gammaloop-nextest-core> prs::{spenso::index}::hedge](3)),[spenso::{spenso::representation,spenso\
  418. 29.14 s gammaloop-nextest-core> ::self_dual}::coad](8,[gammalooprs::{spenso::index}::hedge](5)))*
  419. 29.14 s gammaloop-nextest-core> [spenso::{antisymmetric,real,spenso::tensor}::f]([spenso::{spenso::repre\
  420. 29.14 s gammaloop-nextest-core> sentation,spenso::self_dual}::coad](8,[gammalooprs::{spenso::index}::hed\
  421. 29.14 s gammaloop-nextest-core> ge](1)),[spenso::{spenso::representation,spenso::self_dual}::coad](8,
  422. 29.14 s gammaloop-nextest-core> [gammalooprs::{spenso::index}::hedge](3)),[spenso::{spenso::representati\
  423. 29.14 s gammaloop-nextest-core> on,spenso::self_dual}::coad](8,[gammalooprs::{spenso::index}::hedge](5))
  424. 29.14 s gammaloop-nextest-core> )*dot(p1,p0)*dot(k1,k1)*[UFO::{}::GC_10]^2*rat(-1,ep - 2)
  425. 29.14 s gammaloop-nextest-core>
  426. 29.14 s gammaloop-nextest-core> Error:Symbol spenso::coad redefined with new attributes:
  427. 29.14 s gammaloop-nextest-core> - new user data specified: List([String("spenso::representation-v2"), String("self-dual"), List([String("symbol"), String("coad")]), List([String("cyclic"), Integer(1), List([List([String("symbol"), String("a")]), List([String("symbol"), String("b")]), List([String("symbol"), String("c")]), List([String("symbol"), String("d")])])]), String("top")]) vs None
  428. 29.14 s gammaloop-nextest-core>
  429. 29.14 s gammaloop-nextest-core>
  430. 29.14 s gammaloop-nextest-core> Location:
  431. 29.14 s gammaloop-nextest-core> crates/gammalooprs/src/uv/approx/integrated.rs:332
  432. 29.14 s gammaloop-nextest-core>
  433. 29.14 s gammaloop-nextest-core> ━━━━━━━━━━━━━━━━━━━━━━━━━━━━━━━━━━ BACKTRACE ━━━━━━━━━━━━━━━━━━━━━━━━━━━━━━━━━━━
  434. 29.14 s gammaloop-nextest-core> 1: <color_eyre[5722b77bc20a64cf]::config::EyreHook>::into_eyre_hook::{closure#0}<unknown>
  435. 29.14 s gammaloop-nextest-core> at <unknown source file>:<unknown line>
  436. 29.14 s gammaloop-nextest-core> 2: eyre[cb2fd339c0c40fca]::capture_handler<unknown>
  437. 29.14 s gammaloop-nextest-core> at <unknown source file>:<unknown line>
  438. 29.14 s gammaloop-nextest-core> 3: <eyre[cb2fd339c0c40fca]::Report>::from_std::<vakint[ad2b4d4b4d753fb9]::VakintError><unknown>
  439. 29.14 s gammaloop-nextest-core> at <unknown source file>:<unknown line>
  440. 29.14 s gammaloop-nextest-core> 4: <gammalooprs[4688948c89ba1ea7]::uv::approx::integrated::Integrated>::integrate::<gammalooprs[4688948c89ba1ea7]::uv::hedge_poset::ForestNode><unknown>
  441. 29.14 s gammaloop-nextest-core> at <unknown source file>:<unknown line>
  442. 29.14 s gammaloop-nextest-core> 5: <gammalooprs[4688948c89ba1ea7]::uv::approx::integrated::Integrated>::run::<gammalooprs[4688948c89ba1ea7]::uv::hedge_poset::ForestNode, gammalooprs[4688948c89ba1ea7]::uv::hedge_poset::ForestNode><unknown>
  443. 29.14 s gammaloop-nextest-core> at <unknown source file>:<unknown line>
  444. 29.14 s gammaloop-nextest-core> 6: <gammalooprs[4688948c89ba1ea7]::uv::hedge_poset::Forests>::integrate<unknown>
  445. 29.14 s gammaloop-nextest-core> at <unknown source file>:<unknown line>
  446. 29.14 s gammaloop-nextest-core> 7: gammalooprs[4688948c89ba1ea7]::uv::orchestrator::hedge_poset_renormalization_part<unknown>
  447. 29.14 s gammaloop-nextest-core> at <unknown source file>:<unknown line>
  448. 29.14 s gammaloop-nextest-core> 8: <gammalooprs[4688948c89ba1ea7]::uv::settings::UVOrchestrator>::renormalization_part<unknown>
  449. 29.14 s gammaloop-nextest-core> at <unknown source file>:<unknown line>
  450. 29.14 s gammaloop-nextest-core> 9: <gammalooprs[4688948c89ba1ea7]::processes::amplitude::AmplitudeGraph>::renormalization_part<unknown>
  451. 29.14 s gammaloop-nextest-core> at <unknown source file>:<unknown line>
  452. 29.14 s gammaloop-nextest-core> 10: <test_renormalization[c99a4cd1432bec79]::finit_part_ghlo::{closure#0} as core[940e698046960fd5]::ops::function::FnOnce<()>>::call_once<unknown>
  453. 29.14 s gammaloop-nextest-core> at <unknown source file>:<unknown line>
  454. 29.14 s gammaloop-nextest-core> 11: test[75d6903177b1d7e9]::__rust_begin_short_backtrace::<core[940e698046960fd5]::result::Result<(), alloc[2ea6bcb46fca0c42]::string::String>, fn() -> core[940e698046960fd5]::result::Result<(), alloc[2ea6bcb46fca0c42]::string::String>><unknown>
  455. 29.14 s gammaloop-nextest-core> at <unknown source file>:<unknown line>
  456. 29.14 s gammaloop-nextest-core> 12: test[75d6903177b1d7e9]::run_test::{closure#0}<unknown>
  457. 29.14 s gammaloop-nextest-core> at <unknown source file>:<unknown line>
  458. 29.14 s gammaloop-nextest-core> 13: std[bcb96dfbba0ab899]::sys::backtrace::__rust_begin_short_backtrace::<test[75d6903177b1d7e9]::run_test::{closure#1}, ()><unknown>
  459. 29.14 s gammaloop-nextest-core> at <unknown source file>:<unknown line>
  460. 29.14 s gammaloop-nextest-core> 14: <std[bcb96dfbba0ab899]::thread::lifecycle::spawn_unchecked<test[75d6903177b1d7e9]::run_test::{closure#1}, ()>::{closure#1} as core[940e698046960fd5]::ops::function::FnOnce<()>>::call_once::{shim:vtable#0}<unknown>
  461. 29.14 s gammaloop-nextest-core> at <unknown source file>:<unknown line>
  462. 29.14 s gammaloop-nextest-core> 15: <std[bcb96dfbba0ab899]::sys::thread::unix::Thread>::new::thread_start<unknown>
  463. 29.14 s gammaloop-nextest-core> at <unknown source file>:<unknown line>
  464. 29.14 s gammaloop-nextest-core> 16: start_thread<unknown>
  465. 29.14 s gammaloop-nextest-core> at <unknown source file>:<unknown line>
  466. 29.14 s gammaloop-nextest-core> 17: __clone3<unknown>
  467. 29.14 s gammaloop-nextest-core> at <unknown source file>:<unknown line>
  468. 29.14 s gammaloop-nextest-core>
  469. 29.14 s gammaloop-nextest-core> Run with COLORBT_SHOW_HIDDEN=1 environment variable to disable frame filtering.
  470. 29.14 s gammaloop-nextest-core> Run with RUST_BACKTRACE=full to include source snippets.
  471. 29.14 s gammaloop-nextest-core> Location: crates/gammalooprs/tests/test_renormalization.rs:550
  472. 29.14 s gammaloop-nextest-core>
  473. 29.14 s gammaloop-nextest-core> ━━━━━━━━━━━━━━━━━━━━━━━━━━━━━━━━━━ BACKTRACE ━━━━━━━━━━━━━━━━━━━━━━━━━━━━━━━━━━━
  474. 29.14 s gammaloop-nextest-core> 1: <color_eyre[5722b77bc20a64cf]::config::PanicHook>::panic_report<unknown>
  475. 29.14 s gammaloop-nextest-core> at <unknown source file>:<unknown line>
  476. 29.14 s gammaloop-nextest-core> 2: <color_eyre[5722b77bc20a64cf]::config::PanicHook>::into_panic_hook::{closure#0}<unknown>
  477. 29.14 s gammaloop-nextest-core> at <unknown source file>:<unknown line>
  478. 29.14 s gammaloop-nextest-core> 3: std[bcb96dfbba0ab899]::panicking::panic_with_hook<unknown>
  479. 29.14 s gammaloop-nextest-core> at <unknown source file>:<unknown line>
  480. 29.14 s gammaloop-nextest-core> 4: std[bcb96dfbba0ab899]::panicking::panic_handler::{closure#0}<unknown>
  481. 29.14 s gammaloop-nextest-core> at <unknown source file>:<unknown line>
  482. 29.14 s gammaloop-nextest-core> 5: std[bcb96dfbba0ab899]::sys::backtrace::__rust_end_short_backtrace::<std[bcb96dfbba0ab899]::panicking::panic_handler::{closure#0}, !><unknown>
  483. 29.14 s gammaloop-nextest-core> at <unknown source file>:<unknown line>
  484. 29.14 s gammaloop-nextest-core> 6: __rustc[6c289b9f9c454d21]::rust_begin_unwind<unknown>
  485. 29.14 s gammaloop-nextest-core> at <unknown source file>:<unknown line>
  486. 29.14 s gammaloop-nextest-core> 7: core[940e698046960fd5]::panicking::panic_fmt<unknown>
  487. 29.14 s gammaloop-nextest-core> at <unknown source file>:<unknown line>
  488. 29.14 s gammaloop-nextest-core> 8: core[940e698046960fd5]::result::unwrap_failed<unknown>
  489. 29.14 s gammaloop-nextest-core> at <unknown source file>:<unknown line>
  490. 29.14 s gammaloop-nextest-core> 9: <test_renormalization[c99a4cd1432bec79]::finit_part_ghlo::{closure#0} as core[940e698046960fd5]::ops::function::FnOnce<()>>::call_once<unknown>
  491. 29.14 s gammaloop-nextest-core> at <unknown source file>:<unknown line>
  492. 29.14 s gammaloop-nextest-core> 10: test[75d6903177b1d7e9]::__rust_begin_short_backtrace::<core[940e698046960fd5]::result::Result<(), alloc[2ea6bcb46fca0c42]::string::String>, fn() -> core[940e698046960fd5]::result::Result<(), alloc[2ea6bcb46fca0c42]::string::String>><unknown>
  493. 29.14 s gammaloop-nextest-core> at <unknown source file>:<unknown line>
  494. 29.14 s gammaloop-nextest-core> 11: test[75d6903177b1d7e9]::run_test::{closure#0}<unknown>
  495. 29.14 s gammaloop-nextest-core> at <unknown source file>:<unknown line>
  496. 29.14 s gammaloop-nextest-core> 12: std[bcb96dfbba0ab899]::sys::backtrace::__rust_begin_short_backtrace::<test[75d6903177b1d7e9]::run_test::{closure#1}, ()><unknown>
  497. 29.14 s gammaloop-nextest-core> at <unknown source file>:<unknown line>
  498. 29.14 s gammaloop-nextest-core> 13: <std[bcb96dfbba0ab899]::thread::lifecycle::spawn_unchecked<test[75d6903177b1d7e9]::run_test::{closure#1}, ()>::{closure#1} as core[940e698046960fd5]::ops::function::FnOnce<()>>::call_once::{shim:vtable#0}<unknown>
  499. 29.14 s gammaloop-nextest-core> at <unknown source file>:<unknown line>
  500. 29.14 s gammaloop-nextest-core> 14: <std[bcb96dfbba0ab899]::sys::thread::unix::Thread>::new::thread_start<unknown>
  501. 29.14 s gammaloop-nextest-core> at <unknown source file>:<unknown line>
  502. 29.14 s gammaloop-nextest-core> 15: start_thread<unknown>
  503. 29.14 s gammaloop-nextest-core> at <unknown source file>:<unknown line>
  504. 29.14 s gammaloop-nextest-core> 16: __clone3<unknown>
  505. 29.14 s gammaloop-nextest-core> at <unknown source file>:<unknown line>
  506. 29.14 s gammaloop-nextest-core>
  507. 29.14 s gammaloop-nextest-core> Run with COLORBT_SHOW_HIDDEN=1 environment variable to disable frame filtering.
  508. 29.14 s gammaloop-nextest-core> Run with RUST_BACKTRACE=full to include source snippets.
  509. 29.14 s gammaloop-nextest-core>
  510. 29.14 s gammaloop-nextest-core> FAIL [ 0.195s] (443/456) gammalooprs::test_renormalization finite_part_quark_lo
  511. 29.14 s gammaloop-nextest-core> stdout ---
  512. 29.14 s gammaloop-nextest-core>
  513. 29.14 s gammaloop-nextest-core> running 1 test
  514. 29.14 s gammaloop-nextest-core> test finite_part_quark_lo ... FAILED
  515. 29.14 s gammaloop-nextest-core>
  516. 29.14 s gammaloop-nextest-core> failures:
  517. 29.14 s gammaloop-nextest-core>
  518. 29.14 s gammaloop-nextest-core> failures:
  519. 29.14 s gammaloop-nextest-core> finite_part_quark_lo
  520. 29.14 s gammaloop-nextest-core>
  521. 29.14 s gammaloop-nextest-core> test result: FAILED. 0 passed; 1 failed; 0 ignored; 0 measured; 5 filtered out; finished in 0.18s
  522. 29.14 s gammaloop-nextest-core>
  523. 29.14 s gammaloop-nextest-core> stderr ---
  524. 29.14 s gammaloop-nextest-core> The application panicked (crashed).
  525. 29.14 s gammaloop-nextest-core> Message: called `Result::unwrap()` on an `Err` value: "Symbol spenso::mink redefined with new attributes:\n\t- new user data specified: List([String(\"spenso::representation-v2\"), String(\"inline-metric\"), List([String(\"symbol\"), String(\"mink\")]), List([String(\"cyclic\"), Integer(1), List([List([String(\"symbol\"), String(\"mu\")]), List([String(\"symbol\"), String(\"nu\")]), List([String(\"symbol\"), String(\"rho\")]), List([String(\"symbol\"), String(\"sigma\")])])]), String(\"top\")]) vs None\n"
  526. 29.14 s gammaloop-nextest-core> Location: crates/vakint/src/lib.rs:4766
  527. 29.14 s gammaloop-nextest-core>
  528. 29.14 s gammaloop-nextest-core> ━━━━━━━━━━━━━━━━━━━━━━━━━━━━━━━━━━ BACKTRACE ━━━━━━━━━━━━━━━━━━━━━━━━━━━━━━━━━━━
  529. 29.14 s gammaloop-nextest-core> 1: <color_eyre[5722b77bc20a64cf]::config::PanicHook>::panic_report<unknown>
  530. 29.14 s gammaloop-nextest-core> at <unknown source file>:<unknown line>
  531. 29.14 s gammaloop-nextest-core> 2: <color_eyre[5722b77bc20a64cf]::config::PanicHook>::into_panic_hook::{closure#0}<unknown>
  532. 29.14 s gammaloop-nextest-core> at <unknown source file>:<unknown line>
  533. 29.14 s gammaloop-nextest-core> 3: std[bcb96dfbba0ab899]::panicking::panic_with_hook<unknown>
  534. 29.14 s gammaloop-nextest-core> at <unknown source file>:<unknown line>
  535. 29.14 s gammaloop-nextest-core> 4: std[bcb96dfbba0ab899]::panicking::panic_handler::{closure#0}<unknown>
  536. 29.14 s gammaloop-nextest-core> at <unknown source file>:<unknown line>
  537. 29.14 s gammaloop-nextest-core> 5: std[bcb96dfbba0ab899]::sys::backtrace::__rust_end_short_backtrace::<std[bcb96dfbba0ab899]::panicking::panic_handler::{closure#0}, !><unknown>
  538. 29.14 s gammaloop-nextest-core> at <unknown source file>:<unknown line>
  539. 29.14 s gammaloop-nextest-core> 6: __rustc[6c289b9f9c454d21]::rust_begin_unwind<unknown>
  540. 29.14 s gammaloop-nextest-core> at <unknown source file>:<unknown line>
  541. 29.14 s gammaloop-nextest-core> 7: core[940e698046960fd5]::panicking::panic_fmt<unknown>
  542. 29.14 s gammaloop-nextest-core> at <unknown source file>:<unknown line>
  543. 29.14 s gammaloop-nextest-core> 8: core[940e698046960fd5]::result::unwrap_failed<unknown>
  544. 29.14 s gammaloop-nextest-core> at <unknown source file>:<unknown line>
  545. 29.14 s gammaloop-nextest-core> 9: <vakint[ad2b4d4b4d753fb9]::Vakint>::sanitize_user_expressions<unknown>
  546. 29.14 s gammaloop-nextest-core> at <unknown source file>:<unknown line>
  547. 29.14 s gammaloop-nextest-core> 10: <vakint[ad2b4d4b4d753fb9]::Vakint>::prepare_expression_for_form<unknown>
  548. 29.14 s gammaloop-nextest-core> at <unknown source file>:<unknown line>
  549. 29.14 s gammaloop-nextest-core> 11: <vakint[ad2b4d4b4d753fb9]::VakintTerm>::tensor_reduce<unknown>
  550. 29.14 s gammaloop-nextest-core> at <unknown source file>:<unknown line>
  551. 29.14 s gammaloop-nextest-core> 12: <vakint[ad2b4d4b4d753fb9]::VakintExpression>::tensor_reduce<unknown>
  552. 29.14 s gammaloop-nextest-core> at <unknown source file>:<unknown line>
  553. 29.14 s gammaloop-nextest-core> 13: <gammalooprs[4688948c89ba1ea7]::uv::approx::integrated::Integrated>::integrate::<gammalooprs[4688948c89ba1ea7]::uv::hedge_poset::ForestNode><unknown>
  554. 29.14 s gammaloop-nextest-core> at <unknown source file>:<unknown line>
  555. 29.14 s gammaloop-nextest-core> 14: <gammalooprs[4688948c89ba1ea7]::uv::approx::integrated::Integrated>::run::<gammalooprs[4688948c89ba1ea7]::uv::hedge_poset::ForestNode, gammalooprs[4688948c89ba1ea7]::uv::hedge_poset::ForestNode><unknown>
  556. 29.14 s gammaloop-nextest-core> at <unknown source file>:<unknown line>
  557. 29.14 s gammaloop-nextest-core> 15: <gammalooprs[4688948c89ba1ea7]::uv::hedge_poset::Forests>::integrate<unknown>
  558. 29.14 s gammaloop-nextest-core> at <unknown source file>:<unknown line>
  559. 29.14 s gammaloop-nextest-core> 16: gammalooprs[4688948c89ba1ea7]::uv::orchestrator::hedge_poset_renormalization_part<unknown>
  560. 29.14 s gammaloop-nextest-core> at <unknown source file>:<unknown line>
  561. 29.14 s gammaloop-nextest-core> 17: <gammalooprs[4688948c89ba1ea7]::uv::settings::UVOrchestrator>::renormalization_part<unknown>
  562. 29.14 s gammaloop-nextest-core> at <unknown source file>:<unknown line>
  563. 29.14 s gammaloop-nextest-core> 18: <gammalooprs[4688948c89ba1ea7]::processes::amplitude::AmplitudeGraph>::renormalization_part<unknown>
  564. 29.14 s gammaloop-nextest-core> at <unknown source file>:<unknown line>
  565. 29.14 s gammaloop-nextest-core> 19: <test_renormalization[c99a4cd1432bec79]::finite_part_quark_lo::{closure#0} as core[940e698046960fd5]::ops::function::FnOnce<()>>::call_once<unknown>
  566. 29.14 s gammaloop-nextest-core> at <unknown source file>:<unknown line>
  567. 29.14 s gammaloop-nextest-core> 20: test[75d6903177b1d7e9]::__rust_begin_short_backtrace::<core[940e698046960fd5]::result::Result<(), alloc[2ea6bcb46fca0c42]::string::String>, fn() -> core[940e698046960fd5]::result::Result<(), alloc[2ea6bcb46fca0c42]::string::String>><unknown>
  568. 29.14 s gammaloop-nextest-core> at <unknown source file>:<unknown line>
  569. 29.14 s gammaloop-nextest-core> 21: test[75d6903177b1d7e9]::run_test::{closure#0}<unknown>
  570. 29.14 s gammaloop-nextest-core> at <unknown source file>:<unknown line>
  571. 29.14 s gammaloop-nextest-core> 22: std[bcb96dfbba0ab899]::sys::backtrace::__rust_begin_short_backtrace::<test[75d6903177b1d7e9]::run_test::{closure#1}, ()><unknown>
  572. 29.14 s gammaloop-nextest-core> at <unknown source file>:<unknown line>
  573. 29.14 s gammaloop-nextest-core> 23: <std[bcb96dfbba0ab899]::thread::lifecycle::spawn_unchecked<test[75d6903177b1d7e9]::run_test::{closure#1}, ()>::{closure#1} as core[940e698046960fd5]::ops::function::FnOnce<()>>::call_once::{shim:vtable#0}<unknown>
  574. 29.14 s gammaloop-nextest-core> at <unknown source file>:<unknown line>
  575. 29.14 s gammaloop-nextest-core> 24: <std[bcb96dfbba0ab899]::sys::thread::unix::Thread>::new::thread_start<unknown>
  576. 29.14 s gammaloop-nextest-core> at <unknown source file>:<unknown line>
  577. 29.14 s gammaloop-nextest-core> 25: start_thread<unknown>
  578. 29.14 s gammaloop-nextest-core> at <unknown source file>:<unknown line>
  579. 29.14 s gammaloop-nextest-core> 26: __clone3<unknown>
  580. 29.14 s gammaloop-nextest-core> at <unknown source file>:<unknown line>
  581. 29.14 s gammaloop-nextest-core>
  582. 29.14 s gammaloop-nextest-core> Run with COLORBT_SHOW_HIDDEN=1 environment variable to disable frame filtering.
  583. 29.14 s gammaloop-nextest-core> Run with RUST_BACKTRACE=full to include source snippets.
  584. 29.14 s gammaloop-nextest-core>
  585. 29.14 s gammaloop-nextest-core> FAIL [ 0.298s] (446/456) gammalooprs::test_renormalization finite_part_ghost_2loop
  586. 29.14 s gammaloop-nextest-core> stdout ---
  587. 29.14 s gammaloop-nextest-core>
  588. 29.14 s gammaloop-nextest-core> running 1 test
  589. 29.14 s gammaloop-nextest-core> test finite_part_ghost_2loop ... FAILED
  590. 29.14 s gammaloop-nextest-core>
  591. 29.14 s gammaloop-nextest-core> failures:
  592. 29.14 s gammaloop-nextest-core>
  593. 29.14 s gammaloop-nextest-core> failures:
  594. 29.14 s gammaloop-nextest-core> finite_part_ghost_2loop
  595. 29.14 s gammaloop-nextest-core>
  596. 29.14 s gammaloop-nextest-core> test result: FAILED. 0 passed; 1 failed; 0 ignored; 0 measured; 5 filtered out; finished in 0.29s
  597. 29.14 s gammaloop-nextest-core>
  598. 29.14 s gammaloop-nextest-core> stderr ---
  599. 29.14 s gammaloop-nextest-core> The application panicked (crashed).
  600. 29.14 s gammaloop-nextest-core> Message: called `Result::unwrap()` on an `Err` value:
  601. 29.14 s gammaloop-nextest-core> 0: Symbolica could not parse FORM output:
  602. 29.14 s gammaloop-nextest-core> [spenso::{antisymmetric,real,spenso::tensor}::f]([spenso::{spenso::representat\
  603. 29.14 s gammaloop-nextest-core> ion,spenso::self_dual}::coad](8,[gammalooprs::{spenso::index}::hedge](0)
  604. 29.14 s gammaloop-nextest-core> ),[spenso::{spenso::representation,spenso::self_dual}::coad](8,[gammaloo\
  605. 29.14 s gammaloop-nextest-core> prs::{spenso::index}::hedge](3)),[spenso::{spenso::representation,spenso\
  606. 29.14 s gammaloop-nextest-core> ::self_dual}::coad](8,[gammalooprs::{spenso::index}::hedge](5)))*
  607. 29.14 s gammaloop-nextest-core> [spenso::{antisymmetric,real,spenso::tensor}::f]([spenso::{spenso::repre\
  608. 29.14 s gammaloop-nextest-core> sentation,spenso::self_dual}::coad](8,[gammalooprs::{spenso::index}::hed\
  609. 29.14 s gammaloop-nextest-core> ge](1)),[spenso::{spenso::representation,spenso::self_dual}::coad](8,
  610. 29.14 s gammaloop-nextest-core> [gammalooprs::{spenso::index}::hedge](11)),[spenso::{spenso::representat\
  611. 29.14 s gammaloop-nextest-core> ion,spenso::self_dual}::coad](8,[gammalooprs::{spenso::index}::hedge](7)
  612. 29.14 s gammaloop-nextest-core> ))*[spenso::{antisymmetric,real,spenso::tensor}::f]([spenso::{spenso::re\
  613. 29.14 s gammaloop-nextest-core> presentation,spenso::self_dual}::coad](8,[gammalooprs::{spenso::index}::\
  614. 29.14 s gammaloop-nextest-core> hedge](3)),[spenso::{spenso::representation,spenso::self_dual}::coad](8,
  615. 29.14 s gammaloop-nextest-core> [gammalooprs::{spenso::index}::hedge](7)),[spenso::{spenso::representati\
  616. 29.14 s gammaloop-nextest-core> on,spenso::self_dual}::coad](8,[gammalooprs::{spenso::index}::hedge](9))
  617. 29.14 s gammaloop-nextest-core> )*[spenso::{antisymmetric,real,spenso::tensor}::f]([spenso::{spenso::rep\
  618. 29.14 s gammaloop-nextest-core> resentation,spenso::self_dual}::coad](8,[gammalooprs::{spenso::index}::h\
  619. 29.14 s gammaloop-nextest-core> edge](11)),[spenso::{spenso::representation,spenso::self_dual}::coad](8,
  620. 29.14 s gammaloop-nextest-core> [gammalooprs::{spenso::index}::hedge](5)),[spenso::{spenso::representati\
  621. 29.14 s gammaloop-nextest-core> on,spenso::self_dual}::coad](8,[gammalooprs::{spenso::index}::hedge](9))
  622. 29.14 s gammaloop-nextest-core> )*dot(p4,p0)*dot(k1,k1)*dot(k2,k2)*i_*[UFO::{}::GC_10]^4*rat(1,ep - 2)
  623. 29.14 s gammaloop-nextest-core> + [spenso::{antisymmetric,real,spenso::tensor}::f]([spenso::{spenso::re\
  624. 29.14 s gammaloop-nextest-core> presentation,spenso::self_dual}::coad](8,[gammalooprs::{spenso::index}::\
  625. 29.14 s gammaloop-nextest-core> hedge](0)),[spenso::{spenso::representation,spenso::self_dual}::coad](8,
  626. 29.14 s gammaloop-nextest-core> [gammalooprs::{spenso::index}::hedge](3)),[spenso::{spenso::representati\
  627. 29.14 s gammaloop-nextest-core> on,spenso::self_dual}::coad](8,[gammalooprs::{spenso::index}::hedge](5))
  628. 29.14 s gammaloop-nextest-core> )*[spenso::{antisymmetric,real,spenso::tensor}::f]([spenso::{spenso::rep\
  629. 29.14 s gammaloop-nextest-core> resentation,spenso::self_dual}::coad](8,[gammalooprs::{spenso::index}::h\
  630. 29.14 s gammaloop-nextest-core> edge](1)),[spenso::{spenso::representation,spenso::self_dual}::coad](8,
  631. 29.14 s gammaloop-nextest-core> [gammalooprs::{spenso::index}::hedge](11)),[spenso::{spenso::representat\
  632. 29.14 s gammaloop-nextest-core> ion,spenso::self_dual}::coad](8,[gammalooprs::{spenso::index}::hedge](7)
  633. 29.14 s gammaloop-nextest-core> ))*[spenso::{antisymmetric,real,spenso::tensor}::f]([spenso::{spenso::re\
  634. 29.14 s gammaloop-nextest-core> presentation,spenso::self_dual}::coad](8,[gammalooprs::{spenso::index}::\
  635. 29.14 s gammaloop-nextest-core> hedge](3)),[spenso::{spenso::representation,spenso::self_dual}::coad](8,
  636. 29.14 s gammaloop-nextest-core> [gammalooprs::{spenso::index}::hedge](7)),[spenso::{spenso::representati\
  637. 29.14 s gammaloop-nextest-core> on,spenso::self_dual}::coad](8,[gammalooprs::{spenso::index}::hedge](9))
  638. 29.14 s gammaloop-nextest-core> )*[spenso::{antisymmetric,real,spenso::tensor}::f]([spenso::{spenso::rep\
  639. 29.14 s gammaloop-nextest-core> resentation,spenso::self_dual}::coad](8,[gammalooprs::{spenso::index}::h\
  640. 29.14 s gammaloop-nextest-core> edge](11)),[spenso::{spenso::representation,spenso::self_dual}::coad](8,
  641. 29.14 s gammaloop-nextest-core> [gammalooprs::{spenso::index}::hedge](5)),[spenso::{spenso::representati\
  642. 29.14 s gammaloop-nextest-core> on,spenso::self_dual}::coad](8,[gammalooprs::{spenso::index}::hedge](9))
  643. 29.14 s gammaloop-nextest-core> )*dot(p4,p0)*dot(k1,k2)^2*i_*[UFO::{}::GC_10]^4*rat(-1,ep - 2)
  644. 29.14 s gammaloop-nextest-core>
  645. 29.14 s gammaloop-nextest-core> Error:Symbol spenso::coad redefined with new attributes:
  646. 29.14 s gammaloop-nextest-core> - new user data specified: List([String("spenso::representation-v2"), String("self-dual"), List([String("symbol"), String("coad")]), List([String("cyclic"), Integer(1), List([List([String("symbol"), String("a")]), List([String("symbol"), String("b")]), List([String("symbol"), String("c")]), List([String("symbol"), String("d")])])]), String("top")]) vs None
  647. 29.14 s gammaloop-nextest-core>
  648. 29.14 s gammaloop-nextest-core>
  649. 29.14 s gammaloop-nextest-core> Location:
  650. 29.14 s gammaloop-nextest-core> crates/gammalooprs/src/uv/approx/integrated.rs:332
  651. 29.14 s gammaloop-nextest-core>
  652. 29.14 s gammaloop-nextest-core> ━━━━━━━━━━━━━━━━━━━━━━━━━━━━━━━━━━ BACKTRACE ━━━━━━━━━━━━━━━━━━━━━━━━━━━━━━━━━━━
  653. 29.14 s gammaloop-nextest-core> 1: <color_eyre[5722b77bc20a64cf]::config::EyreHook>::into_eyre_hook::{closure#0}<unknown>
  654. 29.14 s gammaloop-nextest-core> at <unknown source file>:<unknown line>
  655. 29.14 s gammaloop-nextest-core> 2: eyre[cb2fd339c0c40fca]::capture_handler<unknown>
  656. 29.14 s gammaloop-nextest-core> at <unknown source file>:<unknown line>
  657. 29.14 s gammaloop-nextest-core> 3: <eyre[cb2fd339c0c40fca]::Report>::from_std::<vakint[ad2b4d4b4d753fb9]::VakintError><unknown>
  658. 29.14 s gammaloop-nextest-core> at <unknown source file>:<unknown line>
  659. 29.14 s gammaloop-nextest-core> 4: <gammalooprs[4688948c89ba1ea7]::uv::approx::integrated::Integrated>::integrate::<gammalooprs[4688948c89ba1ea7]::uv::approx::Approximation><unknown>
  660. 29.14 s gammaloop-nextest-core> at <unknown source file>:<unknown line>
  661. 29.14 s gammaloop-nextest-core> 5: <gammalooprs[4688948c89ba1ea7]::uv::forest::Forest>::compute<unknown>
  662. 29.14 s gammaloop-nextest-core> at <unknown source file>:<unknown line>
  663. 29.14 s gammaloop-nextest-core> 6: gammalooprs[4688948c89ba1ea7]::uv::orchestrator::legacy_renormalization_part<unknown>
  664. 29.14 s gammaloop-nextest-core> at <unknown source file>:<unknown line>
  665. 29.14 s gammaloop-nextest-core> 7: <gammalooprs[4688948c89ba1ea7]::uv::settings::UVOrchestrator>::renormalization_part<unknown>
  666. 29.14 s gammaloop-nextest-core> at <unknown source file>:<unknown line>
  667. 29.14 s gammaloop-nextest-core> 8: <gammalooprs[4688948c89ba1ea7]::processes::amplitude::AmplitudeGraph>::renormalization_part<unknown>
  668. 29.14 s gammaloop-nextest-core> at <unknown source file>:<unknown line>
  669. 29.14 s gammaloop-nextest-core> 9: test_renormalization[c99a4cd1432bec79]::finite_part_ghost_2loop<unknown>
  670. 29.14 s gammaloop-nextest-core> at <unknown source file>:<unknown line>
  671. 29.14 s gammaloop-nextest-core> 10: <test_renormalization[c99a4cd1432bec79]::finite_part_ghost_2loop::{closure#0} as core[940e698046960fd5]::ops::function::FnOnce<()>>::call_once<unknown>
  672. 29.14 s gammaloop-nextest-core> at <unknown source file>:<unknown line>
  673. 29.14 s gammaloop-nextest-core> 11: test[75d6903177b1d7e9]::__rust_begin_short_backtrace::<core[940e698046960fd5]::result::Result<(), alloc[2ea6bcb46fca0c42]::string::String>, fn() -> core[940e698046960fd5]::result::Result<(), alloc[2ea6bcb46fca0c42]::string::String>><unknown>
  674. 29.14 s gammaloop-nextest-core> at <unknown source file>:<unknown line>
  675. 29.14 s gammaloop-nextest-core> 12: test[75d6903177b1d7e9]::run_test::{closure#0}<unknown>
  676. 29.14 s gammaloop-nextest-core> at <unknown source file>:<unknown line>
  677. 29.14 s gammaloop-nextest-core> 13: std[bcb96dfbba0ab899]::sys::backtrace::__rust_begin_short_backtrace::<test[75d6903177b1d7e9]::run_test::{closure#1}, ()><unknown>
  678. 29.14 s gammaloop-nextest-core> at <unknown source file>:<unknown line>
  679. 29.14 s gammaloop-nextest-core> 14: <std[bcb96dfbba0ab899]::thread::lifecycle::spawn_unchecked<test[75d6903177b1d7e9]::run_test::{closure#1}, ()>::{closure#1} as core[940e698046960fd5]::ops::function::FnOnce<()>>::call_once::{shim:vtable#0}<unknown>
  680. 29.14 s gammaloop-nextest-core> at <unknown source file>:<unknown line>
  681. 29.14 s gammaloop-nextest-core> 15: <std[bcb96dfbba0ab899]::sys::thread::unix::Thread>::new::thread_start<unknown>
  682. 29.14 s gammaloop-nextest-core> at <unknown source file>:<unknown line>
  683. 29.14 s gammaloop-nextest-core> 16: start_thread<unknown>
  684. 29.14 s gammaloop-nextest-core> at <unknown source file>:<unknown line>
  685. 29.14 s gammaloop-nextest-core> 17: __clone3<unknown>
  686. 29.14 s gammaloop-nextest-core> at <unknown source file>:<unknown line>
  687. 29.14 s gammaloop-nextest-core>
  688. 29.14 s gammaloop-nextest-core> Run with COLORBT_SHOW_HIDDEN=1 environment variable to disable frame filtering.
  689. 29.14 s gammaloop-nextest-core> Run with RUST_BACKTRACE=full to include source snippets.
  690. 29.14 s gammaloop-nextest-core> Location: crates/gammalooprs/tests/test_renormalization.rs:445
  691. 29.14 s gammaloop-nextest-core>
  692. 29.14 s gammaloop-nextest-core> ━━━━━━━━━━━━━━━━━━━━━━━━━━━━━━━━━━ BACKTRACE ━━━━━━━━━━━━━━━━━━━━━━━━━━━━━━━━━━━
  693. 29.14 s gammaloop-nextest-core> 1: <color_eyre[5722b77bc20a64cf]::config::PanicHook>::panic_report<unknown>
  694. 29.14 s gammaloop-nextest-core> at <unknown source file>:<unknown line>
  695. 29.14 s gammaloop-nextest-core> 2: <color_eyre[5722b77bc20a64cf]::config::PanicHook>::into_panic_hook::{closure#0}<unknown>
  696. 29.14 s gammaloop-nextest-core> at <unknown source file>:<unknown line>
  697. 29.14 s gammaloop-nextest-core> 3: std[bcb96dfbba0ab899]::panicking::panic_with_hook<unknown>
  698. 29.14 s gammaloop-nextest-core> at <unknown source file>:<unknown line>
  699. 29.14 s gammaloop-nextest-core> 4: std[bcb96dfbba0ab899]::panicking::panic_handler::{closure#0}<unknown>
  700. 29.14 s gammaloop-nextest-core> at <unknown source file>:<unknown line>
  701. 29.14 s gammaloop-nextest-core> 5: std[bcb96dfbba0ab899]::sys::backtrace::__rust_end_short_backtrace::<std[bcb96dfbba0ab899]::panicking::panic_handler::{closure#0}, !><unknown>
  702. 29.14 s gammaloop-nextest-core> at <unknown source file>:<unknown line>
  703. 29.14 s gammaloop-nextest-core> 6: __rustc[6c289b9f9c454d21]::rust_begin_unwind<unknown>
  704. 29.14 s gammaloop-nextest-core> at <unknown source file>:<unknown line>
  705. 29.14 s gammaloop-nextest-core> 7: core[940e698046960fd5]::panicking::panic_fmt<unknown>
  706. 29.14 s gammaloop-nextest-core> at <unknown source file>:<unknown line>
  707. 29.14 s gammaloop-nextest-core> 8: core[940e698046960fd5]::result::unwrap_failed<unknown>
  708. 29.14 s gammaloop-nextest-core> at <unknown source file>:<unknown line>
  709. 29.14 s gammaloop-nextest-core> 9: test_renormalization[c99a4cd1432bec79]::finite_part_ghost_2loop<unknown>
  710. 29.14 s gammaloop-nextest-core> at <unknown source file>:<unknown line>
  711. 29.14 s gammaloop-nextest-core> 10: <test_renormalization[c99a4cd1432bec79]::finite_part_ghost_2loop::{closure#0} as core[940e698046960fd5]::ops::function::FnOnce<()>>::call_once<unknown>
  712. 29.14 s gammaloop-nextest-core> at <unknown source file>:<unknown line>
  713. 29.14 s gammaloop-nextest-core> 11: test[75d6903177b1d7e9]::__rust_begin_short_backtrace::<core[940e698046960fd5]::result::Result<(), alloc[2ea6bcb46fca0c42]::string::String>, fn() -> core[940e698046960fd5]::result::Result<(), alloc[2ea6bcb46fca0c42]::string::String>><unknown>
  714. 29.14 s gammaloop-nextest-core> at <unknown source file>:<unknown line>
  715. 29.14 s gammaloop-nextest-core> 12: test[75d6903177b1d7e9]::run_test::{closure#0}<unknown>
  716. 29.14 s gammaloop-nextest-core> at <unknown source file>:<unknown line>
  717. 29.14 s gammaloop-nextest-core> 13: std[bcb96dfbba0ab899]::sys::backtrace::__rust_begin_short_backtrace::<test[75d6903177b1d7e9]::run_test::{closure#1}, ()><unknown>
  718. 29.14 s gammaloop-nextest-core> at <unknown source file>:<unknown line>
  719. 29.14 s gammaloop-nextest-core> 14: <std[bcb96dfbba0ab899]::thread::lifecycle::spawn_unchecked<test[75d6903177b1d7e9]::run_test::{closure#1}, ()>::{closure#1} as core[940e698046960fd5]::ops::function::FnOnce<()>>::call_once::{shim:vtable#0}<unknown>
  720. 29.14 s gammaloop-nextest-core> at <unknown source file>:<unknown line>
  721. 29.14 s gammaloop-nextest-core> 15: <std[bcb96dfbba0ab899]::sys::thread::unix::Thread>::new::thread_start<unknown>
  722. 29.14 s gammaloop-nextest-core> at <unknown source file>:<unknown line>
  723. 29.14 s gammaloop-nextest-core> 16: start_thread<unknown>
  724. 29.14 s gammaloop-nextest-core> at <unknown source file>:<unknown line>
  725. 29.14 s gammaloop-nextest-core> 17: __clone3<unknown>
  726. 29.14 s gammaloop-nextest-core> at <unknown source file>:<unknown line>
  727. 29.14 s gammaloop-nextest-core>
  728. 29.14 s gammaloop-nextest-core> Run with COLORBT_SHOW_HIDDEN=1 environment variable to disable frame filtering.
  729. 29.14 s gammaloop-nextest-core> Run with RUST_BACKTRACE=full to include source snippets.
  730. 29.14 s gammaloop-nextest-core>
  731. 29.22 s gammaloop-nextest-core> error: test run failed
  732. 29.25 s gammaloop-nextest-core>
  733. 29.25 s gammaloop-nextest-core> ========== nextest test summary ==========
  734. 29.25 s gammaloop-nextest-core> report: target/nextest/ci_gammaloop/junit.xml
  735. 29.25 s gammaloop-nextest-core> tests: 456, failures: 3, errors: 0
  736. 29.25 s gammaloop-nextest-core>
  737. 29.25 s gammaloop-nextest-core> 1. gammalooprs::test_renormalization::finit_part_ghlo
  738. 29.25 s gammaloop-nextest-core> failure: test failure with exit code 101
  739. 29.25 s gammaloop-nextest-core> system-out
  740. 29.25 s gammaloop-nextest-core> running 1 test
  741. 29.25 s gammaloop-nextest-core> test finit_part_ghlo ... FAILED
  742. 29.25 s gammaloop-nextest-core>
  743. 29.25 s gammaloop-nextest-core> failures:
  744. 29.25 s gammaloop-nextest-core>
  745. 29.25 s gammaloop-nextest-core> failures:
  746. 29.25 s gammaloop-nextest-core> finit_part_ghlo
  747. 29.25 s gammaloop-nextest-core>
  748. 29.25 s gammaloop-nextest-core> test result: FAILED. 0 passed; 1 failed; 0 ignored; 0 measured; 5 filtered out; finished in 0.10s
  749. 29.25 s gammaloop-nextest-core> system-err
  750. 29.25 s gammaloop-nextest-core> The application panicked (crashed).
  751. 29.25 s gammaloop-nextest-core> Message: called `Result::unwrap()` on an `Err` value:
  752. 29.25 s gammaloop-nextest-core> 0: Symbolica could not parse FORM output:
  753. 29.25 s gammaloop-nextest-core> [spenso::{antisymmetric,real,spenso::tensor}::f]([spenso::{spenso::representat\
  754. 29.25 s gammaloop-nextest-core> ion,spenso::self_dual}::coad](8,[gammalooprs::{spenso::index}::hedge](0)
  755. 29.25 s gammaloop-nextest-core> ),[spenso::{spenso::representation,spenso::self_dual}::coad](8,[gammaloo\
  756. 29.25 s gammaloop-nextest-core> prs::{spenso::index}::hedge](3)),[spenso::{spenso::representation,spenso\
  757. 29.25 s gammaloop-nextest-core> ::self_dual}::coad](8,[gammalooprs::{spenso::index}::hedge](5)))*
  758. 29.25 s gammaloop-nextest-core> [spenso::{antisymmetric,real,spenso::tensor}::f]([spenso::{spenso::repre\
  759. 29.25 s gammaloop-nextest-core> sentation,spenso::self_dual}::coad](8,[gammalooprs::{spenso::index}::hed\
  760. 29.25 s gammaloop-nextest-core> ge](1)),[spenso::{spenso::representation,spenso::self_dual}::coad](8,
  761. 29.25 s gammaloop-nextest-core> [gammalooprs::{spenso::index}::hedge](3)),[spenso::{spenso::representati\
  762. 29.25 s gammaloop-nextest-core> on,spenso::self_dual}::coad](8,[gammalooprs::{spenso::index}::hedge](5))
  763. 29.25 s gammaloop-nextest-core> )*dot(p1,p0)*dot(k1,k1)*[UFO::{}::GC_10]^2*rat(-1,ep - 2)
  764. 29.25 s gammaloop-nextest-core>
  765. 29.25 s gammaloop-nextest-core> Error:Symbol spenso::coad redefined with new attributes:
  766. 29.25 s gammaloop-nextest-core> - new user data specified: List([String("spenso::representation-v2"), String("self-dual"), List([String("symbol"), String("coad")]), List([String("cyclic"), Integer(1), List([List([String("symbol"), String("a")]), List([String("symbol"), String("b")]), List([String("symbol"), String("c")]), List([String("symbol"), String("d")])])]), String("top")]) vs None
  767. 29.25 s gammaloop-nextest-core>
  768. 29.25 s gammaloop-nextest-core>
  769. 29.25 s gammaloop-nextest-core> Location:
  770. 29.25 s gammaloop-nextest-core> crates/gammalooprs/src/uv/approx/integrated.rs:332
  771. 29.25 s gammaloop-nextest-core>
  772. 29.25 s gammaloop-nextest-core> ━━━━━━━━━━━━━━━━━━━━━━━━━━━━━━━━━━ BACKTRACE ━━━━━━━━━━━━━━━━━━━━━━━━━━━━━━━━━━━
  773. 29.25 s gammaloop-nextest-core> 1: <color_eyre[5722b77bc20a64cf]::config::EyreHook>::into_eyre_hook::{closure#0}<unknown>
  774. 29.25 s gammaloop-nextest-core> at <unknown source file>:<unknown line>
  775. 29.25 s gammaloop-nextest-core> 2: eyre[cb2fd339c0c40fca]::capture_handler<unknown>
  776. 29.25 s gammaloop-nextest-core> at <unknown source file>:<unknown line>
  777. 29.25 s gammaloop-nextest-core> 3: <eyre[cb2fd339c0c40fca]::Report>::from_std::<vakint[ad2b4d4b4d753fb9]::VakintError><unknown>
  778. 29.25 s gammaloop-nextest-core> at <unknown source file>:<unknown line>
  779. 29.25 s gammaloop-nextest-core> 4: <gammalooprs[4688948c89ba1ea7]::uv::approx::integrated::Integrated>::integrate::<gammalooprs[4688948c89ba1ea7]::uv::hedge_poset::ForestNode><unknown>
  780. 29.25 s gammaloop-nextest-core> at <unknown source file>:<unknown line>
  781. 29.25 s gammaloop-nextest-core> 5: <gammalooprs[4688948c89ba1ea7]::uv::approx::integrated::Integrated>::run::<gammalooprs[4688948c89ba1ea7]::uv::hedge_poset::ForestNode, gammalooprs[4688948c89ba1ea7]::uv::hedge_poset::ForestNode><unknown>
  782. 29.25 s gammaloop-nextest-core> at <unknown source file>:<unknown line>
  783. 29.25 s gammaloop-nextest-core> 6: <gammalooprs[4688948c89ba1ea7]::uv::hedge_poset::Forests>::integrate<unknown>
  784. 29.25 s gammaloop-nextest-core> at <unknown source file>:<unknown line>
  785. 29.25 s gammaloop-nextest-core> 7: gammalooprs[4688948c89ba1ea7]::uv::orchestrator::hedge_poset_renormalization_part<unknown>
  786. 29.25 s gammaloop-nextest-core> at <unknown source file>:<unknown line>
  787. 29.25 s gammaloop-nextest-core> 8: <gammalooprs[4688948c89ba1ea7]::uv::settings::UVOrchestrator>::renormalization_part<unknown>
  788. 29.25 s gammaloop-nextest-core> at <unknown source file>:<unknown line>
  789. 29.25 s gammaloop-nextest-core> 9: <gammalooprs[4688948c89ba1ea7]::processes::amplitude::AmplitudeGraph>::renormalization_part<unknown>
  790. 29.25 s gammaloop-nextest-core> at <unknown source file>:<unknown line>
  791. 29.25 s gammaloop-nextest-core> 10: <test_renormalization[c99a4cd1432bec79]::finit_part_ghlo::{closure#0} as core[940e698046960fd5]::ops::function::FnOnce<()>>::call_once<unknown>
  792. 29.25 s gammaloop-nextest-core> at <unknown source file>:<unknown line>
  793. 29.25 s gammaloop-nextest-core> 11: test[75d6903177b1d7e9]::__rust_begin_short_backtrace::<core[940e698046960fd5]::result::Result<(), alloc[2ea6bcb46fca0c42]::string::String>, fn() -> core[940e698046960fd5]::result::Result<(), alloc[2ea6bcb46fca0c42]::string::String>><unknown>
  794. 29.25 s gammaloop-nextest-core> at <unknown source file>:<unknown line>
  795. 29.25 s gammaloop-nextest-core> 12: test[75d6903177b1d7e9]::run_test::{closure#0}<unknown>
  796. 29.25 s gammaloop-nextest-core> at <unknown source file>:<unknown line>
  797. 29.25 s gammaloop-nextest-core> 13: std[bcb96dfbba0ab899]::sys::backtrace::__rust_begin_short_backtrace::<test[75d6903177b1d7e9]::run_test::{closure#1}, ()><unknown>
  798. 29.25 s gammaloop-nextest-core> at <unknown source file>:<unknown line>
  799. 29.25 s gammaloop-nextest-core> 14: <std[bcb96dfbba0ab899]::thread::lifecycle::spawn_unchecked<test[75d6903177b1d7e9]::run_test::{closure#1}, ()>::{closure#1} as core[940e698046960fd5]::ops::function::FnOnce<()>>::call_once::{shim:vtable#0}<unknown>
  800. 29.25 s gammaloop-nextest-core> at <unknown source file>:<unknown line>
  801. 29.25 s gammaloop-nextest-core> 15: <std[bcb96dfbba0ab899]::sys::thread::unix::Thread>::new::thread_start<unknown>
  802. 29.25 s gammaloop-nextest-core> at <unknown source file>:<unknown line>
  803. 29.25 s gammaloop-nextest-core> 16: start_thread<unknown>
  804. 29.25 s gammaloop-nextest-core> at <unknown source file>:<unknown line>
  805. 29.25 s gammaloop-nextest-core> 17: __clone3<unknown>
  806. 29.25 s gammaloop-nextest-core> at <unknown source file>:<unknown line>
  807. 29.25 s gammaloop-nextest-core>
  808. 29.25 s gammaloop-nextest-core> Run with COLORBT_SHOW_HIDDEN=1 environment variable to disable frame filtering.
  809. 29.25 s gammaloop-nextest-core> Run with RUST_BACKTRACE=full to include source snippets.
  810. 29.25 s gammaloop-nextest-core> Location: crates/gammalooprs/tests/test_renormalization.rs:550
  811. 29.25 s gammaloop-nextest-core>
  812. 29.25 s gammaloop-nextest-core> ━━━━━━━━━━━━━━━━━━━━━━━━━━━━━━━━━━ BACKTRACE ━━━━━━━━━━━━━━━━━━━━━━━━━━━━━━━━━━━
  813. 29.25 s gammaloop-nextest-core> 1: <color_eyre[5722b77bc20a64cf]::config::PanicHook>::panic_report<unknown>
  814. 29.25 s gammaloop-nextest-core> at <unknown source file>:<unknown line>
  815. 29.25 s gammaloop-nextest-core> 2: <color_eyre[5722b77bc20a64cf]::config::PanicHook>::into_panic_hook::{closure#0}<unknown>
  816. 29.25 s gammaloop-nextest-core> at <unknown source file>:<unknown line>
  817. 29.25 s gammaloop-nextest-core> 3: std[bcb96dfbba0ab899]::panicking::panic_with_hook<unknown>
  818. 29.25 s gammaloop-nextest-core> at <unknown source file>:<unknown line>
  819. 29.25 s gammaloop-nextest-core> 4: std[bcb96dfbba0ab899]::panicking::panic_handler::{closure#0}<unknown>
  820. 29.25 s gammaloop-nextest-core> at <unknown source file>:<unknown line>
  821. 29.25 s gammaloop-nextest-core> 5: std[bcb96dfbba0ab899]::sys::backtrace::__rust_end_short_backtrace::<std[bcb96dfbba0ab899]::panicking::panic_handler::{closure#0}, !><unknown>
  822. 29.25 s gammaloop-nextest-core> at <unknown source file>:<unknown line>
  823. 29.25 s gammaloop-nextest-core> 6: __rustc[6c289b9f9c454d21]::rust_begin_unwind<unknown>
  824. 29.25 s gammaloop-nextest-core> at <unknown source file>:<unknown line>
  825. 29.25 s gammaloop-nextest-core> 7: core[940e698046960fd5]::panicking::panic_fmt<unknown>
  826. 29.25 s gammaloop-nextest-core> at <unknown source file>:<unknown line>
  827. 29.25 s gammaloop-nextest-core> 8: core[940e698046960fd5]::result::unwrap_failed<unknown>
  828. 29.25 s gammaloop-nextest-core> at <unknown source file>:<unknown line>
  829. 29.25 s gammaloop-nextest-core> 9: <test_renormalization[c99a4cd1432bec79]::finit_part_ghlo::{closure#0} as core[940e698046960fd5]::ops::function::FnOnce<()>>::call_once<unknown>
  830. 29.25 s gammaloop-nextest-core> at <unknown source file>:<unknown line>
  831. 29.25 s gammaloop-nextest-core> 10: test[75d6903177b1d7e9]::__rust_begin_short_backtrace::<core[940e698046960fd5]::result::Result<(), alloc[2ea6bcb46fca0c42]::string::String>, fn() -> core[940e698046960fd5]::result::Result<(), alloc[2ea6bcb46fca0c42]::string::String>><unknown>
  832. 29.25 s gammaloop-nextest-core> at <unknown source file>:<unknown line>
  833. 29.25 s gammaloop-nextest-core> 11: test[75d6903177b1d7e9]::run_test::{closure#0}<unknown>
  834. 29.25 s gammaloop-nextest-core> at <unknown source file>:<unknown line>
  835. 29.25 s gammaloop-nextest-core> 12: std[bcb96dfbba0ab899]::sys::backtrace::__rust_begin_short_backtrace::<test[75d6903177b1d7e9]::run_test::{closure#1}, ()><unknown>
  836. 29.25 s gammaloop-nextest-core> at <unknown source file>:<unknown line>
  837. 29.25 s gammaloop-nextest-core> 13: <std[bcb96dfbba0ab899]::thread::lifecycle::spawn_unchecked<test[75d6903177b1d7e9]::run_test::{closure#1}, ()>::{closure#1} as core[940e698046960fd5]::ops::function::FnOnce<()>>::call_once::{shim:vtable#0}<unknown>
  838. 29.25 s gammaloop-nextest-core> at <unknown source file>:<unknown line>
  839. 29.25 s gammaloop-nextest-core> 14: <std[bcb96dfbba0ab899]::sys::thread::unix::Thread>::new::thread_start<unknown>
  840. 29.25 s gammaloop-nextest-core> at <unknown source file>:<unknown line>
  841. 29.25 s gammaloop-nextest-core> 15: start_thread<unknown>
  842. 29.25 s gammaloop-nextest-core> at <unknown source file>:<unknown line>
  843. 29.25 s gammaloop-nextest-core> 16: __clone3<unknown>
  844. 29.25 s gammaloop-nextest-core> at <unknown source file>:<unknown line>
  845. 29.25 s gammaloop-nextest-core>
  846. 29.25 s gammaloop-nextest-core> Run with COLORBT_SHOW_HIDDEN=1 environment variable to disable frame filtering.
  847. 29.25 s gammaloop-nextest-core> Run with RUST_BACKTRACE=full to include source snippets.
  848. 29.25 s gammaloop-nextest-core>
  849. 29.25 s gammaloop-nextest-core> 2. gammalooprs::test_renormalization::finite_part_quark_lo
  850. 29.25 s gammaloop-nextest-core> failure: test failure with exit code 101
  851. 29.25 s gammaloop-nextest-core> system-out
  852. 29.25 s gammaloop-nextest-core> running 1 test
  853. 29.25 s gammaloop-nextest-core> test finite_part_quark_lo ... FAILED
  854. 29.25 s gammaloop-nextest-core>
  855. 29.25 s gammaloop-nextest-core> failures:
  856. 29.25 s gammaloop-nextest-core>
  857. 29.25 s gammaloop-nextest-core> failures:
  858. 29.25 s gammaloop-nextest-core> finite_part_quark_lo
  859. 29.25 s gammaloop-nextest-core>
  860. 29.25 s gammaloop-nextest-core> test result: FAILED. 0 passed; 1 failed; 0 ignored; 0 measured; 5 filtered out; finished in 0.18s
  861. 29.25 s gammaloop-nextest-core> system-err
  862. 29.25 s gammaloop-nextest-core> The application panicked (crashed).
  863. 29.25 s gammaloop-nextest-core> Message: called `Result::unwrap()` on an `Err` value: "Symbol spenso::mink redefined with new attributes:\n\t- new user data specified: List([String(\"spenso::representation-v2\"), String(\"inline-metric\"), List([String(\"symbol\"), String(\"mink\")]), List([String(\"cyclic\"), Integer(1), List([List([String(\"symbol\"), String(\"mu\")]), List([String(\"symbol\"), String(\"nu\")]), List([String(\"symbol\"), String(\"rho\")]), List([String(\"symbol\"), String(\"sigma\")])])]), String(\"top\")]) vs None\n"
  864. 29.25 s gammaloop-nextest-core> Location: crates/vakint/src/lib.rs:4766
  865. 29.25 s gammaloop-nextest-core>
  866. 29.25 s gammaloop-nextest-core> ━━━━━━━━━━━━━━━━━━━━━━━━━━━━━━━━━━ BACKTRACE ━━━━━━━━━━━━━━━━━━━━━━━━━━━━━━━━━━━
  867. 29.25 s gammaloop-nextest-core> 1: <color_eyre[5722b77bc20a64cf]::config::PanicHook>::panic_report<unknown>
  868. 29.25 s gammaloop-nextest-core> at <unknown source file>:<unknown line>
  869. 29.25 s gammaloop-nextest-core> 2: <color_eyre[5722b77bc20a64cf]::config::PanicHook>::into_panic_hook::{closure#0}<unknown>
  870. 29.25 s gammaloop-nextest-core> at <unknown source file>:<unknown line>
  871. 29.25 s gammaloop-nextest-core> 3: std[bcb96dfbba0ab899]::panicking::panic_with_hook<unknown>
  872. 29.25 s gammaloop-nextest-core> at <unknown source file>:<unknown line>
  873. 29.25 s gammaloop-nextest-core> 4: std[bcb96dfbba0ab899]::panicking::panic_handler::{closure#0}<unknown>
  874. 29.25 s gammaloop-nextest-core> at <unknown source file>:<unknown line>
  875. 29.25 s gammaloop-nextest-core> 5: std[bcb96dfbba0ab899]::sys::backtrace::__rust_end_short_backtrace::<std[bcb96dfbba0ab899]::panicking::panic_handler::{closure#0}, !><unknown>
  876. 29.25 s gammaloop-nextest-core> at <unknown source file>:<unknown line>
  877. 29.25 s gammaloop-nextest-core> 6: __rustc[6c289b9f9c454d21]::rust_begin_unwind<unknown>
  878. 29.25 s gammaloop-nextest-core> at <unknown source file>:<unknown line>
  879. 29.25 s gammaloop-nextest-core> 7: core[940e698046960fd5]::panicking::panic_fmt<unknown>
  880. 29.25 s gammaloop-nextest-core> at <unknown source file>:<unknown line>
  881. 29.25 s gammaloop-nextest-core> 8: core[940e698046960fd5]::result::unwrap_failed<unknown>
  882. 29.25 s gammaloop-nextest-core> at <unknown source file>:<unknown line>
  883. 29.25 s gammaloop-nextest-core> 9: <vakint[ad2b4d4b4d753fb9]::Vakint>::sanitize_user_expressions<unknown>
  884. 29.25 s gammaloop-nextest-core> at <unknown source file>:<unknown line>
  885. 29.25 s gammaloop-nextest-core> 10: <vakint[ad2b4d4b4d753fb9]::Vakint>::prepare_expression_for_form<unknown>
  886. 29.25 s gammaloop-nextest-core> at <unknown source file>:<unknown line>
  887. 29.25 s gammaloop-nextest-core> 11: <vakint[ad2b4d4b4d753fb9]::VakintTerm>::tensor_reduce<unknown>
  888. 29.25 s gammaloop-nextest-core> at <unknown source file>:<unknown line>
  889. 29.25 s gammaloop-nextest-core> 12: <vakint[ad2b4d4b4d753fb9]::VakintExpression>::tensor_reduce<unknown>
  890. 29.25 s gammaloop-nextest-core> at <unknown source file>:<unknown line>
  891. 29.25 s gammaloop-nextest-core> 13: <gammalooprs[4688948c89ba1ea7]::uv::approx::integrated::Integrated>::integrate::<gammalooprs[4688948c89ba1ea7]::uv::hedge_poset::ForestNode><unknown>
  892. 29.25 s gammaloop-nextest-core> at <unknown source file>:<unknown line>
  893. 29.25 s gammaloop-nextest-core> 14: <gammalooprs[4688948c89ba1ea7]::uv::approx::integrated::Integrated>::run::<gammalooprs[4688948c89ba1ea7]::uv::hedge_poset::ForestNode, gammalooprs[4688948c89ba1ea7]::uv::hedge_poset::ForestNode><unknown>
  894. 29.25 s gammaloop-nextest-core> at <unknown source file>:<unknown line>
  895. 29.25 s gammaloop-nextest-core> 15: <gammalooprs[4688948c89ba1ea7]::uv::hedge_poset::Forests>::integrate<unknown>
  896. 29.25 s gammaloop-nextest-core> at <unknown source file>:<unknown line>
  897. 29.25 s gammaloop-nextest-core> 16: gammalooprs[4688948c89ba1ea7]::uv::orchestrator::hedge_poset_renormalization_part<unknown>
  898. 29.25 s gammaloop-nextest-core> at <unknown source file>:<unknown line>
  899. 29.25 s gammaloop-nextest-core> 17: <gammalooprs[4688948c89ba1ea7]::uv::settings::UVOrchestrator>::renormalization_part<unknown>
  900. 29.25 s gammaloop-nextest-core> at <unknown source file>:<unknown line>
  901. 29.25 s gammaloop-nextest-core> 18: <gammalooprs[4688948c89ba1ea7]::processes::amplitude::AmplitudeGraph>::renormalization_part<unknown>
  902. 29.25 s gammaloop-nextest-core> at <unknown source file>:<unknown line>
  903. 29.25 s gammaloop-nextest-core> 19: <test_renormalization[c99a4cd1432bec79]::finite_part_quark_lo::{closure#0} as core[940e698046960fd5]::ops::function::FnOnce<()>>::call_once<unknown>
  904. 29.25 s gammaloop-nextest-core> at <unknown source file>:<unknown line>
  905. 29.25 s gammaloop-nextest-core> 20: test[75d6903177b1d7e9]::__rust_begin_short_backtrace::<core[940e698046960fd5]::result::Result<(), alloc[2ea6bcb46fca0c42]::string::String>, fn() -> core[940e698046960fd5]::result::Result<(), alloc[2ea6bcb46fca0c42]::string::String>><unknown>
  906. 29.25 s gammaloop-nextest-core> at <unknown source file>:<unknown line>
  907. 29.25 s gammaloop-nextest-core> 21: test[75d6903177b1d7e9]::run_test::{closure#0}<unknown>
  908. 29.25 s gammaloop-nextest-core> at <unknown source file>:<unknown line>
  909. 29.25 s gammaloop-nextest-core> 22: std[bcb96dfbba0ab899]::sys::backtrace::__rust_begin_short_backtrace::<test[75d6903177b1d7e9]::run_test::{closure#1}, ()><unknown>
  910. 29.25 s gammaloop-nextest-core> at <unknown source file>:<unknown line>
  911. 29.25 s gammaloop-nextest-core> 23: <std[bcb96dfbba0ab899]::thread::lifecycle::spawn_unchecked<test[75d6903177b1d7e9]::run_test::{closure#1}, ()>::{closure#1} as core[940e698046960fd5]::ops::function::FnOnce<()>>::call_once::{shim:vtable#0}<unknown>
  912. 29.25 s gammaloop-nextest-core> at <unknown source file>:<unknown line>
  913. 29.25 s gammaloop-nextest-core> 24: <std[bcb96dfbba0ab899]::sys::thread::unix::Thread>::new::thread_start<unknown>
  914. 29.25 s gammaloop-nextest-core> at <unknown source file>:<unknown line>
  915. 29.25 s gammaloop-nextest-core> 25: start_thread<unknown>
  916. 29.25 s gammaloop-nextest-core> at <unknown source file>:<unknown line>
  917. 29.25 s gammaloop-nextest-core> 26: __clone3<unknown>
  918. 29.25 s gammaloop-nextest-core> at <unknown source file>:<unknown line>
  919. 29.25 s gammaloop-nextest-core>
  920. 29.25 s gammaloop-nextest-core> Run with COLORBT_SHOW_HIDDEN=1 environment variable to disable frame filtering.
  921. 29.25 s gammaloop-nextest-core> Run with RUST_BACKTRACE=full to include source snippets.
  922. 29.25 s gammaloop-nextest-core>
  923. 29.25 s gammaloop-nextest-core> 3. gammalooprs::test_renormalization::finite_part_ghost_2loop
  924. 29.25 s gammaloop-nextest-core> failure: test failure with exit code 101
  925. 29.25 s gammaloop-nextest-core> system-out
  926. 29.25 s gammaloop-nextest-core> running 1 test
  927. 29.25 s gammaloop-nextest-core> test finite_part_ghost_2loop ... FAILED
  928. 29.25 s gammaloop-nextest-core>
  929. 29.25 s gammaloop-nextest-core> failures:
  930. 29.25 s gammaloop-nextest-core>
  931. 29.25 s gammaloop-nextest-core> failures:
  932. 29.25 s gammaloop-nextest-core> finite_part_ghost_2loop
  933. 29.25 s gammaloop-nextest-core>
  934. 29.25 s gammaloop-nextest-core> test result: FAILED. 0 passed; 1 failed; 0 ignored; 0 measured; 5 filtered out; finished in 0.29s
  935. 29.25 s gammaloop-nextest-core> system-err
  936. 29.25 s gammaloop-nextest-core> The application panicked (crashed).
  937. 29.25 s gammaloop-nextest-core> Message: called `Result::unwrap()` on an `Err` value:
  938. 29.25 s gammaloop-nextest-core> 0: Symbolica could not parse FORM output:
  939. 29.25 s gammaloop-nextest-core> [spenso::{antisymmetric,real,spenso::tensor}::f]([spenso::{spenso::representat\
  940. 29.25 s gammaloop-nextest-core> ion,spenso::self_dual}::coad](8,[gammalooprs::{spenso::index}::hedge](0)
  941. 29.25 s gammaloop-nextest-core> ),[spenso::{spenso::representation,spenso::self_dual}::coad](8,[gammaloo\
  942. 29.25 s gammaloop-nextest-core> prs::{spenso::index}::hedge](3)),[spenso::{spenso::representation,spenso\
  943. 29.25 s gammaloop-nextest-core> ::self_dual}::coad](8,[gammalooprs::{spenso::index}::hedge](5)))*
  944. 29.25 s gammaloop-nextest-core> [spenso::{antisymmetric,real,spenso::tensor}::f]([spenso::{spenso::repre\
  945. 29.25 s gammaloop-nextest-core> sentation,spenso::self_dual}::coad](8,[gammalooprs::{spenso::index}::hed\
  946. 29.25 s gammaloop-nextest-core> ge](1)),[spenso::{spenso::representation,spenso::self_dual}::coad](8,
  947. 29.25 s gammaloop-nextest-core> [gammalooprs::{spenso::index}::hedge](11)),[spenso::{spenso::representat\
  948. 29.25 s gammaloop-nextest-core> ion,spenso::self_dual}::coad](8,[gammalooprs::{spenso::index}::hedge](7)
  949. 29.25 s gammaloop-nextest-core> ))*[spenso::{antisymmetric,real,spenso::tensor}::f]([spenso::{spenso::re\
  950. 29.25 s gammaloop-nextest-core> presentation,spenso::self_dual}::coad](8,[gammalooprs::{spenso::index}::\
  951. 29.25 s gammaloop-nextest-core> hedge](3)),[spenso::{spenso::representation,spenso::self_dual}::coad](8,
  952. 29.25 s gammaloop-nextest-core> [gammalooprs::{spenso::index}::hedge](7)),[spenso::{spenso::representati\
  953. 29.25 s gammaloop-nextest-core> on,spenso::self_dual}::coad](8,[gammalooprs::{spenso::index}::hedge](9))
  954. 29.25 s gammaloop-nextest-core> )*[spenso::{antisymmetric,real,spenso::tensor}::f]([spenso::{spenso::rep\
  955. 29.25 s gammaloop-nextest-core> resentation,spenso::self_dual}::coad](8,[gammalooprs::{spenso::index}::h\
  956. 29.25 s gammaloop-nextest-core> edge](11)),[spenso::{spenso::representation,spenso::self_dual}::coad](8,
  957. 29.25 s gammaloop-nextest-core> [gammalooprs::{spenso::index}::hedge](5)),[spenso::{spenso::representati\
  958. 29.25 s gammaloop-nextest-core> on,spenso::self_dual}::coad](8,[gammalooprs::{spenso::index}::hedge](9))
  959. 29.25 s gammaloop-nextest-core> )*dot(p4,p0)*dot(k1,k1)*dot(k2,k2)*i_*[UFO::{}::GC_10]^4*rat(1,ep - 2)
  960. 29.25 s gammaloop-nextest-core> + [spenso::{antisymmetric,real,spenso::tensor}::f]([spenso::{spenso::re\
  961. 29.25 s gammaloop-nextest-core> presentation,spenso::self_dual}::coad](8,[gammalooprs::{spenso::index}::\
  962. 29.25 s gammaloop-nextest-core> hedge](0)),[spenso::{spenso::representation,spenso::self_dual}::coad](8,
  963. 29.25 s gammaloop-nextest-core> [gammalooprs::{spenso::index}::hedge](3)),[spenso::{spenso::representati\
  964. 29.25 s gammaloop-nextest-core> on,spenso::self_dual}::coad](8,[gammalooprs::{spenso::index}::hedge](5))
  965. 29.25 s gammaloop-nextest-core> )*[spenso::{antisymmetric,real,spenso::tensor}::f]([spenso::{spenso::rep\
  966. 29.25 s gammaloop-nextest-core> resentation,spenso::self_dual}::coad](8,[gammalooprs::{spenso::index}::h\
  967. 29.25 s gammaloop-nextest-core> edge](1)),[spenso::{spenso::representation,spenso::self_dual}::coad](8,
  968. 29.25 s gammaloop-nextest-core> [gammalooprs::{spenso::index}::hedge](11)),[spenso::{spenso::representat\
  969. 29.25 s gammaloop-nextest-core> ion,spenso::self_dual}::coad](8,[gammalooprs::{spenso::index}::hedge](7)
  970. 29.25 s gammaloop-nextest-core> ))*[spenso::{antisymmetric,real,spenso::tensor}::f]([spenso::{spenso::re\
  971. 29.25 s gammaloop-nextest-core> presentation,spenso::self_dual}::coad](8,[gammalooprs::{spenso::index}::\
  972. 29.25 s gammaloop-nextest-core> hedge](3)),[spenso::{spenso::representation,spenso::self_dual}::coad](8,
  973. 29.25 s gammaloop-nextest-core> [gammalooprs::{spenso::index}::hedge](7)),[spenso::{spenso::representati\
  974. 29.25 s gammaloop-nextest-core> on,spenso::self_dual}::coad](8,[gammalooprs::{spenso::index}::hedge](9))
  975. 29.25 s gammaloop-nextest-core> )*[spenso::{antisymmetric,real,spenso::tensor}::f]([spenso::{spenso::rep\
  976. 29.25 s gammaloop-nextest-core> resentation,spenso::self_dual}::coad](8,[gammalooprs::{spenso::index}::h\
  977. 29.25 s gammaloop-nextest-core> edge](11)),[spenso::{spenso::representation,spenso::self_dual}::coad](8,
  978. 29.25 s gammaloop-nextest-core> [gammalooprs::{spenso::index}::hedge](5)),[spenso::{spenso::representati\
  979. 29.25 s gammaloop-nextest-core> on,spenso::self_dual}::coad](8,[gammalooprs::{spenso::index}::hedge](9))
  980. 29.25 s gammaloop-nextest-core> )*dot(p4,p0)*dot(k1,k2)^2*i_*[UFO::{}::GC_10]^4*rat(-1,ep - 2)
  981. 29.25 s gammaloop-nextest-core>
  982. 29.25 s gammaloop-nextest-core> Error:Symbol spenso::coad redefined with new attributes:
  983. 29.25 s gammaloop-nextest-core> - new user data specified: List([String("spenso::representation-v2"), String("self-dual"), List([String("symbol"), String("coad")]), List([String("cyclic"), Integer(1), List([List([String("symbol"), String("a")]), List([String("symbol"), String("b")]), List([String("symbol"), String("c")]), List([String("symbol"), String("d")])])]), String("top")]) vs None
  984. 29.25 s gammaloop-nextest-core>
  985. 29.25 s gammaloop-nextest-core>
  986. 29.25 s gammaloop-nextest-core> Location:
  987. 29.25 s gammaloop-nextest-core> crates/gammalooprs/src/uv/approx/integrated.rs:332
  988. 29.25 s gammaloop-nextest-core>
  989. 29.25 s gammaloop-nextest-core> ━━━━━━━━━━━━━━━━━━━━━━━━━━━━━━━━━━ BACKTRACE ━━━━━━━━━━━━━━━━━━━━━━━━━━━━━━━━━━━
  990. 29.25 s gammaloop-nextest-core> 1: <color_eyre[5722b77bc20a64cf]::config::EyreHook>::into_eyre_hook::{closure#0}<unknown>
  991. 29.25 s gammaloop-nextest-core> at <unknown source file>:<unknown line>
  992. 29.25 s gammaloop-nextest-core> 2: eyre[cb2fd339c0c40fca]::capture_handler<unknown>
  993. 29.25 s gammaloop-nextest-core> at <unknown source file>:<unknown line>
  994. 29.25 s gammaloop-nextest-core> 3: <eyre[cb2fd339c0c40fca]::Report>::from_std::<vakint[ad2b4d4b4d753fb9]::VakintError><unknown>
  995. 29.25 s gammaloop-nextest-core> at <unknown source file>:<unknown line>
  996. 29.25 s gammaloop-nextest-core> 4: <gammalooprs[4688948c89ba1ea7]::uv::approx::integrated::Integrated>::integrate::<gammalooprs[4688948c89ba1ea7]::uv::approx::Approximation><unknown>
  997. 29.25 s gammaloop-nextest-core> at <unknown source file>:<unknown line>
  998. 29.25 s gammaloop-nextest-core> 5: <gammalooprs[4688948c89ba1ea7]::uv::forest::Forest>::compute<unknown>
  999. 29.25 s gammaloop-nextest-core> at <unknown source file>:<unknown line>
  1000. 29.25 s gammaloop-nextest-core> 6: gammalooprs[4688948c89ba1ea7]::uv::orchestrator::legacy_renormalization_part<unknown>
  1001. 29.25 s gammaloop-nextest-core> at <unknown source file>:<unknown line>
  1002. 29.25 s gammaloop-nextest-core> 7: <gammalooprs[4688948c89ba1ea7]::uv::settings::UVOrchestrator>::renormalization_part<unknown>
  1003. 29.25 s gammaloop-nextest-core> at <unknown source file>:<unknown line>
  1004. 29.25 s gammaloop-nextest-core> 8: <gammalooprs[4688948c89ba1ea7]::processes::amplitude::AmplitudeGraph>::renormalization_part<unknown>
  1005. 29.25 s gammaloop-nextest-core> at <unknown source file>:<unknown line>
  1006. 29.25 s gammaloop-nextest-core> 9: test_renormalization[c99a4cd1432bec79]::finite_part_ghost_2loop<unknown>
  1007. 29.25 s gammaloop-nextest-core> at <unknown source file>:<unknown line>
  1008. 29.25 s gammaloop-nextest-core> 10: <test_renormalization[c99a4cd1432bec79]::finite_part_ghost_2loop::{closure#0} as core[940e698046960fd5]::ops::function::FnOnce<()>>::call_once<unknown>
  1009. 29.25 s gammaloop-nextest-core> at <unknown source file>:<unknown line>
  1010. 29.25 s gammaloop-nextest-core> 11: test[75d6903177b1d7e9]::__rust_begin_short_backtrace::<core[940e698046960fd5]::result::Result<(), alloc[2ea6bcb46fca0c42]::string::String>, fn() -> core[940e698046960fd5]::result::Result<(), alloc[2ea6bcb46fca0c42]::string::String>><unknown>
  1011. 29.25 s gammaloop-nextest-core> at <unknown source file>:<unknown line>
  1012. 29.25 s gammaloop-nextest-core> 12: test[75d6903177b1d7e9]::run_test::{closure#0}<unknown>
  1013. 29.25 s gammaloop-nextest-core> at <unknown source file>:<unknown line>
  1014. 29.25 s gammaloop-nextest-core> 13: std[bcb96dfbba0ab899]::sys::backtrace::__rust_begin_short_backtrace::<test[75d6903177b1d7e9]::run_test::{closure#1}, ()><unknown>
  1015. 29.25 s gammaloop-nextest-core> at <unknown source file>:<unknown line>
  1016. 29.25 s gammaloop-nextest-core> 14: <std[bcb96dfbba0ab899]::thread::lifecycle::spawn_unchecked<test[75d6903177b1d7e9]::run_test::{closure#1}, ()>::{closure#1} as core[940e698046960fd5]::ops::function::FnOnce<()>>::call_once::{shim:vtable#0}<unknown>
  1017. 29.25 s gammaloop-nextest-core> at <unknown source file>:<unknown line>
  1018. 29.25 s gammaloop-nextest-core> 15: <std[bcb96dfbba0ab899]::sys::thread::unix::Thread>::new::thread_start<unknown>
  1019. 29.25 s gammaloop-nextest-core> at <unknown source file>:<unknown line>
  1020. 29.25 s gammaloop-nextest-core> 16: start_thread<unknown>
  1021. 29.25 s gammaloop-nextest-core> at <unknown source file>:<unknown line>
  1022. 29.25 s gammaloop-nextest-core> 17: __clone3<unknown>
  1023. 29.25 s gammaloop-nextest-core> at <unknown source file>:<unknown line>
  1024. 29.25 s gammaloop-nextest-core>
  1025. 29.25 s gammaloop-nextest-core> Run with COLORBT_SHOW_HIDDEN=1 environment variable to disable frame filtering.
  1026. 29.25 s gammaloop-nextest-core> Run with RUST_BACKTRACE=full to include source snippets.
  1027. 29.25 s gammaloop-nextest-core> Location: crates/gammalooprs/tests/test_renormalization.rs:445
  1028. 29.25 s gammaloop-nextest-core>
  1029. 29.25 s gammaloop-nextest-core> ━━━━━━━━━━━━━━━━━━━━━━━━━━━━━━━━━━ BACKTRACE ━━━━━━━━━━━━━━━━━━━━━━━━━━━━━━━━━━━
  1030. 29.25 s gammaloop-nextest-core> 1: <color_eyre[5722b77bc20a64cf]::config::PanicHook>::panic_report<unknown>
  1031. 29.25 s gammaloop-nextest-core> at <unknown source file>:<unknown line>
  1032. 29.25 s gammaloop-nextest-core> 2: <color_eyre[5722b77bc20a64cf]::config::PanicHook>::into_panic_hook::{closure#0}<unknown>
  1033. 29.25 s gammaloop-nextest-core> at <unknown source file>:<unknown line>
  1034. 29.25 s gammaloop-nextest-core> 3: std[bcb96dfbba0ab899]::panicking::panic_with_hook<unknown>
  1035. 29.25 s gammaloop-nextest-core> at <unknown source file>:<unknown line>
  1036. 29.25 s gammaloop-nextest-core> 4: std[bcb96dfbba0ab899]::panicking::panic_handler::{closure#0}<unknown>
  1037. 29.25 s gammaloop-nextest-core> at <unknown source file>:<unknown line>
  1038. 29.25 s gammaloop-nextest-core> 5: std[bcb96dfbba0ab899]::sys::backtrace::__rust_end_short_backtrace::<std[bcb96dfbba0ab899]::panicking::panic_handler::{closure#0}, !><unknown>
  1039. 29.25 s gammaloop-nextest-core> at <unknown source file>:<unknown line>
  1040. 29.25 s gammaloop-nextest-core> 6: __rustc[6c289b9f9c454d21]::rust_begin_unwind<unknown>
  1041. 29.25 s gammaloop-nextest-core> at <unknown source file>:<unknown line>
  1042. 29.25 s gammaloop-nextest-core> 7: core[940e698046960fd5]::panicking::panic_fmt<unknown>
  1043. 29.25 s gammaloop-nextest-core> at <unknown source file>:<unknown line>
  1044. 29.25 s gammaloop-nextest-core> 8: core[940e698046960fd5]::result::unwrap_failed<unknown>
  1045. 29.25 s gammaloop-nextest-core> at <unknown source file>:<unknown line>
  1046. 29.25 s gammaloop-nextest-core> 9: test_renormalization[c99a4cd1432bec79]::finite_part_ghost_2loop<unknown>
  1047. 29.25 s gammaloop-nextest-core> at <unknown source file>:<unknown line>
  1048. 29.25 s gammaloop-nextest-core> 10: <test_renormalization[c99a4cd1432bec79]::finite_part_ghost_2loop::{closure#0} as core[940e698046960fd5]::ops::function::FnOnce<()>>::call_once<unknown>
  1049. 29.25 s gammaloop-nextest-core> at <unknown source file>:<unknown line>
  1050. 29.25 s gammaloop-nextest-core> 11: test[75d6903177b1d7e9]::__rust_begin_short_backtrace::<core[940e698046960fd5]::result::Result<(), alloc[2ea6bcb46fca0c42]::string::String>, fn() -> core[940e698046960fd5]::result::Result<(), alloc[2ea6bcb46fca0c42]::string::String>><unknown>
  1051. 29.25 s gammaloop-nextest-core> at <unknown source file>:<unknown line>
  1052. 29.25 s gammaloop-nextest-core> 12: test[75d6903177b1d7e9]::run_test::{closure#0}<unknown>
  1053. 29.25 s gammaloop-nextest-core> at <unknown source file>:<unknown line>
  1054. 29.25 s gammaloop-nextest-core> 13: std[bcb96dfbba0ab899]::sys::backtrace::__rust_begin_short_backtrace::<test[75d6903177b1d7e9]::run_test::{closure#1}, ()><unknown>
  1055. 29.25 s gammaloop-nextest-core> ... omitted 12 more lines; see full nextest output above
  1056. 29.25 s gammaloop-nextest-core> =========================================
  1057. 29.29 s error: Cannot build '/nix/store/kdk12m3q1h6h241yxlkx2wvsy9l2g283-gammaloop-nextest-core.drv'.
  1058. 29.29 s Reason: builder failed with exit code 100.
  1059. 29.29 s Output paths:
  1060. 29.29 s /nix/store/szb4f97yp556knm1315zv5fcq4in56nv-gammaloop-nextest-core
  1061. 29.29 s Last 1040 log lines:
  1062. 29.29 s > Extracting 3 binaries (including 1 non-test binary), 1 build script output directory, and 2 linked paths to /build/nextest-archive-J2hD1a
  1063. 29.29 s > Extracted 18 files to /build/nextest-archive-J2hD1a in 0.47s
  1064. 29.29 s > ------------
  1065. 29.29 s > Nextest run ID dfe87a58-8321-47cf-ba83-41def9feaba0 with nextest profile: ci_gammaloop
  1066. 29.29 s > Starting 339 tests across 2 binaries
  1067. 29.29 s > ------------
  1068. 29.29 s > Summary [ 0.426s] 339 tests run: 339 passed, 0 skipped
  1069. 29.29 s >
  1070. 29.29 s > ========== nextest test summary ==========
  1071. 29.29 s > report: target/nextest/ci_gammaloop/junit.xml
  1072. 29.29 s > tests: 339, failures: 0, errors: 0
  1073. 29.29 s > No failing testcases found.
  1074. 29.29 s > =========================================
  1075. 29.29 s > Extracting 1 binary and 1 linked path to /build/nextest-archive-vE5ucr
  1076. 29.29 s > Extracted 7 files to /build/nextest-archive-vE5ucr in 0.07s
  1077. 29.29 s > ------------
  1078. 29.29 s > Nextest run ID c3ad5222-1652-48ab-986c-4cad1d5509e1 with nextest profile: ci_gammaloop
  1079. 29.29 s > Starting 19 tests across 1 binary
  1080. 29.29 s > ------------
  1081. 29.29 s > Summary [ 0.010s] 19 tests run: 19 passed, 0 skipped
  1082. 29.29 s >
  1083. 29.29 s > ========== nextest test summary ==========
  1084. 29.29 s > report: target/nextest/ci_gammaloop/junit.xml
  1085. 29.29 s > tests: 19, failures: 0, errors: 0
  1086. 29.29 s > No failing testcases found.
  1087. 29.29 s > =========================================
  1088. 29.29 s > Extracting 1 binary to /build/nextest-archive-PhfCUd
  1089. 29.29 s > Extracted 4 files to /build/nextest-archive-PhfCUd in 0.03s
  1090. 29.29 s > ------------
  1091. 29.29 s > Nextest run ID db193ff1-0d6a-4b60-ac49-197ca11641f8 with nextest profile: ci_gammaloop
  1092. 29.29 s > Starting 0 tests across 1 binary
  1093. 29.29 s > ------------
  1094. 29.29 s > Summary [ 0.000s] 0 tests run: 0 passed, 0 skipped
  1095. 29.29 s >
  1096. 29.29 s > ========== nextest test summary ==========
  1097. 29.29 s > report: target/nextest/ci_gammaloop/junit.xml
  1098. 29.29 s > tests: 0, failures: 0, errors: 0
  1099. 29.29 s > No failing testcases found.
  1100. 29.29 s > =========================================
  1101. 29.29 s > Extracting 4 binaries, 1 build script output directory, and 2 linked paths to /build/nextest-archive-D47jz8
  1102. 29.29 s > Extracted 18 files to /build/nextest-archive-D47jz8 in 0.53s
  1103. 29.29 s > ------------
  1104. 29.29 s > Nextest run ID 5e6a32cc-649e-4fbb-8f6b-bc87531c138b with nextest profile: ci_gammaloop
  1105. 29.29 s > Starting 456 tests across 4 binaries (61 tests skipped, including 60 tests via profile.ci_gammaloop.default-filter)
  1106. 29.29 s > FAIL [ 0.111s] (442/456) gammalooprs::test_renormalization finit_part_ghlo
  1107. 29.29 s > stdout ---
  1108. 29.29 s >
  1109. 29.29 s > running 1 test
  1110. 29.29 s > test finit_part_ghlo ... FAILED
  1111. 29.29 s >
  1112. 29.29 s > failures:
  1113. 29.29 s >
  1114. 29.29 s > failures:
  1115. 29.29 s > finit_part_ghlo
  1116. 29.29 s >
  1117. 29.29 s > test result: FAILED. 0 passed; 1 failed; 0 ignored; 0 measured; 5 filtered out; finished in 0.10s
  1118. 29.29 s >
  1119. 29.29 s > stderr ---
  1120. 29.29 s > The application panicked (crashed).
  1121. 29.29 s > Message: called `Result::unwrap()` on an `Err` value:
  1122. 29.29 s > 0: Symbolica could not parse FORM output:
  1123. 29.29 s > [spenso::{antisymmetric,real,spenso::tensor}::f]([spenso::{spenso::representat\
  1124. 29.29 s > ion,spenso::self_dual}::coad](8,[gammalooprs::{spenso::index}::hedge](0)
  1125. 29.29 s > ),[spenso::{spenso::representation,spenso::self_dual}::coad](8,[gammaloo\
  1126. 29.29 s > prs::{spenso::index}::hedge](3)),[spenso::{spenso::representation,spenso\
  1127. 29.29 s > ::self_dual}::coad](8,[gammalooprs::{spenso::index}::hedge](5)))*
  1128. 29.29 s > [spenso::{antisymmetric,real,spenso::tensor}::f]([spenso::{spenso::repre\
  1129. 29.29 s > sentation,spenso::self_dual}::coad](8,[gammalooprs::{spenso::index}::hed\
  1130. 29.29 s > ge](1)),[spenso::{spenso::representation,spenso::self_dual}::coad](8,
  1131. 29.29 s > [gammalooprs::{spenso::index}::hedge](3)),[spenso::{spenso::representati\
  1132. 29.29 s > on,spenso::self_dual}::coad](8,[gammalooprs::{spenso::index}::hedge](5))
  1133. 29.29 s > )*dot(p1,p0)*dot(k1,k1)*[UFO::{}::GC_10]^2*rat(-1,ep - 2)
  1134. 29.29 s >
  1135. 29.29 s > Error:Symbol spenso::coad redefined with new attributes:
  1136. 29.29 s > - new user data specified: List([String("spenso::representation-v2"), String("self-dual"), List([String("symbol"), String("coad")]), List([String("cyclic"), Integer(1), List([List([String("symbol"), String("a")]), List([String("symbol"), String("b")]), List([String("symbol"), String("c")]), List([String("symbol"), String("d")])])]), String("top")]) vs None
  1137. 29.29 s >
  1138. 29.29 s >
  1139. 29.29 s > Location:
  1140. 29.29 s > crates/gammalooprs/src/uv/approx/integrated.rs:332
  1141. 29.29 s >
  1142. 29.29 s > ━━━━━━━━━━━━━━━━━━━━━━━━━━━━━━━━━━ BACKTRACE ━━━━━━━━━━━━━━━━━━━━━━━━━━━━━━━━━━━
  1143. 29.29 s > 1: <color_eyre[5722b77bc20a64cf]::config::EyreHook>::into_eyre_hook::{closure#0}<unknown>
  1144. 29.29 s > at <unknown source file>:<unknown line>
  1145. 29.29 s > 2: eyre[cb2fd339c0c40fca]::capture_handler<unknown>
  1146. 29.29 s > at <unknown source file>:<unknown line>
  1147. 29.29 s > 3: <eyre[cb2fd339c0c40fca]::Report>::from_std::<vakint[ad2b4d4b4d753fb9]::VakintError><unknown>
  1148. 29.29 s > at <unknown source file>:<unknown line>
  1149. 29.29 s > 4: <gammalooprs[4688948c89ba1ea7]::uv::approx::integrated::Integrated>::integrate::<gammalooprs[4688948c89ba1ea7]::uv::hedge_poset::ForestNode><unknown>
  1150. 29.29 s > at <unknown source file>:<unknown line>
  1151. 29.29 s > 5: <gammalooprs[4688948c89ba1ea7]::uv::approx::integrated::Integrated>::run::<gammalooprs[4688948c89ba1ea7]::uv::hedge_poset::ForestNode, gammalooprs[4688948c89ba1ea7]::uv::hedge_poset::ForestNode><unknown>
  1152. 29.29 s > at <unknown source file>:<unknown line>
  1153. 29.29 s > 6: <gammalooprs[4688948c89ba1ea7]::uv::hedge_poset::Forests>::integrate<unknown>
  1154. 29.29 s > at <unknown source file>:<unknown line>
  1155. 29.29 s > 7: gammalooprs[4688948c89ba1ea7]::uv::orchestrator::hedge_poset_renormalization_part<unknown>
  1156. 29.29 s > at <unknown source file>:<unknown line>
  1157. 29.29 s > 8: <gammalooprs[4688948c89ba1ea7]::uv::settings::UVOrchestrator>::renormalization_part<unknown>
  1158. 29.29 s > at <unknown source file>:<unknown line>
  1159. 29.29 s > 9: <gammalooprs[4688948c89ba1ea7]::processes::amplitude::AmplitudeGraph>::renormalization_part<unknown>
  1160. 29.29 s > at <unknown source file>:<unknown line>
  1161. 29.29 s > 10: <test_renormalization[c99a4cd1432bec79]::finit_part_ghlo::{closure#0} as core[940e698046960fd5]::ops::function::FnOnce<()>>::call_once<unknown>
  1162. 29.29 s > at <unknown source file>:<unknown line>
  1163. 29.29 s > 11: test[75d6903177b1d7e9]::__rust_begin_short_backtrace::<core[940e698046960fd5]::result::Result<(), alloc[2ea6bcb46fca0c42]::string::String>, fn() -> core[940e698046960fd5]::result::Result<(), alloc[2ea6bcb46fca0c42]::string::String>><unknown>
  1164. 29.29 s > at <unknown source file>:<unknown line>
  1165. 29.29 s > 12: test[75d6903177b1d7e9]::run_test::{closure#0}<unknown>
  1166. 29.29 s > at <unknown source file>:<unknown line>
  1167. 29.29 s > 13: std[bcb96dfbba0ab899]::sys::backtrace::__rust_begin_short_backtrace::<test[75d6903177b1d7e9]::run_test::{closure#1}, ()><unknown>
  1168. 29.29 s > at <unknown source file>:<unknown line>
  1169. 29.29 s > 14: <std[bcb96dfbba0ab899]::thread::lifecycle::spawn_unchecked<test[75d6903177b1d7e9]::run_test::{closure#1}, ()>::{closure#1} as core[940e698046960fd5]::ops::function::FnOnce<()>>::call_once::{shim:vtable#0}<unknown>
  1170. 29.29 s > at <unknown source file>:<unknown line>
  1171. 29.29 s > 15: <std[bcb96dfbba0ab899]::sys::thread::unix::Thread>::new::thread_start<unknown>
  1172. 29.29 s > at <unknown source file>:<unknown line>
  1173. 29.29 s > 16: start_thread<unknown>
  1174. 29.29 s > at <unknown source file>:<unknown line>
  1175. 29.29 s > 17: __clone3<unknown>
  1176. 29.29 s > at <unknown source file>:<unknown line>
  1177. 29.29 s >
  1178. 29.29 s > Run with COLORBT_SHOW_HIDDEN=1 environment variable to disable frame filtering.
  1179. 29.29 s > Run with RUST_BACKTRACE=full to include source snippets.
  1180. 29.29 s > Location: crates/gammalooprs/tests/test_renormalization.rs:550
  1181. 29.29 s >
  1182. 29.29 s > ━━━━━━━━━━━━━━━━━━━━━━━━━━━━━━━━━━ BACKTRACE ━━━━━━━━━━━━━━━━━━━━━━━━━━━━━━━━━━━
  1183. 29.29 s > 1: <color_eyre[5722b77bc20a64cf]::config::PanicHook>::panic_report<unknown>
  1184. 29.29 s > at <unknown source file>:<unknown line>
  1185. 29.29 s > 2: <color_eyre[5722b77bc20a64cf]::config::PanicHook>::into_panic_hook::{closure#0}<unknown>
  1186. 29.29 s > at <unknown source file>:<unknown line>
  1187. 29.29 s > 3: std[bcb96dfbba0ab899]::panicking::panic_with_hook<unknown>
  1188. 29.29 s > at <unknown source file>:<unknown line>
  1189. 29.29 s > 4: std[bcb96dfbba0ab899]::panicking::panic_handler::{closure#0}<unknown>
  1190. 29.29 s > at <unknown source file>:<unknown line>
  1191. 29.29 s > 5: std[bcb96dfbba0ab899]::sys::backtrace::__rust_end_short_backtrace::<std[bcb96dfbba0ab899]::panicking::panic_handler::{closure#0}, !><unknown>
  1192. 29.29 s > at <unknown source file>:<unknown line>
  1193. 29.29 s > 6: __rustc[6c289b9f9c454d21]::rust_begin_unwind<unknown>
  1194. 29.29 s > at <unknown source file>:<unknown line>
  1195. 29.29 s > 7: core[940e698046960fd5]::panicking::panic_fmt<unknown>
  1196. 29.29 s > at <unknown source file>:<unknown line>
  1197. 29.29 s > 8: core[940e698046960fd5]::result::unwrap_failed<unknown>
  1198. 29.29 s > at <unknown source file>:<unknown line>
  1199. 29.29 s > 9: <test_renormalization[c99a4cd1432bec79]::finit_part_ghlo::{closure#0} as core[940e698046960fd5]::ops::function::FnOnce<()>>::call_once<unknown>
  1200. 29.29 s > at <unknown source file>:<unknown line>
  1201. 29.29 s > 10: test[75d6903177b1d7e9]::__rust_begin_short_backtrace::<core[940e698046960fd5]::result::Result<(), alloc[2ea6bcb46fca0c42]::string::String>, fn() -> core[940e698046960fd5]::result::Result<(), alloc[2ea6bcb46fca0c42]::string::String>><unknown>
  1202. 29.29 s > at <unknown source file>:<unknown line>
  1203. 29.29 s > 11: test[75d6903177b1d7e9]::run_test::{closure#0}<unknown>
  1204. 29.29 s > at <unknown source file>:<unknown line>
  1205. 29.29 s > 12: std[bcb96dfbba0ab899]::sys::backtrace::__rust_begin_short_backtrace::<test[75d6903177b1d7e9]::run_test::{closure#1}, ()><unknown>
  1206. 29.29 s > at <unknown source file>:<unknown line>
  1207. 29.29 s > 13: <std[bcb96dfbba0ab899]::thread::lifecycle::spawn_unchecked<test[75d6903177b1d7e9]::run_test::{closure#1}, ()>::{closure#1} as core[940e698046960fd5]::ops::function::FnOnce<()>>::call_once::{shim:vtable#0}<unknown>
  1208. 29.29 s > at <unknown source file>:<unknown line>
  1209. 29.29 s > 14: <std[bcb96dfbba0ab899]::sys::thread::unix::Thread>::new::thread_start<unknown>
  1210. 29.29 s > at <unknown source file>:<unknown line>
  1211. 29.29 s > 15: start_thread<unknown>
  1212. 29.29 s > at <unknown source file>:<unknown line>
  1213. 29.29 s > 16: __clone3<unknown>
  1214. 29.29 s > at <unknown source file>:<unknown line>
  1215. 29.29 s >
  1216. 29.29 s > Run with COLORBT_SHOW_HIDDEN=1 environment variable to disable frame filtering.
  1217. 29.29 s > Run with RUST_BACKTRACE=full to include source snippets.
  1218. 29.29 s >
  1219. 29.29 s > FAIL [ 0.195s] (443/456) gammalooprs::test_renormalization finite_part_quark_lo
  1220. 29.29 s > stdout ---
  1221. 29.29 s >
  1222. 29.29 s > running 1 test
  1223. 29.29 s > test finite_part_quark_lo ... FAILED
  1224. 29.29 s >
  1225. 29.29 s > failures:
  1226. 29.29 s >
  1227. 29.29 s > failures:
  1228. 29.29 s > finite_part_quark_lo
  1229. 29.29 s >
  1230. 29.29 s > test result: FAILED. 0 passed; 1 failed; 0 ignored; 0 measured; 5 filtered out; finished in 0.18s
  1231. 29.29 s >
  1232. 29.29 s > stderr ---
  1233. 29.29 s > The application panicked (crashed).
  1234. 29.29 s > Message: called `Result::unwrap()` on an `Err` value: "Symbol spenso::mink redefined with new attributes:\n\t- new user data specified: List([String(\"spenso::representation-v2\"), String(\"inline-metric\"), List([String(\"symbol\"), String(\"mink\")]), List([String(\"cyclic\"), Integer(1), List([List([String(\"symbol\"), String(\"mu\")]), List([String(\"symbol\"), String(\"nu\")]), List([String(\"symbol\"), String(\"rho\")]), List([String(\"symbol\"), String(\"sigma\")])])]), String(\"top\")]) vs None\n"
  1235. 29.29 s > Location: crates/vakint/src/lib.rs:4766
  1236. 29.29 s >
  1237. 29.29 s > ━━━━━━━━━━━━━━━━━━━━━━━━━━━━━━━━━━ BACKTRACE ━━━━━━━━━━━━━━━━━━━━━━━━━━━━━━━━━━━
  1238. 29.29 s > 1: <color_eyre[5722b77bc20a64cf]::config::PanicHook>::panic_report<unknown>
  1239. 29.29 s > at <unknown source file>:<unknown line>
  1240. 29.29 s > 2: <color_eyre[5722b77bc20a64cf]::config::PanicHook>::into_panic_hook::{closure#0}<unknown>
  1241. 29.29 s > at <unknown source file>:<unknown line>
  1242. 29.29 s > 3: std[bcb96dfbba0ab899]::panicking::panic_with_hook<unknown>
  1243. 29.29 s > at <unknown source file>:<unknown line>
  1244. 29.29 s > 4: std[bcb96dfbba0ab899]::panicking::panic_handler::{closure#0}<unknown>
  1245. 29.29 s > at <unknown source file>:<unknown line>
  1246. 29.29 s > 5: std[bcb96dfbba0ab899]::sys::backtrace::__rust_end_short_backtrace::<std[bcb96dfbba0ab899]::panicking::panic_handler::{closure#0}, !><unknown>
  1247. 29.29 s > at <unknown source file>:<unknown line>
  1248. 29.29 s > 6: __rustc[6c289b9f9c454d21]::rust_begin_unwind<unknown>
  1249. 29.29 s > at <unknown source file>:<unknown line>
  1250. 29.29 s > 7: core[940e698046960fd5]::panicking::panic_fmt<unknown>
  1251. 29.29 s > at <unknown source file>:<unknown line>
  1252. 29.29 s > 8: core[940e698046960fd5]::result::unwrap_failed<unknown>
  1253. 29.29 s > at <unknown source file>:<unknown line>
  1254. 29.29 s > 9: <vakint[ad2b4d4b4d753fb9]::Vakint>::sanitize_user_expressions<unknown>
  1255. 29.29 s > at <unknown source file>:<unknown line>
  1256. 29.29 s > 10: <vakint[ad2b4d4b4d753fb9]::Vakint>::prepare_expression_for_form<unknown>
  1257. 29.29 s > at <unknown source file>:<unknown line>
  1258. 29.29 s > 11: <vakint[ad2b4d4b4d753fb9]::VakintTerm>::tensor_reduce<unknown>
  1259. 29.29 s > at <unknown source file>:<unknown line>
  1260. 29.29 s > 12: <vakint[ad2b4d4b4d753fb9]::VakintExpression>::tensor_reduce<unknown>
  1261. 29.29 s > at <unknown source file>:<unknown line>
  1262. 29.29 s > 13: <gammalooprs[4688948c89ba1ea7]::uv::approx::integrated::Integrated>::integrate::<gammalooprs[4688948c89ba1ea7]::uv::hedge_poset::ForestNode><unknown>
  1263. 29.29 s > at <unknown source file>:<unknown line>
  1264. 29.29 s > 14: <gammalooprs[4688948c89ba1ea7]::uv::approx::integrated::Integrated>::run::<gammalooprs[4688948c89ba1ea7]::uv::hedge_poset::ForestNode, gammalooprs[4688948c89ba1ea7]::uv::hedge_poset::ForestNode><unknown>
  1265. 29.29 s > at <unknown source file>:<unknown line>
  1266. 29.29 s > 15: <gammalooprs[4688948c89ba1ea7]::uv::hedge_poset::Forests>::integrate<unknown>
  1267. 29.29 s > at <unknown source file>:<unknown line>
  1268. 29.29 s > 16: gammalooprs[4688948c89ba1ea7]::uv::orchestrator::hedge_poset_renormalization_part<unknown>
  1269. 29.29 s > at <unknown source file>:<unknown line>
  1270. 29.29 s > 17: <gammalooprs[4688948c89ba1ea7]::uv::settings::UVOrchestrator>::renormalization_part<unknown>
  1271. 29.29 s > at <unknown source file>:<unknown line>
  1272. 29.29 s > 18: <gammalooprs[4688948c89ba1ea7]::processes::amplitude::AmplitudeGraph>::renormalization_part<unknown>
  1273. 29.29 s > at <unknown source file>:<unknown line>
  1274. 29.29 s > 19: <test_renormalization[c99a4cd1432bec79]::finite_part_quark_lo::{closure#0} as core[940e698046960fd5]::ops::function::FnOnce<()>>::call_once<unknown>
  1275. 29.29 s > at <unknown source file>:<unknown line>
  1276. 29.29 s > 20: test[75d6903177b1d7e9]::__rust_begin_short_backtrace::<core[940e698046960fd5]::result::Result<(), alloc[2ea6bcb46fca0c42]::string::String>, fn() -> core[940e698046960fd5]::result::Result<(), alloc[2ea6bcb46fca0c42]::string::String>><unknown>
  1277. 29.29 s > at <unknown source file>:<unknown line>
  1278. 29.29 s > 21: test[75d6903177b1d7e9]::run_test::{closure#0}<unknown>
  1279. 29.29 s > at <unknown source file>:<unknown line>
  1280. 29.29 s > 22: std[bcb96dfbba0ab899]::sys::backtrace::__rust_begin_short_backtrace::<test[75d6903177b1d7e9]::run_test::{closure#1}, ()><unknown>
  1281. 29.29 s > at <unknown source file>:<unknown line>
  1282. 29.29 s > 23: <std[bcb96dfbba0ab899]::thread::lifecycle::spawn_unchecked<test[75d6903177b1d7e9]::run_test::{closure#1}, ()>::{closure#1} as core[940e698046960fd5]::ops::function::FnOnce<()>>::call_once::{shim:vtable#0}<unknown>
  1283. 29.29 s > at <unknown source file>:<unknown line>
  1284. 29.29 s > 24: <std[bcb96dfbba0ab899]::sys::thread::unix::Thread>::new::thread_start<unknown>
  1285. 29.29 s > at <unknown source file>:<unknown line>
  1286. 29.29 s > 25: start_thread<unknown>
  1287. 29.29 s > at <unknown source file>:<unknown line>
  1288. 29.29 s > 26: __clone3<unknown>
  1289. 29.29 s > at <unknown source file>:<unknown line>
  1290. 29.29 s >
  1291. 29.29 s > Run with COLORBT_SHOW_HIDDEN=1 environment variable to disable frame filtering.
  1292. 29.29 s > Run with RUST_BACKTRACE=full to include source snippets.
  1293. 29.29 s >
  1294. 29.29 s > FAIL [ 0.298s] (446/456) gammalooprs::test_renormalization finite_part_ghost_2loop
  1295. 29.29 s > stdout ---
  1296. 29.29 s >
  1297. 29.29 s > running 1 test
  1298. 29.29 s > test finite_part_ghost_2loop ... FAILED
  1299. 29.29 s >
  1300. 29.29 s > failures:
  1301. 29.29 s >
  1302. 29.29 s > failures:
  1303. 29.29 s > finite_part_ghost_2loop
  1304. 29.29 s >
  1305. 29.29 s > test result: FAILED. 0 passed; 1 failed; 0 ignored; 0 measured; 5 filtered out; finished in 0.29s
  1306. 29.29 s >
  1307. 29.30 s > stderr ---
  1308. 29.30 s > The application panicked (crashed).
  1309. 29.30 s > Message: called `Result::unwrap()` on an `Err` value:
  1310. 29.30 s > 0: Symbolica could not parse FORM output:
  1311. 29.30 s > [spenso::{antisymmetric,real,spenso::tensor}::f]([spenso::{spenso::representat\
  1312. 29.30 s > ion,spenso::self_dual}::coad](8,[gammalooprs::{spenso::index}::hedge](0)
  1313. 29.30 s > ),[spenso::{spenso::representation,spenso::self_dual}::coad](8,[gammaloo\
  1314. 29.30 s > prs::{spenso::index}::hedge](3)),[spenso::{spenso::representation,spenso\
  1315. 29.30 s > ::self_dual}::coad](8,[gammalooprs::{spenso::index}::hedge](5)))*
  1316. 29.30 s > [spenso::{antisymmetric,real,spenso::tensor}::f]([spenso::{spenso::repre\
  1317. 29.30 s > sentation,spenso::self_dual}::coad](8,[gammalooprs::{spenso::index}::hed\
  1318. 29.30 s > ge](1)),[spenso::{spenso::representation,spenso::self_dual}::coad](8,
  1319. 29.30 s > [gammalooprs::{spenso::index}::hedge](11)),[spenso::{spenso::representat\
  1320. 29.30 s > ion,spenso::self_dual}::coad](8,[gammalooprs::{spenso::index}::hedge](7)
  1321. 29.30 s > ))*[spenso::{antisymmetric,real,spenso::tensor}::f]([spenso::{spenso::re\
  1322. 29.30 s > presentation,spenso::self_dual}::coad](8,[gammalooprs::{spenso::index}::\
  1323. 29.30 s > hedge](3)),[spenso::{spenso::representation,spenso::self_dual}::coad](8,
  1324. 29.30 s > [gammalooprs::{spenso::index}::hedge](7)),[spenso::{spenso::representati\
  1325. 29.30 s > on,spenso::self_dual}::coad](8,[gammalooprs::{spenso::index}::hedge](9))
  1326. 29.30 s > )*[spenso::{antisymmetric,real,spenso::tensor}::f]([spenso::{spenso::rep\
  1327. 29.30 s > resentation,spenso::self_dual}::coad](8,[gammalooprs::{spenso::index}::h\
  1328. 29.30 s > edge](11)),[spenso::{spenso::representation,spenso::self_dual}::coad](8,
  1329. 29.30 s > [gammalooprs::{spenso::index}::hedge](5)),[spenso::{spenso::representati\
  1330. 29.30 s > on,spenso::self_dual}::coad](8,[gammalooprs::{spenso::index}::hedge](9))
  1331. 29.30 s > )*dot(p4,p0)*dot(k1,k1)*dot(k2,k2)*i_*[UFO::{}::GC_10]^4*rat(1,ep - 2)
  1332. 29.30 s > + [spenso::{antisymmetric,real,spenso::tensor}::f]([spenso::{spenso::re\
  1333. 29.30 s > presentation,spenso::self_dual}::coad](8,[gammalooprs::{spenso::index}::\
  1334. 29.30 s > hedge](0)),[spenso::{spenso::representation,spenso::self_dual}::coad](8,
  1335. 29.30 s > [gammalooprs::{spenso::index}::hedge](3)),[spenso::{spenso::representati\
  1336. 29.30 s > on,spenso::self_dual}::coad](8,[gammalooprs::{spenso::index}::hedge](5))
  1337. 29.30 s > )*[spenso::{antisymmetric,real,spenso::tensor}::f]([spenso::{spenso::rep\
  1338. 29.30 s > resentation,spenso::self_dual}::coad](8,[gammalooprs::{spenso::index}::h\
  1339. 29.30 s > edge](1)),[spenso::{spenso::representation,spenso::self_dual}::coad](8,
  1340. 29.30 s > [gammalooprs::{spenso::index}::hedge](11)),[spenso::{spenso::representat\
  1341. 29.30 s > ion,spenso::self_dual}::coad](8,[gammalooprs::{spenso::index}::hedge](7)
  1342. 29.30 s > ))*[spenso::{antisymmetric,real,spenso::tensor}::f]([spenso::{spenso::re\
  1343. 29.30 s > presentation,spenso::self_dual}::coad](8,[gammalooprs::{spenso::index}::\
  1344. 29.30 s > hedge](3)),[spenso::{spenso::representation,spenso::self_dual}::coad](8,
  1345. 29.30 s > [gammalooprs::{spenso::index}::hedge](7)),[spenso::{spenso::representati\
  1346. 29.30 s > on,spenso::self_dual}::coad](8,[gammalooprs::{spenso::index}::hedge](9))
  1347. 29.30 s > )*[spenso::{antisymmetric,real,spenso::tensor}::f]([spenso::{spenso::rep\
  1348. 29.30 s > resentation,spenso::self_dual}::coad](8,[gammalooprs::{spenso::index}::h\
  1349. 29.30 s > edge](11)),[spenso::{spenso::representation,spenso::self_dual}::coad](8,
  1350. 29.30 s > [gammalooprs::{spenso::index}::hedge](5)),[spenso::{spenso::representati\
  1351. 29.30 s > on,spenso::self_dual}::coad](8,[gammalooprs::{spenso::index}::hedge](9))
  1352. 29.30 s > )*dot(p4,p0)*dot(k1,k2)^2*i_*[UFO::{}::GC_10]^4*rat(-1,ep - 2)
  1353. 29.30 s >
  1354. 29.30 s > Error:Symbol spenso::coad redefined with new attributes:
  1355. 29.30 s > - new user data specified: List([String("spenso::representation-v2"), String("self-dual"), List([String("symbol"), String("coad")]), List([String("cyclic"), Integer(1), List([List([String("symbol"), String("a")]), List([String("symbol"), String("b")]), List([String("symbol"), String("c")]), List([String("symbol"), String("d")])])]), String("top")]) vs None
  1356. 29.30 s >
  1357. 29.30 s >
  1358. 29.30 s > Location:
  1359. 29.30 s > crates/gammalooprs/src/uv/approx/integrated.rs:332
  1360. 29.30 s >
  1361. 29.30 s > ━━━━━━━━━━━━━━━━━━━━━━━━━━━━━━━━━━ BACKTRACE ━━━━━━━━━━━━━━━━━━━━━━━━━━━━━━━━━━━
  1362. 29.30 s > 1: <color_eyre[5722b77bc20a64cf]::config::EyreHook>::into_eyre_hook::{closure#0}<unknown>
  1363. 29.30 s > at <unknown source file>:<unknown line>
  1364. 29.30 s > 2: eyre[cb2fd339c0c40fca]::capture_handler<unknown>
  1365. 29.30 s > at <unknown source file>:<unknown line>
  1366. 29.30 s > 3: <eyre[cb2fd339c0c40fca]::Report>::from_std::<vakint[ad2b4d4b4d753fb9]::VakintError><unknown>
  1367. 29.30 s > at <unknown source file>:<unknown line>
  1368. 29.30 s > 4: <gammalooprs[4688948c89ba1ea7]::uv::approx::integrated::Integrated>::integrate::<gammalooprs[4688948c89ba1ea7]::uv::approx::Approximation><unknown>
  1369. 29.30 s > at <unknown source file>:<unknown line>
  1370. 29.30 s > 5: <gammalooprs[4688948c89ba1ea7]::uv::forest::Forest>::compute<unknown>
  1371. 29.30 s > at <unknown source file>:<unknown line>
  1372. 29.30 s > 6: gammalooprs[4688948c89ba1ea7]::uv::orchestrator::legacy_renormalization_part<unknown>
  1373. 29.30 s > at <unknown source file>:<unknown line>
  1374. 29.30 s > 7: <gammalooprs[4688948c89ba1ea7]::uv::settings::UVOrchestrator>::renormalization_part<unknown>
  1375. 29.30 s > at <unknown source file>:<unknown line>
  1376. 29.30 s > 8: <gammalooprs[4688948c89ba1ea7]::processes::amplitude::AmplitudeGraph>::renormalization_part<unknown>
  1377. 29.30 s > at <unknown source file>:<unknown line>
  1378. 29.30 s > 9: test_renormalization[c99a4cd1432bec79]::finite_part_ghost_2loop<unknown>
  1379. 29.30 s > at <unknown source file>:<unknown line>
  1380. 29.30 s > 10: <test_renormalization[c99a4cd1432bec79]::finite_part_ghost_2loop::{closure#0} as core[940e698046960fd5]::ops::function::FnOnce<()>>::call_once<unknown>
  1381. 29.30 s > at <unknown source file>:<unknown line>
  1382. 29.30 s > 11: test[75d6903177b1d7e9]::__rust_begin_short_backtrace::<core[940e698046960fd5]::result::Result<(), alloc[2ea6bcb46fca0c42]::string::String>, fn() -> core[940e698046960fd5]::result::Result<(), alloc[2ea6bcb46fca0c42]::string::String>><unknown>
  1383. 29.30 s > at <unknown source file>:<unknown line>
  1384. 29.30 s > 12: test[75d6903177b1d7e9]::run_test::{closure#0}<unknown>
  1385. 29.30 s > at <unknown source file>:<unknown line>
  1386. 29.30 s > 13: std[bcb96dfbba0ab899]::sys::backtrace::__rust_begin_short_backtrace::<test[75d6903177b1d7e9]::run_test::{closure#1}, ()><unknown>
  1387. 29.30 s > at <unknown source file>:<unknown line>
  1388. 29.30 s > 14: <std[bcb96dfbba0ab899]::thread::lifecycle::spawn_unchecked<test[75d6903177b1d7e9]::run_test::{closure#1}, ()>::{closure#1} as core[940e698046960fd5]::ops::function::FnOnce<()>>::call_once::{shim:vtable#0}<unknown>
  1389. 29.30 s > at <unknown source file>:<unknown line>
  1390. 29.30 s > 15: <std[bcb96dfbba0ab899]::sys::thread::unix::Thread>::new::thread_start<unknown>
  1391. 29.30 s > at <unknown source file>:<unknown line>
  1392. 29.30 s > 16: start_thread<unknown>
  1393. 29.30 s > at <unknown source file>:<unknown line>
  1394. 29.30 s > 17: __clone3<unknown>
  1395. 29.30 s > at <unknown source file>:<unknown line>
  1396. 29.30 s >
  1397. 29.30 s > Run with COLORBT_SHOW_HIDDEN=1 environment variable to disable frame filtering.
  1398. 29.30 s > Run with RUST_BACKTRACE=full to include source snippets.
  1399. 29.30 s > Location: crates/gammalooprs/tests/test_renormalization.rs:445
  1400. 29.30 s >
  1401. 29.30 s > ━━━━━━━━━━━━━━━━━━━━━━━━━━━━━━━━━━ BACKTRACE ━━━━━━━━━━━━━━━━━━━━━━━━━━━━━━━━━━━
  1402. 29.30 s > 1: <color_eyre[5722b77bc20a64cf]::config::PanicHook>::panic_report<unknown>
  1403. 29.30 s > at <unknown source file>:<unknown line>
  1404. 29.30 s > 2: <color_eyre[5722b77bc20a64cf]::config::PanicHook>::into_panic_hook::{closure#0}<unknown>
  1405. 29.30 s > at <unknown source file>:<unknown line>
  1406. 29.30 s > 3: std[bcb96dfbba0ab899]::panicking::panic_with_hook<unknown>
  1407. 29.30 s > at <unknown source file>:<unknown line>
  1408. 29.30 s > 4: std[bcb96dfbba0ab899]::panicking::panic_handler::{closure#0}<unknown>
  1409. 29.30 s > at <unknown source file>:<unknown line>
  1410. 29.30 s > 5: std[bcb96dfbba0ab899]::sys::backtrace::__rust_end_short_backtrace::<std[bcb96dfbba0ab899]::panicking::panic_handler::{closure#0}, !><unknown>
  1411. 29.30 s > at <unknown source file>:<unknown line>
  1412. 29.30 s > 6: __rustc[6c289b9f9c454d21]::rust_begin_unwind<unknown>
  1413. 29.30 s > at <unknown source file>:<unknown line>
  1414. 29.30 s > 7: core[940e698046960fd5]::panicking::panic_fmt<unknown>
  1415. 29.30 s > at <unknown source file>:<unknown line>
  1416. 29.30 s > 8: core[940e698046960fd5]::result::unwrap_failed<unknown>
  1417. 29.30 s > at <unknown source file>:<unknown line>
  1418. 29.30 s > 9: test_renormalization[c99a4cd1432bec79]::finite_part_ghost_2loop<unknown>
  1419. 29.30 s > at <unknown source file>:<unknown line>
  1420. 29.30 s > 10: <test_renormalization[c99a4cd1432bec79]::finite_part_ghost_2loop::{closure#0} as core[940e698046960fd5]::ops::function::FnOnce<()>>::call_once<unknown>
  1421. 29.30 s > at <unknown source file>:<unknown line>
  1422. 29.30 s > 11: test[75d6903177b1d7e9]::__rust_begin_short_backtrace::<core[940e698046960fd5]::result::Result<(), alloc[2ea6bcb46fca0c42]::string::String>, fn() -> core[940e698046960fd5]::result::Result<(), alloc[2ea6bcb46fca0c42]::string::String>><unknown>
  1423. 29.30 s > at <unknown source file>:<unknown line>
  1424. 29.30 s > 12: test[75d6903177b1d7e9]::run_test::{closure#0}<unknown>
  1425. 29.30 s > at <unknown source file>:<unknown line>
  1426. 29.30 s > 13: std[bcb96dfbba0ab899]::sys::backtrace::__rust_begin_short_backtrace::<test[75d6903177b1d7e9]::run_test::{closure#1}, ()><unknown>
  1427. 29.30 s > at <unknown source file>:<unknown line>
  1428. 29.30 s > 14: <std[bcb96dfbba0ab899]::thread::lifecycle::spawn_unchecked<test[75d6903177b1d7e9]::run_test::{closure#1}, ()>::{closure#1} as core[940e698046960fd5]::ops::function::FnOnce<()>>::call_once::{shim:vtable#0}<unknown>
  1429. 29.30 s > at <unknown source file>:<unknown line>
  1430. 29.30 s > 15: <std[bcb96dfbba0ab899]::sys::thread::unix::Thread>::new::thread_start<unknown>
  1431. 29.30 s > at <unknown source file>:<unknown line>
  1432. 29.30 s > 16: start_thread<unknown>
  1433. 29.30 s > at <unknown source file>:<unknown line>
  1434. 29.30 s > 17: __clone3<unknown>
  1435. 29.30 s > at <unknown source file>:<unknown line>
  1436. 29.30 s >
  1437. 29.30 s > Run with COLORBT_SHOW_HIDDEN=1 environment variable to disable frame filtering.
  1438. 29.30 s > Run with RUST_BACKTRACE=full to include source snippets.
  1439. 29.30 s >
  1440. 29.30 s > ------------
  1441. 29.30 s > Summary [ 8.140s] 456 tests run: 453 passed, 3 failed, 61 skipped
  1442. 29.30 s > FAIL [ 0.111s] (442/456) gammalooprs::test_renormalization finit_part_ghlo
  1443. 29.30 s > stdout ---
  1444. 29.30 s >
  1445. 29.30 s > running 1 test
  1446. 29.30 s > test finit_part_ghlo ... FAILED
  1447. 29.30 s >
  1448. 29.30 s > failures:
  1449. 29.30 s >
  1450. 29.30 s > failures:
  1451. 29.30 s > finit_part_ghlo
  1452. 29.30 s >
  1453. 29.30 s > test result: FAILED. 0 passed; 1 failed; 0 ignored; 0 measured; 5 filtered out; finished in 0.10s
  1454. 29.30 s >
  1455. 29.30 s > stderr ---
  1456. 29.30 s > The application panicked (crashed).
  1457. 29.30 s > Message: called `Result::unwrap()` on an `Err` value:
  1458. 29.30 s > 0: Symbolica could not parse FORM output:
  1459. 29.30 s > [spenso::{antisymmetric,real,spenso::tensor}::f]([spenso::{spenso::representat\
  1460. 29.30 s > ion,spenso::self_dual}::coad](8,[gammalooprs::{spenso::index}::hedge](0)
  1461. 29.30 s > ),[spenso::{spenso::representation,spenso::self_dual}::coad](8,[gammaloo\
  1462. 29.30 s > prs::{spenso::index}::hedge](3)),[spenso::{spenso::representation,spenso\
  1463. 29.30 s > ::self_dual}::coad](8,[gammalooprs::{spenso::index}::hedge](5)))*
  1464. 29.30 s > [spenso::{antisymmetric,real,spenso::tensor}::f]([spenso::{spenso::repre\
  1465. 29.30 s > sentation,spenso::self_dual}::coad](8,[gammalooprs::{spenso::index}::hed\
  1466. 29.30 s > ge](1)),[spenso::{spenso::representation,spenso::self_dual}::coad](8,
  1467. 29.30 s > [gammalooprs::{spenso::index}::hedge](3)),[spenso::{spenso::representati\
  1468. 29.30 s > on,spenso::self_dual}::coad](8,[gammalooprs::{spenso::index}::hedge](5))
  1469. 29.30 s > )*dot(p1,p0)*dot(k1,k1)*[UFO::{}::GC_10]^2*rat(-1,ep - 2)
  1470. 29.30 s >
  1471. 29.30 s > Error:Symbol spenso::coad redefined with new attributes:
  1472. 29.30 s > - new user data specified: List([String("spenso::representation-v2"), String("self-dual"), List([String("symbol"), String("coad")]), List([String("cyclic"), Integer(1), List([List([String("symbol"), String("a")]), List([String("symbol"), String("b")]), List([String("symbol"), String("c")]), List([String("symbol"), String("d")])])]), String("top")]) vs None
  1473. 29.30 s >
  1474. 29.30 s >
  1475. 29.30 s > Location:
  1476. 29.30 s > crates/gammalooprs/src/uv/approx/integrated.rs:332
  1477. 29.30 s >
  1478. 29.30 s > ━━━━━━━━━━━━━━━━━━━━━━━━━━━━━━━━━━ BACKTRACE ━━━━━━━━━━━━━━━━━━━━━━━━━━━━━━━━━━━
  1479. 29.30 s > 1: <color_eyre[5722b77bc20a64cf]::config::EyreHook>::into_eyre_hook::{closure#0}<unknown>
  1480. 29.30 s > at <unknown source file>:<unknown line>
  1481. 29.30 s > 2: eyre[cb2fd339c0c40fca]::capture_handler<unknown>
  1482. 29.30 s > at <unknown source file>:<unknown line>
  1483. 29.30 s > 3: <eyre[cb2fd339c0c40fca]::Report>::from_std::<vakint[ad2b4d4b4d753fb9]::VakintError><unknown>
  1484. 29.30 s > at <unknown source file>:<unknown line>
  1485. 29.30 s > 4: <gammalooprs[4688948c89ba1ea7]::uv::approx::integrated::Integrated>::integrate::<gammalooprs[4688948c89ba1ea7]::uv::hedge_poset::ForestNode><unknown>
  1486. 29.30 s > at <unknown source file>:<unknown line>
  1487. 29.30 s > 5: <gammalooprs[4688948c89ba1ea7]::uv::approx::integrated::Integrated>::run::<gammalooprs[4688948c89ba1ea7]::uv::hedge_poset::ForestNode, gammalooprs[4688948c89ba1ea7]::uv::hedge_poset::ForestNode><unknown>
  1488. 29.30 s > at <unknown source file>:<unknown line>
  1489. 29.30 s > 6: <gammalooprs[4688948c89ba1ea7]::uv::hedge_poset::Forests>::integrate<unknown>
  1490. 29.30 s > at <unknown source file>:<unknown line>
  1491. 29.30 s > 7: gammalooprs[4688948c89ba1ea7]::uv::orchestrator::hedge_poset_renormalization_part<unknown>
  1492. 29.30 s > at <unknown source file>:<unknown line>
  1493. 29.30 s > 8: <gammalooprs[4688948c89ba1ea7]::uv::settings::UVOrchestrator>::renormalization_part<unknown>
  1494. 29.30 s > at <unknown source file>:<unknown line>
  1495. 29.30 s > 9: <gammalooprs[4688948c89ba1ea7]::processes::amplitude::AmplitudeGraph>::renormalization_part<unknown>
  1496. 29.30 s > at <unknown source file>:<unknown line>
  1497. 29.30 s > 10: <test_renormalization[c99a4cd1432bec79]::finit_part_ghlo::{closure#0} as core[940e698046960fd5]::ops::function::FnOnce<()>>::call_once<unknown>
  1498. 29.30 s > at <unknown source file>:<unknown line>
  1499. 29.30 s > 11: test[75d6903177b1d7e9]::__rust_begin_short_backtrace::<core[940e698046960fd5]::result::Result<(), alloc[2ea6bcb46fca0c42]::string::String>, fn() -> core[940e698046960fd5]::result::Result<(), alloc[2ea6bcb46fca0c42]::string::String>><unknown>
  1500. 29.30 s > at <unknown source file>:<unknown line>
  1501. 29.30 s > 12: test[75d6903177b1d7e9]::run_test::{closure#0}<unknown>
  1502. 29.30 s > at <unknown source file>:<unknown line>
  1503. 29.30 s > 13: std[bcb96dfbba0ab899]::sys::backtrace::__rust_begin_short_backtrace::<test[75d6903177b1d7e9]::run_test::{closure#1}, ()><unknown>
  1504. 29.30 s > at <unknown source file>:<unknown line>
  1505. 29.30 s > 14: <std[bcb96dfbba0ab899]::thread::lifecycle::spawn_unchecked<test[75d6903177b1d7e9]::run_test::{closure#1}, ()>::{closure#1} as core[940e698046960fd5]::ops::function::FnOnce<()>>::call_once::{shim:vtable#0}<unknown>
  1506. 29.30 s > at <unknown source file>:<unknown line>
  1507. 29.30 s > 15: <std[bcb96dfbba0ab899]::sys::thread::unix::Thread>::new::thread_start<unknown>
  1508. 29.30 s > at <unknown source file>:<unknown line>
  1509. 29.30 s > 16: start_thread<unknown>
  1510. 29.30 s > at <unknown source file>:<unknown line>
  1511. 29.30 s > 17: __clone3<unknown>
  1512. 29.30 s > at <unknown source file>:<unknown line>
  1513. 29.30 s >
  1514. 29.30 s > Run with COLORBT_SHOW_HIDDEN=1 environment variable to disable frame filtering.
  1515. 29.30 s > Run with RUST_BACKTRACE=full to include source snippets.
  1516. 29.30 s > Location: crates/gammalooprs/tests/test_renormalization.rs:550
  1517. 29.30 s >
  1518. 29.30 s > ━━━━━━━━━━━━━━━━━━━━━━━━━━━━━━━━━━ BACKTRACE ━━━━━━━━━━━━━━━━━━━━━━━━━━━━━━━━━━━
  1519. 29.30 s > 1: <color_eyre[5722b77bc20a64cf]::config::PanicHook>::panic_report<unknown>
  1520. 29.30 s > at <unknown source file>:<unknown line>
  1521. 29.30 s > 2: <color_eyre[5722b77bc20a64cf]::config::PanicHook>::into_panic_hook::{closure#0}<unknown>
  1522. 29.30 s > at <unknown source file>:<unknown line>
  1523. 29.30 s > 3: std[bcb96dfbba0ab899]::panicking::panic_with_hook<unknown>
  1524. 29.30 s > at <unknown source file>:<unknown line>
  1525. 29.30 s > 4: std[bcb96dfbba0ab899]::panicking::panic_handler::{closure#0}<unknown>
  1526. 29.30 s > at <unknown source file>:<unknown line>
  1527. 29.30 s > 5: std[bcb96dfbba0ab899]::sys::backtrace::__rust_end_short_backtrace::<std[bcb96dfbba0ab899]::panicking::panic_handler::{closure#0}, !><unknown>
  1528. 29.30 s > at <unknown source file>:<unknown line>
  1529. 29.30 s > 6: __rustc[6c289b9f9c454d21]::rust_begin_unwind<unknown>
  1530. 29.30 s > at <unknown source file>:<unknown line>
  1531. 29.30 s > 7: core[940e698046960fd5]::panicking::panic_fmt<unknown>
  1532. 29.30 s > at <unknown source file>:<unknown line>
  1533. 29.30 s > 8: core[940e698046960fd5]::result::unwrap_failed<unknown>
  1534. 29.30 s > at <unknown source file>:<unknown line>
  1535. 29.30 s > 9: <test_renormalization[c99a4cd1432bec79]::finit_part_ghlo::{closure#0} as core[940e698046960fd5]::ops::function::FnOnce<()>>::call_once<unknown>
  1536. 29.30 s > at <unknown source file>:<unknown line>
  1537. 29.30 s > 10: test[75d6903177b1d7e9]::__rust_begin_short_backtrace::<core[940e698046960fd5]::result::Result<(), alloc[2ea6bcb46fca0c42]::string::String>, fn() -> core[940e698046960fd5]::result::Result<(), alloc[2ea6bcb46fca0c42]::string::String>><unknown>
  1538. 29.30 s > at <unknown source file>:<unknown line>
  1539. 29.30 s > 11: test[75d6903177b1d7e9]::run_test::{closure#0}<unknown>
  1540. 29.30 s > at <unknown source file>:<unknown line>
  1541. 29.30 s > 12: std[bcb96dfbba0ab899]::sys::backtrace::__rust_begin_short_backtrace::<test[75d6903177b1d7e9]::run_test::{closure#1}, ()><unknown>
  1542. 29.30 s > at <unknown source file>:<unknown line>
  1543. 29.30 s > 13: <std[bcb96dfbba0ab899]::thread::lifecycle::spawn_unchecked<test[75d6903177b1d7e9]::run_test::{closure#1}, ()>::{closure#1} as core[940e698046960fd5]::ops::function::FnOnce<()>>::call_once::{shim:vtable#0}<unknown>
  1544. 29.30 s > at <unknown source file>:<unknown line>
  1545. 29.30 s > 14: <std[bcb96dfbba0ab899]::sys::thread::unix::Thread>::new::thread_start<unknown>
  1546. 29.30 s > at <unknown source file>:<unknown line>
  1547. 29.30 s > 15: start_thread<unknown>
  1548. 29.30 s > at <unknown source file>:<unknown line>
  1549. 29.30 s > 16: __clone3<unknown>
  1550. 29.30 s > at <unknown source file>:<unknown line>
  1551. 29.30 s >
  1552. 29.30 s > Run with COLORBT_SHOW_HIDDEN=1 environment variable to disable frame filtering.
  1553. 29.30 s > Run with RUST_BACKTRACE=full to include source snippets.
  1554. 29.30 s >
  1555. 29.30 s > FAIL [ 0.195s] (443/456) gammalooprs::test_renormalization finite_part_quark_lo
  1556. 29.30 s > stdout ---
  1557. 29.30 s >
  1558. 29.30 s > running 1 test
  1559. 29.30 s > test finite_part_quark_lo ... FAILED
  1560. 29.30 s >
  1561. 29.30 s > failures:
  1562. 29.30 s >
  1563. 29.30 s > failures:
  1564. 29.30 s > finite_part_quark_lo
  1565. 29.30 s >
  1566. 29.30 s > test result: FAILED. 0 passed; 1 failed; 0 ignored; 0 measured; 5 filtered out; finished in 0.18s
  1567. 29.30 s >
  1568. 29.30 s > stderr ---
  1569. 29.30 s > The application panicked (crashed).
  1570. 29.30 s > Message: called `Result::unwrap()` on an `Err` value: "Symbol spenso::mink redefined with new attributes:\n\t- new user data specified: List([String(\"spenso::representation-v2\"), String(\"inline-metric\"), List([String(\"symbol\"), String(\"mink\")]), List([String(\"cyclic\"), Integer(1), List([List([String(\"symbol\"), String(\"mu\")]), List([String(\"symbol\"), String(\"nu\")]), List([String(\"symbol\"), String(\"rho\")]), List([String(\"symbol\"), String(\"sigma\")])])]), String(\"top\")]) vs None\n"
  1571. 29.30 s > Location: crates/vakint/src/lib.rs:4766
  1572. 29.30 s >
  1573. 29.30 s > ━━━━━━━━━━━━━━━━━━━━━━━━━━━━━━━━━━ BACKTRACE ━━━━━━━━━━━━━━━━━━━━━━━━━━━━━━━━━━━
  1574. 29.30 s > 1: <color_eyre[5722b77bc20a64cf]::config::PanicHook>::panic_report<unknown>
  1575. 29.30 s > at <unknown source file>:<unknown line>
  1576. 29.30 s > 2: <color_eyre[5722b77bc20a64cf]::config::PanicHook>::into_panic_hook::{closure#0}<unknown>
  1577. 29.30 s > at <unknown source file>:<unknown line>
  1578. 29.30 s > 3: std[bcb96dfbba0ab899]::panicking::panic_with_hook<unknown>
  1579. 29.30 s > at <unknown source file>:<unknown line>
  1580. 29.30 s > 4: std[bcb96dfbba0ab899]::panicking::panic_handler::{closure#0}<unknown>
  1581. 29.30 s > at <unknown source file>:<unknown line>
  1582. 29.30 s > 5: std[bcb96dfbba0ab899]::sys::backtrace::__rust_end_short_backtrace::<std[bcb96dfbba0ab899]::panicking::panic_handler::{closure#0}, !><unknown>
  1583. 29.30 s > at <unknown source file>:<unknown line>
  1584. 29.30 s > 6: __rustc[6c289b9f9c454d21]::rust_begin_unwind<unknown>
  1585. 29.30 s > at <unknown source file>:<unknown line>
  1586. 29.30 s > 7: core[940e698046960fd5]::panicking::panic_fmt<unknown>
  1587. 29.30 s > at <unknown source file>:<unknown line>
  1588. 29.30 s > 8: core[940e698046960fd5]::result::unwrap_failed<unknown>
  1589. 29.30 s > at <unknown source file>:<unknown line>
  1590. 29.30 s > 9: <vakint[ad2b4d4b4d753fb9]::Vakint>::sanitize_user_expressions<unknown>
  1591. 29.30 s > at <unknown source file>:<unknown line>
  1592. 29.30 s > 10: <vakint[ad2b4d4b4d753fb9]::Vakint>::prepare_expression_for_form<unknown>
  1593. 29.30 s > at <unknown source file>:<unknown line>
  1594. 29.30 s > 11: <vakint[ad2b4d4b4d753fb9]::VakintTerm>::tensor_reduce<unknown>
  1595. 29.30 s > at <unknown source file>:<unknown line>
  1596. 29.30 s > 12: <vakint[ad2b4d4b4d753fb9]::VakintExpression>::tensor_reduce<unknown>
  1597. 29.30 s > at <unknown source file>:<unknown line>
  1598. 29.30 s > 13: <gammalooprs[4688948c89ba1ea7]::uv::approx::integrated::Integrated>::integrate::<gammalooprs[4688948c89ba1ea7]::uv::hedge_poset::ForestNode><unknown>
  1599. 29.30 s > at <unknown source file>:<unknown line>
  1600. 29.30 s > 14: <gammalooprs[4688948c89ba1ea7]::uv::approx::integrated::Integrated>::run::<gammalooprs[4688948c89ba1ea7]::uv::hedge_poset::ForestNode, gammalooprs[4688948c89ba1ea7]::uv::hedge_poset::ForestNode><unknown>
  1601. 29.30 s > at <unknown source file>:<unknown line>
  1602. 29.30 s > 15: <gammalooprs[4688948c89ba1ea7]::uv::hedge_poset::Forests>::integrate<unknown>
  1603. 29.30 s > at <unknown source file>:<unknown line>
  1604. 29.30 s > 16: gammalooprs[4688948c89ba1ea7]::uv::orchestrator::hedge_poset_renormalization_part<unknown>
  1605. 29.30 s > at <unknown source file>:<unknown line>
  1606. 29.30 s > 17: <gammalooprs[4688948c89ba1ea7]::uv::settings::UVOrchestrator>::renormalization_part<unknown>
  1607. 29.30 s > at <unknown source file>:<unknown line>
  1608. 29.30 s > 18: <gammalooprs[4688948c89ba1ea7]::processes::amplitude::AmplitudeGraph>::renormalization_part<unknown>
  1609. 29.30 s > at <unknown source file>:<unknown line>
  1610. 29.30 s > 19: <test_renormalization[c99a4cd1432bec79]::finite_part_quark_lo::{closure#0} as core[940e698046960fd5]::ops::function::FnOnce<()>>::call_once<unknown>
  1611. 29.30 s > at <unknown source file>:<unknown line>
  1612. 29.30 s > 20: test[75d6903177b1d7e9]::__rust_begin_short_backtrace::<core[940e698046960fd5]::result::Result<(), alloc[2ea6bcb46fca0c42]::string::String>, fn() -> core[940e698046960fd5]::result::Result<(), alloc[2ea6bcb46fca0c42]::string::String>><unknown>
  1613. 29.30 s > at <unknown source file>:<unknown line>
  1614. 29.30 s > 21: test[75d6903177b1d7e9]::run_test::{closure#0}<unknown>
  1615. 29.30 s > at <unknown source file>:<unknown line>
  1616. 29.30 s > 22: std[bcb96dfbba0ab899]::sys::backtrace::__rust_begin_short_backtrace::<test[75d6903177b1d7e9]::run_test::{closure#1}, ()><unknown>
  1617. 29.30 s > at <unknown source file>:<unknown line>
  1618. 29.30 s > 23: <std[bcb96dfbba0ab899]::thread::lifecycle::spawn_unchecked<test[75d6903177b1d7e9]::run_test::{closure#1}, ()>::{closure#1} as core[940e698046960fd5]::ops::function::FnOnce<()>>::call_once::{shim:vtable#0}<unknown>
  1619. 29.30 s > at <unknown source file>:<unknown line>
  1620. 29.30 s > 24: <std[bcb96dfbba0ab899]::sys::thread::unix::Thread>::new::thread_start<unknown>
  1621. 29.30 s > at <unknown source file>:<unknown line>
  1622. 29.30 s > 25: start_thread<unknown>
  1623. 29.30 s > at <unknown source file>:<unknown line>
  1624. 29.30 s > 26: __clone3<unknown>
  1625. 29.30 s > at <unknown source file>:<unknown line>
  1626. 29.30 s >
  1627. 29.30 s > Run with COLORBT_SHOW_HIDDEN=1 environment variable to disable frame filtering.
  1628. 29.30 s > Run with RUST_BACKTRACE=full to include source snippets.
  1629. 29.30 s >
  1630. 29.30 s > FAIL [ 0.298s] (446/456) gammalooprs::test_renormalization finite_part_ghost_2loop
  1631. 29.30 s > stdout ---
  1632. 29.30 s >
  1633. 29.30 s > running 1 test
  1634. 29.30 s > test finite_part_ghost_2loop ... FAILED
  1635. 29.30 s >
  1636. 29.30 s > failures:
  1637. 29.30 s >
  1638. 29.30 s > failures:
  1639. 29.30 s > finite_part_ghost_2loop
  1640. 29.30 s >
  1641. 29.30 s > test result: FAILED. 0 passed; 1 failed; 0 ignored; 0 measured; 5 filtered out; finished in 0.29s
  1642. 29.30 s >
  1643. 29.30 s > stderr ---
  1644. 29.30 s > The application panicked (crashed).
  1645. 29.30 s > Message: called `Result::unwrap()` on an `Err` value:
  1646. 29.30 s > 0: Symbolica could not parse FORM output:
  1647. 29.30 s > [spenso::{antisymmetric,real,spenso::tensor}::f]([spenso::{spenso::representat\
  1648. 29.30 s > ion,spenso::self_dual}::coad](8,[gammalooprs::{spenso::index}::hedge](0)
  1649. 29.30 s > ),[spenso::{spenso::representation,spenso::self_dual}::coad](8,[gammaloo\
  1650. 29.30 s > prs::{spenso::index}::hedge](3)),[spenso::{spenso::representation,spenso\
  1651. 29.30 s > ::self_dual}::coad](8,[gammalooprs::{spenso::index}::hedge](5)))*
  1652. 29.30 s > [spenso::{antisymmetric,real,spenso::tensor}::f]([spenso::{spenso::repre\
  1653. 29.30 s > sentation,spenso::self_dual}::coad](8,[gammalooprs::{spenso::index}::hed\
  1654. 29.30 s > ge](1)),[spenso::{spenso::representation,spenso::self_dual}::coad](8,
  1655. 29.30 s > [gammalooprs::{spenso::index}::hedge](11)),[spenso::{spenso::representat\
  1656. 29.30 s > ion,spenso::self_dual}::coad](8,[gammalooprs::{spenso::index}::hedge](7)
  1657. 29.30 s > ))*[spenso::{antisymmetric,real,spenso::tensor}::f]([spenso::{spenso::re\
  1658. 29.30 s > presentation,spenso::self_dual}::coad](8,[gammalooprs::{spenso::index}::\
  1659. 29.30 s > hedge](3)),[spenso::{spenso::representation,spenso::self_dual}::coad](8,
  1660. 29.30 s > [gammalooprs::{spenso::index}::hedge](7)),[spenso::{spenso::representati\
  1661. 29.30 s > on,spenso::self_dual}::coad](8,[gammalooprs::{spenso::index}::hedge](9))
  1662. 29.30 s > )*[spenso::{antisymmetric,real,spenso::tensor}::f]([spenso::{spenso::rep\
  1663. 29.30 s > resentation,spenso::self_dual}::coad](8,[gammalooprs::{spenso::index}::h\
  1664. 29.30 s > edge](11)),[spenso::{spenso::representation,spenso::self_dual}::coad](8,
  1665. 29.30 s > [gammalooprs::{spenso::index}::hedge](5)),[spenso::{spenso::representati\
  1666. 29.30 s > on,spenso::self_dual}::coad](8,[gammalooprs::{spenso::index}::hedge](9))
  1667. 29.30 s > )*dot(p4,p0)*dot(k1,k1)*dot(k2,k2)*i_*[UFO::{}::GC_10]^4*rat(1,ep - 2)
  1668. 29.30 s > + [spenso::{antisymmetric,real,spenso::tensor}::f]([spenso::{spenso::re\
  1669. 29.30 s > presentation,spenso::self_dual}::coad](8,[gammalooprs::{spenso::index}::\
  1670. 29.30 s > hedge](0)),[spenso::{spenso::representation,spenso::self_dual}::coad](8,
  1671. 29.30 s > [gammalooprs::{spenso::index}::hedge](3)),[spenso::{spenso::representati\
  1672. 29.30 s > on,spenso::self_dual}::coad](8,[gammalooprs::{spenso::index}::hedge](5))
  1673. 29.30 s > )*[spenso::{antisymmetric,real,spenso::tensor}::f]([spenso::{spenso::rep\
  1674. 29.30 s > resentation,spenso::self_dual}::coad](8,[gammalooprs::{spenso::index}::h\
  1675. 29.30 s > edge](1)),[spenso::{spenso::representation,spenso::self_dual}::coad](8,
  1676. 29.30 s > [gammalooprs::{spenso::index}::hedge](11)),[spenso::{spenso::representat\
  1677. 29.30 s > ion,spenso::self_dual}::coad](8,[gammalooprs::{spenso::index}::hedge](7)
  1678. 29.30 s > ))*[spenso::{antisymmetric,real,spenso::tensor}::f]([spenso::{spenso::re\
  1679. 29.30 s > presentation,spenso::self_dual}::coad](8,[gammalooprs::{spenso::index}::\
  1680. 29.30 s > hedge](3)),[spenso::{spenso::representation,spenso::self_dual}::coad](8,
  1681. 29.30 s > [gammalooprs::{spenso::index}::hedge](7)),[spenso::{spenso::representati\
  1682. 29.30 s > on,spenso::self_dual}::coad](8,[gammalooprs::{spenso::index}::hedge](9))
  1683. 29.30 s > )*[spenso::{antisymmetric,real,spenso::tensor}::f]([spenso::{spenso::rep\
  1684. 29.30 s > resentation,spenso::self_dual}::coad](8,[gammalooprs::{spenso::index}::h\
  1685. 29.30 s > edge](11)),[spenso::{spenso::representation,spenso::self_dual}::coad](8,
  1686. 29.30 s > [gammalooprs::{spenso::index}::hedge](5)),[spenso::{spenso::representati\
  1687. 29.30 s > on,spenso::self_dual}::coad](8,[gammalooprs::{spenso::index}::hedge](9))
  1688. 29.30 s > )*dot(p4,p0)*dot(k1,k2)^2*i_*[UFO::{}::GC_10]^4*rat(-1,ep - 2)
  1689. 29.30 s >
  1690. 29.30 s > Error:Symbol spenso::coad redefined with new attributes:
  1691. 29.30 s > - new user data specified: List([String("spenso::representation-v2"), String("self-dual"), List([String("symbol"), String("coad")]), List([String("cyclic"), Integer(1), List([List([String("symbol"), String("a")]), List([String("symbol"), String("b")]), List([String("symbol"), String("c")]), List([String("symbol"), String("d")])])]), String("top")]) vs None
  1692. 29.30 s >
  1693. 29.30 s >
  1694. 29.30 s > Location:
  1695. 29.30 s > crates/gammalooprs/src/uv/approx/integrated.rs:332
  1696. 29.30 s >
  1697. 29.30 s > ━━━━━━━━━━━━━━━━━━━━━━━━━━━━━━━━━━ BACKTRACE ━━━━━━━━━━━━━━━━━━━━━━━━━━━━━━━━━━━
  1698. 29.30 s > 1: <color_eyre[5722b77bc20a64cf]::config::EyreHook>::into_eyre_hook::{closure#0}<unknown>
  1699. 29.30 s > at <unknown source file>:<unknown line>
  1700. 29.30 s > 2: eyre[cb2fd339c0c40fca]::capture_handler<unknown>
  1701. 29.30 s > at <unknown source file>:<unknown line>
  1702. 29.30 s > 3: <eyre[cb2fd339c0c40fca]::Report>::from_std::<vakint[ad2b4d4b4d753fb9]::VakintError><unknown>
  1703. 29.30 s > at <unknown source file>:<unknown line>
  1704. 29.30 s > 4: <gammalooprs[4688948c89ba1ea7]::uv::approx::integrated::Integrated>::integrate::<gammalooprs[4688948c89ba1ea7]::uv::approx::Approximation><unknown>
  1705. 29.30 s > at <unknown source file>:<unknown line>
  1706. 29.30 s > 5: <gammalooprs[4688948c89ba1ea7]::uv::forest::Forest>::compute<unknown>
  1707. 29.30 s > at <unknown source file>:<unknown line>
  1708. 29.30 s > 6: gammalooprs[4688948c89ba1ea7]::uv::orchestrator::legacy_renormalization_part<unknown>
  1709. 29.30 s > at <unknown source file>:<unknown line>
  1710. 29.30 s > 7: <gammalooprs[4688948c89ba1ea7]::uv::settings::UVOrchestrator>::renormalization_part<unknown>
  1711. 29.30 s > at <unknown source file>:<unknown line>
  1712. 29.30 s > 8: <gammalooprs[4688948c89ba1ea7]::processes::amplitude::AmplitudeGraph>::renormalization_part<unknown>
  1713. 29.30 s > at <unknown source file>:<unknown line>
  1714. 29.30 s > 9: test_renormalization[c99a4cd1432bec79]::finite_part_ghost_2loop<unknown>
  1715. 29.30 s > at <unknown source file>:<unknown line>
  1716. 29.30 s > 10: <test_renormalization[c99a4cd1432bec79]::finite_part_ghost_2loop::{closure#0} as core[940e698046960fd5]::ops::function::FnOnce<()>>::call_once<unknown>
  1717. 29.30 s > at <unknown source file>:<unknown line>
  1718. 29.30 s > 11: test[75d6903177b1d7e9]::__rust_begin_short_backtrace::<core[940e698046960fd5]::result::Result<(), alloc[2ea6bcb46fca0c42]::string::String>, fn() -> core[940e698046960fd5]::result::Result<(), alloc[2ea6bcb46fca0c42]::string::String>><unknown>
  1719. 29.30 s > at <unknown source file>:<unknown line>
  1720. 29.30 s > 12: test[75d6903177b1d7e9]::run_test::{closure#0}<unknown>
  1721. 29.30 s > at <unknown source file>:<unknown line>
  1722. 29.30 s > 13: std[bcb96dfbba0ab899]::sys::backtrace::__rust_begin_short_backtrace::<test[75d6903177b1d7e9]::run_test::{closure#1}, ()><unknown>
  1723. 29.30 s > at <unknown source file>:<unknown line>
  1724. 29.30 s > 14: <std[bcb96dfbba0ab899]::thread::lifecycle::spawn_unchecked<test[75d6903177b1d7e9]::run_test::{closure#1}, ()>::{closure#1} as core[940e698046960fd5]::ops::function::FnOnce<()>>::call_once::{shim:vtable#0}<unknown>
  1725. 29.30 s > at <unknown source file>:<unknown line>
  1726. 29.30 s > 15: <std[bcb96dfbba0ab899]::sys::thread::unix::Thread>::new::thread_start<unknown>
  1727. 29.30 s > at <unknown source file>:<unknown line>
  1728. 29.30 s > 16: start_thread<unknown>
  1729. 29.30 s > at <unknown source file>:<unknown line>
  1730. 29.30 s > 17: __clone3<unknown>
  1731. 29.30 s > at <unknown source file>:<unknown line>
  1732. 29.30 s >
  1733. 29.30 s > Run with COLORBT_SHOW_HIDDEN=1 environment variable to disable frame filtering.
  1734. 29.30 s > Run with RUST_BACKTRACE=full to include source snippets.
  1735. 29.30 s > Location: crates/gammalooprs/tests/test_renormalization.rs:445
  1736. 29.30 s >
  1737. 29.30 s > ━━━━━━━━━━━━━━━━━━━━━━━━━━━━━━━━━━ BACKTRACE ━━━━━━━━━━━━━━━━━━━━━━━━━━━━━━━━━━━
  1738. 29.30 s > 1: <color_eyre[5722b77bc20a64cf]::config::PanicHook>::panic_report<unknown>
  1739. 29.30 s > at <unknown source file>:<unknown line>
  1740. 29.30 s > 2: <color_eyre[5722b77bc20a64cf]::config::PanicHook>::into_panic_hook::{closure#0}<unknown>
  1741. 29.30 s > at <unknown source file>:<unknown line>
  1742. 29.30 s > 3: std[bcb96dfbba0ab899]::panicking::panic_with_hook<unknown>
  1743. 29.30 s > at <unknown source file>:<unknown line>
  1744. 29.30 s > 4: std[bcb96dfbba0ab899]::panicking::panic_handler::{closure#0}<unknown>
  1745. 29.30 s > at <unknown source file>:<unknown line>
  1746. 29.30 s > 5: std[bcb96dfbba0ab899]::sys::backtrace::__rust_end_short_backtrace::<std[bcb96dfbba0ab899]::panicking::panic_handler::{closure#0}, !><unknown>
  1747. 29.30 s > at <unknown source file>:<unknown line>
  1748. 29.30 s > 6: __rustc[6c289b9f9c454d21]::rust_begin_unwind<unknown>
  1749. 29.30 s > at <unknown source file>:<unknown line>
  1750. 29.30 s > 7: core[940e698046960fd5]::panicking::panic_fmt<unknown>
  1751. 29.30 s > at <unknown source file>:<unknown line>
  1752. 29.30 s > 8: core[940e698046960fd5]::result::unwrap_failed<unknown>
  1753. 29.30 s > at <unknown source file>:<unknown line>
  1754. 29.30 s > 9: test_renormalization[c99a4cd1432bec79]::finite_part_ghost_2loop<unknown>
  1755. 29.30 s > at <unknown source file>:<unknown line>
  1756. 29.30 s > 10: <test_renormalization[c99a4cd1432bec79]::finite_part_ghost_2loop::{closure#0} as core[940e698046960fd5]::ops::function::FnOnce<()>>::call_once<unknown>
  1757. 29.30 s > at <unknown source file>:<unknown line>
  1758. 29.30 s > 11: test[75d6903177b1d7e9]::__rust_begin_short_backtrace::<core[940e698046960fd5]::result::Result<(), alloc[2ea6bcb46fca0c42]::string::String>, fn() -> core[940e698046960fd5]::result::Result<(), alloc[2ea6bcb46fca0c42]::string::String>><unknown>
  1759. 29.30 s > at <unknown source file>:<unknown line>
  1760. 29.30 s > 12: test[75d6903177b1d7e9]::run_test::{closure#0}<unknown>
  1761. 29.30 s > at <unknown source file>:<unknown line>
  1762. 29.30 s > 13: std[bcb96dfbba0ab899]::sys::backtrace::__rust_begin_short_backtrace::<test[75d6903177b1d7e9]::run_test::{closure#1}, ()><unknown>
  1763. 29.30 s > at <unknown source file>:<unknown line>
  1764. 29.30 s > 14: <std[bcb96dfbba0ab899]::thread::lifecycle::spawn_unchecked<test[75d6903177b1d7e9]::run_test::{closure#1}, ()>::{closure#1} as core[940e698046960fd5]::ops::function::FnOnce<()>>::call_once::{shim:vtable#0}<unknown>
  1765. 29.30 s > at <unknown source file>:<unknown line>
  1766. 29.30 s > 15: <std[bcb96dfbba0ab899]::sys::thread::unix::Thread>::new::thread_start<unknown>
  1767. 29.30 s > at <unknown source file>:<unknown line>
  1768. 29.30 s > 16: start_thread<unknown>
  1769. 29.30 s > at <unknown source file>:<unknown line>
  1770. 29.30 s > 17: __clone3<unknown>
  1771. 29.30 s > at <unknown source file>:<unknown line>
  1772. 29.30 s >
  1773. 29.30 s > Run with COLORBT_SHOW_HIDDEN=1 environment variable to disable frame filtering.
  1774. 29.30 s > Run with RUST_BACKTRACE=full to include source snippets.
  1775. 29.30 s >
  1776. 29.30 s > error: test run failed
  1777. 29.30 s >
  1778. 29.30 s > ========== nextest test summary ==========
  1779. 29.30 s > report: target/nextest/ci_gammaloop/junit.xml
  1780. 29.30 s > tests: 456, failures: 3, errors: 0
  1781. 29.30 s >
  1782. 29.30 s > 1. gammalooprs::test_renormalization::finit_part_ghlo
  1783. 29.30 s > failure: test failure with exit code 101
  1784. 29.30 s > system-out
  1785. 29.30 s > running 1 test
  1786. 29.30 s > test finit_part_ghlo ... FAILED
  1787. 29.30 s >
  1788. 29.30 s > failures:
  1789. 29.30 s >
  1790. 29.30 s > failures:
  1791. 29.30 s > finit_part_ghlo
  1792. 29.30 s >
  1793. 29.30 s > test result: FAILED. 0 passed; 1 failed; 0 ignored; 0 measured; 5 filtered out; finished in 0.10s
  1794. 29.30 s > system-err
  1795. 29.30 s > The application panicked (crashed).
  1796. 29.30 s > Message: called `Result::unwrap()` on an `Err` value:
  1797. 29.30 s > 0: Symbolica could not parse FORM output:
  1798. 29.30 s > [spenso::{antisymmetric,real,spenso::tensor}::f]([spenso::{spenso::representat\
  1799. 29.30 s > ion,spenso::self_dual}::coad](8,[gammalooprs::{spenso::index}::hedge](0)
  1800. 29.30 s > ),[spenso::{spenso::representation,spenso::self_dual}::coad](8,[gammaloo\
  1801. 29.30 s > prs::{spenso::index}::hedge](3)),[spenso::{spenso::representation,spenso\
  1802. 29.30 s > ::self_dual}::coad](8,[gammalooprs::{spenso::index}::hedge](5)))*
  1803. 29.30 s > [spenso::{antisymmetric,real,spenso::tensor}::f]([spenso::{spenso::repre\
  1804. 29.30 s > sentation,spenso::self_dual}::coad](8,[gammalooprs::{spenso::index}::hed\
  1805. 29.30 s > ge](1)),[spenso::{spenso::representation,spenso::self_dual}::coad](8,
  1806. 29.30 s > [gammalooprs::{spenso::index}::hedge](3)),[spenso::{spenso::representati\
  1807. 29.30 s > on,spenso::self_dual}::coad](8,[gammalooprs::{spenso::index}::hedge](5))
  1808. 29.30 s > )*dot(p1,p0)*dot(k1,k1)*[UFO::{}::GC_10]^2*rat(-1,ep - 2)
  1809. 29.30 s >
  1810. 29.30 s > Error:Symbol spenso::coad redefined with new attributes:
  1811. 29.30 s > - new user data specified: List([String("spenso::representation-v2"), String("self-dual"), List([String("symbol"), String("coad")]), List([String("cyclic"), Integer(1), List([List([String("symbol"), String("a")]), List([String("symbol"), String("b")]), List([String("symbol"), String("c")]), List([String("symbol"), String("d")])])]), String("top")]) vs None
  1812. 29.30 s >
  1813. 29.30 s >
  1814. 29.30 s > Location:
  1815. 29.30 s > crates/gammalooprs/src/uv/approx/integrated.rs:332
  1816. 29.30 s >
  1817. 29.30 s > ━━━━━━━━━━━━━━━━━━━━━━━━━━━━━━━━━━ BACKTRACE ━━━━━━━━━━━━━━━━━━━━━━━━━━━━━━━━━━━
  1818. 29.30 s > 1: <color_eyre[5722b77bc20a64cf]::config::EyreHook>::into_eyre_hook::{closure#0}<unknown>
  1819. 29.30 s > at <unknown source file>:<unknown line>
  1820. 29.30 s > 2: eyre[cb2fd339c0c40fca]::capture_handler<unknown>
  1821. 29.30 s > at <unknown source file>:<unknown line>
  1822. 29.30 s > 3: <eyre[cb2fd339c0c40fca]::Report>::from_std::<vakint[ad2b4d4b4d753fb9]::VakintError><unknown>
  1823. 29.30 s > at <unknown source file>:<unknown line>
  1824. 29.30 s > 4: <gammalooprs[4688948c89ba1ea7]::uv::approx::integrated::Integrated>::integrate::<gammalooprs[4688948c89ba1ea7]::uv::hedge_poset::ForestNode><unknown>
  1825. 29.30 s > at <unknown source file>:<unknown line>
  1826. 29.30 s > 5: <gammalooprs[4688948c89ba1ea7]::uv::approx::integrated::Integrated>::run::<gammalooprs[4688948c89ba1ea7]::uv::hedge_poset::ForestNode, gammalooprs[4688948c89ba1ea7]::uv::hedge_poset::ForestNode><unknown>
  1827. 29.30 s > at <unknown source file>:<unknown line>
  1828. 29.30 s > 6: <gammalooprs[4688948c89ba1ea7]::uv::hedge_poset::Forests>::integrate<unknown>
  1829. 29.30 s > at <unknown source file>:<unknown line>
  1830. 29.30 s > 7: gammalooprs[4688948c89ba1ea7]::uv::orchestrator::hedge_poset_renormalization_part<unknown>
  1831. 29.30 s > at <unknown source file>:<unknown line>
  1832. 29.30 s > 8: <gammalooprs[4688948c89ba1ea7]::uv::settings::UVOrchestrator>::renormalization_part<unknown>
  1833. 29.30 s > at <unknown source file>:<unknown line>
  1834. 29.30 s > 9: <gammalooprs[4688948c89ba1ea7]::processes::amplitude::AmplitudeGraph>::renormalization_part<unknown>
  1835. 29.30 s > at <unknown source file>:<unknown line>
  1836. 29.30 s > 10: <test_renormalization[c99a4cd1432bec79]::finit_part_ghlo::{closure#0} as core[940e698046960fd5]::ops::function::FnOnce<()>>::call_once<unknown>
  1837. 29.30 s > at <unknown source file>:<unknown line>
  1838. 29.30 s > 11: test[75d6903177b1d7e9]::__rust_begin_short_backtrace::<core[940e698046960fd5]::result::Result<(), alloc[2ea6bcb46fca0c42]::string::String>, fn() -> core[940e698046960fd5]::result::Result<(), alloc[2ea6bcb46fca0c42]::string::String>><unknown>
  1839. 29.30 s > at <unknown source file>:<unknown line>
  1840. 29.30 s > 12: test[75d6903177b1d7e9]::run_test::{closure#0}<unknown>
  1841. 29.30 s > at <unknown source file>:<unknown line>
  1842. 29.30 s > 13: std[bcb96dfbba0ab899]::sys::backtrace::__rust_begin_short_backtrace::<test[75d6903177b1d7e9]::run_test::{closure#1}, ()><unknown>
  1843. 29.30 s > at <unknown source file>:<unknown line>
  1844. 29.30 s > 14: <std[bcb96dfbba0ab899]::thread::lifecycle::spawn_unchecked<test[75d6903177b1d7e9]::run_test::{closure#1}, ()>::{closure#1} as core[940e698046960fd5]::ops::function::FnOnce<()>>::call_once::{shim:vtable#0}<unknown>
  1845. 29.30 s > at <unknown source file>:<unknown line>
  1846. 29.30 s > 15: <std[bcb96dfbba0ab899]::sys::thread::unix::Thread>::new::thread_start<unknown>
  1847. 29.30 s > at <unknown source file>:<unknown line>
  1848. 29.30 s > 16: start_thread<unknown>
  1849. 29.30 s > at <unknown source file>:<unknown line>
  1850. 29.30 s > 17: __clone3<unknown>
  1851. 29.30 s > at <unknown source file>:<unknown line>
  1852. 29.30 s >
  1853. 29.30 s > Run with COLORBT_SHOW_HIDDEN=1 environment variable to disable frame filtering.
  1854. 29.30 s > Run with RUST_BACKTRACE=full to include source snippets.
  1855. 29.30 s > Location: crates/gammalooprs/tests/test_renormalization.rs:550
  1856. 29.30 s >
  1857. 29.30 s > ━━━━━━━━━━━━━━━━━━━━━━━━━━━━━━━━━━ BACKTRACE ━━━━━━━━━━━━━━━━━━━━━━━━━━━━━━━━━━━
  1858. 29.30 s > 1: <color_eyre[5722b77bc20a64cf]::config::PanicHook>::panic_report<unknown>
  1859. 29.30 s > at <unknown source file>:<unknown line>
  1860. 29.30 s > 2: <color_eyre[5722b77bc20a64cf]::config::PanicHook>::into_panic_hook::{closure#0}<unknown>
  1861. 29.30 s > at <unknown source file>:<unknown line>
  1862. 29.30 s > 3: std[bcb96dfbba0ab899]::panicking::panic_with_hook<unknown>
  1863. 29.30 s > at <unknown source file>:<unknown line>
  1864. 29.30 s > 4: std[bcb96dfbba0ab899]::panicking::panic_handler::{closure#0}<unknown>
  1865. 29.30 s > at <unknown source file>:<unknown line>
  1866. 29.30 s > 5: std[bcb96dfbba0ab899]::sys::backtrace::__rust_end_short_backtrace::<std[bcb96dfbba0ab899]::panicking::panic_handler::{closure#0}, !><unknown>
  1867. 29.30 s > at <unknown source file>:<unknown line>
  1868. 29.30 s > 6: __rustc[6c289b9f9c454d21]::rust_begin_unwind<unknown>
  1869. 29.30 s > at <unknown source file>:<unknown line>
  1870. 29.30 s > 7: core[940e698046960fd5]::panicking::panic_fmt<unknown>
  1871. 29.30 s > at <unknown source file>:<unknown line>
  1872. 29.30 s > 8: core[940e698046960fd5]::result::unwrap_failed<unknown>
  1873. 29.30 s > at <unknown source file>:<unknown line>
  1874. 29.30 s > 9: <test_renormalization[c99a4cd1432bec79]::finit_part_ghlo::{closure#0} as core[940e698046960fd5]::ops::function::FnOnce<()>>::call_once<unknown>
  1875. 29.30 s > at <unknown source file>:<unknown line>
  1876. 29.30 s > 10: test[75d6903177b1d7e9]::__rust_begin_short_backtrace::<core[940e698046960fd5]::result::Result<(), alloc[2ea6bcb46fca0c42]::string::String>, fn() -> core[940e698046960fd5]::result::Result<(), alloc[2ea6bcb46fca0c42]::string::String>><unknown>
  1877. 29.30 s > at <unknown source file>:<unknown line>
  1878. 29.30 s > 11: test[75d6903177b1d7e9]::run_test::{closure#0}<unknown>
  1879. 29.30 s > at <unknown source file>:<unknown line>
  1880. 29.30 s > 12: std[bcb96dfbba0ab899]::sys::backtrace::__rust_begin_short_backtrace::<test[75d6903177b1d7e9]::run_test::{closure#1}, ()><unknown>
  1881. 29.30 s > at <unknown source file>:<unknown line>
  1882. 29.30 s > 13: <std[bcb96dfbba0ab899]::thread::lifecycle::spawn_unchecked<test[75d6903177b1d7e9]::run_test::{closure#1}, ()>::{closure#1} as core[940e698046960fd5]::ops::function::FnOnce<()>>::call_once::{shim:vtable#0}<unknown>
  1883. 29.30 s > at <unknown source file>:<unknown line>
  1884. 29.30 s > 14: <std[bcb96dfbba0ab899]::sys::thread::unix::Thread>::new::thread_start<unknown>
  1885. 29.30 s > at <unknown source file>:<unknown line>
  1886. 29.30 s > 15: start_thread<unknown>
  1887. 29.30 s > at <unknown source file>:<unknown line>
  1888. 29.30 s > 16: __clone3<unknown>
  1889. 29.30 s > at <unknown source file>:<unknown line>
  1890. 29.30 s >
  1891. 29.30 s > Run with COLORBT_SHOW_HIDDEN=1 environment variable to disable frame filtering.
  1892. 29.30 s > Run with RUST_BACKTRACE=full to include source snippets.
  1893. 29.30 s >
  1894. 29.30 s > 2. gammalooprs::test_renormalization::finite_part_quark_lo
  1895. 29.30 s > failure: test failure with exit code 101
  1896. 29.30 s > system-out
  1897. 29.30 s > running 1 test
  1898. 29.30 s > test finite_part_quark_lo ... FAILED
  1899. 29.30 s >
  1900. 29.30 s > failures:
  1901. 29.30 s >
  1902. 29.30 s > failures:
  1903. 29.30 s > finite_part_quark_lo
  1904. 29.30 s >
  1905. 29.30 s > test result: FAILED. 0 passed; 1 failed; 0 ignored; 0 measured; 5 filtered out; finished in 0.18s
  1906. 29.30 s > system-err
  1907. 29.30 s > The application panicked (crashed).
  1908. 29.30 s > Message: called `Result::unwrap()` on an `Err` value: "Symbol spenso::mink redefined with new attributes:\n\t- new user data specified: List([String(\"spenso::representation-v2\"), String(\"inline-metric\"), List([String(\"symbol\"), String(\"mink\")]), List([String(\"cyclic\"), Integer(1), List([List([String(\"symbol\"), String(\"mu\")]), List([String(\"symbol\"), String(\"nu\")]), List([String(\"symbol\"), String(\"rho\")]), List([String(\"symbol\"), String(\"sigma\")])])]), String(\"top\")]) vs None\n"
  1909. 29.30 s > Location: crates/vakint/src/lib.rs:4766
  1910. 29.30 s >
  1911. 29.30 s > ━━━━━━━━━━━━━━━━━━━━━━━━━━━━━━━━━━ BACKTRACE ━━━━━━━━━━━━━━━━━━━━━━━━━━━━━━━━━━━
  1912. 29.30 s > 1: <color_eyre[5722b77bc20a64cf]::config::PanicHook>::panic_report<unknown>
  1913. 29.30 s > at <unknown source file>:<unknown line>
  1914. 29.30 s > 2: <color_eyre[5722b77bc20a64cf]::config::PanicHook>::into_panic_hook::{closure#0}<unknown>
  1915. 29.30 s > at <unknown source file>:<unknown line>
  1916. 29.30 s > 3: std[bcb96dfbba0ab899]::panicking::panic_with_hook<unknown>
  1917. 29.30 s > at <unknown source file>:<unknown line>
  1918. 29.30 s > 4: std[bcb96dfbba0ab899]::panicking::panic_handler::{closure#0}<unknown>
  1919. 29.30 s > at <unknown source file>:<unknown line>
  1920. 29.30 s > 5: std[bcb96dfbba0ab899]::sys::backtrace::__rust_end_short_backtrace::<std[bcb96dfbba0ab899]::panicking::panic_handler::{closure#0}, !><unknown>
  1921. 29.30 s > at <unknown source file>:<unknown line>
  1922. 29.30 s > 6: __rustc[6c289b9f9c454d21]::rust_begin_unwind<unknown>
  1923. 29.30 s > at <unknown source file>:<unknown line>
  1924. 29.30 s > 7: core[940e698046960fd5]::panicking::panic_fmt<unknown>
  1925. 29.30 s > at <unknown source file>:<unknown line>
  1926. 29.30 s > 8: core[940e698046960fd5]::result::unwrap_failed<unknown>
  1927. 29.30 s > at <unknown source file>:<unknown line>
  1928. 29.30 s > 9: <vakint[ad2b4d4b4d753fb9]::Vakint>::sanitize_user_expressions<unknown>
  1929. 29.30 s > at <unknown source file>:<unknown line>
  1930. 29.30 s > 10: <vakint[ad2b4d4b4d753fb9]::Vakint>::prepare_expression_for_form<unknown>
  1931. 29.30 s > at <unknown source file>:<unknown line>
  1932. 29.30 s > 11: <vakint[ad2b4d4b4d753fb9]::VakintTerm>::tensor_reduce<unknown>
  1933. 29.30 s > at <unknown source file>:<unknown line>
  1934. 29.30 s > 12: <vakint[ad2b4d4b4d753fb9]::VakintExpression>::tensor_reduce<unknown>
  1935. 29.30 s > at <unknown source file>:<unknown line>
  1936. 29.30 s > 13: <gammalooprs[4688948c89ba1ea7]::uv::approx::integrated::Integrated>::integrate::<gammalooprs[4688948c89ba1ea7]::uv::hedge_poset::ForestNode><unknown>
  1937. 29.30 s > at <unknown source file>:<unknown line>
  1938. 29.30 s > 14: <gammalooprs[4688948c89ba1ea7]::uv::approx::integrated::Integrated>::run::<gammalooprs[4688948c89ba1ea7]::uv::hedge_poset::ForestNode, gammalooprs[4688948c89ba1ea7]::uv::hedge_poset::ForestNode><unknown>
  1939. 29.30 s > at <unknown source file>:<unknown line>
  1940. 29.30 s > 15: <gammalooprs[4688948c89ba1ea7]::uv::hedge_poset::Forests>::integrate<unknown>
  1941. 29.30 s > at <unknown source file>:<unknown line>
  1942. 29.30 s > 16: gammalooprs[4688948c89ba1ea7]::uv::orchestrator::hedge_poset_renormalization_part<unknown>
  1943. 29.30 s > at <unknown source file>:<unknown line>
  1944. 29.30 s > 17: <gammalooprs[4688948c89ba1ea7]::uv::settings::UVOrchestrator>::renormalization_part<unknown>
  1945. 29.30 s > at <unknown source file>:<unknown line>
  1946. 29.30 s > 18: <gammalooprs[4688948c89ba1ea7]::processes::amplitude::AmplitudeGraph>::renormalization_part<unknown>
  1947. 29.30 s > at <unknown source file>:<unknown line>
  1948. 29.30 s > 19: <test_renormalization[c99a4cd1432bec79]::finite_part_quark_lo::{closure#0} as core[940e698046960fd5]::ops::function::FnOnce<()>>::call_once<unknown>
  1949. 29.30 s > at <unknown source file>:<unknown line>
  1950. 29.30 s > 20: test[75d6903177b1d7e9]::__rust_begin_short_backtrace::<core[940e698046960fd5]::result::Result<(), alloc[2ea6bcb46fca0c42]::string::String>, fn() -> core[940e698046960fd5]::result::Result<(), alloc[2ea6bcb46fca0c42]::string::String>><unknown>
  1951. 29.30 s > at <unknown source file>:<unknown line>
  1952. 29.30 s > 21: test[75d6903177b1d7e9]::run_test::{closure#0}<unknown>
  1953. 29.30 s > at <unknown source file>:<unknown line>
  1954. 29.30 s > 22: std[bcb96dfbba0ab899]::sys::backtrace::__rust_begin_short_backtrace::<test[75d6903177b1d7e9]::run_test::{closure#1}, ()><unknown>
  1955. 29.30 s > at <unknown source file>:<unknown line>
  1956. 29.30 s > 23: <std[bcb96dfbba0ab899]::thread::lifecycle::spawn_unchecked<test[75d6903177b1d7e9]::run_test::{closure#1}, ()>::{closure#1} as core[940e698046960fd5]::ops::function::FnOnce<()>>::call_once::{shim:vtable#0}<unknown>
  1957. 29.30 s > at <unknown source file>:<unknown line>
  1958. 29.30 s > 24: <std[bcb96dfbba0ab899]::sys::thread::unix::Thread>::new::thread_start<unknown>
  1959. 29.30 s > at <unknown source file>:<unknown line>
  1960. 29.30 s > 25: start_thread<unknown>
  1961. 29.30 s > at <unknown source file>:<unknown line>
  1962. 29.30 s > 26: __clone3<unknown>
  1963. 29.30 s > at <unknown source file>:<unknown line>
  1964. 29.30 s >
  1965. 29.30 s > Run with COLORBT_SHOW_HIDDEN=1 environment variable to disable frame filtering.
  1966. 29.30 s > Run with RUST_BACKTRACE=full to include source snippets.
  1967. 29.30 s >
  1968. 29.30 s > 3. gammalooprs::test_renormalization::finite_part_ghost_2loop
  1969. 29.30 s > failure: test failure with exit code 101
  1970. 29.30 s > system-out
  1971. 29.30 s > running 1 test
  1972. 29.30 s > test finite_part_ghost_2loop ... FAILED
  1973. 29.30 s >
  1974. 29.30 s > failures:
  1975. 29.30 s >
  1976. 29.30 s > failures:
  1977. 29.30 s > finite_part_ghost_2loop
  1978. 29.30 s >
  1979. 29.30 s > test result: FAILED. 0 passed; 1 failed; 0 ignored; 0 measured; 5 filtered out; finished in 0.29s
  1980. 29.30 s > system-err
  1981. 29.30 s > The application panicked (crashed).
  1982. 29.30 s > Message: called `Result::unwrap()` on an `Err` value:
  1983. 29.30 s > 0: Symbolica could not parse FORM output:
  1984. 29.30 s > [spenso::{antisymmetric,real,spenso::tensor}::f]([spenso::{spenso::representat\
  1985. 29.30 s > ion,spenso::self_dual}::coad](8,[gammalooprs::{spenso::index}::hedge](0)
  1986. 29.30 s > ),[spenso::{spenso::representation,spenso::self_dual}::coad](8,[gammaloo\
  1987. 29.30 s > prs::{spenso::index}::hedge](3)),[spenso::{spenso::representation,spenso\
  1988. 29.30 s > ::self_dual}::coad](8,[gammalooprs::{spenso::index}::hedge](5)))*
  1989. 29.30 s > [spenso::{antisymmetric,real,spenso::tensor}::f]([spenso::{spenso::repre\
  1990. 29.30 s > sentation,spenso::self_dual}::coad](8,[gammalooprs::{spenso::index}::hed\
  1991. 29.30 s > ge](1)),[spenso::{spenso::representation,spenso::self_dual}::coad](8,
  1992. 29.30 s > [gammalooprs::{spenso::index}::hedge](11)),[spenso::{spenso::representat\
  1993. 29.30 s > ion,spenso::self_dual}::coad](8,[gammalooprs::{spenso::index}::hedge](7)
  1994. 29.30 s > ))*[spenso::{antisymmetric,real,spenso::tensor}::f]([spenso::{spenso::re\
  1995. 29.30 s > presentation,spenso::self_dual}::coad](8,[gammalooprs::{spenso::index}::\
  1996. 29.30 s > hedge](3)),[spenso::{spenso::representation,spenso::self_dual}::coad](8,
  1997. 29.30 s > [gammalooprs::{spenso::index}::hedge](7)),[spenso::{spenso::representati\
  1998. 29.30 s > on,spenso::self_dual}::coad](8,[gammalooprs::{spenso::index}::hedge](9))
  1999. 29.30 s > )*[spenso::{antisymmetric,real,spenso::tensor}::f]([spenso::{spenso::rep\
  2000. 29.30 s > resentation,spenso::self_dual}::coad](8,[gammalooprs::{spenso::index}::h\
  2001. 29.30 s > edge](11)),[spenso::{spenso::representation,spenso::self_dual}::coad](8,
  2002. 29.30 s > [gammalooprs::{spenso::index}::hedge](5)),[spenso::{spenso::representati\
  2003. 29.30 s > on,spenso::self_dual}::coad](8,[gammalooprs::{spenso::index}::hedge](9))
  2004. 29.30 s > )*dot(p4,p0)*dot(k1,k1)*dot(k2,k2)*i_*[UFO::{}::GC_10]^4*rat(1,ep - 2)
  2005. 29.30 s > + [spenso::{antisymmetric,real,spenso::tensor}::f]([spenso::{spenso::re\
  2006. 29.30 s > presentation,spenso::self_dual}::coad](8,[gammalooprs::{spenso::index}::\
  2007. 29.30 s > hedge](0)),[spenso::{spenso::representation,spenso::self_dual}::coad](8,
  2008. 29.30 s > [gammalooprs::{spenso::index}::hedge](3)),[spenso::{spenso::representati\
  2009. 29.30 s > on,spenso::self_dual}::coad](8,[gammalooprs::{spenso::index}::hedge](5))
  2010. 29.30 s > )*[spenso::{antisymmetric,real,spenso::tensor}::f]([spenso::{spenso::rep\
  2011. 29.30 s > resentation,spenso::self_dual}::coad](8,[gammalooprs::{spenso::index}::h\
  2012. 29.30 s > edge](1)),[spenso::{spenso::representation,spenso::self_dual}::coad](8,
  2013. 29.30 s > [gammalooprs::{spenso::index}::hedge](11)),[spenso::{spenso::representat\
  2014. 29.30 s > ion,spenso::self_dual}::coad](8,[gammalooprs::{spenso::index}::hedge](7)
  2015. 29.30 s > ))*[spenso::{antisymmetric,real,spenso::tensor}::f]([spenso::{spenso::re\
  2016. 29.30 s > presentation,spenso::self_dual}::coad](8,[gammalooprs::{spenso::index}::\
  2017. 29.30 s > hedge](3)),[spenso::{spenso::representation,spenso::self_dual}::coad](8,
  2018. 29.30 s > [gammalooprs::{spenso::index}::hedge](7)),[spenso::{spenso::representati\
  2019. 29.30 s > on,spenso::self_dual}::coad](8,[gammalooprs::{spenso::index}::hedge](9))
  2020. 29.30 s > )*[spenso::{antisymmetric,real,spenso::tensor}::f]([spenso::{spenso::rep\
  2021. 29.30 s > resentation,spenso::self_dual}::coad](8,[gammalooprs::{spenso::index}::h\
  2022. 29.30 s > edge](11)),[spenso::{spenso::representation,spenso::self_dual}::coad](8,
  2023. 29.30 s > [gammalooprs::{spenso::index}::hedge](5)),[spenso::{spenso::representati\
  2024. 29.30 s > on,spenso::self_dual}::coad](8,[gammalooprs::{spenso::index}::hedge](9))
  2025. 29.30 s > )*dot(p4,p0)*dot(k1,k2)^2*i_*[UFO::{}::GC_10]^4*rat(-1,ep - 2)
  2026. 29.30 s >
  2027. 29.30 s > Error:Symbol spenso::coad redefined with new attributes:
  2028. 29.30 s > - new user data specified: List([String("spenso::representation-v2"), String("self-dual"), List([String("symbol"), String("coad")]), List([String("cyclic"), Integer(1), List([List([String("symbol"), String("a")]), List([String("symbol"), String("b")]), List([String("symbol"), String("c")]), List([String("symbol"), String("d")])])]), String("top")]) vs None
  2029. 29.30 s >
  2030. 29.30 s >
  2031. 29.30 s > Location:
  2032. 29.30 s > crates/gammalooprs/src/uv/approx/integrated.rs:332
  2033. 29.30 s >
  2034. 29.30 s > ━━━━━━━━━━━━━━━━━━━━━━━━━━━━━━━━━━ BACKTRACE ━━━━━━━━━━━━━━━━━━━━━━━━━━━━━━━━━━━
  2035. 29.30 s > 1: <color_eyre[5722b77bc20a64cf]::config::EyreHook>::into_eyre_hook::{closure#0}<unknown>
  2036. 29.30 s > at <unknown source file>:<unknown line>
  2037. 29.30 s > 2: eyre[cb2fd339c0c40fca]::capture_handler<unknown>
  2038. 29.30 s > at <unknown source file>:<unknown line>
  2039. 29.30 s > 3: <eyre[cb2fd339c0c40fca]::Report>::from_std::<vakint[ad2b4d4b4d753fb9]::VakintError><unknown>
  2040. 29.30 s > at <unknown source file>:<unknown line>
  2041. 29.30 s > 4: <gammalooprs[4688948c89ba1ea7]::uv::approx::integrated::Integrated>::integrate::<gammalooprs[4688948c89ba1ea7]::uv::approx::Approximation><unknown>
  2042. 29.30 s > at <unknown source file>:<unknown line>
  2043. 29.30 s > 5: <gammalooprs[4688948c89ba1ea7]::uv::forest::Forest>::compute<unknown>
  2044. 29.30 s > at <unknown source file>:<unknown line>
  2045. 29.30 s > 6: gammalooprs[4688948c89ba1ea7]::uv::orchestrator::legacy_renormalization_part<unknown>
  2046. 29.30 s > at <unknown source file>:<unknown line>
  2047. 29.30 s > 7: <gammalooprs[4688948c89ba1ea7]::uv::settings::UVOrchestrator>::renormalization_part<unknown>
  2048. 29.30 s > at <unknown source file>:<unknown line>
  2049. 29.30 s > 8: <gammalooprs[4688948c89ba1ea7]::processes::amplitude::AmplitudeGraph>::renormalization_part<unknown>
  2050. 29.30 s > at <unknown source file>:<unknown line>
  2051. 29.30 s > 9: test_renormalization[c99a4cd1432bec79]::finite_part_ghost_2loop<unknown>
  2052. 29.30 s > at <unknown source file>:<unknown line>
  2053. 29.30 s > 10: <test_renormalization[c99a4cd1432bec79]::finite_part_ghost_2loop::{closure#0} as core[940e698046960fd5]::ops::function::FnOnce<()>>::call_once<unknown>
  2054. 29.30 s > at <unknown source file>:<unknown line>
  2055. 29.30 s > 11: test[75d6903177b1d7e9]::__rust_begin_short_backtrace::<core[940e698046960fd5]::result::Result<(), alloc[2ea6bcb46fca0c42]::string::String>, fn() -> core[940e698046960fd5]::result::Result<(), alloc[2ea6bcb46fca0c42]::string::String>><unknown>
  2056. 29.30 s > at <unknown source file>:<unknown line>
  2057. 29.30 s > 12: test[75d6903177b1d7e9]::run_test::{closure#0}<unknown>
  2058. 29.30 s > at <unknown source file>:<unknown line>
  2059. 29.30 s > 13: std[bcb96dfbba0ab899]::sys::backtrace::__rust_begin_short_backtrace::<test[75d6903177b1d7e9]::run_test::{closure#1}, ()><unknown>
  2060. 29.30 s > at <unknown source file>:<unknown line>
  2061. 29.30 s > 14: <std[bcb96dfbba0ab899]::thread::lifecycle::spawn_unchecked<test[75d6903177b1d7e9]::run_test::{closure#1}, ()>::{closure#1} as core[940e698046960fd5]::ops::function::FnOnce<()>>::call_once::{shim:vtable#0}<unknown>
  2062. 29.30 s > at <unknown source file>:<unknown line>
  2063. 29.30 s > 15: <std[bcb96dfbba0ab899]::sys::thread::unix::Thread>::new::thread_start<unknown>
  2064. 29.30 s > at <unknown source file>:<unknown line>
  2065. 29.30 s > 16: start_thread<unknown>
  2066. 29.30 s > at <unknown source file>:<unknown line>
  2067. 29.30 s > 17: __clone3<unknown>
  2068. 29.30 s > at <unknown source file>:<unknown line>
  2069. 29.30 s >
  2070. 29.30 s > Run with COLORBT_SHOW_HIDDEN=1 environment variable to disable frame filtering.
  2071. 29.30 s > Run with RUST_BACKTRACE=full to include source snippets.
  2072. 29.30 s > Location: crates/gammalooprs/tests/test_renormalization.rs:445
  2073. 29.30 s >
  2074. 29.30 s > ━━━━━━━━━━━━━━━━━━━━━━━━━━━━━━━━━━ BACKTRACE ━━━━━━━━━━━━━━━━━━━━━━━━━━━━━━━━━━━
  2075. 29.30 s > 1: <color_eyre[5722b77bc20a64cf]::config::PanicHook>::panic_report<unknown>
  2076. 29.30 s > at <unknown source file>:<unknown line>
  2077. 29.30 s > 2: <color_eyre[5722b77bc20a64cf]::config::PanicHook>::into_panic_hook::{closure#0}<unknown>
  2078. 29.30 s > at <unknown source file>:<unknown line>
  2079. 29.30 s > 3: std[bcb96dfbba0ab899]::panicking::panic_with_hook<unknown>
  2080. 29.30 s > at <unknown source file>:<unknown line>
  2081. 29.30 s > 4: std[bcb96dfbba0ab899]::panicking::panic_handler::{closure#0}<unknown>
  2082. 29.30 s > at <unknown source file>:<unknown line>
  2083. 29.30 s > 5: std[bcb96dfbba0ab899]::sys::backtrace::__rust_end_short_backtrace::<std[bcb96dfbba0ab899]::panicking::panic_handler::{closure#0}, !><unknown>
  2084. 29.30 s > at <unknown source file>:<unknown line>
  2085. 29.30 s > 6: __rustc[6c289b9f9c454d21]::rust_begin_unwind<unknown>
  2086. 29.30 s > at <unknown source file>:<unknown line>
  2087. 29.30 s > 7: core[940e698046960fd5]::panicking::panic_fmt<unknown>
  2088. 29.30 s > at <unknown source file>:<unknown line>
  2089. 29.30 s > 8: core[940e698046960fd5]::result::unwrap_failed<unknown>
  2090. 29.30 s > at <unknown source file>:<unknown line>
  2091. 29.30 s > 9: test_renormalization[c99a4cd1432bec79]::finite_part_ghost_2loop<unknown>
  2092. 29.30 s > at <unknown source file>:<unknown line>
  2093. 29.30 s > 10: <test_renormalization[c99a4cd1432bec79]::finite_part_ghost_2loop::{closure#0} as core[940e698046960fd5]::ops::function::FnOnce<()>>::call_once<unknown>
  2094. 29.30 s > at <unknown source file>:<unknown line>
  2095. 29.30 s > 11: test[75d6903177b1d7e9]::__rust_begin_short_backtrace::<core[940e698046960fd5]::result::Result<(), alloc[2ea6bcb46fca0c42]::string::String>, fn() -> core[940e698046960fd5]::result::Result<(), alloc[2ea6bcb46fca0c42]::string::String>><unknown>
  2096. 29.30 s > at <unknown source file>:<unknown line>
  2097. 29.30 s > 12: test[75d6903177b1d7e9]::run_test::{closure#0}<unknown>
  2098. 29.30 s > at <unknown source file>:<unknown line>
  2099. 29.30 s > 13: std[bcb96dfbba0ab899]::sys::backtrace::__rust_begin_short_backtrace::<test[75d6903177b1d7e9]::run_test::{closure#1}, ()><unknown>
  2100. 29.30 s > ... omitted 12 more lines; see full nextest output above
  2101. 29.30 s > =========================================
  2102. 29.30 s For full logs, run:
  2103. 29.30 s nix log /nix/store/kdk12m3q1h6h241yxlkx2wvsy9l2g283-gammaloop-nextest-core.drv
  2104. 29.41 s [0 built (1 failed), 0.0Run failed.