test packages.x86_64-linux.nix-ci-check-gammaloop-nextest-spenso

Reproduce this run
Retry Run
  1. 0.00 s $ /nix/store/9ypz3flqsrl5xl495mm8h645gadjsxi1-coreutils-9.11/bin/timeout --kill-after=15s 7200s /nix/store/23zk8sgzamrbmj1fday15szf7f2279s8-nix-2.34.7/bin/nix --extra-experimental-features nix-command --extra-experimental-features flakes flake clone git+https://github.com/alphal00p/gammaloop --dest /tmp/nix-ci-worker/stable-pwd/repo/
  2. 0.10 s Cloning into '/tmp/nix-ci-worker/stable-pwd/repo'...
  3. 0.81 s remote: Enumerating objects: 84275, done.
  4. 0.93 s remote: Counting objects: 0% (1/8564) remote: Counting objects: 1% (86/8564) remote: Counting objects: 2% (172/8564) remote: Counting objects: 3% (257/8564) remote: Counting objects: 4% (343/8564) remote: Counting objects: 5% (429/8564) remote: Counting objects: 6% (514/8564) remote: Counting objects: 7% (600/8564) remote: Counting objects: 8% (686/8564) remote: Counting objects: 9% (771/8564) remote: Counting objects: 10% (857/8564) remote: Counting objects: 11% (943/8564) remote: Counting objects: 12% (1028/8564) remote: Counting objects: 13% (1114/8564) remote: Counting objects: 14% (1199/8564) remote: Counting objects: 15% (1285/8564) remote: Counting objects: 16% (1371/8564) remote: Counting objects: 17% (1456/8564) remote: Counting objects: 18% (1542/8564) remote: Counting objects: 19% (1628/8564) remote: Counting objects: 20% (1713/8564) remote: Counting objects: 21% (1799/8564) remote: Counting objects: 22% (1885/8564) remote: Counting objects: 23% (1970/8564) remote: Counting objects: 24% (2056/8564) remote: Counting objects: 25% (2141/8564) remote: Counting objects: 26% (2227/8564) remote: Counting objects: 27% (2313/8564) remote: Counting objects: 28% (2398/8564) remote: Counting objects: 29% (2484/8564) remote: Counting objects: 30% (2570/8564) remote: Counting objects: 31% (2655/8564) remote: Counting objects: 32% (2741/8564) remote: Counting objects: 33% (2827/8564) remote: Counting objects: 34% (2912/8564) remote: Counting objects: 35% (2998/8564) remote: Counting objects: 36% (3084/8564) remote: Counting objects: 37% (3169/8564) remote: Counting objects: 38% (3255/8564) remote: Counting objects: 39% (3340/8564) remote: Counting objects: 40% (3426/8564) remote: Counting objects: 41% (3512/8564) remote: Counting objects: 42% (3597/8564) remote: Counting objects: 43% (3683/8564) remote: Counting objects: 44% (3769/8564) remote: Counting objects: 45% (3854/8564) remote: Counting objects: 46% (3940/8564) remote: Counting objects: 47% (4026/8564) remote: Counting objects: 48% (4111/8564) remote: Counting objects: 49% (4197/8564) remote: Counting objects: 50% (4282/8564) remote: Counting objects: 51% (4368/8564) remote: Counting objects: 52% (4454/8564) remote: Counting objects: 53% (4539/8564) remote: Counting objects: 54% (4625/8564) remote: Counting objects: 55% (4711/8564) remote: Counting objects: 56% (4796/8564) remote: Counting objects: 57% (4882/8564) remote: Counting objects: 58% (4968/8564) remote: Counting objects: 59% (5053/8564) remote: Counting objects: 60% (5139/8564) remote: Counting objects: 61% (5225/8564) remote: Counting objects: 62% (5310/8564) remote: Counting objects: 63% (5396/8564) remote: Counting objects: 64% (5481/8564) remote: Counting objects: 65% (5567/8564) remote: Counting objects: 66% (5653/8564) remote: Counting objects: 67% (5738/8564) remote: Counting objects: 68% (5824/8564) remote: Counting objects: 69% (5910/8564) remote: Counting objects: 70% (5995/8564) remote: Counting objects: 71% (6081/8564) remote: Counting objects: 72% (6167/8564) remote: Counting objects: 73% (6252/8564) remote: Counting objects: 74% (6338/8564) remote: Counting objects: 75% (6423/8564) remote: Counting objects: 76% (6509/8564) remote: Counting objects: 77% (6595/8564) remote: Counting objects: 78% (6680/8564) remote: Counting objects: 79% (6766/8564) remote: Counting objects: 80% (6852/8564) remote: Counting objects: 81% (6937/8564) remote: Counting objects: 82% (7023/8564) remote: Counting objects: 83% (7109/8564) remote: Counting objects: 84% (7194/8564) remote: Counting objects: 85% (7280/8564) remote: Counting objects: 86% (7366/8564) remote: Counting objects: 87% (7451/8564) remote: Counting objects: 88% (7537/8564) remote: Counting objects: 89% (7622/8564) remote: Counting objects: 90% (7708/8564) remote: Counting objects: 91% (7794/8564) remote: Counting objects: 92% (7879/8564) remote: Counting objects: 93% (7965/8564) remote: Counting objects: 94% (8051/8564) remote: Counting objects: 95% (8136/8564) remote: Counting objects: 96% (8222/8564) remote: Counting objects: 97% (8308/8564) remote: Counting objects: 98% (8393/8564) remote: Counting objects: 99% (8479/8564) remote: Counting objects: 100% (8564/8564) remote: Counting objects: 100% (8564/8564), done.
  5. 2.65 s remote: Compressing objects: 0% (1/1729) remote: Compressing objects: 1% (18/1729) remote: Compressing objects: 2% (35/1729) remote: Compressing objects: 3% (52/1729) remote: Compressing objects: 4% (70/1729) remote: Compressing objects: 5% (87/1729) remote: Compressing objects: 6% (104/1729) remote: Compressing objects: 7% (122/1729) remote: Compressing objects: 8% (139/1729) remote: Compressing objects: 9% (156/1729) remote: Compressing objects: 10% (173/1729) remote: Compressing objects: 10% (189/1729) remote: Compressing objects: 11% (191/1729) remote: Compressing objects: 12% (208/1729) remote: Compressing objects: 13% (225/1729) remote: Compressing objects: 14% (243/1729) remote: Compressing objects: 15% (260/1729) remote: Compressing objects: 16% (277/1729) remote: Compressing objects: 17% (294/1729) remote: Compressing objects: 18% (312/1729) remote: Compressing objects: 19% (329/1729) remote: Compressing objects: 20% (346/1729) remote: Compressing objects: 21% (364/1729) remote: Compressing objects: 22% (381/1729) remote: Compressing objects: 23% (398/1729) remote: Compressing objects: 24% (415/1729) remote: Compressing objects: 25% (433/1729) remote: Compressing objects: 26% (450/1729) remote: Compressing objects: 27% (467/1729) remote: Compressing objects: 28% (485/1729) remote: Compressing objects: 29% (502/1729) remote: Compressing objects: 30% (519/1729) remote: Compressing objects: 31% (536/1729) remote: Compressing objects: 32% (554/1729) remote: Compressing objects: 33% (571/1729) remote: Compressing objects: 34% (588/1729) remote: Compressing objects: 35% (606/1729) remote: Compressing objects: 36% (623/1729) remote: Compressing objects: 37% (640/1729) remote: Compressing objects: 38% (658/1729) remote: Compressing objects: 39% (675/1729) remote: Compressing objects: 40% (692/1729) remote: Compressing objects: 41% (709/1729) remote: Compressing objects: 42% (727/1729) remote: Compressing objects: 43% (744/1729) remote: Compressing objects: 44% (761/1729) remote: Compressing objects: 45% (779/1729) remote: Compressing objects: 46% (796/1729) remote: Compressing objects: 47% (813/1729) remote: Compressing objects: 48% (830/1729) remote: Compressing objects: 49% (848/1729) remote: Compressing objects: 50% (865/1729) remote: Compressing objects: 51% (882/1729) remote: Compressing objects: 52% (900/1729) remote: Compressing objects: 53% (917/1729) remote: Compressing objects: 54% (934/1729) remote: Compressing objects: 55% (951/1729) remote: Compressing objects: 56% (969/1729) remote: Compressing objects: 57% (986/1729) remote: Compressing objects: 58% (1003/1729) remote: Compressing objects: 59% (1021/1729) remote: Compressing objects: 60% (1038/1729) remote: Compressing objects: 61% (1055/1729) remote: Compressing objects: 62% (1072/1729) remote: Compressing objects: 63% (1090/1729) remote: Compressing objects: 64% (1107/1729) remote: Compressing objects: 65% (1124/1729) remote: Compressing objects: 66% (1142/1729) remote: Compressing objects: 67% (1159/1729) remote: Compressing objects: 68% (1176/1729) remote: Compressing objects: 69% (1194/1729) remote: Compressing objects: 70% (1211/1729) remote: Compressing objects: 71% (1228/1729) remote: Compressing objects: 72% (1245/1729) remote: Compressing objects: 73% (1263/1729) remote: Compressing objects: 74% (1280/1729) remote: Compressing objects: 75% (1297/1729) remote: Compressing objects: 76% (1315/1729) remote: Compressing objects: 77% (1332/1729) remote: Compressing objects: 78% (1349/1729) remote: Compressing objects: 79% (1366/1729) remote: Compressing objects: 80% (1384/1729) remote: Compressing objects: 81% (1401/1729) remote: Compressing objects: 82% (1418/1729) remote: Compressing objects: 83% (1436/1729) remote: Compressing objects: 84% (1453/1729) remote: Compressing objects: 85% (1470/1729) remote: Compressing objects: 86% (1487/1729) remote: Compressing objects: 87% (1505/1729) remote: Compressing objects: 88% (1522/1729) remote: Compressing objects: 89% (1539/1729) remote: Compressing objects: 90% (1557/1729) remote: Compressing objects: 91% (1574/1729) remote: Compressing objects: 92% (1591/1729) remote: Compressing objects: 93% (1608/1729) remote: Compressing objects: 94% (1626/1729) remote: Compressing objects: 95% (1643/1729) remote: Compressing objects: 96% (1660/1729) remote: Compressing objects: 97% (1678/1729) remote: Compressing objects: 98% (1695/1729) remote: Compressing objects: 99% (1712/1729) remote: Compressing objects: 100% (1729/1729) remote: Compressing objects: 100% (1729/1729), done.
  6. 7.36 s Receiving objects: 0% (1/84275) Receiving objects: 1% (843/84275) Receiving objects: 2% (1686/84275) Receiving objects: 3% (2529/84275) Receiving objects: 4% (3371/84275) Receiving objects: 5% (4214/84275) Receiving objects: 6% (5057/84275) Receiving objects: 7% (5900/84275) Receiving objects: 8% (6742/84275), 9.87 MiB | 19.76 MiB/s Receiving objects: 9% (7585/84275), 9.87 MiB | 19.76 MiB/s Receiving objects: 10% (8428/84275), 9.87 MiB | 19.76 MiB/s Receiving objects: 11% (9271/84275), 9.87 MiB | 19.76 MiB/s Receiving objects: 12% (10113/84275), 9.87 MiB | 19.76 MiB/s Receiving objects: 13% (10956/84275), 9.87 MiB | 19.76 MiB/s Receiving objects: 14% (11799/84275), 9.87 MiB | 19.76 MiB/s Receiving objects: 15% (12642/84275), 9.87 MiB | 19.76 MiB/s Receiving objects: 16% (13484/84275), 9.87 MiB | 19.76 MiB/s Receiving objects: 17% (14327/84275), 9.87 MiB | 19.76 MiB/s Receiving objects: 18% (15170/84275), 9.87 MiB | 19.76 MiB/s Receiving objects: 19% (16013/84275), 9.87 MiB | 19.76 MiB/s Receiving objects: 20% (16855/84275), 9.87 MiB | 19.76 MiB/s Receiving objects: 21% (17698/84275), 9.87 MiB | 19.76 MiB/s Receiving objects: 22% (18541/84275), 9.87 MiB | 19.76 MiB/s Receiving objects: 23% (19384/84275), 9.87 MiB | 19.76 MiB/s Receiving objects: 24% (20226/84275), 9.87 MiB | 19.76 MiB/s Receiving objects: 25% (21069/84275), 9.87 MiB | 19.76 MiB/s Receiving objects: 26% (21912/84275), 9.87 MiB | 19.76 MiB/s Receiving objects: 27% (22755/84275), 9.87 MiB | 19.76 MiB/s Receiving objects: 28% (23597/84275), 9.87 MiB | 19.76 MiB/s Receiving objects: 29% (24440/84275), 9.87 MiB | 19.76 MiB/s Receiving objects: 30% (25283/84275), 9.87 MiB | 19.76 MiB/s Receiving objects: 31% (26126/84275), 9.87 MiB | 19.76 MiB/s Receiving objects: 32% (26968/84275), 9.87 MiB | 19.76 MiB/s Receiving objects: 33% (27811/84275), 9.87 MiB | 19.76 MiB/s Receiving objects: 34% (28654/84275), 9.87 MiB | 19.76 MiB/s Receiving objects: 35% (29497/84275), 9.87 MiB | 19.76 MiB/s Receiving objects: 36% (30339/84275), 9.87 MiB | 19.76 MiB/s Receiving objects: 37% (31182/84275), 9.87 MiB | 19.76 MiB/s Receiving objects: 38% (32025/84275), 9.87 MiB | 19.76 MiB/s Receiving objects: 39% (32868/84275), 9.87 MiB | 19.76 MiB/s Receiving objects: 39% (33644/84275), 9.87 MiB | 19.76 MiB/s Receiving objects: 40% (33710/84275), 31.63 MiB | 31.66 MiB/s Receiving objects: 41% (34553/84275), 31.63 MiB | 31.66 MiB/s Receiving objects: 42% (35396/84275), 31.63 MiB | 31.66 MiB/s Receiving objects: 43% (36239/84275), 31.63 MiB | 31.66 MiB/s Receiving objects: 44% (37081/84275), 31.63 MiB | 31.66 MiB/s Receiving objects: 45% (37924/84275), 31.63 MiB | 31.66 MiB/s Receiving objects: 46% (38767/84275), 31.63 MiB | 31.66 MiB/s Receiving objects: 47% (39610/84275), 31.63 MiB | 31.66 MiB/s Receiving objects: 48% (40452/84275), 47.92 MiB | 31.96 MiB/s Receiving objects: 49% (41295/84275), 47.92 MiB | 31.96 MiB/s Receiving objects: 50% (42138/84275), 47.92 MiB | 31.96 MiB/s Receiving objects: 51% (42981/84275), 47.92 MiB | 31.96 MiB/s Receiving objects: 52% (43823/84275), 47.92 MiB | 31.96 MiB/s Receiving objects: 53% (44666/84275), 47.92 MiB | 31.96 MiB/s Receiving objects: 54% (45509/84275), 47.92 MiB | 31.96 MiB/s Receiving objects: 55% (46352/84275), 47.92 MiB | 31.96 MiB/s Receiving objects: 56% (47194/84275), 47.92 MiB | 31.96 MiB/s Receiving objects: 57% (48037/84275), 47.92 MiB | 31.96 MiB/s Receiving objects: 57% (48754/84275), 64.79 MiB | 32.41 MiB/s Receiving objects: 58% (48880/84275), 64.79 MiB | 32.41 MiB/s Receiving objects: 59% (49723/84275), 64.79 MiB | 32.41 MiB/s Receiving objects: 60% (50565/84275), 64.79 MiB | 32.41 MiB/s Receiving objects: 61% (51408/84275), 64.79 MiB | 32.41 MiB/s Receiving objects: 62% (52251/84275), 64.79 MiB | 32.41 MiB/s Receiving objects: 63% (53094/84275), 64.79 MiB | 32.41 MiB/s Receiving objects: 64% (53936/84275), 64.79 MiB | 32.41 MiB/s Receiving objects: 65% (54779/84275), 64.79 MiB | 32.41 MiB/s Receiving objects: 66% (55622/84275), 64.79 MiB | 32.41 MiB/s Receiving objects: 67% (56465/84275), 64.79 MiB | 32.41 MiB/s Receiving objects: 68% (57307/84275), 81.94 MiB | 32.23 MiB/s Receiving objects: 68% (57371/84275), 99.45 MiB | 32.69 MiB/s Receiving objects: 69% (58150/84275), 99.45 MiB | 32.69 MiB/s Receiving objects: 70% (58993/84275), 99.45 MiB | 32.69 MiB/s Receiving objects: 71% (59836/84275), 99.45 MiB | 32.69 MiB/s Receiving objects: 72% (60678/84275), 99.45 MiB | 32.69 MiB/s Receiving objects: 73% (61521/84275), 99.45 MiB | 32.69 MiB/s Receiving objects: 74% (62364/84275), 99.45 MiB | 32.69 MiB/s Receiving objects: 75% (63207/84275), 116.33 MiB | 32.44 MiB/s Receiving objects: 76% (64049/84275), 116.33 MiB | 32.44 MiB/s Receiving objects: 77% (64892/84275), 116.33 MiB | 32.44 MiB/s Receiving objects: 77% (65086/84275), 116.33 MiB | 32.44 MiB/s Receiving objects: 78% (65735/84275), 116.33 MiB | 32.44 MiB/s Receiving objects: 79% (66578/84275), 116.33 MiB | 32.44 MiB/s Receiving objects: 80% (67420/84275), 116.33 MiB | 32.44 MiB/s Receiving objects: 81% (68263/84275), 116.33 MiB | 32.44 MiB/s Receiving objects: 82% (69106/84275), 134.22 MiB | 32.85 MiB/s Receiving objects: 83% (69949/84275), 134.22 MiB | 32.85 MiB/s Receiving objects: 84% (70791/84275), 134.22 MiB | 32.85 MiB/s Receiving objects: 85% (71634/84275), 134.22 MiB | 32.85 MiB/s Receiving objects: 86% (72477/84275), 134.22 MiB | 32.85 MiB/s Receiving objects: 87% (73320/84275), 134.22 MiB | 32.85 MiB/s Receiving objects: 88% (74162/84275), 134.22 MiB | 32.85 MiB/s Receiving objects: 89% (75005/84275), 134.22 MiB | 32.85 MiB/s Receiving objects: 90% (75848/84275), 134.22 MiB | 32.85 MiB/s Receiving objects: 91% (76691/84275), 134.22 MiB | 32.85 MiB/s Receiving objects: 92% (77533/84275), 134.22 MiB | 32.85 MiB/s Receiving objects: 93% (78376/84275), 134.22 MiB | 32.85 MiB/s Receiving objects: 94% (79219/84275), 134.22 MiB | 32.85 MiB/s Receiving objects: 95% (80062/84275), 149.52 MiB | 32.60 MiB/s Receiving objects: 96% (80904/84275), 149.52 MiB | 32.60 MiB/s Receiving objects: 97% (81747/84275), 149.52 MiB | 32.60 MiB/s Receiving objects: 98% (82590/84275), 149.52 MiB | 32.60 MiB/s Receiving objects: 99% (83433/84275), 149.52 MiB | 32.60 MiB/s remote: Total 84275 (delta 7443), reused 6856 (delta 6833), pack-reused 75711 (from 2)
  7. 7.36 s Receiving objects: 100% (84275/84275), 149.52 MiB | 32.60 MiB/s Receiving objects: 100% (84275/84275), 153.42 MiB | 32.59 MiB/s, done.
  8. 8.77 s Resolving deltas: 0% (0/57012) Resolving deltas: 1% (571/57012) Resolving deltas: 2% (1141/57012) Resolving deltas: 3% (1711/57012) Resolving deltas: 4% (2281/57012) Resolving deltas: 5% (2851/57012) Resolving deltas: 6% (3421/57012) Resolving deltas: 7% (3991/57012) Resolving deltas: 8% (4561/57012) Resolving deltas: 9% (5132/57012) Resolving deltas: 10% (5702/57012) Resolving deltas: 11% (6274/57012) Resolving deltas: 12% (6845/57012) Resolving deltas: 13% (7412/57012) Resolving deltas: 14% (7982/57012) Resolving deltas: 15% (8552/57012) Resolving deltas: 16% (9122/57012) Resolving deltas: 17% (9693/57012) Resolving deltas: 18% (10264/57012) Resolving deltas: 19% (10833/57012) Resolving deltas: 20% (11403/57012) Resolving deltas: 21% (11975/57012) Resolving deltas: 22% (12543/57012) Resolving deltas: 23% (13114/57012) Resolving deltas: 24% (13683/57012) Resolving deltas: 25% (14253/57012) Resolving deltas: 26% (14824/57012) Resolving deltas: 27% (15394/57012) Resolving deltas: 28% (15964/57012) Resolving deltas: 29% (16535/57012) Resolving deltas: 30% (17104/57012) Resolving deltas: 31% (17674/57012) Resolving deltas: 32% (18244/57012) Resolving deltas: 33% (18814/57012) Resolving deltas: 34% (19385/57012) Resolving deltas: 35% (19955/57012) Resolving deltas: 36% (20525/57012) Resolving deltas: 37% (21095/57012) Resolving deltas: 38% (21665/57012) Resolving deltas: 39% (22235/57012) Resolving deltas: 40% (22807/57012) Resolving deltas: 41% (23375/57012) Resolving deltas: 42% (23946/57012) Resolving deltas: 43% (24516/57012) Resolving deltas: 44% (25087/57012) Resolving deltas: 45% (25658/57012) Resolving deltas: 46% (26226/57012) Resolving deltas: 47% (26796/57012) Resolving deltas: 48% (27367/57012) Resolving deltas: 49% (27936/57012) Resolving deltas: 50% (28506/57012) Resolving deltas: 51% (29077/57012) Resolving deltas: 52% (29647/57012) Resolving deltas: 53% (30217/57012) Resolving deltas: 54% (30789/57012) Resolving deltas: 55% (31357/57012) Resolving deltas: 56% (31927/57012) Resolving deltas: 57% (32497/57012) Resolving deltas: 58% (33067/57012) Resolving deltas: 59% (33638/57012) Resolving deltas: 60% (34208/57012) Resolving deltas: 61% (34778/57012) Resolving deltas: 62% (35348/57012) Resolving deltas: 63% (35919/57012) Resolving deltas: 64% (36488/57012) Resolving deltas: 65% (37059/57012) Resolving deltas: 66% (37629/57012) Resolving deltas: 67% (38199/57012) Resolving deltas: 68% (38769/57012) Resolving deltas: 69% (39339/57012) Resolving deltas: 70% (39909/57012) Resolving deltas: 71% (40479/57012) Resolving deltas: 71% (40933/57012) Resolving deltas: 72% (41049/57012) Resolving deltas: 73% (41619/57012) Resolving deltas: 74% (42189/57012) Resolving deltas: 75% (42761/57012) Resolving deltas: 76% (43330/57012) Resolving deltas: 77% (43900/57012) Resolving deltas: 78% (44470/57012) Resolving deltas: 79% (45040/57012) Resolving deltas: 80% (45610/57012) Resolving deltas: 81% (46180/57012) Resolving deltas: 82% (46752/57012) Resolving deltas: 83% (47320/57012) Resolving deltas: 84% (47891/57012) Resolving deltas: 85% (48462/57012) Resolving deltas: 86% (49031/57012) Resolving deltas: 87% (49601/57012) Resolving deltas: 88% (50171/57012) Resolving deltas: 89% (50741/57012) Resolving deltas: 90% (51311/57012) Resolving deltas: 91% (51881/57012) Resolving deltas: 92% (52452/57012) Resolving deltas: 93% (53022/57012) Resolving deltas: 94% (53592/57012) Resolving deltas: 95% (54162/57012) Resolving deltas: 96% (54733/57012) Resolving deltas: 97% (55302/57012) Resolving deltas: 98% (55872/57012) Resolving deltas: 99% (56442/57012) Resolving deltas: 100% (57012/57012) Resolving deltas: 100% (57012/57012), done.
  9. 9.31 s Fetching commit ff11577b1777f94f30ac4c8d99e2f898d5902f7b for simplify-spenso-api ...
  10. 9.31 s $ /nix/store/bcnisk3ydfgv26v2gw3zlky24g00yww2-git-2.54.0/bin/git fetch origin ff11577b1777f94f30ac4c8d99e2f898d5902f7b
  11. 9.75 s From https://github.com/alphal00p/gammaloop
  12. 9.75 s * branch ff11577b1777f94f30ac4c8d99e2f898d5902f7b -> FETCH_HEAD
  13. 9.77 s $ /nix/store/9ypz3flqsrl5xl495mm8h645gadjsxi1-coreutils-9.11/bin/timeout --kill-after=15s 7200s /nix/store/bcnisk3ydfgv26v2gw3zlky24g00yww2-git-2.54.0/bin/git -c advice.detachedHead=false checkout ff11577b1777f94f30ac4c8d99e2f898d5902f7b
  14. 10.03 s HEAD is now at ff11577b1 update Symbolica to 0084bc7c
  15. 10.03 s $ /nix/store/9ypz3flqsrl5xl495mm8h645gadjsxi1-coreutils-9.11/bin/timeout --kill-after=15s 7200s /nix/store/23zk8sgzamrbmj1fday15szf7f2279s8-nix-2.34.7/bin/nix --extra-experimental-features nix-command --extra-experimental-features flakes --log-format internal-json run .#packages.x86_64-linux.nix-ci-check-gammaloop-nextest-spenso --print-build-logs
  16. 15.78 s
  17. 21.59 s evaluating derivation 'g copying '/nix/store/zvcs evaluating derivation 'g copying '/nix/store/zvcs evaluating derivation 'g copying '/nix/store/zvcs evaluating derivation 'g copying '/nix/store/zvcs evaluating derivation 'g querying gammaloop-nexte [0/1 built, 0.0 KiB DL] [1/0/1 built, 0.0 KiB DLgammaloop-nextest-spenso> Extracting 5 binaries and 2 linked paths to /build/nextest-archive-LMdElm
  18. 21.89 s gammaloop-nextest-spenso> Extracted 19 files to /build/nextest-archive-LMdElm in 0.30s
  19. 21.91 s gammaloop-nextest-spenso> ------------
  20. 21.91 s gammaloop-nextest-spenso> Nextest run ID ff48b94b-e5a8-4581-bf55-b13ecc300aef with nextest profile: ci_gammaloop
  21. 21.91 s gammaloop-nextest-spenso> Starting 232 tests across 5 binaries (26 tests skipped, including 2 tests via profile.ci_gammaloop.default-filter)
  22. 22.11 s gammaloop-nextest-spenso> FAIL [ 0.014s] ( 90/232) idenso dirac::test::feyncalc_reference::dirac_simplify_id40_repeated_gamma_and_two_trace
  23. 22.11 s gammaloop-nextest-spenso> stdout ---
  24. 22.11 s gammaloop-nextest-spenso>
  25. 22.11 s gammaloop-nextest-spenso> running 1 test
  26. 22.11 s gammaloop-nextest-spenso> test dirac::test::feyncalc_reference::dirac_simplify_id40_repeated_gamma_and_two_trace ... FAILED
  27. 22.11 s gammaloop-nextest-spenso>
  28. 22.12 s gammaloop-nextest-spenso> failures:
  29. 22.12 s gammaloop-nextest-spenso>
  30. 22.12 s gammaloop-nextest-spenso> failures:
  31. 22.12 s gammaloop-nextest-spenso> dirac::test::feyncalc_reference::dirac_simplify_id40_repeated_gamma_and_two_trace
  32. 22.12 s gammaloop-nextest-spenso>
  33. 22.12 s gammaloop-nextest-spenso> test result: FAILED. 0 passed; 1 failed; 0 ignored; 0 measured; 248 filtered out; finished in 0.01s
  34. 22.12 s gammaloop-nextest-spenso>
  35. 22.12 s gammaloop-nextest-spenso> stderr ---
  36. 22.12 s gammaloop-nextest-spenso>
  37. 22.12 s gammaloop-nextest-spenso> thread 'dirac::test::feyncalc_reference::dirac_simplify_id40_repeated_gamma_and_two_trace' (500) panicked at crates/idenso/src/dirac/mod.rs:360:5:
  38. 22.12 s gammaloop-nextest-spenso> gamma third argument must be a Minkowski slot
  39. 22.12 s gammaloop-nextest-spenso> stack backtrace:
  40. 22.12 s gammaloop-nextest-spenso> 0: __rustc::rust_begin_unwind
  41. 22.12 s gammaloop-nextest-spenso> 1: core::panicking::panic_fmt
  42. 22.12 s gammaloop-nextest-spenso> 2: idenso::dirac::require_gamma_port
  43. 22.12 s gammaloop-nextest-spenso> 3: idenso::dirac::gamma_tensor
  44. 22.12 s gammaloop-nextest-spenso> 4: idenso::dirac::test::feyncalc_reference::dirac_simplify_id40_repeated_gamma_and_two_trace
  45. 22.12 s gammaloop-nextest-spenso> 5: <idenso::dirac::test::feyncalc_reference::dirac_simplify_id40_repeated_gamma_and_two_trace::{closure#0} as core::ops::function::FnOnce<()>>::call_once
  46. 22.12 s gammaloop-nextest-spenso> note: Some details are omitted, run with `RUST_BACKTRACE=full` for a verbose backtrace.
  47. 22.12 s gammaloop-nextest-spenso>
  48. 22.12 s gammaloop-nextest-spenso> FAIL [ 0.015s] ( 91/232) idenso dirac::test::feyncalc_reference::dirac_simplify_id46_d_dim_repeated_gamma_slash_sum
  49. 22.12 s gammaloop-nextest-spenso> stdout ---
  50. 22.12 s gammaloop-nextest-spenso>
  51. 22.12 s gammaloop-nextest-spenso> running 1 test
  52. 22.12 s gammaloop-nextest-spenso> test dirac::test::feyncalc_reference::dirac_simplify_id46_d_dim_repeated_gamma_slash_sum ... FAILED
  53. 22.12 s gammaloop-nextest-spenso>
  54. 22.12 s gammaloop-nextest-spenso> failures:
  55. 22.12 s gammaloop-nextest-spenso>
  56. 22.12 s gammaloop-nextest-spenso> failures:
  57. 22.12 s gammaloop-nextest-spenso> dirac::test::feyncalc_reference::dirac_simplify_id46_d_dim_repeated_gamma_slash_sum
  58. 22.12 s gammaloop-nextest-spenso>
  59. 22.12 s gammaloop-nextest-spenso> test result: FAILED. 0 passed; 1 failed; 0 ignored; 0 measured; 248 filtered out; finished in 0.01s
  60. 22.12 s gammaloop-nextest-spenso>
  61. 22.12 s gammaloop-nextest-spenso> stderr ---
  62. 22.12 s gammaloop-nextest-spenso>
  63. 22.12 s gammaloop-nextest-spenso> thread 'dirac::test::feyncalc_reference::dirac_simplify_id46_d_dim_repeated_gamma_slash_sum' (505) panicked at crates/idenso/src/dirac/mod.rs:360:5:
  64. 22.12 s gammaloop-nextest-spenso> gamma third argument must be a Minkowski slot
  65. 22.12 s gammaloop-nextest-spenso> stack backtrace:
  66. 22.12 s gammaloop-nextest-spenso> 0: __rustc::rust_begin_unwind
  67. 22.12 s gammaloop-nextest-spenso> 1: core::panicking::panic_fmt
  68. 22.12 s gammaloop-nextest-spenso> 2: idenso::dirac::require_gamma_port
  69. 22.12 s gammaloop-nextest-spenso> 3: idenso::dirac::gamma_tensor
  70. 22.12 s gammaloop-nextest-spenso> 4: idenso::dirac::test::feyncalc_reference::dirac_simplify_id46_d_dim_repeated_gamma_slash_sum
  71. 22.12 s gammaloop-nextest-spenso> 5: <idenso::dirac::test::feyncalc_reference::dirac_simplify_id46_d_dim_repeated_gamma_slash_sum::{closure#0} as core::ops::function::FnOnce<()>>::call_once
  72. 22.12 s gammaloop-nextest-spenso> note: Some details are omitted, run with `RUST_BACKTRACE=full` for a verbose backtrace.
  73. 22.12 s gammaloop-nextest-spenso>
  74. 22.13 s gammaloop-nextest-spenso> FAIL [ 0.023s] ( 93/232) idenso dirac::test::feyncalc_reference::dirac_simplify_id4_slash_sandwich
  75. 22.13 s gammaloop-nextest-spenso> stdout ---
  76. 22.13 s gammaloop-nextest-spenso>
  77. 22.13 s gammaloop-nextest-spenso> running 1 test
  78. 22.13 s gammaloop-nextest-spenso> test dirac::test::feyncalc_reference::dirac_simplify_id4_slash_sandwich ... FAILED
  79. 22.13 s gammaloop-nextest-spenso>
  80. 22.13 s gammaloop-nextest-spenso> failures:
  81. 22.13 s gammaloop-nextest-spenso>
  82. 22.13 s gammaloop-nextest-spenso> failures:
  83. 22.13 s gammaloop-nextest-spenso> dirac::test::feyncalc_reference::dirac_simplify_id4_slash_sandwich
  84. 22.13 s gammaloop-nextest-spenso>
  85. 22.13 s gammaloop-nextest-spenso> test result: FAILED. 0 passed; 1 failed; 0 ignored; 0 measured; 248 filtered out; finished in 0.01s
  86. 22.13 s gammaloop-nextest-spenso>
  87. 22.13 s gammaloop-nextest-spenso> stderr ---
  88. 22.13 s gammaloop-nextest-spenso>
  89. 22.13 s gammaloop-nextest-spenso> thread 'dirac::test::feyncalc_reference::dirac_simplify_id4_slash_sandwich' (510) panicked at crates/idenso/src/dirac/mod.rs:360:5:
  90. 22.13 s gammaloop-nextest-spenso> gamma third argument must be a Minkowski slot
  91. 22.13 s gammaloop-nextest-spenso> stack backtrace:
  92. 22.13 s gammaloop-nextest-spenso> 0: __rustc::rust_begin_unwind
  93. 22.13 s gammaloop-nextest-spenso> 1: core::panicking::panic_fmt
  94. 22.13 s gammaloop-nextest-spenso> 2: idenso::dirac::require_gamma_port
  95. 22.13 s gammaloop-nextest-spenso> 3: idenso::dirac::gamma_tensor
  96. 22.13 s gammaloop-nextest-spenso> 4: idenso::dirac::test::feyncalc_reference::dirac_simplify_id4_slash_sandwich
  97. 22.13 s gammaloop-nextest-spenso> 5: <idenso::dirac::test::feyncalc_reference::dirac_simplify_id4_slash_sandwich::{closure#0} as core::ops::function::FnOnce<()>>::call_once
  98. 22.13 s gammaloop-nextest-spenso> note: Some details are omitted, run with `RUST_BACKTRACE=full` for a verbose backtrace.
  99. 22.13 s gammaloop-nextest-spenso>
  100. 22.24 s gammaloop-nextest-spenso> FAIL [ 0.017s] (140/232) idenso reference_cases::tests::reference_case_simplification_snapshots
  101. 22.24 s gammaloop-nextest-spenso> stdout ---
  102. 22.24 s gammaloop-nextest-spenso>
  103. 22.24 s gammaloop-nextest-spenso> running 1 test
  104. 22.24 s gammaloop-nextest-spenso> test reference_cases::tests::reference_case_simplification_snapshots ... FAILED
  105. 22.24 s gammaloop-nextest-spenso>
  106. 22.24 s gammaloop-nextest-spenso> failures:
  107. 22.24 s gammaloop-nextest-spenso>
  108. 22.24 s gammaloop-nextest-spenso> failures:
  109. 22.24 s gammaloop-nextest-spenso> reference_cases::tests::reference_case_simplification_snapshots
  110. 22.24 s gammaloop-nextest-spenso>
  111. 22.24 s gammaloop-nextest-spenso> test result: FAILED. 0 passed; 1 failed; 0 ignored; 0 measured; 248 filtered out; finished in 0.01s
  112. 22.24 s gammaloop-nextest-spenso>
  113. 22.24 s gammaloop-nextest-spenso> stderr ---
  114. 22.24 s gammaloop-nextest-spenso>
  115. 22.24 s gammaloop-nextest-spenso> thread 'reference_cases::tests::reference_case_simplification_snapshots' (674) panicked at crates/idenso/src/dirac/mod.rs:360:5:
  116. 22.24 s gammaloop-nextest-spenso> gamma third argument must be a Minkowski slot
  117. 22.24 s gammaloop-nextest-spenso> stack backtrace:
  118. 22.24 s gammaloop-nextest-spenso> 0: __rustc::rust_begin_unwind
  119. 22.24 s gammaloop-nextest-spenso> 1: core::panicking::panic_fmt
  120. 22.24 s gammaloop-nextest-spenso> 2: idenso::dirac::require_gamma_port
  121. 22.24 s gammaloop-nextest-spenso> 3: idenso::dirac::gamma_tensor
  122. 22.24 s gammaloop-nextest-spenso> 4: idenso::reference_cases::dirac_feyncalc_slash_sandwich_id4
  123. 22.24 s gammaloop-nextest-spenso> 5: <idenso::reference_cases::ReferenceCase>::simplified
  124. 22.24 s gammaloop-nextest-spenso> 6: <core::iter::adapters::map::Map<core::slice::iter::Iter<idenso::reference_cases::ReferenceCase>, idenso::reference_cases::tests::reference_case_simplification_snapshots::{closure#0}> as core::iter::traits::iterator::Iterator>::fold::<(), core::iter::traits::iterator::Iterator::for_each::call<alloc::string::String, <alloc::vec::Vec<alloc::string::String>>::extend_trusted<core::iter::adapters::map::Map<core::slice::iter::Iter<idenso::reference_cases::ReferenceCase>, idenso::reference_cases::tests::reference_case_simplification_snapshots::{closure#0}>>::{closure#0}>::{closure#0}>
  125. 22.24 s gammaloop-nextest-spenso> 7: <alloc::vec::Vec<alloc::string::String> as alloc::vec::spec_from_iter_nested::SpecFromIterNested<alloc::string::String, core::iter::adapters::map::Map<core::slice::iter::Iter<idenso::reference_cases::ReferenceCase>, idenso::reference_cases::tests::reference_case_simplification_snapshots::{closure#0}>>>::from_iter
  126. 22.24 s gammaloop-nextest-spenso> 8: idenso::reference_cases::tests::reference_case_simplification_snapshots
  127. 22.24 s gammaloop-nextest-spenso> 9: <idenso::reference_cases::tests::reference_case_simplification_snapshots::{closure#0} as core::ops::function::FnOnce<()>>::call_once
  128. 22.24 s gammaloop-nextest-spenso> note: Some details are omitted, run with `RUST_BACKTRACE=full` for a verbose backtrace.
  129. 22.24 s gammaloop-nextest-spenso>
  130. 22.40 s gammaloop-nextest-spenso> FAIL [ 0.070s] (228/232) idenso tensor::tests::parsing::infinite_execution
  131. 22.40 s gammaloop-nextest-spenso> stdout ---
  132. 22.40 s gammaloop-nextest-spenso>
  133. 22.40 s gammaloop-nextest-spenso> running 1 test
  134. 22.40 s gammaloop-nextest-spenso> ━━━━━━━━━━━━━━━━━━━━━━━━━━━━━━━ Snapshot Summary ━━━━━━━━━━━━━━━━━━━━━━━━━━━━━━━
  135. 22.40 s gammaloop-nextest-spenso> Snapshot: infinite_execution
  136. 22.40 s gammaloop-nextest-spenso> Source: crates/idenso/src/tensor/tests/parsing.rs:905
  137. 22.40 s gammaloop-nextest-spenso> ────────────────────────────────────────────────────────────────────────────────
  138. 22.40 s gammaloop-nextest-spenso> Expression: net_iter.snapshot_dot()
  139. 22.40 s gammaloop-nextest-spenso> ────────────────────────────────────────────────────────────────────────────────
  140. 22.40 s gammaloop-nextest-spenso> -old snapshot
  141. 22.40 s gammaloop-nextest-spenso> +new results
  142. 22.40 s gammaloop-nextest-spenso> ────────────┬───────────────────────────────────────────────────────────────────
  143. 22.40 s gammaloop-nextest-spenso> 8 8 │ 0:0:s -> ext0 [id=0 color="red"];
  144. 22.40 s gammaloop-nextest-spenso> 9 9 │ ext1 [style=invis];
  145. 22.40 s gammaloop-nextest-spenso> 10 10 │ 0:5:s -> ext1 [id=1 dir=none color="red" label="mink4|l_0"];
  146. 22.40 s gammaloop-nextest-spenso> 11 11 │ ext2 [style=invis];
  147. 22.40 s gammaloop-nextest-spenso> 12 │- 0:4:s -> ext2 [id=2 dir=none color="red" label="bis4|l_2"];
  148. 22.40 s gammaloop-nextest-spenso> 12 │+ 0:3:s -> ext2 [id=2 dir=none color="red" label="mink4|l_1"];
  149. 22.40 s gammaloop-nextest-spenso> 13 13 │ ext3 [style=invis];
  150. 22.40 s gammaloop-nextest-spenso> 14 │- 0:3:s -> ext3 [id=3 dir=none color="red" label="bis4|l_3"];
  151. 22.40 s gammaloop-nextest-spenso> 14 │+ 0:1:s -> ext3 [id=3 dir=none color="red" label="bis4|l_2"];
  152. 22.40 s gammaloop-nextest-spenso> 15 15 │ ext4 [style=invis];
  153. 22.40 s gammaloop-nextest-spenso> 16 │- 0:1:s -> ext4 [id=4 dir=none color="red" label="mink4|l_1"];
  154. 22.40 s gammaloop-nextest-spenso> 16 │+ 0:2:s -> ext4 [id=4 dir=none color="red" label="mink4|l_4"];
  155. 22.40 s gammaloop-nextest-spenso> 17 17 │ ext5 [style=invis];
  156. 22.40 s gammaloop-nextest-spenso> 18 │- 0:2:s -> ext5 [id=5 dir=none color="red" label="mink4|l_4"];
  157. 22.40 s gammaloop-nextest-spenso> 18 │+ 0:4:s -> ext5 [id=5 dir=none color="red" label="bis4|l_3"];
  158. 22.40 s gammaloop-nextest-spenso> 19 19 │ }
  159. 22.40 s gammaloop-nextest-spenso> ────────────┴───────────────────────────────────────────────────────────────────
  160. 22.40 s gammaloop-nextest-spenso> To update snapshots run `cargo insta review`
  161. 22.40 s gammaloop-nextest-spenso> Stopped on the first failure. Run `cargo insta test` to run all snapshots.
  162. 22.40 s gammaloop-nextest-spenso> test tensor::tests::parsing::infinite_execution ... FAILED
  163. 22.40 s gammaloop-nextest-spenso>
  164. 22.40 s gammaloop-nextest-spenso> failures:
  165. 22.40 s gammaloop-nextest-spenso>
  166. 22.40 s gammaloop-nextest-spenso> failures:
  167. 22.40 s gammaloop-nextest-spenso> tensor::tests::parsing::infinite_execution
  168. 22.40 s gammaloop-nextest-spenso>
  169. 22.40 s gammaloop-nextest-spenso> test result: FAILED. 0 passed; 1 failed; 0 ignored; 0 measured; 248 filtered out; finished in 0.06s
  170. 22.40 s gammaloop-nextest-spenso>
  171. 22.40 s gammaloop-nextest-spenso> stderr ---
  172. 22.40 s gammaloop-nextest-spenso>
  173. 22.40 s gammaloop-nextest-spenso> thread 'tensor::tests::parsing::infinite_execution' (860) panicked at /nix/store/hg5bizfwiwqlh0nqmr64rssi5zwpdp0k-vendor-cargo-deps/c19b7c6f923b580ac259164a89f2577984ad5ab09ee9d583b888f934adbbe8d0/insta-1.47.2/src/runtime.rs:719:13:
  174. 22.40 s gammaloop-nextest-spenso> snapshot assertion for 'infinite_execution' failed in line 905
  175. 22.40 s gammaloop-nextest-spenso> stack backtrace:
  176. 22.40 s gammaloop-nextest-spenso> 0: __rustc::rust_begin_unwind
  177. 22.40 s gammaloop-nextest-spenso> 1: core::panicking::panic_fmt
  178. 22.40 s gammaloop-nextest-spenso> 2: insta::runtime::assert_snapshot
  179. 22.40 s gammaloop-nextest-spenso> 3: idenso::tensor::tests::parsing::infinite_execution
  180. 22.40 s gammaloop-nextest-spenso> 4: <idenso::tensor::tests::parsing::infinite_execution::{closure#0} as core::ops::function::FnOnce<()>>::call_once
  181. 22.40 s gammaloop-nextest-spenso> note: Some details are omitted, run with `RUST_BACKTRACE=full` for a verbose backtrace.
  182. 22.40 s gammaloop-nextest-spenso>
  183. 24.35 s gammaloop-nextest-spenso> ------------
  184. 24.35 s gammaloop-nextest-spenso> Summary [ 2.444s] 232 tests run: 227 passed, 5 failed, 26 skipped
  185. 24.35 s gammaloop-nextest-spenso> FAIL [ 0.014s] ( 90/232) idenso dirac::test::feyncalc_reference::dirac_simplify_id40_repeated_gamma_and_two_trace
  186. 24.35 s gammaloop-nextest-spenso> stdout ---
  187. 24.35 s gammaloop-nextest-spenso>
  188. 24.35 s gammaloop-nextest-spenso> running 1 test
  189. 24.35 s gammaloop-nextest-spenso> test dirac::test::feyncalc_reference::dirac_simplify_id40_repeated_gamma_and_two_trace ... FAILED
  190. 24.35 s gammaloop-nextest-spenso>
  191. 24.35 s gammaloop-nextest-spenso> failures:
  192. 24.35 s gammaloop-nextest-spenso>
  193. 24.35 s gammaloop-nextest-spenso> failures:
  194. 24.35 s gammaloop-nextest-spenso> dirac::test::feyncalc_reference::dirac_simplify_id40_repeated_gamma_and_two_trace
  195. 24.35 s gammaloop-nextest-spenso>
  196. 24.35 s gammaloop-nextest-spenso> test result: FAILED. 0 passed; 1 failed; 0 ignored; 0 measured; 248 filtered out; finished in 0.01s
  197. 24.35 s gammaloop-nextest-spenso>
  198. 24.35 s gammaloop-nextest-spenso> stderr ---
  199. 24.35 s gammaloop-nextest-spenso>
  200. 24.35 s gammaloop-nextest-spenso> thread 'dirac::test::feyncalc_reference::dirac_simplify_id40_repeated_gamma_and_two_trace' (500) panicked at crates/idenso/src/dirac/mod.rs:360:5:
  201. 24.35 s gammaloop-nextest-spenso> gamma third argument must be a Minkowski slot
  202. 24.35 s gammaloop-nextest-spenso> stack backtrace:
  203. 24.35 s gammaloop-nextest-spenso> 0: __rustc::rust_begin_unwind
  204. 24.35 s gammaloop-nextest-spenso> 1: core::panicking::panic_fmt
  205. 24.35 s gammaloop-nextest-spenso> 2: idenso::dirac::require_gamma_port
  206. 24.35 s gammaloop-nextest-spenso> 3: idenso::dirac::gamma_tensor
  207. 24.35 s gammaloop-nextest-spenso> 4: idenso::dirac::test::feyncalc_reference::dirac_simplify_id40_repeated_gamma_and_two_trace
  208. 24.35 s gammaloop-nextest-spenso> 5: <idenso::dirac::test::feyncalc_reference::dirac_simplify_id40_repeated_gamma_and_two_trace::{closure#0} as core::ops::function::FnOnce<()>>::call_once
  209. 24.35 s gammaloop-nextest-spenso> note: Some details are omitted, run with `RUST_BACKTRACE=full` for a verbose backtrace.
  210. 24.35 s gammaloop-nextest-spenso>
  211. 24.35 s gammaloop-nextest-spenso> FAIL [ 0.015s] ( 91/232) idenso dirac::test::feyncalc_reference::dirac_simplify_id46_d_dim_repeated_gamma_slash_sum
  212. 24.35 s gammaloop-nextest-spenso> stdout ---
  213. 24.35 s gammaloop-nextest-spenso>
  214. 24.35 s gammaloop-nextest-spenso> running 1 test
  215. 24.35 s gammaloop-nextest-spenso> test dirac::test::feyncalc_reference::dirac_simplify_id46_d_dim_repeated_gamma_slash_sum ... FAILED
  216. 24.35 s gammaloop-nextest-spenso>
  217. 24.35 s gammaloop-nextest-spenso> failures:
  218. 24.35 s gammaloop-nextest-spenso>
  219. 24.35 s gammaloop-nextest-spenso> failures:
  220. 24.35 s gammaloop-nextest-spenso> dirac::test::feyncalc_reference::dirac_simplify_id46_d_dim_repeated_gamma_slash_sum
  221. 24.35 s gammaloop-nextest-spenso>
  222. 24.35 s gammaloop-nextest-spenso> test result: FAILED. 0 passed; 1 failed; 0 ignored; 0 measured; 248 filtered out; finished in 0.01s
  223. 24.35 s gammaloop-nextest-spenso>
  224. 24.35 s gammaloop-nextest-spenso> stderr ---
  225. 24.35 s gammaloop-nextest-spenso>
  226. 24.35 s gammaloop-nextest-spenso> thread 'dirac::test::feyncalc_reference::dirac_simplify_id46_d_dim_repeated_gamma_slash_sum' (505) panicked at crates/idenso/src/dirac/mod.rs:360:5:
  227. 24.35 s gammaloop-nextest-spenso> gamma third argument must be a Minkowski slot
  228. 24.35 s gammaloop-nextest-spenso> stack backtrace:
  229. 24.35 s gammaloop-nextest-spenso> 0: __rustc::rust_begin_unwind
  230. 24.35 s gammaloop-nextest-spenso> 1: core::panicking::panic_fmt
  231. 24.35 s gammaloop-nextest-spenso> 2: idenso::dirac::require_gamma_port
  232. 24.35 s gammaloop-nextest-spenso> 3: idenso::dirac::gamma_tensor
  233. 24.35 s gammaloop-nextest-spenso> 4: idenso::dirac::test::feyncalc_reference::dirac_simplify_id46_d_dim_repeated_gamma_slash_sum
  234. 24.35 s gammaloop-nextest-spenso> 5: <idenso::dirac::test::feyncalc_reference::dirac_simplify_id46_d_dim_repeated_gamma_slash_sum::{closure#0} as core::ops::function::FnOnce<()>>::call_once
  235. 24.35 s gammaloop-nextest-spenso> note: Some details are omitted, run with `RUST_BACKTRACE=full` for a verbose backtrace.
  236. 24.35 s gammaloop-nextest-spenso>
  237. 24.35 s gammaloop-nextest-spenso> FAIL [ 0.023s] ( 93/232) idenso dirac::test::feyncalc_reference::dirac_simplify_id4_slash_sandwich
  238. 24.35 s gammaloop-nextest-spenso> stdout ---
  239. 24.35 s gammaloop-nextest-spenso>
  240. 24.35 s gammaloop-nextest-spenso> running 1 test
  241. 24.35 s gammaloop-nextest-spenso> test dirac::test::feyncalc_reference::dirac_simplify_id4_slash_sandwich ... FAILED
  242. 24.35 s gammaloop-nextest-spenso>
  243. 24.35 s gammaloop-nextest-spenso> failures:
  244. 24.35 s gammaloop-nextest-spenso>
  245. 24.35 s gammaloop-nextest-spenso> failures:
  246. 24.35 s gammaloop-nextest-spenso> dirac::test::feyncalc_reference::dirac_simplify_id4_slash_sandwich
  247. 24.35 s gammaloop-nextest-spenso>
  248. 24.35 s gammaloop-nextest-spenso> test result: FAILED. 0 passed; 1 failed; 0 ignored; 0 measured; 248 filtered out; finished in 0.01s
  249. 24.35 s gammaloop-nextest-spenso>
  250. 24.35 s gammaloop-nextest-spenso> stderr ---
  251. 24.35 s gammaloop-nextest-spenso>
  252. 24.35 s gammaloop-nextest-spenso> thread 'dirac::test::feyncalc_reference::dirac_simplify_id4_slash_sandwich' (510) panicked at crates/idenso/src/dirac/mod.rs:360:5:
  253. 24.35 s gammaloop-nextest-spenso> gamma third argument must be a Minkowski slot
  254. 24.35 s gammaloop-nextest-spenso> stack backtrace:
  255. 24.35 s gammaloop-nextest-spenso> 0: __rustc::rust_begin_unwind
  256. 24.35 s gammaloop-nextest-spenso> 1: core::panicking::panic_fmt
  257. 24.35 s gammaloop-nextest-spenso> 2: idenso::dirac::require_gamma_port
  258. 24.35 s gammaloop-nextest-spenso> 3: idenso::dirac::gamma_tensor
  259. 24.35 s gammaloop-nextest-spenso> 4: idenso::dirac::test::feyncalc_reference::dirac_simplify_id4_slash_sandwich
  260. 24.35 s gammaloop-nextest-spenso> 5: <idenso::dirac::test::feyncalc_reference::dirac_simplify_id4_slash_sandwich::{closure#0} as core::ops::function::FnOnce<()>>::call_once
  261. 24.35 s gammaloop-nextest-spenso> note: Some details are omitted, run with `RUST_BACKTRACE=full` for a verbose backtrace.
  262. 24.35 s gammaloop-nextest-spenso>
  263. 24.35 s gammaloop-nextest-spenso> FAIL [ 0.017s] (140/232) idenso reference_cases::tests::reference_case_simplification_snapshots
  264. 24.35 s gammaloop-nextest-spenso> stdout ---
  265. 24.35 s gammaloop-nextest-spenso>
  266. 24.35 s gammaloop-nextest-spenso> running 1 test
  267. 24.35 s gammaloop-nextest-spenso> test reference_cases::tests::reference_case_simplification_snapshots ... FAILED
  268. 24.35 s gammaloop-nextest-spenso>
  269. 24.35 s gammaloop-nextest-spenso> failures:
  270. 24.35 s gammaloop-nextest-spenso>
  271. 24.35 s gammaloop-nextest-spenso> failures:
  272. 24.35 s gammaloop-nextest-spenso> reference_cases::tests::reference_case_simplification_snapshots
  273. 24.35 s gammaloop-nextest-spenso>
  274. 24.35 s gammaloop-nextest-spenso> test result: FAILED. 0 passed; 1 failed; 0 ignored; 0 measured; 248 filtered out; finished in 0.01s
  275. 24.35 s gammaloop-nextest-spenso>
  276. 24.35 s gammaloop-nextest-spenso> stderr ---
  277. 24.35 s gammaloop-nextest-spenso>
  278. 24.35 s gammaloop-nextest-spenso> thread 'reference_cases::tests::reference_case_simplification_snapshots' (674) panicked at crates/idenso/src/dirac/mod.rs:360:5:
  279. 24.35 s gammaloop-nextest-spenso> gamma third argument must be a Minkowski slot
  280. 24.36 s gammaloop-nextest-spenso> stack backtrace:
  281. 24.36 s gammaloop-nextest-spenso> 0: __rustc::rust_begin_unwind
  282. 24.36 s gammaloop-nextest-spenso> 1: core::panicking::panic_fmt
  283. 24.36 s gammaloop-nextest-spenso> 2: idenso::dirac::require_gamma_port
  284. 24.36 s gammaloop-nextest-spenso> 3: idenso::dirac::gamma_tensor
  285. 24.36 s gammaloop-nextest-spenso> 4: idenso::reference_cases::dirac_feyncalc_slash_sandwich_id4
  286. 24.36 s gammaloop-nextest-spenso> 5: <idenso::reference_cases::ReferenceCase>::simplified
  287. 24.36 s gammaloop-nextest-spenso> 6: <core::iter::adapters::map::Map<core::slice::iter::Iter<idenso::reference_cases::ReferenceCase>, idenso::reference_cases::tests::reference_case_simplification_snapshots::{closure#0}> as core::iter::traits::iterator::Iterator>::fold::<(), core::iter::traits::iterator::Iterator::for_each::call<alloc::string::String, <alloc::vec::Vec<alloc::string::String>>::extend_trusted<core::iter::adapters::map::Map<core::slice::iter::Iter<idenso::reference_cases::ReferenceCase>, idenso::reference_cases::tests::reference_case_simplification_snapshots::{closure#0}>>::{closure#0}>::{closure#0}>
  288. 24.36 s gammaloop-nextest-spenso> 7: <alloc::vec::Vec<alloc::string::String> as alloc::vec::spec_from_iter_nested::SpecFromIterNested<alloc::string::String, core::iter::adapters::map::Map<core::slice::iter::Iter<idenso::reference_cases::ReferenceCase>, idenso::reference_cases::tests::reference_case_simplification_snapshots::{closure#0}>>>::from_iter
  289. 24.36 s gammaloop-nextest-spenso> 8: idenso::reference_cases::tests::reference_case_simplification_snapshots
  290. 24.36 s gammaloop-nextest-spenso> 9: <idenso::reference_cases::tests::reference_case_simplification_snapshots::{closure#0} as core::ops::function::FnOnce<()>>::call_once
  291. 24.36 s gammaloop-nextest-spenso> note: Some details are omitted, run with `RUST_BACKTRACE=full` for a verbose backtrace.
  292. 24.36 s gammaloop-nextest-spenso>
  293. 24.36 s gammaloop-nextest-spenso> FAIL [ 0.070s] (228/232) idenso tensor::tests::parsing::infinite_execution
  294. 24.36 s gammaloop-nextest-spenso> stdout ---
  295. 24.36 s gammaloop-nextest-spenso>
  296. 24.36 s gammaloop-nextest-spenso> running 1 test
  297. 24.36 s gammaloop-nextest-spenso> ━━━━━━━━━━━━━━━━━━━━━━━━━━━━━━━ Snapshot Summary ━━━━━━━━━━━━━━━━━━━━━━━━━━━━━━━
  298. 24.36 s gammaloop-nextest-spenso> Snapshot: infinite_execution
  299. 24.36 s gammaloop-nextest-spenso> Source: crates/idenso/src/tensor/tests/parsing.rs:905
  300. 24.36 s gammaloop-nextest-spenso> ────────────────────────────────────────────────────────────────────────────────
  301. 24.36 s gammaloop-nextest-spenso> Expression: net_iter.snapshot_dot()
  302. 24.36 s gammaloop-nextest-spenso> ────────────────────────────────────────────────────────────────────────────────
  303. 24.36 s gammaloop-nextest-spenso> -old snapshot
  304. 24.36 s gammaloop-nextest-spenso> +new results
  305. 24.36 s gammaloop-nextest-spenso> ────────────┬───────────────────────────────────────────────────────────────────
  306. 24.36 s gammaloop-nextest-spenso> 8 8 │ 0:0:s -> ext0 [id=0 color="red"];
  307. 24.36 s gammaloop-nextest-spenso> 9 9 │ ext1 [style=invis];
  308. 24.36 s gammaloop-nextest-spenso> 10 10 │ 0:5:s -> ext1 [id=1 dir=none color="red" label="mink4|l_0"];
  309. 24.36 s gammaloop-nextest-spenso> 11 11 │ ext2 [style=invis];
  310. 24.36 s gammaloop-nextest-spenso> 12 │- 0:4:s -> ext2 [id=2 dir=none color="red" label="bis4|l_2"];
  311. 24.36 s gammaloop-nextest-spenso> 12 │+ 0:3:s -> ext2 [id=2 dir=none color="red" label="mink4|l_1"];
  312. 24.36 s gammaloop-nextest-spenso> 13 13 │ ext3 [style=invis];
  313. 24.36 s gammaloop-nextest-spenso> 14 │- 0:3:s -> ext3 [id=3 dir=none color="red" label="bis4|l_3"];
  314. 24.36 s gammaloop-nextest-spenso> 14 │+ 0:1:s -> ext3 [id=3 dir=none color="red" label="bis4|l_2"];
  315. 24.36 s gammaloop-nextest-spenso> 15 15 │ ext4 [style=invis];
  316. 24.36 s gammaloop-nextest-spenso> 16 │- 0:1:s -> ext4 [id=4 dir=none color="red" label="mink4|l_1"];
  317. 24.36 s gammaloop-nextest-spenso> 16 │+ 0:2:s -> ext4 [id=4 dir=none color="red" label="mink4|l_4"];
  318. 24.36 s gammaloop-nextest-spenso> 17 17 │ ext5 [style=invis];
  319. 24.36 s gammaloop-nextest-spenso> 18 │- 0:2:s -> ext5 [id=5 dir=none color="red" label="mink4|l_4"];
  320. 24.36 s gammaloop-nextest-spenso> 18 │+ 0:4:s -> ext5 [id=5 dir=none color="red" label="bis4|l_3"];
  321. 24.36 s gammaloop-nextest-spenso> 19 19 │ }
  322. 24.36 s gammaloop-nextest-spenso> ────────────┴───────────────────────────────────────────────────────────────────
  323. 24.36 s gammaloop-nextest-spenso> To update snapshots run `cargo insta review`
  324. 24.36 s gammaloop-nextest-spenso> Stopped on the first failure. Run `cargo insta test` to run all snapshots.
  325. 24.36 s gammaloop-nextest-spenso> test tensor::tests::parsing::infinite_execution ... FAILED
  326. 24.36 s gammaloop-nextest-spenso>
  327. 24.36 s gammaloop-nextest-spenso> failures:
  328. 24.36 s gammaloop-nextest-spenso>
  329. 24.36 s gammaloop-nextest-spenso> failures:
  330. 24.36 s gammaloop-nextest-spenso> tensor::tests::parsing::infinite_execution
  331. 24.36 s gammaloop-nextest-spenso>
  332. 24.36 s gammaloop-nextest-spenso> test result: FAILED. 0 passed; 1 failed; 0 ignored; 0 measured; 248 filtered out; finished in 0.06s
  333. 24.36 s gammaloop-nextest-spenso>
  334. 24.36 s gammaloop-nextest-spenso> stderr ---
  335. 24.36 s gammaloop-nextest-spenso>
  336. 24.36 s gammaloop-nextest-spenso> thread 'tensor::tests::parsing::infinite_execution' (860) panicked at /nix/store/hg5bizfwiwqlh0nqmr64rssi5zwpdp0k-vendor-cargo-deps/c19b7c6f923b580ac259164a89f2577984ad5ab09ee9d583b888f934adbbe8d0/insta-1.47.2/src/runtime.rs:719:13:
  337. 24.36 s gammaloop-nextest-spenso> snapshot assertion for 'infinite_execution' failed in line 905
  338. 24.36 s gammaloop-nextest-spenso> stack backtrace:
  339. 24.36 s gammaloop-nextest-spenso> 0: __rustc::rust_begin_unwind
  340. 24.36 s gammaloop-nextest-spenso> 1: core::panicking::panic_fmt
  341. 24.36 s gammaloop-nextest-spenso> 2: insta::runtime::assert_snapshot
  342. 24.36 s gammaloop-nextest-spenso> 3: idenso::tensor::tests::parsing::infinite_execution
  343. 24.36 s gammaloop-nextest-spenso> 4: <idenso::tensor::tests::parsing::infinite_execution::{closure#0} as core::ops::function::FnOnce<()>>::call_once
  344. 24.36 s gammaloop-nextest-spenso> note: Some details are omitted, run with `RUST_BACKTRACE=full` for a verbose backtrace.
  345. 24.36 s gammaloop-nextest-spenso>
  346. 24.40 s gammaloop-nextest-spenso> error: test run failed
  347. 24.43 s gammaloop-nextest-spenso>
  348. 24.43 s gammaloop-nextest-spenso> ========== nextest test summary ==========
  349. 24.43 s gammaloop-nextest-spenso> report: target/nextest/ci_gammaloop/junit.xml
  350. 24.43 s gammaloop-nextest-spenso> tests: 232, failures: 5, errors: 0
  351. 24.43 s gammaloop-nextest-spenso>
  352. 24.43 s gammaloop-nextest-spenso> 1. idenso::dirac::test::feyncalc_reference::dirac_simplify_id40_repeated_gamma_and_two_trace
  353. 24.43 s gammaloop-nextest-spenso> failure: test failure with exit code 101
  354. 24.43 s gammaloop-nextest-spenso> thread 'dirac::test::feyncalc_reference::dirac_simplify_id40_repeated_gamma_and_two_trace' (500) panicked at crates/idenso/src/dirac/mod.rs:360:5:
  355. 24.43 s gammaloop-nextest-spenso> gamma third argument must be a Minkowski slot
  356. 24.43 s gammaloop-nextest-spenso> stack backtrace:
  357. 24.43 s gammaloop-nextest-spenso> 0: __rustc::rust_begin_unwind
  358. 24.43 s gammaloop-nextest-spenso> 1: core::panicking::panic_fmt
  359. 24.43 s gammaloop-nextest-spenso> 2: idenso::dirac::require_gamma_port
  360. 24.43 s gammaloop-nextest-spenso> 3: idenso::dirac::gamma_tensor
  361. 24.43 s gammaloop-nextest-spenso> 4: idenso::dirac::test::feyncalc_reference::dirac_simplify_id40_repeated_gamma_and_two_trace
  362. 24.43 s gammaloop-nextest-spenso> 5: <idenso::dirac::test::feyncalc_reference::dirac_simplify_id40_repeated_gamma_and_two_trace::{closure#0} as core::ops::function::FnOnce<()>>::call_once
  363. 24.43 s gammaloop-nextest-spenso> note: Some details are omitted, run with `RUST_BACKTRACE=full` for a verbose backtrace.
  364. 24.43 s gammaloop-nextest-spenso> system-out
  365. 24.43 s gammaloop-nextest-spenso> running 1 test
  366. 24.43 s gammaloop-nextest-spenso> test dirac::test::feyncalc_reference::dirac_simplify_id40_repeated_gamma_and_two_trace ... FAILED
  367. 24.43 s gammaloop-nextest-spenso>
  368. 24.43 s gammaloop-nextest-spenso> failures:
  369. 24.43 s gammaloop-nextest-spenso>
  370. 24.43 s gammaloop-nextest-spenso> failures:
  371. 24.43 s gammaloop-nextest-spenso> dirac::test::feyncalc_reference::dirac_simplify_id40_repeated_gamma_and_two_trace
  372. 24.43 s gammaloop-nextest-spenso>
  373. 24.43 s gammaloop-nextest-spenso> test result: FAILED. 0 passed; 1 failed; 0 ignored; 0 measured; 248 filtered out; finished in 0.01s
  374. 24.43 s gammaloop-nextest-spenso> system-err
  375. 24.43 s gammaloop-nextest-spenso> thread 'dirac::test::feyncalc_reference::dirac_simplify_id40_repeated_gamma_and_two_trace' (500) panicked at crates/idenso/src/dirac/mod.rs:360:5:
  376. 24.43 s gammaloop-nextest-spenso> gamma third argument must be a Minkowski slot
  377. 24.43 s gammaloop-nextest-spenso> stack backtrace:
  378. 24.43 s gammaloop-nextest-spenso> 0: __rustc::rust_begin_unwind
  379. 24.43 s gammaloop-nextest-spenso> 1: core::panicking::panic_fmt
  380. 24.43 s gammaloop-nextest-spenso> 2: idenso::dirac::require_gamma_port
  381. 24.43 s gammaloop-nextest-spenso> 3: idenso::dirac::gamma_tensor
  382. 24.43 s gammaloop-nextest-spenso> 4: idenso::dirac::test::feyncalc_reference::dirac_simplify_id40_repeated_gamma_and_two_trace
  383. 24.43 s gammaloop-nextest-spenso> 5: <idenso::dirac::test::feyncalc_reference::dirac_simplify_id40_repeated_gamma_and_two_trace::{closure#0} as core::ops::function::FnOnce<()>>::call_once
  384. 24.43 s gammaloop-nextest-spenso> note: Some details are omitted, run with `RUST_BACKTRACE=full` for a verbose backtrace.
  385. 24.43 s gammaloop-nextest-spenso>
  386. 24.43 s gammaloop-nextest-spenso> 2. idenso::dirac::test::feyncalc_reference::dirac_simplify_id46_d_dim_repeated_gamma_slash_sum
  387. 24.43 s gammaloop-nextest-spenso> failure: test failure with exit code 101
  388. 24.43 s gammaloop-nextest-spenso> thread 'dirac::test::feyncalc_reference::dirac_simplify_id46_d_dim_repeated_gamma_slash_sum' (505) panicked at crates/idenso/src/dirac/mod.rs:360:5:
  389. 24.43 s gammaloop-nextest-spenso> gamma third argument must be a Minkowski slot
  390. 24.43 s gammaloop-nextest-spenso> stack backtrace:
  391. 24.43 s gammaloop-nextest-spenso> 0: __rustc::rust_begin_unwind
  392. 24.43 s gammaloop-nextest-spenso> 1: core::panicking::panic_fmt
  393. 24.43 s gammaloop-nextest-spenso> 2: idenso::dirac::require_gamma_port
  394. 24.43 s gammaloop-nextest-spenso> 3: idenso::dirac::gamma_tensor
  395. 24.43 s gammaloop-nextest-spenso> 4: idenso::dirac::test::feyncalc_reference::dirac_simplify_id46_d_dim_repeated_gamma_slash_sum
  396. 24.43 s gammaloop-nextest-spenso> 5: <idenso::dirac::test::feyncalc_reference::dirac_simplify_id46_d_dim_repeated_gamma_slash_sum::{closure#0} as core::ops::function::FnOnce<()>>::call_once
  397. 24.43 s gammaloop-nextest-spenso> note: Some details are omitted, run with `RUST_BACKTRACE=full` for a verbose backtrace.
  398. 24.43 s gammaloop-nextest-spenso> system-out
  399. 24.43 s gammaloop-nextest-spenso> running 1 test
  400. 24.43 s gammaloop-nextest-spenso> test dirac::test::feyncalc_reference::dirac_simplify_id46_d_dim_repeated_gamma_slash_sum ... FAILED
  401. 24.43 s gammaloop-nextest-spenso>
  402. 24.43 s gammaloop-nextest-spenso> failures:
  403. 24.43 s gammaloop-nextest-spenso>
  404. 24.43 s gammaloop-nextest-spenso> failures:
  405. 24.43 s gammaloop-nextest-spenso> dirac::test::feyncalc_reference::dirac_simplify_id46_d_dim_repeated_gamma_slash_sum
  406. 24.43 s gammaloop-nextest-spenso>
  407. 24.43 s gammaloop-nextest-spenso> test result: FAILED. 0 passed; 1 failed; 0 ignored; 0 measured; 248 filtered out; finished in 0.01s
  408. 24.43 s gammaloop-nextest-spenso> system-err
  409. 24.43 s gammaloop-nextest-spenso> thread 'dirac::test::feyncalc_reference::dirac_simplify_id46_d_dim_repeated_gamma_slash_sum' (505) panicked at crates/idenso/src/dirac/mod.rs:360:5:
  410. 24.43 s gammaloop-nextest-spenso> gamma third argument must be a Minkowski slot
  411. 24.43 s gammaloop-nextest-spenso> stack backtrace:
  412. 24.43 s gammaloop-nextest-spenso> 0: __rustc::rust_begin_unwind
  413. 24.43 s gammaloop-nextest-spenso> 1: core::panicking::panic_fmt
  414. 24.43 s gammaloop-nextest-spenso> 2: idenso::dirac::require_gamma_port
  415. 24.43 s gammaloop-nextest-spenso> 3: idenso::dirac::gamma_tensor
  416. 24.43 s gammaloop-nextest-spenso> 4: idenso::dirac::test::feyncalc_reference::dirac_simplify_id46_d_dim_repeated_gamma_slash_sum
  417. 24.43 s gammaloop-nextest-spenso> 5: <idenso::dirac::test::feyncalc_reference::dirac_simplify_id46_d_dim_repeated_gamma_slash_sum::{closure#0} as core::ops::function::FnOnce<()>>::call_once
  418. 24.43 s gammaloop-nextest-spenso> note: Some details are omitted, run with `RUST_BACKTRACE=full` for a verbose backtrace.
  419. 24.43 s gammaloop-nextest-spenso>
  420. 24.43 s gammaloop-nextest-spenso> 3. idenso::dirac::test::feyncalc_reference::dirac_simplify_id4_slash_sandwich
  421. 24.43 s gammaloop-nextest-spenso> failure: test failure with exit code 101
  422. 24.43 s gammaloop-nextest-spenso> thread 'dirac::test::feyncalc_reference::dirac_simplify_id4_slash_sandwich' (510) panicked at crates/idenso/src/dirac/mod.rs:360:5:
  423. 24.43 s gammaloop-nextest-spenso> gamma third argument must be a Minkowski slot
  424. 24.43 s gammaloop-nextest-spenso> stack backtrace:
  425. 24.43 s gammaloop-nextest-spenso> 0: __rustc::rust_begin_unwind
  426. 24.43 s gammaloop-nextest-spenso> 1: core::panicking::panic_fmt
  427. 24.43 s gammaloop-nextest-spenso> 2: idenso::dirac::require_gamma_port
  428. 24.43 s gammaloop-nextest-spenso> 3: idenso::dirac::gamma_tensor
  429. 24.43 s gammaloop-nextest-spenso> 4: idenso::dirac::test::feyncalc_reference::dirac_simplify_id4_slash_sandwich
  430. 24.43 s gammaloop-nextest-spenso> 5: <idenso::dirac::test::feyncalc_reference::dirac_simplify_id4_slash_sandwich::{closure#0} as core::ops::function::FnOnce<()>>::call_once
  431. 24.43 s gammaloop-nextest-spenso> note: Some details are omitted, run with `RUST_BACKTRACE=full` for a verbose backtrace.
  432. 24.43 s gammaloop-nextest-spenso> system-out
  433. 24.43 s gammaloop-nextest-spenso> running 1 test
  434. 24.43 s gammaloop-nextest-spenso> test dirac::test::feyncalc_reference::dirac_simplify_id4_slash_sandwich ... FAILED
  435. 24.43 s gammaloop-nextest-spenso>
  436. 24.43 s gammaloop-nextest-spenso> failures:
  437. 24.43 s gammaloop-nextest-spenso>
  438. 24.43 s gammaloop-nextest-spenso> failures:
  439. 24.43 s gammaloop-nextest-spenso> dirac::test::feyncalc_reference::dirac_simplify_id4_slash_sandwich
  440. 24.43 s gammaloop-nextest-spenso>
  441. 24.43 s gammaloop-nextest-spenso> test result: FAILED. 0 passed; 1 failed; 0 ignored; 0 measured; 248 filtered out; finished in 0.01s
  442. 24.43 s gammaloop-nextest-spenso> system-err
  443. 24.43 s gammaloop-nextest-spenso> thread 'dirac::test::feyncalc_reference::dirac_simplify_id4_slash_sandwich' (510) panicked at crates/idenso/src/dirac/mod.rs:360:5:
  444. 24.43 s gammaloop-nextest-spenso> gamma third argument must be a Minkowski slot
  445. 24.43 s gammaloop-nextest-spenso> stack backtrace:
  446. 24.43 s gammaloop-nextest-spenso> 0: __rustc::rust_begin_unwind
  447. 24.43 s gammaloop-nextest-spenso> 1: core::panicking::panic_fmt
  448. 24.43 s gammaloop-nextest-spenso> 2: idenso::dirac::require_gamma_port
  449. 24.43 s gammaloop-nextest-spenso> 3: idenso::dirac::gamma_tensor
  450. 24.43 s gammaloop-nextest-spenso> 4: idenso::dirac::test::feyncalc_reference::dirac_simplify_id4_slash_sandwich
  451. 24.43 s gammaloop-nextest-spenso> 5: <idenso::dirac::test::feyncalc_reference::dirac_simplify_id4_slash_sandwich::{closure#0} as core::ops::function::FnOnce<()>>::call_once
  452. 24.43 s gammaloop-nextest-spenso> note: Some details are omitted, run with `RUST_BACKTRACE=full` for a verbose backtrace.
  453. 24.43 s gammaloop-nextest-spenso>
  454. 24.43 s gammaloop-nextest-spenso> 4. idenso::reference_cases::tests::reference_case_simplification_snapshots
  455. 24.43 s gammaloop-nextest-spenso> failure: test failure with exit code 101
  456. 24.43 s gammaloop-nextest-spenso> thread 'reference_cases::tests::reference_case_simplification_snapshots' (674) panicked at crates/idenso/src/dirac/mod.rs:360:5:
  457. 24.43 s gammaloop-nextest-spenso> gamma third argument must be a Minkowski slot
  458. 24.43 s gammaloop-nextest-spenso> stack backtrace:
  459. 24.43 s gammaloop-nextest-spenso> 0: __rustc::rust_begin_unwind
  460. 24.43 s gammaloop-nextest-spenso> 1: core::panicking::panic_fmt
  461. 24.43 s gammaloop-nextest-spenso> 2: idenso::dirac::require_gamma_port
  462. 24.43 s gammaloop-nextest-spenso> 3: idenso::dirac::gamma_tensor
  463. 24.43 s gammaloop-nextest-spenso> 4: idenso::reference_cases::dirac_feyncalc_slash_sandwich_id4
  464. 24.43 s gammaloop-nextest-spenso> 5: <idenso::reference_cases::ReferenceCase>::simplified
  465. 24.43 s gammaloop-nextest-spenso> 6: <core::iter::adapters::map::Map<core::slice::iter::Iter<idenso::reference_cases::ReferenceCase>, idenso::reference_cases::tests::reference_case_simplification_snapshots::{closure#0}> as core::iter::traits::iterator::Iterator>::fold::<(), core::iter::traits::iterator::Iterator::for_each::call<alloc::string::String, <alloc::vec::Vec<alloc::string::String>>::extend_trusted<core::iter::adapters::map::Map<core::slice::iter::Iter<idenso::reference_cases::ReferenceCase>, idenso::reference_cases::tests::reference_case_simplification_snapshots::{closure#0}>>::{closure#0}>::{closure#0}>
  466. 24.43 s gammaloop-nextest-spenso> 7: <alloc::vec::Vec<alloc::string::String> as alloc::vec::spec_from_iter_nested::SpecFromIterNested<alloc::string::String, core::iter::adapters::map::Map<core::slice::iter::Iter<idenso::reference_cases::ReferenceCase>, idenso::reference_cases::tests::reference_case_simplification_snapshots::{closure#0}>>>::from_iter
  467. 24.43 s gammaloop-nextest-spenso> 8: idenso::reference_cases::tests::reference_case_simplification_snapshots
  468. 24.43 s gammaloop-nextest-spenso> 9: <idenso::reference_cases::tests::reference_case_simplification_snapshots::{closure#0} as core::ops::function::FnOnce<()>>::call_once
  469. 24.43 s gammaloop-nextest-spenso> note: Some details are omitted, run with `RUST_BACKTRACE=full` for a verbose backtrace.
  470. 24.43 s gammaloop-nextest-spenso> system-out
  471. 24.43 s gammaloop-nextest-spenso> running 1 test
  472. 24.43 s gammaloop-nextest-spenso> test reference_cases::tests::reference_case_simplification_snapshots ... FAILED
  473. 24.43 s gammaloop-nextest-spenso>
  474. 24.43 s gammaloop-nextest-spenso> failures:
  475. 24.43 s gammaloop-nextest-spenso>
  476. 24.43 s gammaloop-nextest-spenso> failures:
  477. 24.43 s gammaloop-nextest-spenso> reference_cases::tests::reference_case_simplification_snapshots
  478. 24.43 s gammaloop-nextest-spenso>
  479. 24.43 s gammaloop-nextest-spenso> test result: FAILED. 0 passed; 1 failed; 0 ignored; 0 measured; 248 filtered out; finished in 0.01s
  480. 24.43 s gammaloop-nextest-spenso> system-err
  481. 24.43 s gammaloop-nextest-spenso> thread 'reference_cases::tests::reference_case_simplification_snapshots' (674) panicked at crates/idenso/src/dirac/mod.rs:360:5:
  482. 24.43 s gammaloop-nextest-spenso> gamma third argument must be a Minkowski slot
  483. 24.43 s gammaloop-nextest-spenso> stack backtrace:
  484. 24.43 s gammaloop-nextest-spenso> 0: __rustc::rust_begin_unwind
  485. 24.43 s gammaloop-nextest-spenso> 1: core::panicking::panic_fmt
  486. 24.43 s gammaloop-nextest-spenso> 2: idenso::dirac::require_gamma_port
  487. 24.43 s gammaloop-nextest-spenso> 3: idenso::dirac::gamma_tensor
  488. 24.43 s gammaloop-nextest-spenso> 4: idenso::reference_cases::dirac_feyncalc_slash_sandwich_id4
  489. 24.43 s gammaloop-nextest-spenso> 5: <idenso::reference_cases::ReferenceCase>::simplified
  490. 24.43 s gammaloop-nextest-spenso> 6: <core::iter::adapters::map::Map<core::slice::iter::Iter<idenso::reference_cases::ReferenceCase>, idenso::reference_cases::tests::reference_case_simplification_snapshots::{closure#0}> as core::iter::traits::iterator::Iterator>::fold::<(), core::iter::traits::iterator::Iterator::for_each::call<alloc::string::String, <alloc::vec::Vec<alloc::string::String>>::extend_trusted<core::iter::adapters::map::Map<core::slice::iter::Iter<idenso::reference_cases::ReferenceCase>, idenso::reference_cases::tests::reference_case_simplification_snapshots::{closure#0}>>::{closure#0}>::{closure#0}>
  491. 24.43 s gammaloop-nextest-spenso> 7: <alloc::vec::Vec<alloc::string::String> as alloc::vec::spec_from_iter_nested::SpecFromIterNested<alloc::string::String, core::iter::adapters::map::Map<core::slice::iter::Iter<idenso::reference_cases::ReferenceCase>, idenso::reference_cases::tests::reference_case_simplification_snapshots::{closure#0}>>>::from_iter
  492. 24.43 s gammaloop-nextest-spenso> 8: idenso::reference_cases::tests::reference_case_simplification_snapshots
  493. 24.43 s gammaloop-nextest-spenso> 9: <idenso::reference_cases::tests::reference_case_simplification_snapshots::{closure#0} as core::ops::function::FnOnce<()>>::call_once
  494. 24.43 s gammaloop-nextest-spenso> note: Some details are omitted, run with `RUST_BACKTRACE=full` for a verbose backtrace.
  495. 24.43 s gammaloop-nextest-spenso>
  496. 24.43 s gammaloop-nextest-spenso> 5. idenso::tensor::tests::parsing::infinite_execution
  497. 24.43 s gammaloop-nextest-spenso> failure: test failure with exit code 101
  498. 24.43 s gammaloop-nextest-spenso> thread 'tensor::tests::parsing::infinite_execution' (860) panicked at /nix/store/hg5bizfwiwqlh0nqmr64rssi5zwpdp0k-vendor-cargo-deps/c19b7c6f923b580ac259164a89f2577984ad5ab09ee9d583b888f934adbbe8d0/insta-1.47.2/src/runtime.rs:719:13:
  499. 24.43 s gammaloop-nextest-spenso> snapshot assertion for 'infinite_execution' failed in line 905
  500. 24.43 s gammaloop-nextest-spenso> stack backtrace:
  501. 24.43 s gammaloop-nextest-spenso> 0: __rustc::rust_begin_unwind
  502. 24.43 s gammaloop-nextest-spenso> 1: core::panicking::panic_fmt
  503. 24.43 s gammaloop-nextest-spenso> 2: insta::runtime::assert_snapshot
  504. 24.43 s gammaloop-nextest-spenso> 3: idenso::tensor::tests::parsing::infinite_execution
  505. 24.43 s gammaloop-nextest-spenso> 4: <idenso::tensor::tests::parsing::infinite_execution::{closure#0} as core::ops::function::FnOnce<()>>::call_once
  506. 24.43 s gammaloop-nextest-spenso> note: Some details are omitted, run with `RUST_BACKTRACE=full` for a verbose backtrace.
  507. 24.43 s gammaloop-nextest-spenso> system-out
  508. 24.43 s gammaloop-nextest-spenso> running 1 test
  509. 24.43 s gammaloop-nextest-spenso> ━━━━━━━━━━━━━━━━━━━━━━━━━━━━━━━ Snapshot Summary ━━━━━━━━━━━━━━━━━━━━━━━━━━━━━━━
  510. 24.43 s gammaloop-nextest-spenso> Snapshot: infinite_execution
  511. 24.43 s gammaloop-nextest-spenso> Source: crates/idenso/src/tensor/tests/parsing.rs:905
  512. 24.43 s gammaloop-nextest-spenso> ────────────────────────────────────────────────────────────────────────────────
  513. 24.43 s gammaloop-nextest-spenso> Expression: net_iter.snapshot_dot()
  514. 24.43 s gammaloop-nextest-spenso> ────────────────────────────────────────────────────────────────────────────────
  515. 24.43 s gammaloop-nextest-spenso> -old snapshot
  516. 24.43 s gammaloop-nextest-spenso> +new results
  517. 24.43 s gammaloop-nextest-spenso> ────────────┬───────────────────────────────────────────────────────────────────
  518. 24.43 s gammaloop-nextest-spenso> 8 8 │ 0:0:s-> ext0 [id=0 color="red"];
  519. 24.43 s gammaloop-nextest-spenso> 9 9 │ ext1 [style=invis];
  520. 24.43 s gammaloop-nextest-spenso> 10 10 │ 0:5:s-> ext1 [id=1 dir=none color="red" label="mink4|l_0"];
  521. 24.43 s gammaloop-nextest-spenso> 11 11 │ ext2 [style=invis];
  522. 24.43 s gammaloop-nextest-spenso> 12 │- 0:4:s-> ext2 [id=2 dir=none color="red" label="bis4|l_2"];
  523. 24.43 s gammaloop-nextest-spenso> 12 │+ 0:3:s-> ext2 [id=2 dir=none color="red" label="mink4|l_1"];
  524. 24.43 s gammaloop-nextest-spenso> 13 13 │ ext3 [style=invis];
  525. 24.43 s gammaloop-nextest-spenso> 14 │- 0:3:s-> ext3 [id=3 dir=none color="red" label="bis4|l_3"];
  526. 24.43 s gammaloop-nextest-spenso> 14 │+ 0:1:s-> ext3 [id=3 dir=none color="red" label="bis4|l_2"];
  527. 24.43 s gammaloop-nextest-spenso> 15 15 │ ext4 [style=invis];
  528. 24.43 s gammaloop-nextest-spenso> 16 │- 0:1:s-> ext4 [id=4 dir=none color="red" label="mink4|l_1"];
  529. 24.43 s gammaloop-nextest-spenso> 16 │+ 0:2:s-> ext4 [id=4 dir=none color="red" label="mink4|l_4"];
  530. 24.43 s gammaloop-nextest-spenso> 17 17 │ ext5 [style=invis];
  531. 24.43 s gammaloop-nextest-spenso> 18 │- 0:2:s-> ext5 [id=5 dir=none color="red" label="mink4|l_4"];
  532. 24.43 s gammaloop-nextest-spenso> 18 │+ 0:4:s-> ext5 [id=5 dir=none color="red" label="bis4|l_3"];
  533. 24.43 s gammaloop-nextest-spenso> 19 19 │ }
  534. 24.43 s gammaloop-nextest-spenso> ────────────┴───────────────────────────────────────────────────────────────────
  535. 24.43 s gammaloop-nextest-spenso> To update snapshots run `cargo insta review`
  536. 24.43 s gammaloop-nextest-spenso> Stopped on the first failure. Run `cargo insta test` to run all snapshots.
  537. 24.43 s gammaloop-nextest-spenso> test tensor::tests::parsing::infinite_execution ... FAILED
  538. 24.43 s gammaloop-nextest-spenso>
  539. 24.43 s gammaloop-nextest-spenso> failures:
  540. 24.43 s gammaloop-nextest-spenso>
  541. 24.43 s gammaloop-nextest-spenso> failures:
  542. 24.43 s gammaloop-nextest-spenso> tensor::tests::parsing::infinite_execution
  543. 24.43 s gammaloop-nextest-spenso>
  544. 24.44 s gammaloop-nextest-spenso> test result: FAILED. 0 passed; 1 failed; 0 ignored; 0 measured; 248 filtered out; finished in 0.06s
  545. 24.44 s gammaloop-nextest-spenso> system-err
  546. 24.44 s gammaloop-nextest-spenso> thread 'tensor::tests::parsing::infinite_execution' (860) panicked at /nix/store/hg5bizfwiwqlh0nqmr64rssi5zwpdp0k-vendor-cargo-deps/c19b7c6f923b580ac259164a89f2577984ad5ab09ee9d583b888f934adbbe8d0/insta-1.47.2/src/runtime.rs:719:13:
  547. 24.44 s gammaloop-nextest-spenso> snapshot assertion for 'infinite_execution' failed in line 905
  548. 24.44 s gammaloop-nextest-spenso> stack backtrace:
  549. 24.44 s gammaloop-nextest-spenso> 0: __rustc::rust_begin_unwind
  550. 24.44 s gammaloop-nextest-spenso> 1: core::panicking::panic_fmt
  551. 24.44 s gammaloop-nextest-spenso> 2: insta::runtime::assert_snapshot
  552. 24.44 s gammaloop-nextest-spenso> 3: idenso::tensor::tests::parsing::infinite_execution
  553. 24.44 s gammaloop-nextest-spenso> 4: <idenso::tensor::tests::parsing::infinite_execution::{closure#0} as core::ops::function::FnOnce<()>>::call_once
  554. 24.44 s gammaloop-nextest-spenso> note: Some details are omitted, run with `RUST_BACKTRACE=full` for a verbose backtrace.
  555. 24.44 s gammaloop-nextest-spenso> =========================================
  556. 24.45 s gammaloop-nextest-spenso> Extracting 2 binaries and 1 linked path to /build/nextest-archive-MaSD3v
  557. 24.57 s gammaloop-nextest-spenso> Extracted 8 files to /build/nextest-archive-MaSD3v in 0.11s
  558. 24.58 s gammaloop-nextest-spenso> ------------
  559. 24.58 s gammaloop-nextest-spenso> Nextest run ID c3b3dee3-4e43-4b5b-9df2-f365a506f86c with nextest profile: ci_gammaloop
  560. 24.58 s gammaloop-nextest-spenso> Starting 195 tests across 2 binaries
  561. 24.77 s gammaloop-nextest-spenso> ------------
  562. 24.77 s gammaloop-nextest-spenso> Summary [ 0.190s] 195 tests run: 195 passed, 0 skipped
  563. 24.85 s gammaloop-nextest-spenso>
  564. 24.85 s gammaloop-nextest-spenso> ========== nextest test summary ==========
  565. 24.85 s gammaloop-nextest-spenso> report: target/nextest/ci_gammaloop/junit.xml
  566. 24.85 s gammaloop-nextest-spenso> tests: 195, failures: 0, errors: 0
  567. 24.85 s gammaloop-nextest-spenso> No failing testcases found.
  568. 24.85 s gammaloop-nextest-spenso> =========================================
  569. 24.87 s gammaloop-nextest-spenso> Extracting 5 binaries and 2 linked paths to /build/nextest-archive-E9EJVE
  570. 25.30 s gammaloop-nextest-spenso> Extracted 19 files to /build/nextest-archive-E9EJVE in 0.44s
  571. 25.32 s gammaloop-nextest-spenso> ------------
  572. 25.32 s gammaloop-nextest-spenso> Nextest run ID 50e8221f-77a5-4cfa-8726-9f214cbcad54 with nextest profile: ci_gammaloop
  573. 25.32 s gammaloop-nextest-spenso> Starting 27 tests across 5 binaries (1 test skipped via profile.ci_gammaloop.default-filter)
  574. 25.44 s gammaloop-nextest-spenso> FAIL [ 0.092s] (24/27) spenso-hep-lib::idenso_validation enabled_idenso_reference_cases_validate_against_explicit_tensors
  575. 25.44 s gammaloop-nextest-spenso> stdout ---
  576. 25.44 s gammaloop-nextest-spenso>
  577. 25.44 s gammaloop-nextest-spenso> running 1 test
  578. 25.44 s gammaloop-nextest-spenso> test enabled_idenso_reference_cases_validate_against_explicit_tensors ... FAILED
  579. 25.44 s gammaloop-nextest-spenso>
  580. 25.44 s gammaloop-nextest-spenso> failures:
  581. 25.44 s gammaloop-nextest-spenso>
  582. 25.44 s gammaloop-nextest-spenso> failures:
  583. 25.44 s gammaloop-nextest-spenso> enabled_idenso_reference_cases_validate_against_explicit_tensors
  584. 25.44 s gammaloop-nextest-spenso>
  585. 25.44 s gammaloop-nextest-spenso> test result: FAILED. 0 passed; 1 failed; 0 ignored; 0 measured; 14 filtered out; finished in 0.08s
  586. 25.44 s gammaloop-nextest-spenso>
  587. 25.44 s gammaloop-nextest-spenso> stderr ---
  588. 25.44 s gammaloop-nextest-spenso>
  589. 25.44 s gammaloop-nextest-spenso> thread 'enabled_idenso_reference_cases_validate_against_explicit_tensors' (1668) panicked at crates/idenso/src/dirac/mod.rs:360:5:
  590. 25.44 s gammaloop-nextest-spenso> gamma third argument must be a Minkowski slot
  591. 25.44 s gammaloop-nextest-spenso> stack backtrace:
  592. 25.44 s gammaloop-nextest-spenso> 0: __rustc::rust_begin_unwind
  593. 25.44 s gammaloop-nextest-spenso> 1: core::panicking::panic_fmt
  594. 25.44 s gammaloop-nextest-spenso> 2: idenso::dirac::require_gamma_port
  595. 25.44 s gammaloop-nextest-spenso> 3: idenso::dirac::gamma_tensor
  596. 25.44 s gammaloop-nextest-spenso> 4: idenso::reference_cases::dirac_feyncalc_slash_sandwich_id4
  597. 25.44 s gammaloop-nextest-spenso> 5: <idenso_validation::enabled_idenso_reference_cases_validate_against_explicit_tensors::{closure#0} as core::ops::function::FnOnce<()>>::call_once
  598. 25.44 s gammaloop-nextest-spenso> note: Some details are omitted, run with `RUST_BACKTRACE=full` for a verbose backtrace.
  599. 25.44 s gammaloop-nextest-spenso>
  600. 25.57 s gammaloop-nextest-spenso> ------------
  601. 25.57 s gammaloop-nextest-spenso> Summary [ 0.244s] 27 tests run: 26 passed, 1 failed, 1 skipped
  602. 25.57 s gammaloop-nextest-spenso> FAIL [ 0.092s] (24/27) spenso-hep-lib::idenso_validation enabled_idenso_reference_cases_validate_against_explicit_tensors
  603. 25.57 s gammaloop-nextest-spenso> stdout ---
  604. 25.57 s gammaloop-nextest-spenso>
  605. 25.57 s gammaloop-nextest-spenso> running 1 test
  606. 25.57 s gammaloop-nextest-spenso> test enabled_idenso_reference_cases_validate_against_explicit_tensors ... FAILED
  607. 25.57 s gammaloop-nextest-spenso>
  608. 25.57 s gammaloop-nextest-spenso> failures:
  609. 25.57 s gammaloop-nextest-spenso>
  610. 25.57 s gammaloop-nextest-spenso> failures:
  611. 25.57 s gammaloop-nextest-spenso> enabled_idenso_reference_cases_validate_against_explicit_tensors
  612. 25.57 s gammaloop-nextest-spenso>
  613. 25.57 s gammaloop-nextest-spenso> test result: FAILED. 0 passed; 1 failed; 0 ignored; 0 measured; 14 filtered out; finished in 0.08s
  614. 25.57 s gammaloop-nextest-spenso>
  615. 25.57 s gammaloop-nextest-spenso> stderr ---
  616. 25.57 s gammaloop-nextest-spenso>
  617. 25.57 s gammaloop-nextest-spenso> thread 'enabled_idenso_reference_cases_validate_against_explicit_tensors' (1668) panicked at crates/idenso/src/dirac/mod.rs:360:5:
  618. 25.57 s gammaloop-nextest-spenso> gamma third argument must be a Minkowski slot
  619. 25.57 s gammaloop-nextest-spenso> stack backtrace:
  620. 25.57 s gammaloop-nextest-spenso> 0: __rustc::rust_begin_unwind
  621. 25.57 s gammaloop-nextest-spenso> 1: core::panicking::panic_fmt
  622. 25.57 s gammaloop-nextest-spenso> 2: idenso::dirac::require_gamma_port
  623. 25.57 s gammaloop-nextest-spenso> 3: idenso::dirac::gamma_tensor
  624. 25.57 s gammaloop-nextest-spenso> 4: idenso::reference_cases::dirac_feyncalc_slash_sandwich_id4
  625. 25.57 s gammaloop-nextest-spenso> 5: <idenso_validation::enabled_idenso_reference_cases_validate_against_explicit_tensors::{closure#0} as core::ops::function::FnOnce<()>>::call_once
  626. 25.57 s gammaloop-nextest-spenso> note: Some details are omitted, run with `RUST_BACKTRACE=full` for a verbose backtrace.
  627. 25.57 s gammaloop-nextest-spenso>
  628. 25.64 s gammaloop-nextest-spenso> error: test run failed
  629. 25.70 s gammaloop-nextest-spenso>
  630. 25.70 s gammaloop-nextest-spenso> ========== nextest test summary ==========
  631. 25.70 s gammaloop-nextest-spenso> report: target/nextest/ci_gammaloop/junit.xml
  632. 25.70 s gammaloop-nextest-spenso> tests: 27, failures: 1, errors: 0
  633. 25.70 s gammaloop-nextest-spenso>
  634. 25.70 s gammaloop-nextest-spenso> 1. spenso-hep-lib::idenso_validation::enabled_idenso_reference_cases_validate_against_explicit_tensors
  635. 25.70 s gammaloop-nextest-spenso> failure: test failure with exit code 101
  636. 25.70 s gammaloop-nextest-spenso> thread 'enabled_idenso_reference_cases_validate_against_explicit_tensors' (1668) panicked at crates/idenso/src/dirac/mod.rs:360:5:
  637. 25.70 s gammaloop-nextest-spenso> gamma third argument must be a Minkowski slot
  638. 25.70 s gammaloop-nextest-spenso> stack backtrace:
  639. 25.70 s gammaloop-nextest-spenso> 0: __rustc::rust_begin_unwind
  640. 25.70 s gammaloop-nextest-spenso> 1: core::panicking::panic_fmt
  641. 25.70 s gammaloop-nextest-spenso> 2: idenso::dirac::require_gamma_port
  642. 25.70 s gammaloop-nextest-spenso> 3: idenso::dirac::gamma_tensor
  643. 25.70 s gammaloop-nextest-spenso> 4: idenso::reference_cases::dirac_feyncalc_slash_sandwich_id4
  644. 25.70 s gammaloop-nextest-spenso> 5: <idenso_validation::enabled_idenso_reference_cases_validate_against_explicit_tensors::{closure#0} as core::ops::function::FnOnce<()>>::call_once
  645. 25.70 s gammaloop-nextest-spenso> note: Some details are omitted, run with `RUST_BACKTRACE=full` for a verbose backtrace.
  646. 25.70 s gammaloop-nextest-spenso> system-out
  647. 25.70 s gammaloop-nextest-spenso> running 1 test
  648. 25.70 s gammaloop-nextest-spenso> test enabled_idenso_reference_cases_validate_against_explicit_tensors ... FAILED
  649. 25.70 s gammaloop-nextest-spenso>
  650. 25.70 s gammaloop-nextest-spenso> failures:
  651. 25.70 s gammaloop-nextest-spenso>
  652. 25.70 s gammaloop-nextest-spenso> failures:
  653. 25.70 s gammaloop-nextest-spenso> enabled_idenso_reference_cases_validate_against_explicit_tensors
  654. 25.70 s gammaloop-nextest-spenso>
  655. 25.70 s gammaloop-nextest-spenso> test result: FAILED. 0 passed; 1 failed; 0 ignored; 0 measured; 14 filtered out; finished in 0.08s
  656. 25.70 s gammaloop-nextest-spenso> system-err
  657. 25.70 s gammaloop-nextest-spenso> thread 'enabled_idenso_reference_cases_validate_against_explicit_tensors' (1668) panicked at crates/idenso/src/dirac/mod.rs:360:5:
  658. 25.70 s gammaloop-nextest-spenso> gamma third argument must be a Minkowski slot
  659. 25.70 s gammaloop-nextest-spenso> stack backtrace:
  660. 25.70 s gammaloop-nextest-spenso> 0: __rustc::rust_begin_unwind
  661. 25.70 s gammaloop-nextest-spenso> 1: core::panicking::panic_fmt
  662. 25.70 s gammaloop-nextest-spenso> 2: idenso::dirac::require_gamma_port
  663. 25.70 s gammaloop-nextest-spenso> 3: idenso::dirac::gamma_tensor
  664. 25.70 s gammaloop-nextest-spenso> 4: idenso::reference_cases::dirac_feyncalc_slash_sandwich_id4
  665. 25.70 s gammaloop-nextest-spenso> 5: <idenso_validation::enabled_idenso_reference_cases_validate_against_explicit_tensors::{closure#0} as core::ops::function::FnOnce<()>>::call_once
  666. 25.70 s gammaloop-nextest-spenso> note: Some details are omitted, run with `RUST_BACKTRACE=full` for a verbose backtrace.
  667. 25.70 s gammaloop-nextest-spenso> =========================================
  668. 25.73 s gammaloop-nextest-spenso> Extracting 2 binaries and 1 linked path to /build/nextest-archive-95pi18
  669. 25.85 s gammaloop-nextest-spenso> Extracted 8 files to /build/nextest-archive-95pi18 in 0.13s
  670. 25.87 s gammaloop-nextest-spenso> ------------
  671. 25.87 s gammaloop-nextest-spenso> Nextest run ID 1d705142-de78-47d2-be02-e2600cdf9191 with nextest profile: ci_gammaloop
  672. 25.87 s gammaloop-nextest-spenso> Starting 1 test across 2 binaries
  673. 25.88 s gammaloop-nextest-spenso> ------------
  674. 25.88 s gammaloop-nextest-spenso> Summary [ 0.008s] 1 test run: 1 passed, 0 skipped
  675. 25.94 s gammaloop-nextest-spenso>
  676. 25.94 s gammaloop-nextest-spenso> ========== nextest test summary ==========
  677. 25.94 s gammaloop-nextest-spenso> report: target/nextest/ci_gammaloop/junit.xml
  678. 25.94 s gammaloop-nextest-spenso> tests: 1, failures: 0, errors: 0
  679. 25.94 s gammaloop-nextest-spenso> No failing testcases found.
  680. 25.94 s gammaloop-nextest-spenso> =========================================
  681. 25.97 s gammaloop-nextest-spenso> Extracting 1 binary and 1 linked path to /build/nextest-archive-eAUh6A
  682. 26.09 s gammaloop-nextest-spenso> Extracted 7 files to /build/nextest-archive-eAUh6A in 0.12s
  683. 26.10 s gammaloop-nextest-spenso> ------------
  684. 26.10 s gammaloop-nextest-spenso> Nextest run ID 81b52048-492c-4673-b94a-fd5436dd084b with nextest profile: ci_gammaloop
  685. 26.10 s gammaloop-nextest-spenso> Starting 0 tests across 1 binary
  686. 26.10 s gammaloop-nextest-spenso> ------------
  687. 26.10 s gammaloop-nextest-spenso> Summary [ 0.000s] 0 tests run: 0 passed, 0 skipped
  688. 26.17 s gammaloop-nextest-spenso>
  689. 26.17 s gammaloop-nextest-spenso> ========== nextest test summary ==========
  690. 26.17 s gammaloop-nextest-spenso> report: target/nextest/ci_gammaloop/junit.xml
  691. 26.17 s gammaloop-nextest-spenso> tests: 0, failures: 0, errors: 0
  692. 26.17 s gammaloop-nextest-spenso> No failing testcases found.
  693. 26.17 s gammaloop-nextest-spenso> =========================================
  694. 26.23 s error: Cannot build '/nix/store/9sbgbb6pw8px5w5h52x6id0993hp37qd-gammaloop-nextest-spenso.drv'.
  695. 26.23 s Reason: builder failed with exit code 100.
  696. 26.23 s Output paths:
  697. 26.23 s /nix/store/a97wgffcw6m7xlnmdpkf5n07613sq2jn-gammaloop-nextest-spenso
  698. 26.23 s Last 677 log lines:
  699. 26.23 s > Extracting 5 binaries and 2 linked paths to /build/nextest-archive-LMdElm
  700. 26.23 s > Extracted 19 files to /build/nextest-archive-LMdElm in 0.30s
  701. 26.23 s > ------------
  702. 26.23 s > Nextest run ID ff48b94b-e5a8-4581-bf55-b13ecc300aef with nextest profile: ci_gammaloop
  703. 26.23 s > Starting 232 tests across 5 binaries (26 tests skipped, including 2 tests via profile.ci_gammaloop.default-filter)
  704. 26.23 s > FAIL [ 0.014s] ( 90/232) idenso dirac::test::feyncalc_reference::dirac_simplify_id40_repeated_gamma_and_two_trace
  705. 26.23 s > stdout ---
  706. 26.23 s >
  707. 26.23 s > running 1 test
  708. 26.23 s > test dirac::test::feyncalc_reference::dirac_simplify_id40_repeated_gamma_and_two_trace ... FAILED
  709. 26.23 s >
  710. 26.23 s > failures:
  711. 26.23 s >
  712. 26.23 s > failures:
  713. 26.23 s > dirac::test::feyncalc_reference::dirac_simplify_id40_repeated_gamma_and_two_trace
  714. 26.23 s >
  715. 26.23 s > test result: FAILED. 0 passed; 1 failed; 0 ignored; 0 measured; 248 filtered out; finished in 0.01s
  716. 26.23 s >
  717. 26.23 s > stderr ---
  718. 26.23 s >
  719. 26.23 s > thread 'dirac::test::feyncalc_reference::dirac_simplify_id40_repeated_gamma_and_two_trace' (500) panicked at crates/idenso/src/dirac/mod.rs:360:5:
  720. 26.23 s > gamma third argument must be a Minkowski slot
  721. 26.23 s > stack backtrace:
  722. 26.23 s > 0: __rustc::rust_begin_unwind
  723. 26.23 s > 1: core::panicking::panic_fmt
  724. 26.23 s > 2: idenso::dirac::require_gamma_port
  725. 26.23 s > 3: idenso::dirac::gamma_tensor
  726. 26.23 s > 4: idenso::dirac::test::feyncalc_reference::dirac_simplify_id40_repeated_gamma_and_two_trace
  727. 26.23 s > 5: <idenso::dirac::test::feyncalc_reference::dirac_simplify_id40_repeated_gamma_and_two_trace::{closure#0} as core::ops::function::FnOnce<()>>::call_once
  728. 26.23 s > note: Some details are omitted, run with `RUST_BACKTRACE=full` for a verbose backtrace.
  729. 26.23 s >
  730. 26.23 s > FAIL [ 0.015s] ( 91/232) idenso dirac::test::feyncalc_reference::dirac_simplify_id46_d_dim_repeated_gamma_slash_sum
  731. 26.23 s > stdout ---
  732. 26.23 s >
  733. 26.23 s > running 1 test
  734. 26.23 s > test dirac::test::feyncalc_reference::dirac_simplify_id46_d_dim_repeated_gamma_slash_sum ... FAILED
  735. 26.23 s >
  736. 26.23 s > failures:
  737. 26.23 s >
  738. 26.23 s > failures:
  739. 26.23 s > dirac::test::feyncalc_reference::dirac_simplify_id46_d_dim_repeated_gamma_slash_sum
  740. 26.23 s >
  741. 26.23 s > test result: FAILED. 0 passed; 1 failed; 0 ignored; 0 measured; 248 filtered out; finished in 0.01s
  742. 26.23 s >
  743. 26.23 s > stderr ---
  744. 26.23 s >
  745. 26.23 s > thread 'dirac::test::feyncalc_reference::dirac_simplify_id46_d_dim_repeated_gamma_slash_sum' (505) panicked at crates/idenso/src/dirac/mod.rs:360:5:
  746. 26.23 s > gamma third argument must be a Minkowski slot
  747. 26.23 s > stack backtrace:
  748. 26.23 s > 0: __rustc::rust_begin_unwind
  749. 26.23 s > 1: core::panicking::panic_fmt
  750. 26.23 s > 2: idenso::dirac::require_gamma_port
  751. 26.23 s > 3: idenso::dirac::gamma_tensor
  752. 26.23 s > 4: idenso::dirac::test::feyncalc_reference::dirac_simplify_id46_d_dim_repeated_gamma_slash_sum
  753. 26.23 s > 5: <idenso::dirac::test::feyncalc_reference::dirac_simplify_id46_d_dim_repeated_gamma_slash_sum::{closure#0} as core::ops::function::FnOnce<()>>::call_once
  754. 26.23 s > note: Some details are omitted, run with `RUST_BACKTRACE=full` for a verbose backtrace.
  755. 26.23 s >
  756. 26.23 s > FAIL [ 0.023s] ( 93/232) idenso dirac::test::feyncalc_reference::dirac_simplify_id4_slash_sandwich
  757. 26.23 s > stdout ---
  758. 26.23 s >
  759. 26.23 s > running 1 test
  760. 26.23 s > test dirac::test::feyncalc_reference::dirac_simplify_id4_slash_sandwich ... FAILED
  761. 26.23 s >
  762. 26.23 s > failures:
  763. 26.23 s >
  764. 26.23 s > failures:
  765. 26.23 s > dirac::test::feyncalc_reference::dirac_simplify_id4_slash_sandwich
  766. 26.23 s >
  767. 26.23 s > test result: FAILED. 0 passed; 1 failed; 0 ignored; 0 measured; 248 filtered out; finished in 0.01s
  768. 26.23 s >
  769. 26.23 s > stderr ---
  770. 26.23 s >
  771. 26.23 s > thread 'dirac::test::feyncalc_reference::dirac_simplify_id4_slash_sandwich' (510) panicked at crates/idenso/src/dirac/mod.rs:360:5:
  772. 26.23 s > gamma third argument must be a Minkowski slot
  773. 26.23 s > stack backtrace:
  774. 26.23 s > 0: __rustc::rust_begin_unwind
  775. 26.23 s > 1: core::panicking::panic_fmt
  776. 26.23 s > 2: idenso::dirac::require_gamma_port
  777. 26.23 s > 3: idenso::dirac::gamma_tensor
  778. 26.23 s > 4: idenso::dirac::test::feyncalc_reference::dirac_simplify_id4_slash_sandwich
  779. 26.23 s > 5: <idenso::dirac::test::feyncalc_reference::dirac_simplify_id4_slash_sandwich::{closure#0} as core::ops::function::FnOnce<()>>::call_once
  780. 26.23 s > note: Some details are omitted, run with `RUST_BACKTRACE=full` for a verbose backtrace.
  781. 26.23 s >
  782. 26.23 s > FAIL [ 0.017s] (140/232) idenso reference_cases::tests::reference_case_simplification_snapshots
  783. 26.23 s > stdout ---
  784. 26.23 s >
  785. 26.23 s > running 1 test
  786. 26.23 s > test reference_cases::tests::reference_case_simplification_snapshots ... FAILED
  787. 26.23 s >
  788. 26.23 s > failures:
  789. 26.23 s >
  790. 26.23 s > failures:
  791. 26.23 s > reference_cases::tests::reference_case_simplification_snapshots
  792. 26.23 s >
  793. 26.23 s > test result: FAILED. 0 passed; 1 failed; 0 ignored; 0 measured; 248 filtered out; finished in 0.01s
  794. 26.23 s >
  795. 26.23 s > stderr ---
  796. 26.23 s >
  797. 26.23 s > thread 'reference_cases::tests::reference_case_simplification_snapshots' (674) panicked at crates/idenso/src/dirac/mod.rs:360:5:
  798. 26.23 s > gamma third argument must be a Minkowski slot
  799. 26.23 s > stack backtrace:
  800. 26.23 s > 0: __rustc::rust_begin_unwind
  801. 26.23 s > 1: core::panicking::panic_fmt
  802. 26.23 s > 2: idenso::dirac::require_gamma_port
  803. 26.23 s > 3: idenso::dirac::gamma_tensor
  804. 26.23 s > 4: idenso::reference_cases::dirac_feyncalc_slash_sandwich_id4
  805. 26.23 s > 5: <idenso::reference_cases::ReferenceCase>::simplified
  806. 26.23 s > 6: <core::iter::adapters::map::Map<core::slice::iter::Iter<idenso::reference_cases::ReferenceCase>, idenso::reference_cases::tests::reference_case_simplification_snapshots::{closure#0}> as core::iter::traits::iterator::Iterator>::fold::<(), core::iter::traits::iterator::Iterator::for_each::call<alloc::string::String, <alloc::vec::Vec<alloc::string::String>>::extend_trusted<core::iter::adapters::map::Map<core::slice::iter::Iter<idenso::reference_cases::ReferenceCase>, idenso::reference_cases::tests::reference_case_simplification_snapshots::{closure#0}>>::{closure#0}>::{closure#0}>
  807. 26.23 s > 7: <alloc::vec::Vec<alloc::string::String> as alloc::vec::spec_from_iter_nested::SpecFromIterNested<alloc::string::String, core::iter::adapters::map::Map<core::slice::iter::Iter<idenso::reference_cases::ReferenceCase>, idenso::reference_cases::tests::reference_case_simplification_snapshots::{closure#0}>>>::from_iter
  808. 26.23 s > 8: idenso::reference_cases::tests::reference_case_simplification_snapshots
  809. 26.23 s > 9: <idenso::reference_cases::tests::reference_case_simplification_snapshots::{closure#0} as core::ops::function::FnOnce<()>>::call_once
  810. 26.23 s > note: Some details are omitted, run with `RUST_BACKTRACE=full` for a verbose backtrace.
  811. 26.23 s >
  812. 26.23 s > FAIL [ 0.070s] (228/232) idenso tensor::tests::parsing::infinite_execution
  813. 26.23 s > stdout ---
  814. 26.23 s >
  815. 26.23 s > running 1 test
  816. 26.23 s > ━━━━━━━━━━━━━━━━━━━━━━━━━━━━━━━ Snapshot Summary ━━━━━━━━━━━━━━━━━━━━━━━━━━━━━━━
  817. 26.23 s > Snapshot: infinite_execution
  818. 26.23 s > Source: crates/idenso/src/tensor/tests/parsing.rs:905
  819. 26.23 s > ────────────────────────────────────────────────────────────────────────────────
  820. 26.23 s > Expression: net_iter.snapshot_dot()
  821. 26.23 s > ────────────────────────────────────────────────────────────────────────────────
  822. 26.23 s > -old snapshot
  823. 26.23 s > +new results
  824. 26.23 s > ────────────┬───────────────────────────────────────────────────────────────────
  825. 26.23 s > 8 8 │ 0:0:s -> ext0 [id=0 color="red"];
  826. 26.23 s > 9 9 │ ext1 [style=invis];
  827. 26.23 s > 10 10 │ 0:5:s -> ext1 [id=1 dir=none color="red" label="mink4|l_0"];
  828. 26.23 s > 11 11 │ ext2 [style=invis];
  829. 26.23 s > 12 │- 0:4:s -> ext2 [id=2 dir=none color="red" label="bis4|l_2"];
  830. 26.23 s > 12 │+ 0:3:s -> ext2 [id=2 dir=none color="red" label="mink4|l_1"];
  831. 26.23 s > 13 13 │ ext3 [style=invis];
  832. 26.23 s > 14 │- 0:3:s -> ext3 [id=3 dir=none color="red" label="bis4|l_3"];
  833. 26.23 s > 14 │+ 0:1:s -> ext3 [id=3 dir=none color="red" label="bis4|l_2"];
  834. 26.23 s > 15 15 │ ext4 [style=invis];
  835. 26.23 s > 16 │- 0:1:s -> ext4 [id=4 dir=none color="red" label="mink4|l_1"];
  836. 26.23 s > 16 │+ 0:2:s -> ext4 [id=4 dir=none color="red" label="mink4|l_4"];
  837. 26.23 s > 17 17 │ ext5 [style=invis];
  838. 26.23 s > 18 │- 0:2:s -> ext5 [id=5 dir=none color="red" label="mink4|l_4"];
  839. 26.23 s > 18 │+ 0:4:s -> ext5 [id=5 dir=none color="red" label="bis4|l_3"];
  840. 26.23 s > 19 19 │ }
  841. 26.23 s > ────────────┴───────────────────────────────────────────────────────────────────
  842. 26.23 s > To update snapshots run `cargo insta review`
  843. 26.23 s > Stopped on the first failure. Run `cargo insta test` to run all snapshots.
  844. 26.23 s > test tensor::tests::parsing::infinite_execution ... FAILED
  845. 26.23 s >
  846. 26.23 s > failures:
  847. 26.23 s >
  848. 26.23 s > failures:
  849. 26.23 s > tensor::tests::parsing::infinite_execution
  850. 26.23 s >
  851. 26.23 s > test result: FAILED. 0 passed; 1 failed; 0 ignored; 0 measured; 248 filtered out; finished in 0.06s
  852. 26.23 s >
  853. 26.23 s > stderr ---
  854. 26.23 s >
  855. 26.23 s > thread 'tensor::tests::parsing::infinite_execution' (860) panicked at /nix/store/hg5bizfwiwqlh0nqmr64rssi5zwpdp0k-vendor-cargo-deps/c19b7c6f923b580ac259164a89f2577984ad5ab09ee9d583b888f934adbbe8d0/insta-1.47.2/src/runtime.rs:719:13:
  856. 26.23 s > snapshot assertion for 'infinite_execution' failed in line 905
  857. 26.23 s > stack backtrace:
  858. 26.23 s > 0: __rustc::rust_begin_unwind
  859. 26.23 s > 1: core::panicking::panic_fmt
  860. 26.23 s > 2: insta::runtime::assert_snapshot
  861. 26.23 s > 3: idenso::tensor::tests::parsing::infinite_execution
  862. 26.23 s > 4: <idenso::tensor::tests::parsing::infinite_execution::{closure#0} as core::ops::function::FnOnce<()>>::call_once
  863. 26.23 s > note: Some details are omitted, run with `RUST_BACKTRACE=full` for a verbose backtrace.
  864. 26.23 s >
  865. 26.23 s > ------------
  866. 26.23 s > Summary [ 2.444s] 232 tests run: 227 passed, 5 failed, 26 skipped
  867. 26.23 s > FAIL [ 0.014s] ( 90/232) idenso dirac::test::feyncalc_reference::dirac_simplify_id40_repeated_gamma_and_two_trace
  868. 26.23 s > stdout ---
  869. 26.23 s >
  870. 26.23 s > running 1 test
  871. 26.23 s > test dirac::test::feyncalc_reference::dirac_simplify_id40_repeated_gamma_and_two_trace ... FAILED
  872. 26.23 s >
  873. 26.23 s > failures:
  874. 26.23 s >
  875. 26.23 s > failures:
  876. 26.23 s > dirac::test::feyncalc_reference::dirac_simplify_id40_repeated_gamma_and_two_trace
  877. 26.23 s >
  878. 26.23 s > test result: FAILED. 0 passed; 1 failed; 0 ignored; 0 measured; 248 filtered out; finished in 0.01s
  879. 26.23 s >
  880. 26.23 s > stderr ---
  881. 26.23 s >
  882. 26.23 s > thread 'dirac::test::feyncalc_reference::dirac_simplify_id40_repeated_gamma_and_two_trace' (500) panicked at crates/idenso/src/dirac/mod.rs:360:5:
  883. 26.23 s > gamma third argument must be a Minkowski slot
  884. 26.23 s > stack backtrace:
  885. 26.23 s > 0: __rustc::rust_begin_unwind
  886. 26.23 s > 1: core::panicking::panic_fmt
  887. 26.23 s > 2: idenso::dirac::require_gamma_port
  888. 26.23 s > 3: idenso::dirac::gamma_tensor
  889. 26.23 s > 4: idenso::dirac::test::feyncalc_reference::dirac_simplify_id40_repeated_gamma_and_two_trace
  890. 26.23 s > 5: <idenso::dirac::test::feyncalc_reference::dirac_simplify_id40_repeated_gamma_and_two_trace::{closure#0} as core::ops::function::FnOnce<()>>::call_once
  891. 26.23 s > note: Some details are omitted, run with `RUST_BACKTRACE=full` for a verbose backtrace.
  892. 26.23 s >
  893. 26.23 s > FAIL [ 0.015s] ( 91/232) idenso dirac::test::feyncalc_reference::dirac_simplify_id46_d_dim_repeated_gamma_slash_sum
  894. 26.23 s > stdout ---
  895. 26.23 s >
  896. 26.23 s > running 1 test
  897. 26.23 s > test dirac::test::feyncalc_reference::dirac_simplify_id46_d_dim_repeated_gamma_slash_sum ... FAILED
  898. 26.23 s >
  899. 26.23 s > failures:
  900. 26.23 s >
  901. 26.23 s > failures:
  902. 26.23 s > dirac::test::feyncalc_reference::dirac_simplify_id46_d_dim_repeated_gamma_slash_sum
  903. 26.23 s >
  904. 26.23 s > test result: FAILED. 0 passed; 1 failed; 0 ignored; 0 measured; 248 filtered out; finished in 0.01s
  905. 26.23 s >
  906. 26.23 s > stderr ---
  907. 26.23 s >
  908. 26.23 s > thread 'dirac::test::feyncalc_reference::dirac_simplify_id46_d_dim_repeated_gamma_slash_sum' (505) panicked at crates/idenso/src/dirac/mod.rs:360:5:
  909. 26.23 s > gamma third argument must be a Minkowski slot
  910. 26.23 s > stack backtrace:
  911. 26.23 s > 0: __rustc::rust_begin_unwind
  912. 26.23 s > 1: core::panicking::panic_fmt
  913. 26.23 s > 2: idenso::dirac::require_gamma_port
  914. 26.23 s > 3: idenso::dirac::gamma_tensor
  915. 26.23 s > 4: idenso::dirac::test::feyncalc_reference::dirac_simplify_id46_d_dim_repeated_gamma_slash_sum
  916. 26.23 s > 5: <idenso::dirac::test::feyncalc_reference::dirac_simplify_id46_d_dim_repeated_gamma_slash_sum::{closure#0} as core::ops::function::FnOnce<()>>::call_once
  917. 26.23 s > note: Some details are omitted, run with `RUST_BACKTRACE=full` for a verbose backtrace.
  918. 26.23 s >
  919. 26.23 s > FAIL [ 0.023s] ( 93/232) idenso dirac::test::feyncalc_reference::dirac_simplify_id4_slash_sandwich
  920. 26.23 s > stdout ---
  921. 26.23 s >
  922. 26.23 s > running 1 test
  923. 26.23 s > test dirac::test::feyncalc_reference::dirac_simplify_id4_slash_sandwich ... FAILED
  924. 26.23 s >
  925. 26.23 s > failures:
  926. 26.23 s >
  927. 26.23 s > failures:
  928. 26.23 s > dirac::test::feyncalc_reference::dirac_simplify_id4_slash_sandwich
  929. 26.23 s >
  930. 26.23 s > test result: FAILED. 0 passed; 1 failed; 0 ignored; 0 measured; 248 filtered out; finished in 0.01s
  931. 26.23 s >
  932. 26.23 s > stderr ---
  933. 26.23 s >
  934. 26.23 s > thread 'dirac::test::feyncalc_reference::dirac_simplify_id4_slash_sandwich' (510) panicked at crates/idenso/src/dirac/mod.rs:360:5:
  935. 26.23 s > gamma third argument must be a Minkowski slot
  936. 26.23 s > stack backtrace:
  937. 26.23 s > 0: __rustc::rust_begin_unwind
  938. 26.23 s > 1: core::panicking::panic_fmt
  939. 26.23 s > 2: idenso::dirac::require_gamma_port
  940. 26.23 s > 3: idenso::dirac::gamma_tensor
  941. 26.23 s > 4: idenso::dirac::test::feyncalc_reference::dirac_simplify_id4_slash_sandwich
  942. 26.23 s > 5: <idenso::dirac::test::feyncalc_reference::dirac_simplify_id4_slash_sandwich::{closure#0} as core::ops::function::FnOnce<()>>::call_once
  943. 26.23 s > note: Some details are omitted, run with `RUST_BACKTRACE=full` for a verbose backtrace.
  944. 26.23 s >
  945. 26.23 s > FAIL [ 0.017s] (140/232) idenso reference_cases::tests::reference_case_simplification_snapshots
  946. 26.23 s > stdout ---
  947. 26.23 s >
  948. 26.23 s > running 1 test
  949. 26.23 s > test reference_cases::tests::reference_case_simplification_snapshots ... FAILED
  950. 26.23 s >
  951. 26.23 s > failures:
  952. 26.23 s >
  953. 26.23 s > failures:
  954. 26.23 s > reference_cases::tests::reference_case_simplification_snapshots
  955. 26.23 s >
  956. 26.23 s > test result: FAILED. 0 passed; 1 failed; 0 ignored; 0 measured; 248 filtered out; finished in 0.01s
  957. 26.23 s >
  958. 26.23 s > stderr ---
  959. 26.23 s >
  960. 26.23 s > thread 'reference_cases::tests::reference_case_simplification_snapshots' (674) panicked at crates/idenso/src/dirac/mod.rs:360:5:
  961. 26.23 s > gamma third argument must be a Minkowski slot
  962. 26.23 s > stack backtrace:
  963. 26.23 s > 0: __rustc::rust_begin_unwind
  964. 26.23 s > 1: core::panicking::panic_fmt
  965. 26.23 s > 2: idenso::dirac::require_gamma_port
  966. 26.23 s > 3: idenso::dirac::gamma_tensor
  967. 26.23 s > 4: idenso::reference_cases::dirac_feyncalc_slash_sandwich_id4
  968. 26.23 s > 5: <idenso::reference_cases::ReferenceCase>::simplified
  969. 26.23 s > 6: <core::iter::adapters::map::Map<core::slice::iter::Iter<idenso::reference_cases::ReferenceCase>, idenso::reference_cases::tests::reference_case_simplification_snapshots::{closure#0}> as core::iter::traits::iterator::Iterator>::fold::<(), core::iter::traits::iterator::Iterator::for_each::call<alloc::string::String, <alloc::vec::Vec<alloc::string::String>>::extend_trusted<core::iter::adapters::map::Map<core::slice::iter::Iter<idenso::reference_cases::ReferenceCase>, idenso::reference_cases::tests::reference_case_simplification_snapshots::{closure#0}>>::{closure#0}>::{closure#0}>
  970. 26.23 s > 7: <alloc::vec::Vec<alloc::string::String> as alloc::vec::spec_from_iter_nested::SpecFromIterNested<alloc::string::String, core::iter::adapters::map::Map<core::slice::iter::Iter<idenso::reference_cases::ReferenceCase>, idenso::reference_cases::tests::reference_case_simplification_snapshots::{closure#0}>>>::from_iter
  971. 26.23 s > 8: idenso::reference_cases::tests::reference_case_simplification_snapshots
  972. 26.23 s > 9: <idenso::reference_cases::tests::reference_case_simplification_snapshots::{closure#0} as core::ops::function::FnOnce<()>>::call_once
  973. 26.23 s > note: Some details are omitted, run with `RUST_BACKTRACE=full` for a verbose backtrace.
  974. 26.23 s >
  975. 26.23 s > FAIL [ 0.070s] (228/232) idenso tensor::tests::parsing::infinite_execution
  976. 26.23 s > stdout ---
  977. 26.23 s >
  978. 26.23 s > running 1 test
  979. 26.23 s > ━━━━━━━━━━━━━━━━━━━━━━━━━━━━━━━ Snapshot Summary ━━━━━━━━━━━━━━━━━━━━━━━━━━━━━━━
  980. 26.23 s > Snapshot: infinite_execution
  981. 26.23 s > Source: crates/idenso/src/tensor/tests/parsing.rs:905
  982. 26.23 s > ────────────────────────────────────────────────────────────────────────────────
  983. 26.23 s > Expression: net_iter.snapshot_dot()
  984. 26.23 s > ────────────────────────────────────────────────────────────────────────────────
  985. 26.23 s > -old snapshot
  986. 26.23 s > +new results
  987. 26.23 s > ────────────┬───────────────────────────────────────────────────────────────────
  988. 26.23 s > 8 8 │ 0:0:s -> ext0 [id=0 color="red"];
  989. 26.23 s > 9 9 │ ext1 [style=invis];
  990. 26.23 s > 10 10 │ 0:5:s -> ext1 [id=1 dir=none color="red" label="mink4|l_0"];
  991. 26.23 s > 11 11 │ ext2 [style=invis];
  992. 26.23 s > 12 │- 0:4:s -> ext2 [id=2 dir=none color="red" label="bis4|l_2"];
  993. 26.23 s > 12 │+ 0:3:s -> ext2 [id=2 dir=none color="red" label="mink4|l_1"];
  994. 26.23 s > 13 13 │ ext3 [style=invis];
  995. 26.23 s > 14 │- 0:3:s -> ext3 [id=3 dir=none color="red" label="bis4|l_3"];
  996. 26.23 s > 14 │+ 0:1:s -> ext3 [id=3 dir=none color="red" label="bis4|l_2"];
  997. 26.23 s > 15 15 │ ext4 [style=invis];
  998. 26.23 s > 16 │- 0:1:s -> ext4 [id=4 dir=none color="red" label="mink4|l_1"];
  999. 26.23 s > 16 │+ 0:2:s -> ext4 [id=4 dir=none color="red" label="mink4|l_4"];
  1000. 26.23 s > 17 17 │ ext5 [style=invis];
  1001. 26.23 s > 18 │- 0:2:s -> ext5 [id=5 dir=none color="red" label="mink4|l_4"];
  1002. 26.23 s > 18 │+ 0:4:s -> ext5 [id=5 dir=none color="red" label="bis4|l_3"];
  1003. 26.23 s > 19 19 │ }
  1004. 26.23 s > ────────────┴───────────────────────────────────────────────────────────────────
  1005. 26.23 s > To update snapshots run `cargo insta review`
  1006. 26.23 s > Stopped on the first failure. Run `cargo insta test` to run all snapshots.
  1007. 26.23 s > test tensor::tests::parsing::infinite_execution ... FAILED
  1008. 26.23 s >
  1009. 26.23 s > failures:
  1010. 26.23 s >
  1011. 26.23 s > failures:
  1012. 26.23 s > tensor::tests::parsing::infinite_execution
  1013. 26.23 s >
  1014. 26.23 s > test result: FAILED. 0 passed; 1 failed; 0 ignored; 0 measured; 248 filtered out; finished in 0.06s
  1015. 26.23 s >
  1016. 26.23 s > stderr ---
  1017. 26.23 s >
  1018. 26.23 s > thread 'tensor::tests::parsing::infinite_execution' (860) panicked at /nix/store/hg5bizfwiwqlh0nqmr64rssi5zwpdp0k-vendor-cargo-deps/c19b7c6f923b580ac259164a89f2577984ad5ab09ee9d583b888f934adbbe8d0/insta-1.47.2/src/runtime.rs:719:13:
  1019. 26.23 s > snapshot assertion for 'infinite_execution' failed in line 905
  1020. 26.23 s > stack backtrace:
  1021. 26.23 s > 0: __rustc::rust_begin_unwind
  1022. 26.23 s > 1: core::panicking::panic_fmt
  1023. 26.23 s > 2: insta::runtime::assert_snapshot
  1024. 26.23 s > 3: idenso::tensor::tests::parsing::infinite_execution
  1025. 26.23 s > 4: <idenso::tensor::tests::parsing::infinite_execution::{closure#0} as core::ops::function::FnOnce<()>>::call_once
  1026. 26.23 s > note: Some details are omitted, run with `RUST_BACKTRACE=full` for a verbose backtrace.
  1027. 26.23 s >
  1028. 26.23 s > error: test run failed
  1029. 26.23 s >
  1030. 26.23 s > ========== nextest test summary ==========
  1031. 26.23 s > report: target/nextest/ci_gammaloop/junit.xml
  1032. 26.23 s > tests: 232, failures: 5, errors: 0
  1033. 26.23 s >
  1034. 26.23 s > 1. idenso::dirac::test::feyncalc_reference::dirac_simplify_id40_repeated_gamma_and_two_trace
  1035. 26.23 s > failure: test failure with exit code 101
  1036. 26.23 s > thread 'dirac::test::feyncalc_reference::dirac_simplify_id40_repeated_gamma_and_two_trace' (500) panicked at crates/idenso/src/dirac/mod.rs:360:5:
  1037. 26.23 s > gamma third argument must be a Minkowski slot
  1038. 26.23 s > stack backtrace:
  1039. 26.23 s > 0: __rustc::rust_begin_unwind
  1040. 26.23 s > 1: core::panicking::panic_fmt
  1041. 26.23 s > 2: idenso::dirac::require_gamma_port
  1042. 26.23 s > 3: idenso::dirac::gamma_tensor
  1043. 26.23 s > 4: idenso::dirac::test::feyncalc_reference::dirac_simplify_id40_repeated_gamma_and_two_trace
  1044. 26.23 s > 5: <idenso::dirac::test::feyncalc_reference::dirac_simplify_id40_repeated_gamma_and_two_trace::{closure#0} as core::ops::function::FnOnce<()>>::call_once
  1045. 26.23 s > note: Some details are omitted, run with `RUST_BACKTRACE=full` for a verbose backtrace.
  1046. 26.23 s > system-out
  1047. 26.23 s > running 1 test
  1048. 26.23 s > test dirac::test::feyncalc_reference::dirac_simplify_id40_repeated_gamma_and_two_trace ... FAILED
  1049. 26.23 s >
  1050. 26.23 s > failures:
  1051. 26.23 s >
  1052. 26.23 s > failures:
  1053. 26.23 s > dirac::test::feyncalc_reference::dirac_simplify_id40_repeated_gamma_and_two_trace
  1054. 26.23 s >
  1055. 26.23 s > test result: FAILED. 0 passed; 1 failed; 0 ignored; 0 measured; 248 filtered out; finished in 0.01s
  1056. 26.23 s > system-err
  1057. 26.23 s > thread 'dirac::test::feyncalc_reference::dirac_simplify_id40_repeated_gamma_and_two_trace' (500) panicked at crates/idenso/src/dirac/mod.rs:360:5:
  1058. 26.23 s > gamma third argument must be a Minkowski slot
  1059. 26.23 s > stack backtrace:
  1060. 26.23 s > 0: __rustc::rust_begin_unwind
  1061. 26.23 s > 1: core::panicking::panic_fmt
  1062. 26.23 s > 2: idenso::dirac::require_gamma_port
  1063. 26.23 s > 3: idenso::dirac::gamma_tensor
  1064. 26.23 s > 4: idenso::dirac::test::feyncalc_reference::dirac_simplify_id40_repeated_gamma_and_two_trace
  1065. 26.23 s > 5: <idenso::dirac::test::feyncalc_reference::dirac_simplify_id40_repeated_gamma_and_two_trace::{closure#0} as core::ops::function::FnOnce<()>>::call_once
  1066. 26.23 s > note: Some details are omitted, run with `RUST_BACKTRACE=full` for a verbose backtrace.
  1067. 26.23 s >
  1068. 26.23 s > 2. idenso::dirac::test::feyncalc_reference::dirac_simplify_id46_d_dim_repeated_gamma_slash_sum
  1069. 26.23 s > failure: test failure with exit code 101
  1070. 26.23 s > thread 'dirac::test::feyncalc_reference::dirac_simplify_id46_d_dim_repeated_gamma_slash_sum' (505) panicked at crates/idenso/src/dirac/mod.rs:360:5:
  1071. 26.23 s > gamma third argument must be a Minkowski slot
  1072. 26.23 s > stack backtrace:
  1073. 26.23 s > 0: __rustc::rust_begin_unwind
  1074. 26.23 s > 1: core::panicking::panic_fmt
  1075. 26.23 s > 2: idenso::dirac::require_gamma_port
  1076. 26.23 s > 3: idenso::dirac::gamma_tensor
  1077. 26.23 s > 4: idenso::dirac::test::feyncalc_reference::dirac_simplify_id46_d_dim_repeated_gamma_slash_sum
  1078. 26.23 s > 5: <idenso::dirac::test::feyncalc_reference::dirac_simplify_id46_d_dim_repeated_gamma_slash_sum::{closure#0} as core::ops::function::FnOnce<()>>::call_once
  1079. 26.23 s > note: Some details are omitted, run with `RUST_BACKTRACE=full` for a verbose backtrace.
  1080. 26.23 s > system-out
  1081. 26.23 s > running 1 test
  1082. 26.23 s > test dirac::test::feyncalc_reference::dirac_simplify_id46_d_dim_repeated_gamma_slash_sum ... FAILED
  1083. 26.23 s >
  1084. 26.23 s > failures:
  1085. 26.23 s >
  1086. 26.23 s > failures:
  1087. 26.23 s > dirac::test::feyncalc_reference::dirac_simplify_id46_d_dim_repeated_gamma_slash_sum
  1088. 26.23 s >
  1089. 26.23 s > test result: FAILED. 0 passed; 1 failed; 0 ignored; 0 measured; 248 filtered out; finished in 0.01s
  1090. 26.23 s > system-err
  1091. 26.23 s > thread 'dirac::test::feyncalc_reference::dirac_simplify_id46_d_dim_repeated_gamma_slash_sum' (505) panicked at crates/idenso/src/dirac/mod.rs:360:5:
  1092. 26.23 s > gamma third argument must be a Minkowski slot
  1093. 26.23 s > stack backtrace:
  1094. 26.23 s > 0: __rustc::rust_begin_unwind
  1095. 26.23 s > 1: core::panicking::panic_fmt
  1096. 26.23 s > 2: idenso::dirac::require_gamma_port
  1097. 26.23 s > 3: idenso::dirac::gamma_tensor
  1098. 26.23 s > 4: idenso::dirac::test::feyncalc_reference::dirac_simplify_id46_d_dim_repeated_gamma_slash_sum
  1099. 26.23 s > 5: <idenso::dirac::test::feyncalc_reference::dirac_simplify_id46_d_dim_repeated_gamma_slash_sum::{closure#0} as core::ops::function::FnOnce<()>>::call_once
  1100. 26.23 s > note: Some details are omitted, run with `RUST_BACKTRACE=full` for a verbose backtrace.
  1101. 26.23 s >
  1102. 26.23 s > 3. idenso::dirac::test::feyncalc_reference::dirac_simplify_id4_slash_sandwich
  1103. 26.23 s > failure: test failure with exit code 101
  1104. 26.23 s > thread 'dirac::test::feyncalc_reference::dirac_simplify_id4_slash_sandwich' (510) panicked at crates/idenso/src/dirac/mod.rs:360:5:
  1105. 26.23 s > gamma third argument must be a Minkowski slot
  1106. 26.23 s > stack backtrace:
  1107. 26.23 s > 0: __rustc::rust_begin_unwind
  1108. 26.23 s > 1: core::panicking::panic_fmt
  1109. 26.23 s > 2: idenso::dirac::require_gamma_port
  1110. 26.23 s > 3: idenso::dirac::gamma_tensor
  1111. 26.23 s > 4: idenso::dirac::test::feyncalc_reference::dirac_simplify_id4_slash_sandwich
  1112. 26.23 s > 5: <idenso::dirac::test::feyncalc_reference::dirac_simplify_id4_slash_sandwich::{closure#0} as core::ops::function::FnOnce<()>>::call_once
  1113. 26.23 s > note: Some details are omitted, run with `RUST_BACKTRACE=full` for a verbose backtrace.
  1114. 26.23 s > system-out
  1115. 26.23 s > running 1 test
  1116. 26.23 s > test dirac::test::feyncalc_reference::dirac_simplify_id4_slash_sandwich ... FAILED
  1117. 26.23 s >
  1118. 26.23 s > failures:
  1119. 26.23 s >
  1120. 26.23 s > failures:
  1121. 26.23 s > dirac::test::feyncalc_reference::dirac_simplify_id4_slash_sandwich
  1122. 26.23 s >
  1123. 26.23 s > test result: FAILED. 0 passed; 1 failed; 0 ignored; 0 measured; 248 filtered out; finished in 0.01s
  1124. 26.23 s > system-err
  1125. 26.23 s > thread 'dirac::test::feyncalc_reference::dirac_simplify_id4_slash_sandwich' (510) panicked at crates/idenso/src/dirac/mod.rs:360:5:
  1126. 26.23 s > gamma third argument must be a Minkowski slot
  1127. 26.23 s > stack backtrace:
  1128. 26.23 s > 0: __rustc::rust_begin_unwind
  1129. 26.23 s > 1: core::panicking::panic_fmt
  1130. 26.23 s > 2: idenso::dirac::require_gamma_port
  1131. 26.23 s > 3: idenso::dirac::gamma_tensor
  1132. 26.23 s > 4: idenso::dirac::test::feyncalc_reference::dirac_simplify_id4_slash_sandwich
  1133. 26.23 s > 5: <idenso::dirac::test::feyncalc_reference::dirac_simplify_id4_slash_sandwich::{closure#0} as core::ops::function::FnOnce<()>>::call_once
  1134. 26.23 s > note: Some details are omitted, run with `RUST_BACKTRACE=full` for a verbose backtrace.
  1135. 26.23 s >
  1136. 26.23 s > 4. idenso::reference_cases::tests::reference_case_simplification_snapshots
  1137. 26.23 s > failure: test failure with exit code 101
  1138. 26.23 s > thread 'reference_cases::tests::reference_case_simplification_snapshots' (674) panicked at crates/idenso/src/dirac/mod.rs:360:5:
  1139. 26.23 s > gamma third argument must be a Minkowski slot
  1140. 26.23 s > stack backtrace:
  1141. 26.23 s > 0: __rustc::rust_begin_unwind
  1142. 26.23 s > 1: core::panicking::panic_fmt
  1143. 26.23 s > 2: idenso::dirac::require_gamma_port
  1144. 26.23 s > 3: idenso::dirac::gamma_tensor
  1145. 26.23 s > 4: idenso::reference_cases::dirac_feyncalc_slash_sandwich_id4
  1146. 26.23 s > 5: <idenso::reference_cases::ReferenceCase>::simplified
  1147. 26.23 s > 6: <core::iter::adapters::map::Map<core::slice::iter::Iter<idenso::reference_cases::ReferenceCase>, idenso::reference_cases::tests::reference_case_simplification_snapshots::{closure#0}> as core::iter::traits::iterator::Iterator>::fold::<(), core::iter::traits::iterator::Iterator::for_each::call<alloc::string::String, <alloc::vec::Vec<alloc::string::String>>::extend_trusted<core::iter::adapters::map::Map<core::slice::iter::Iter<idenso::reference_cases::ReferenceCase>, idenso::reference_cases::tests::reference_case_simplification_snapshots::{closure#0}>>::{closure#0}>::{closure#0}>
  1148. 26.23 s > 7: <alloc::vec::Vec<alloc::string::String> as alloc::vec::spec_from_iter_nested::SpecFromIterNested<alloc::string::String, core::iter::adapters::map::Map<core::slice::iter::Iter<idenso::reference_cases::ReferenceCase>, idenso::reference_cases::tests::reference_case_simplification_snapshots::{closure#0}>>>::from_iter
  1149. 26.23 s > 8: idenso::reference_cases::tests::reference_case_simplification_snapshots
  1150. 26.23 s > 9: <idenso::reference_cases::tests::reference_case_simplification_snapshots::{closure#0} as core::ops::function::FnOnce<()>>::call_once
  1151. 26.23 s > note: Some details are omitted, run with `RUST_BACKTRACE=full` for a verbose backtrace.
  1152. 26.23 s > system-out
  1153. 26.23 s > running 1 test
  1154. 26.23 s > test reference_cases::tests::reference_case_simplification_snapshots ... FAILED
  1155. 26.23 s >
  1156. 26.23 s > failures:
  1157. 26.23 s >
  1158. 26.23 s > failures:
  1159. 26.23 s > reference_cases::tests::reference_case_simplification_snapshots
  1160. 26.23 s >
  1161. 26.23 s > test result: FAILED. 0 passed; 1 failed; 0 ignored; 0 measured; 248 filtered out; finished in 0.01s
  1162. 26.23 s > system-err
  1163. 26.23 s > thread 'reference_cases::tests::reference_case_simplification_snapshots' (674) panicked at crates/idenso/src/dirac/mod.rs:360:5:
  1164. 26.23 s > gamma third argument must be a Minkowski slot
  1165. 26.23 s > stack backtrace:
  1166. 26.23 s > 0: __rustc::rust_begin_unwind
  1167. 26.23 s > 1: core::panicking::panic_fmt
  1168. 26.23 s > 2: idenso::dirac::require_gamma_port
  1169. 26.23 s > 3: idenso::dirac::gamma_tensor
  1170. 26.23 s > 4: idenso::reference_cases::dirac_feyncalc_slash_sandwich_id4
  1171. 26.23 s > 5: <idenso::reference_cases::ReferenceCase>::simplified
  1172. 26.23 s > 6: <core::iter::adapters::map::Map<core::slice::iter::Iter<idenso::reference_cases::ReferenceCase>, idenso::reference_cases::tests::reference_case_simplification_snapshots::{closure#0}> as core::iter::traits::iterator::Iterator>::fold::<(), core::iter::traits::iterator::Iterator::for_each::call<alloc::string::String, <alloc::vec::Vec<alloc::string::String>>::extend_trusted<core::iter::adapters::map::Map<core::slice::iter::Iter<idenso::reference_cases::ReferenceCase>, idenso::reference_cases::tests::reference_case_simplification_snapshots::{closure#0}>>::{closure#0}>::{closure#0}>
  1173. 26.23 s > 7: <alloc::vec::Vec<alloc::string::String> as alloc::vec::spec_from_iter_nested::SpecFromIterNested<alloc::string::String, core::iter::adapters::map::Map<core::slice::iter::Iter<idenso::reference_cases::ReferenceCase>, idenso::reference_cases::tests::reference_case_simplification_snapshots::{closure#0}>>>::from_iter
  1174. 26.23 s > 8: idenso::reference_cases::tests::reference_case_simplification_snapshots
  1175. 26.23 s > 9: <idenso::reference_cases::tests::reference_case_simplification_snapshots::{closure#0} as core::ops::function::FnOnce<()>>::call_once
  1176. 26.23 s > note: Some details are omitted, run with `RUST_BACKTRACE=full` for a verbose backtrace.
  1177. 26.23 s >
  1178. 26.23 s > 5. idenso::tensor::tests::parsing::infinite_execution
  1179. 26.23 s > failure: test failure with exit code 101
  1180. 26.23 s > thread 'tensor::tests::parsing::infinite_execution' (860) panicked at /nix/store/hg5bizfwiwqlh0nqmr64rssi5zwpdp0k-vendor-cargo-deps/c19b7c6f923b580ac259164a89f2577984ad5ab09ee9d583b888f934adbbe8d0/insta-1.47.2/src/runtime.rs:719:13:
  1181. 26.23 s > snapshot assertion for 'infinite_execution' failed in line 905
  1182. 26.23 s > stack backtrace:
  1183. 26.23 s > 0: __rustc::rust_begin_unwind
  1184. 26.23 s > 1: core::panicking::panic_fmt
  1185. 26.23 s > 2: insta::runtime::assert_snapshot
  1186. 26.23 s > 3: idenso::tensor::tests::parsing::infinite_execution
  1187. 26.23 s > 4: <idenso::tensor::tests::parsing::infinite_execution::{closure#0} as core::ops::function::FnOnce<()>>::call_once
  1188. 26.23 s > note: Some details are omitted, run with `RUST_BACKTRACE=full` for a verbose backtrace.
  1189. 26.23 s > system-out
  1190. 26.23 s > running 1 test
  1191. 26.23 s > ━━━━━━━━━━━━━━━━━━━━━━━━━━━━━━━ Snapshot Summary ━━━━━━━━━━━━━━━━━━━━━━━━━━━━━━━
  1192. 26.23 s > Snapshot: infinite_execution
  1193. 26.23 s > Source: crates/idenso/src/tensor/tests/parsing.rs:905
  1194. 26.23 s > ────────────────────────────────────────────────────────────────────────────────
  1195. 26.23 s > Expression: net_iter.snapshot_dot()
  1196. 26.23 s > ────────────────────────────────────────────────────────────────────────────────
  1197. 26.23 s > -old snapshot
  1198. 26.23 s > +new results
  1199. 26.23 s > ────────────┬───────────────────────────────────────────────────────────────────
  1200. 26.23 s > 8 8 │ 0:0:s-> ext0 [id=0 color="red"];
  1201. 26.23 s > 9 9 │ ext1 [style=invis];
  1202. 26.23 s > 10 10 │ 0:5:s-> ext1 [id=1 dir=none color="red" label="mink4|l_0"];
  1203. 26.23 s > 11 11 │ ext2 [style=invis];
  1204. 26.23 s > 12 │- 0:4:s-> ext2 [id=2 dir=none color="red" label="bis4|l_2"];
  1205. 26.23 s > 12 │+ 0:3:s-> ext2 [id=2 dir=none color="red" label="mink4|l_1"];
  1206. 26.23 s > 13 13 │ ext3 [style=invis];
  1207. 26.23 s > 14 │- 0:3:s-> ext3 [id=3 dir=none color="red" label="bis4|l_3"];
  1208. 26.23 s > 14 │+ 0:1:s-> ext3 [id=3 dir=none color="red" label="bis4|l_2"];
  1209. 26.23 s > 15 15 │ ext4 [style=invis];
  1210. 26.23 s > 16 │- 0:1:s-> ext4 [id=4 dir=none color="red" label="mink4|l_1"];
  1211. 26.23 s > 16 │+ 0:2:s-> ext4 [id=4 dir=none color="red" label="mink4|l_4"];
  1212. 26.23 s > 17 17 │ ext5 [style=invis];
  1213. 26.23 s > 18 │- 0:2:s-> ext5 [id=5 dir=none color="red" label="mink4|l_4"];
  1214. 26.23 s > 18 │+ 0:4:s-> ext5 [id=5 dir=none color="red" label="bis4|l_3"];
  1215. 26.23 s > 19 19 │ }
  1216. 26.23 s > ────────────┴───────────────────────────────────────────────────────────────────
  1217. 26.23 s > To update snapshots run `cargo insta review`
  1218. 26.23 s > Stopped on the first failure. Run `cargo insta test` to run all snapshots.
  1219. 26.23 s > test tensor::tests::parsing::infinite_execution ... FAILED
  1220. 26.23 s >
  1221. 26.23 s > failures:
  1222. 26.23 s >
  1223. 26.23 s > failures:
  1224. 26.23 s > tensor::tests::parsing::infinite_execution
  1225. 26.23 s >
  1226. 26.23 s > test result: FAILED. 0 passed; 1 failed; 0 ignored; 0 measured; 248 filtered out; finished in 0.06s
  1227. 26.23 s > system-err
  1228. 26.23 s > thread 'tensor::tests::parsing::infinite_execution' (860) panicked at /nix/store/hg5bizfwiwqlh0nqmr64rssi5zwpdp0k-vendor-cargo-deps/c19b7c6f923b580ac259164a89f2577984ad5ab09ee9d583b888f934adbbe8d0/insta-1.47.2/src/runtime.rs:719:13:
  1229. 26.23 s > snapshot assertion for 'infinite_execution' failed in line 905
  1230. 26.23 s > stack backtrace:
  1231. 26.23 s > 0: __rustc::rust_begin_unwind
  1232. 26.23 s > 1: core::panicking::panic_fmt
  1233. 26.23 s > 2: insta::runtime::assert_snapshot
  1234. 26.23 s > 3: idenso::tensor::tests::parsing::infinite_execution
  1235. 26.23 s > 4: <idenso::tensor::tests::parsing::infinite_execution::{closure#0} as core::ops::function::FnOnce<()>>::call_once
  1236. 26.23 s > note: Some details are omitted, run with `RUST_BACKTRACE=full` for a verbose backtrace.
  1237. 26.23 s > =========================================
  1238. 26.23 s > Extracting 2 binaries and 1 linked path to /build/nextest-archive-MaSD3v
  1239. 26.23 s > Extracted 8 files to /build/nextest-archive-MaSD3v in 0.11s
  1240. 26.23 s > ------------
  1241. 26.23 s > Nextest run ID c3b3dee3-4e43-4b5b-9df2-f365a506f86c with nextest profile: ci_gammaloop
  1242. 26.23 s > Starting 195 tests across 2 binaries
  1243. 26.23 s > ------------
  1244. 26.23 s > Summary [ 0.190s] 195 tests run: 195 passed, 0 skipped
  1245. 26.23 s >
  1246. 26.23 s > ========== nextest test summary ==========
  1247. 26.23 s > report: target/nextest/ci_gammaloop/junit.xml
  1248. 26.23 s > tests: 195, failures: 0, errors: 0
  1249. 26.23 s > No failing testcases found.
  1250. 26.23 s > =========================================
  1251. 26.23 s > Extracting 5 binaries and 2 linked paths to /build/nextest-archive-E9EJVE
  1252. 26.23 s > Extracted 19 files to /build/nextest-archive-E9EJVE in 0.44s
  1253. 26.23 s > ------------
  1254. 26.23 s > Nextest run ID 50e8221f-77a5-4cfa-8726-9f214cbcad54 with nextest profile: ci_gammaloop
  1255. 26.23 s > Starting 27 tests across 5 binaries (1 test skipped via profile.ci_gammaloop.default-filter)
  1256. 26.23 s > FAIL [ 0.092s] (24/27) spenso-hep-lib::idenso_validation enabled_idenso_reference_cases_validate_against_explicit_tensors
  1257. 26.23 s > stdout ---
  1258. 26.23 s >
  1259. 26.23 s > running 1 test
  1260. 26.23 s > test enabled_idenso_reference_cases_validate_against_explicit_tensors ... FAILED
  1261. 26.23 s >
  1262. 26.23 s > failures:
  1263. 26.23 s >
  1264. 26.23 s > failures:
  1265. 26.23 s > enabled_idenso_reference_cases_validate_against_explicit_tensors
  1266. 26.23 s >
  1267. 26.23 s > test result: FAILED. 0 passed; 1 failed; 0 ignored; 0 measured; 14 filtered out; finished in 0.08s
  1268. 26.23 s >
  1269. 26.23 s > stderr ---
  1270. 26.23 s >
  1271. 26.23 s > thread 'enabled_idenso_reference_cases_validate_against_explicit_tensors' (1668) panicked at crates/idenso/src/dirac/mod.rs:360:5:
  1272. 26.23 s > gamma third argument must be a Minkowski slot
  1273. 26.23 s > stack backtrace:
  1274. 26.23 s > 0: __rustc::rust_begin_unwind
  1275. 26.23 s > 1: core::panicking::panic_fmt
  1276. 26.23 s > 2: idenso::dirac::require_gamma_port
  1277. 26.23 s > 3: idenso::dirac::gamma_tensor
  1278. 26.23 s > 4: idenso::reference_cases::dirac_feyncalc_slash_sandwich_id4
  1279. 26.23 s > 5: <idenso_validation::enabled_idenso_reference_cases_validate_against_explicit_tensors::{closure#0} as core::ops::function::FnOnce<()>>::call_once
  1280. 26.23 s > note: Some details are omitted, run with `RUST_BACKTRACE=full` for a verbose backtrace.
  1281. 26.23 s >
  1282. 26.23 s > ------------
  1283. 26.23 s > Summary [ 0.244s] 27 tests run: 26 passed, 1 failed, 1 skipped
  1284. 26.23 s > FAIL [ 0.092s] (24/27) spenso-hep-lib::idenso_validation enabled_idenso_reference_cases_validate_against_explicit_tensors
  1285. 26.23 s > stdout ---
  1286. 26.23 s >
  1287. 26.23 s > running 1 test
  1288. 26.23 s > test enabled_idenso_reference_cases_validate_against_explicit_tensors ... FAILED
  1289. 26.23 s >
  1290. 26.23 s > failures:
  1291. 26.23 s >
  1292. 26.23 s > failures:
  1293. 26.23 s > enabled_idenso_reference_cases_validate_against_explicit_tensors
  1294. 26.23 s >
  1295. 26.23 s > test result: FAILED. 0 passed; 1 failed; 0 ignored; 0 measured; 14 filtered out; finished in 0.08s
  1296. 26.23 s >
  1297. 26.23 s > stderr ---
  1298. 26.23 s >
  1299. 26.23 s > thread 'enabled_idenso_reference_cases_validate_against_explicit_tensors' (1668) panicked at crates/idenso/src/dirac/mod.rs:360:5:
  1300. 26.23 s > gamma third argument must be a Minkowski slot
  1301. 26.23 s > stack backtrace:
  1302. 26.23 s > 0: __rustc::rust_begin_unwind
  1303. 26.23 s > 1: core::panicking::panic_fmt
  1304. 26.23 s > 2: idenso::dirac::require_gamma_port
  1305. 26.23 s > 3: idenso::dirac::gamma_tensor
  1306. 26.23 s > 4: idenso::reference_cases::dirac_feyncalc_slash_sandwich_id4
  1307. 26.23 s > 5: <idenso_validation::enabled_idenso_reference_cases_validate_against_explicit_tensors::{closure#0} as core::ops::function::FnOnce<()>>::call_once
  1308. 26.23 s > note: Some details are omitted, run with `RUST_BACKTRACE=full` for a verbose backtrace.
  1309. 26.23 s >
  1310. 26.23 s > error: test run failed
  1311. 26.23 s >
  1312. 26.23 s > ========== nextest test summary ==========
  1313. 26.23 s > report: target/nextest/ci_gammaloop/junit.xml
  1314. 26.23 s > tests: 27, failures: 1, errors: 0
  1315. 26.23 s >
  1316. 26.23 s > 1. spenso-hep-lib::idenso_validation::enabled_idenso_reference_cases_validate_against_explicit_tensors
  1317. 26.23 s > failure: test failure with exit code 101
  1318. 26.23 s > thread 'enabled_idenso_reference_cases_validate_against_explicit_tensors' (1668) panicked at crates/idenso/src/dirac/mod.rs:360:5:
  1319. 26.23 s > gamma third argument must be a Minkowski slot
  1320. 26.23 s > stack backtrace:
  1321. 26.23 s > 0: __rustc::rust_begin_unwind
  1322. 26.23 s > 1: core::panicking::panic_fmt
  1323. 26.23 s > 2: idenso::dirac::require_gamma_port
  1324. 26.23 s > 3: idenso::dirac::gamma_tensor
  1325. 26.23 s > 4: idenso::reference_cases::dirac_feyncalc_slash_sandwich_id4
  1326. 26.23 s > 5: <idenso_validation::enabled_idenso_reference_cases_validate_against_explicit_tensors::{closure#0} as core::ops::function::FnOnce<()>>::call_once
  1327. 26.23 s > note: Some details are omitted, run with `RUST_BACKTRACE=full` for a verbose backtrace.
  1328. 26.23 s > system-out
  1329. 26.23 s > running 1 test
  1330. 26.23 s > test enabled_idenso_reference_cases_validate_against_explicit_tensors ... FAILED
  1331. 26.23 s >
  1332. 26.23 s > failures:
  1333. 26.23 s >
  1334. 26.23 s > failures:
  1335. 26.23 s > enabled_idenso_reference_cases_validate_against_explicit_tensors
  1336. 26.23 s >
  1337. 26.23 s > test result: FAILED. 0 passed; 1 failed; 0 ignored; 0 measured; 14 filtered out; finished in 0.08s
  1338. 26.23 s > system-err
  1339. 26.23 s > thread 'enabled_idenso_reference_cases_validate_against_explicit_tensors' (1668) panicked at crates/idenso/src/dirac/mod.rs:360:5:
  1340. 26.23 s > gamma third argument must be a Minkowski slot
  1341. 26.23 s > stack backtrace:
  1342. 26.23 s > 0: __rustc::rust_begin_unwind
  1343. 26.23 s > 1: core::panicking::panic_fmt
  1344. 26.23 s > 2: idenso::dirac::require_gamma_port
  1345. 26.23 s > 3: idenso::dirac::gamma_tensor
  1346. 26.23 s > 4: idenso::reference_cases::dirac_feyncalc_slash_sandwich_id4
  1347. 26.23 s > 5: <idenso_validation::enabled_idenso_reference_cases_validate_against_explicit_tensors::{closure#0} as core::ops::function::FnOnce<()>>::call_once
  1348. 26.23 s > note: Some details are omitted, run with `RUST_BACKTRACE=full` for a verbose backtrace.
  1349. 26.23 s > =========================================
  1350. 26.23 s > Extracting 2 binaries and 1 linked path to /build/nextest-archive-95pi18
  1351. 26.23 s > Extracted 8 files to /build/nextest-archive-95pi18 in 0.13s
  1352. 26.23 s > ------------
  1353. 26.23 s > Nextest run ID 1d705142-de78-47d2-be02-e2600cdf9191 with nextest profile: ci_gammaloop
  1354. 26.24 s > Starting 1 test across 2 binaries
  1355. 26.24 s > ------------
  1356. 26.24 s > Summary [ 0.008s] 1 test run: 1 passed, 0 skipped
  1357. 26.24 s >
  1358. 26.24 s > ========== nextest test summary ==========
  1359. 26.24 s > report: target/nextest/ci_gammaloop/junit.xml
  1360. 26.24 s > tests: 1, failures: 0, errors: 0
  1361. 26.24 s > No failing testcases found.
  1362. 26.24 s > =========================================
  1363. 26.24 s > Extracting 1 binary and 1 linked path to /build/nextest-archive-eAUh6A
  1364. 26.24 s > Extracted 7 files to /build/nextest-archive-eAUh6A in 0.12s
  1365. 26.24 s > ------------
  1366. 26.24 s > Nextest run ID 81b52048-492c-4673-b94a-fd5436dd084b with nextest profile: ci_gammaloop
  1367. 26.24 s > Starting 0 tests across 1 binary
  1368. 26.24 s > ------------
  1369. 26.24 s > Summary [ 0.000s] 0 tests run: 0 passed, 0 skipped
  1370. 26.24 s >
  1371. 26.24 s > ========== nextest test summary ==========
  1372. 26.24 s > report: target/nextest/ci_gammaloop/junit.xml
  1373. 26.24 s > tests: 0, failures: 0, errors: 0
  1374. 26.24 s > No failing testcases found.
  1375. 26.24 s > =========================================
  1376. 26.24 s For full logs, run:
  1377. 26.24 s nix log /nix/store/9sbgbb6pw8px5w5h52x6id0993hp37qd-gammaloop-nextest-spenso.drv
  1378. 26.44 s [0 built (1 failed), 0.0Run failed.