0.00 s
$ /nix/store/9ypz3flqsrl5xl495mm8h645gadjsxi1-coreutils-9.11/bin/timeout --kill-after=15s 7200s /nix/store/23zk8sgzamrbmj1fday15szf7f2279s8-nix-2.34.7/bin/nix --extra-experimental-features nix-command --extra-experimental-features flakes flake clone git+https://github.com/alphal00p/gammaloop --dest /tmp/nix-ci-worker/stable-pwd/repo/
0.26 s
Cloning into '/tmp/nix-ci-worker/stable-pwd/repo'...
1.11 s
remote: Enumerating objects: 84275, done.
1.23 s
remote: Counting objects: 0% (1/8564)
remote: Counting objects: 1% (86/8564)
remote: Counting objects: 2% (172/8564)
remote: Counting objects: 3% (257/8564)
remote: Counting objects: 4% (343/8564)
remote: Counting objects: 5% (429/8564)
remote: Counting objects: 6% (514/8564)
remote: Counting objects: 7% (600/8564)
remote: Counting objects: 8% (686/8564)
remote: Counting objects: 9% (771/8564)
remote: Counting objects: 10% (857/8564)
remote: Counting objects: 11% (943/8564)
remote: Counting objects: 12% (1028/8564)
remote: Counting objects: 13% (1114/8564)
remote: Counting objects: 14% (1199/8564)
remote: Counting objects: 15% (1285/8564)
remote: Counting objects: 16% (1371/8564)
remote: Counting objects: 17% (1456/8564)
remote: Counting objects: 18% (1542/8564)
remote: Counting objects: 19% (1628/8564)
remote: Counting objects: 20% (1713/8564)
remote: Counting objects: 21% (1799/8564)
remote: Counting objects: 22% (1885/8564)
remote: Counting objects: 23% (1970/8564)
remote: Counting objects: 24% (2056/8564)
remote: Counting objects: 25% (2141/8564)
remote: Counting objects: 26% (2227/8564)
remote: Counting objects: 27% (2313/8564)
remote: Counting objects: 28% (2398/8564)
remote: Counting objects: 29% (2484/8564)
remote: Counting objects: 30% (2570/8564)
remote: Counting objects: 31% (2655/8564)
remote: Counting objects: 32% (2741/8564)
remote: Counting objects: 33% (2827/8564)
remote: Counting objects: 34% (2912/8564)
remote: Counting objects: 35% (2998/8564)
remote: Counting objects: 36% (3084/8564)
remote: Counting objects: 37% (3169/8564)
remote: Counting objects: 38% (3255/8564)
remote: Counting objects: 39% (3340/8564)
remote: Counting objects: 40% (3426/8564)
remote: Counting objects: 41% (3512/8564)
remote: Counting objects: 42% (3597/8564)
remote: Counting objects: 43% (3683/8564)
remote: Counting objects: 44% (3769/8564)
remote: Counting objects: 45% (3854/8564)
remote: Counting objects: 46% (3940/8564)
remote: Counting objects: 47% (4026/8564)
remote: Counting objects: 48% (4111/8564)
remote: Counting objects: 49% (4197/8564)
remote: Counting objects: 50% (4282/8564)
remote: Counting objects: 51% (4368/8564)
remote: Counting objects: 52% (4454/8564)
remote: Counting objects: 53% (4539/8564)
remote: Counting objects: 54% (4625/8564)
remote: Counting objects: 55% (4711/8564)
remote: Counting objects: 56% (4796/8564)
remote: Counting objects: 57% (4882/8564)
remote: Counting objects: 58% (4968/8564)
remote: Counting objects: 59% (5053/8564)
remote: Counting objects: 60% (5139/8564)
remote: Counting objects: 61% (5225/8564)
remote: Counting objects: 62% (5310/8564)
remote: Counting objects: 63% (5396/8564)
remote: Counting objects: 64% (5481/8564)
remote: Counting objects: 65% (5567/8564)
remote: Counting objects: 66% (5653/8564)
remote: Counting objects: 67% (5738/8564)
remote: Counting objects: 68% (5824/8564)
remote: Counting objects: 69% (5910/8564)
remote: Counting objects: 70% (5995/8564)
remote: Counting objects: 71% (6081/8564)
remote: Counting objects: 72% (6167/8564)
remote: Counting objects: 73% (6252/8564)
remote: Counting objects: 74% (6338/8564)
remote: Counting objects: 75% (6423/8564)
remote: Counting objects: 76% (6509/8564)
remote: Counting objects: 77% (6595/8564)
remote: Counting objects: 78% (6680/8564)
remote: Counting objects: 79% (6766/8564)
remote: Counting objects: 80% (6852/8564)
remote: Counting objects: 81% (6937/8564)
remote: Counting objects: 82% (7023/8564)
remote: Counting objects: 83% (7109/8564)
remote: Counting objects: 84% (7194/8564)
remote: Counting objects: 85% (7280/8564)
remote: Counting objects: 86% (7366/8564)
remote: Counting objects: 87% (7451/8564)
remote: Counting objects: 88% (7537/8564)
remote: Counting objects: 89% (7622/8564)
remote: Counting objects: 90% (7708/8564)
remote: Counting objects: 91% (7794/8564)
remote: Counting objects: 92% (7879/8564)
remote: Counting objects: 93% (7965/8564)
remote: Counting objects: 94% (8051/8564)
remote: Counting objects: 95% (8136/8564)
remote: Counting objects: 96% (8222/8564)
remote: Counting objects: 97% (8308/8564)
remote: Counting objects: 98% (8393/8564)
remote: Counting objects: 99% (8479/8564)
remote: Counting objects: 100% (8564/8564)
remote: Counting objects: 100% (8564/8564), done.
2.94 s
remote: Compressing objects: 0% (1/1729)
remote: Compressing objects: 1% (18/1729)
remote: Compressing objects: 2% (35/1729)
remote: Compressing objects: 3% (52/1729)
remote: Compressing objects: 4% (70/1729)
remote: Compressing objects: 5% (87/1729)
remote: Compressing objects: 6% (104/1729)
remote: Compressing objects: 7% (122/1729)
remote: Compressing objects: 8% (139/1729)
remote: Compressing objects: 9% (156/1729)
remote: Compressing objects: 10% (173/1729)
remote: Compressing objects: 10% (186/1729)
remote: Compressing objects: 11% (191/1729)
remote: Compressing objects: 12% (208/1729)
remote: Compressing objects: 13% (225/1729)
remote: Compressing objects: 14% (243/1729)
remote: Compressing objects: 15% (260/1729)
remote: Compressing objects: 16% (277/1729)
remote: Compressing objects: 17% (294/1729)
remote: Compressing objects: 18% (312/1729)
remote: Compressing objects: 19% (329/1729)
remote: Compressing objects: 20% (346/1729)
remote: Compressing objects: 21% (364/1729)
remote: Compressing objects: 22% (381/1729)
remote: Compressing objects: 23% (398/1729)
remote: Compressing objects: 24% (415/1729)
remote: Compressing objects: 25% (433/1729)
remote: Compressing objects: 26% (450/1729)
remote: Compressing objects: 27% (467/1729)
remote: Compressing objects: 28% (485/1729)
remote: Compressing objects: 29% (502/1729)
remote: Compressing objects: 30% (519/1729)
remote: Compressing objects: 31% (536/1729)
remote: Compressing objects: 32% (554/1729)
remote: Compressing objects: 33% (571/1729)
remote: Compressing objects: 34% (588/1729)
remote: Compressing objects: 35% (606/1729)
remote: Compressing objects: 36% (623/1729)
remote: Compressing objects: 37% (640/1729)
remote: Compressing objects: 38% (658/1729)
remote: Compressing objects: 39% (675/1729)
remote: Compressing objects: 40% (692/1729)
remote: Compressing objects: 41% (709/1729)
remote: Compressing objects: 42% (727/1729)
remote: Compressing objects: 43% (744/1729)
remote: Compressing objects: 44% (761/1729)
remote: Compressing objects: 45% (779/1729)
remote: Compressing objects: 46% (796/1729)
remote: Compressing objects: 47% (813/1729)
remote: Compressing objects: 48% (830/1729)
remote: Compressing objects: 49% (848/1729)
remote: Compressing objects: 50% (865/1729)
remote: Compressing objects: 51% (882/1729)
remote: Compressing objects: 52% (900/1729)
remote: Compressing objects: 53% (917/1729)
remote: Compressing objects: 54% (934/1729)
remote: Compressing objects: 55% (951/1729)
remote: Compressing objects: 56% (969/1729)
remote: Compressing objects: 57% (986/1729)
remote: Compressing objects: 58% (1003/1729)
remote: Compressing objects: 59% (1021/1729)
remote: Compressing objects: 60% (1038/1729)
remote: Compressing objects: 61% (1055/1729)
remote: Compressing objects: 62% (1072/1729)
remote: Compressing objects: 63% (1090/1729)
remote: Compressing objects: 64% (1107/1729)
remote: Compressing objects: 65% (1124/1729)
remote: Compressing objects: 66% (1142/1729)
remote: Compressing objects: 67% (1159/1729)
remote: Compressing objects: 68% (1176/1729)
remote: Compressing objects: 69% (1194/1729)
remote: Compressing objects: 70% (1211/1729)
remote: Compressing objects: 71% (1228/1729)
remote: Compressing objects: 72% (1245/1729)
remote: Compressing objects: 73% (1263/1729)
remote: Compressing objects: 74% (1280/1729)
remote: Compressing objects: 75% (1297/1729)
remote: Compressing objects: 76% (1315/1729)
remote: Compressing objects: 77% (1332/1729)
remote: Compressing objects: 78% (1349/1729)
remote: Compressing objects: 79% (1366/1729)
remote: Compressing objects: 80% (1384/1729)
remote: Compressing objects: 81% (1401/1729)
remote: Compressing objects: 82% (1418/1729)
remote: Compressing objects: 83% (1436/1729)
remote: Compressing objects: 84% (1453/1729)
remote: Compressing objects: 85% (1470/1729)
remote: Compressing objects: 86% (1487/1729)
remote: Compressing objects: 87% (1505/1729)
remote: Compressing objects: 88% (1522/1729)
remote: Compressing objects: 89% (1539/1729)
remote: Compressing objects: 90% (1557/1729)
remote: Compressing objects: 91% (1574/1729)
remote: Compressing objects: 92% (1591/1729)
remote: Compressing objects: 93% (1608/1729)
remote: Compressing objects: 94% (1626/1729)
remote: Compressing objects: 95% (1643/1729)
remote: Compressing objects: 96% (1660/1729)
remote: Compressing objects: 97% (1678/1729)
remote: Compressing objects: 98% (1695/1729)
remote: Compressing objects: 99% (1712/1729)
remote: Compressing objects: 100% (1729/1729)
remote: Compressing objects: 100% (1729/1729), done.
7.97 s
Receiving objects: 0% (1/84275)
Receiving objects: 1% (843/84275)
Receiving objects: 2% (1686/84275)
Receiving objects: 3% (2529/84275)
Receiving objects: 4% (3371/84275)
Receiving objects: 5% (4214/84275)
Receiving objects: 6% (5057/84275), 9.09 MiB | 18.16 MiB/s
Receiving objects: 7% (5900/84275), 9.09 MiB | 18.16 MiB/s
Receiving objects: 8% (6742/84275), 9.09 MiB | 18.16 MiB/s
Receiving objects: 9% (7585/84275), 9.09 MiB | 18.16 MiB/s
Receiving objects: 10% (8428/84275), 9.09 MiB | 18.16 MiB/s
Receiving objects: 11% (9271/84275), 9.09 MiB | 18.16 MiB/s
Receiving objects: 12% (10113/84275), 9.09 MiB | 18.16 MiB/s
Receiving objects: 13% (10956/84275), 9.09 MiB | 18.16 MiB/s
Receiving objects: 14% (11799/84275), 9.09 MiB | 18.16 MiB/s
Receiving objects: 15% (12642/84275), 9.09 MiB | 18.16 MiB/s
Receiving objects: 16% (13484/84275), 9.09 MiB | 18.16 MiB/s
Receiving objects: 17% (14327/84275), 9.09 MiB | 18.16 MiB/s
Receiving objects: 18% (15170/84275), 9.09 MiB | 18.16 MiB/s
Receiving objects: 19% (16013/84275), 9.09 MiB | 18.16 MiB/s
Receiving objects: 20% (16855/84275), 9.09 MiB | 18.16 MiB/s
Receiving objects: 21% (17698/84275), 9.09 MiB | 18.16 MiB/s
Receiving objects: 22% (18541/84275), 9.09 MiB | 18.16 MiB/s
Receiving objects: 23% (19384/84275), 9.09 MiB | 18.16 MiB/s
Receiving objects: 24% (20226/84275), 9.09 MiB | 18.16 MiB/s
Receiving objects: 25% (21069/84275), 9.09 MiB | 18.16 MiB/s
Receiving objects: 26% (21912/84275), 9.09 MiB | 18.16 MiB/s
Receiving objects: 27% (22755/84275), 9.09 MiB | 18.16 MiB/s
Receiving objects: 28% (23597/84275), 9.09 MiB | 18.16 MiB/s
Receiving objects: 29% (24440/84275), 9.09 MiB | 18.16 MiB/s
Receiving objects: 30% (25283/84275), 9.09 MiB | 18.16 MiB/s
Receiving objects: 31% (26126/84275), 9.09 MiB | 18.16 MiB/s
Receiving objects: 31% (26948/84275), 26.62 MiB | 26.64 MiB/s
Receiving objects: 32% (26968/84275), 26.62 MiB | 26.64 MiB/s
Receiving objects: 33% (27811/84275), 26.62 MiB | 26.64 MiB/s
Receiving objects: 34% (28654/84275), 26.62 MiB | 26.64 MiB/s
Receiving objects: 35% (29497/84275), 26.62 MiB | 26.64 MiB/s
Receiving objects: 36% (30339/84275), 26.62 MiB | 26.64 MiB/s
Receiving objects: 37% (31182/84275), 26.62 MiB | 26.64 MiB/s
Receiving objects: 38% (32025/84275), 26.62 MiB | 26.64 MiB/s
Receiving objects: 39% (32868/84275), 26.62 MiB | 26.64 MiB/s
Receiving objects: 40% (33710/84275), 26.62 MiB | 26.64 MiB/s
Receiving objects: 41% (34553/84275), 26.62 MiB | 26.64 MiB/s
Receiving objects: 42% (35396/84275), 26.62 MiB | 26.64 MiB/s
Receiving objects: 43% (36239/84275), 26.62 MiB | 26.64 MiB/s
Receiving objects: 44% (37081/84275), 26.62 MiB | 26.64 MiB/s
Receiving objects: 45% (37924/84275), 26.62 MiB | 26.64 MiB/s
Receiving objects: 46% (38767/84275), 43.17 MiB | 28.74 MiB/s
Receiving objects: 47% (39610/84275), 43.17 MiB | 28.74 MiB/s
Receiving objects: 48% (40452/84275), 43.17 MiB | 28.74 MiB/s
Receiving objects: 49% (41295/84275), 43.17 MiB | 28.74 MiB/s
Receiving objects: 50% (42138/84275), 43.17 MiB | 28.74 MiB/s
Receiving objects: 51% (42981/84275), 43.17 MiB | 28.74 MiB/s
Receiving objects: 52% (43823/84275), 43.17 MiB | 28.74 MiB/s
Receiving objects: 53% (44666/84275), 43.17 MiB | 28.74 MiB/s
Receiving objects: 54% (45509/84275), 43.17 MiB | 28.74 MiB/s
Receiving objects: 55% (46352/84275), 43.17 MiB | 28.74 MiB/s
Receiving objects: 55% (46499/84275), 43.17 MiB | 28.74 MiB/s
Receiving objects: 56% (47194/84275), 58.89 MiB | 29.41 MiB/s
Receiving objects: 57% (48037/84275), 58.89 MiB | 29.41 MiB/s
Receiving objects: 58% (48880/84275), 58.89 MiB | 29.41 MiB/s
Receiving objects: 59% (49723/84275), 58.89 MiB | 29.41 MiB/s
Receiving objects: 60% (50565/84275), 58.89 MiB | 29.41 MiB/s
Receiving objects: 61% (51408/84275), 58.89 MiB | 29.41 MiB/s
Receiving objects: 62% (52251/84275), 74.00 MiB | 29.31 MiB/s
Receiving objects: 63% (53094/84275), 74.00 MiB | 29.31 MiB/s
Receiving objects: 64% (53936/84275), 74.00 MiB | 29.31 MiB/s
Receiving objects: 65% (54779/84275), 74.00 MiB | 29.31 MiB/s
Receiving objects: 66% (55622/84275), 74.00 MiB | 29.31 MiB/s
Receiving objects: 67% (56465/84275), 74.00 MiB | 29.31 MiB/s
Receiving objects: 68% (57307/84275), 74.00 MiB | 29.31 MiB/s
Receiving objects: 68% (57371/84275), 90.28 MiB | 29.85 MiB/s
Receiving objects: 69% (58150/84275), 105.62 MiB | 29.96 MiB/s
Receiving objects: 70% (58993/84275), 105.62 MiB | 29.96 MiB/s
Receiving objects: 71% (59836/84275), 105.62 MiB | 29.96 MiB/s
Receiving objects: 72% (60678/84275), 105.62 MiB | 29.96 MiB/s
Receiving objects: 73% (61521/84275), 105.62 MiB | 29.96 MiB/s
Receiving objects: 74% (62364/84275), 105.62 MiB | 29.96 MiB/s
Receiving objects: 75% (63207/84275), 105.62 MiB | 29.96 MiB/s
Receiving objects: 75% (63255/84275), 105.62 MiB | 29.96 MiB/s
Receiving objects: 76% (64049/84275), 121.70 MiB | 30.24 MiB/s
Receiving objects: 77% (64892/84275), 121.70 MiB | 30.24 MiB/s
Receiving objects: 78% (65735/84275), 121.70 MiB | 30.24 MiB/s
Receiving objects: 79% (66578/84275), 121.70 MiB | 30.24 MiB/s
Receiving objects: 80% (67420/84275), 121.70 MiB | 30.24 MiB/s
Receiving objects: 81% (68263/84275), 121.70 MiB | 30.24 MiB/s
Receiving objects: 82% (69106/84275), 121.70 MiB | 30.24 MiB/s
Receiving objects: 83% (69949/84275), 121.70 MiB | 30.24 MiB/s
Receiving objects: 84% (70791/84275), 121.70 MiB | 30.24 MiB/s
Receiving objects: 85% (71634/84275), 137.44 MiB | 30.38 MiB/s
Receiving objects: 86% (72477/84275), 137.44 MiB | 30.38 MiB/s
Receiving objects: 87% (73320/84275), 137.44 MiB | 30.38 MiB/s
Receiving objects: 88% (74162/84275), 137.44 MiB | 30.38 MiB/s
Receiving objects: 89% (75005/84275), 137.44 MiB | 30.38 MiB/s
Receiving objects: 90% (75848/84275), 137.44 MiB | 30.38 MiB/s
Receiving objects: 91% (76691/84275), 137.44 MiB | 30.38 MiB/s
Receiving objects: 92% (77533/84275), 137.44 MiB | 30.38 MiB/s
Receiving objects: 93% (78376/84275), 137.44 MiB | 30.38 MiB/s
Receiving objects: 94% (79219/84275), 137.44 MiB | 30.38 MiB/s
Receiving objects: 95% (80062/84275), 137.44 MiB | 30.38 MiB/s
Receiving objects: 96% (80904/84275), 137.44 MiB | 30.38 MiB/s
Receiving objects: 97% (81747/84275), 137.44 MiB | 30.38 MiB/s
Receiving objects: 98% (82590/84275), 137.44 MiB | 30.38 MiB/s
Receiving objects: 99% (83433/84275), 137.44 MiB | 30.38 MiB/s
Receiving objects: 99% (83875/84275), 137.44 MiB | 30.38 MiB/s
remote: Total 84275 (delta 7443), reused 6856 (delta 6833), pack-reused 75711 (from 2)
7.98 s
Receiving objects: 100% (84275/84275), 153.39 MiB | 31.89 MiB/s
Receiving objects: 100% (84275/84275), 153.42 MiB | 30.51 MiB/s, done.
10.05 s
Resolving deltas: 0% (0/57012)
Resolving deltas: 1% (571/57012)
Resolving deltas: 2% (1141/57012)
Resolving deltas: 3% (1711/57012)
Resolving deltas: 4% (2281/57012)
Resolving deltas: 5% (2851/57012)
Resolving deltas: 6% (3421/57012)
Resolving deltas: 7% (3991/57012)
Resolving deltas: 8% (4561/57012)
Resolving deltas: 9% (5132/57012)
Resolving deltas: 10% (5702/57012)
Resolving deltas: 11% (6272/57012)
Resolving deltas: 12% (6842/57012)
Resolving deltas: 13% (7412/57012)
Resolving deltas: 14% (7982/57012)
Resolving deltas: 15% (8552/57012)
Resolving deltas: 16% (9122/57012)
Resolving deltas: 17% (9693/57012)
Resolving deltas: 18% (10263/57012)
Resolving deltas: 19% (10833/57012)
Resolving deltas: 20% (11403/57012)
Resolving deltas: 21% (11973/57012)
Resolving deltas: 22% (12543/57012)
Resolving deltas: 23% (13113/57012)
Resolving deltas: 24% (13683/57012)
Resolving deltas: 25% (14253/57012)
Resolving deltas: 26% (14824/57012)
Resolving deltas: 27% (15394/57012)
Resolving deltas: 28% (15964/57012)
Resolving deltas: 29% (16534/57012)
Resolving deltas: 30% (17104/57012)
Resolving deltas: 31% (17674/57012)
Resolving deltas: 32% (18244/57012)
Resolving deltas: 33% (18814/57012)
Resolving deltas: 34% (19385/57012)
Resolving deltas: 35% (19955/57012)
Resolving deltas: 36% (20525/57012)
Resolving deltas: 37% (21095/57012)
Resolving deltas: 38% (21665/57012)
Resolving deltas: 39% (22235/57012)
Resolving deltas: 40% (22805/57012)
Resolving deltas: 41% (23375/57012)
Resolving deltas: 42% (23946/57012)
Resolving deltas: 43% (24516/57012)
Resolving deltas: 44% (25086/57012)
Resolving deltas: 45% (25656/57012)
Resolving deltas: 46% (26226/57012)
Resolving deltas: 47% (26796/57012)
Resolving deltas: 48% (27366/57012)
Resolving deltas: 49% (27936/57012)
Resolving deltas: 50% (28506/57012)
Resolving deltas: 51% (29077/57012)
Resolving deltas: 52% (29647/57012)
Resolving deltas: 53% (30217/57012)
Resolving deltas: 54% (30787/57012)
Resolving deltas: 55% (31357/57012)
Resolving deltas: 56% (31927/57012)
Resolving deltas: 57% (32497/57012)
Resolving deltas: 58% (33068/57012)
Resolving deltas: 59% (33638/57012)
Resolving deltas: 59% (34070/57012)
Resolving deltas: 60% (34208/57012)
Resolving deltas: 61% (34778/57012)
Resolving deltas: 62% (35348/57012)
Resolving deltas: 63% (35919/57012)
Resolving deltas: 64% (36488/57012)
Resolving deltas: 65% (37058/57012)
Resolving deltas: 66% (37628/57012)
Resolving deltas: 67% (38199/57012)
Resolving deltas: 68% (38769/57012)
Resolving deltas: 69% (39339/57012)
Resolving deltas: 70% (39909/57012)
Resolving deltas: 71% (40479/57012)
Resolving deltas: 72% (41050/57012)
Resolving deltas: 73% (41619/57012)
Resolving deltas: 74% (42189/57012)
Resolving deltas: 75% (42759/57012)
Resolving deltas: 76% (43330/57012)
Resolving deltas: 77% (43900/57012)
Resolving deltas: 78% (44470/57012)
Resolving deltas: 79% (45040/57012)
Resolving deltas: 80% (45610/57012)
Resolving deltas: 81% (46180/57012)
Resolving deltas: 82% (46750/57012)
Resolving deltas: 83% (47320/57012)
Resolving deltas: 84% (47891/57012)
Resolving deltas: 85% (48461/57012)
Resolving deltas: 86% (49031/57012)
Resolving deltas: 87% (49601/57012)
Resolving deltas: 88% (50171/57012)
Resolving deltas: 89% (50741/57012)
Resolving deltas: 90% (51311/57012)
Resolving deltas: 91% (51881/57012)
Resolving deltas: 92% (52452/57012)
Resolving deltas: 93% (53022/57012)
Resolving deltas: 94% (53592/57012)
Resolving deltas: 95% (54162/57012)
Resolving deltas: 96% (54733/57012)
Resolving deltas: 96% (55144/57012)
Resolving deltas: 97% (55302/57012)
Resolving deltas: 98% (55872/57012)
Resolving deltas: 99% (56442/57012)
Resolving deltas: 100% (57012/57012)
Resolving deltas: 100% (57012/57012), done.
10.58 s
Fetching commit ff11577b1777f94f30ac4c8d99e2f898d5902f7b for simplify-spenso-api ...
10.58 s
$ /nix/store/bcnisk3ydfgv26v2gw3zlky24g00yww2-git-2.54.0/bin/git fetch origin ff11577b1777f94f30ac4c8d99e2f898d5902f7b
11.25 s
From https://github.com/alphal00p/gammaloop
11.25 s
* branch ff11577b1777f94f30ac4c8d99e2f898d5902f7b -> FETCH_HEAD
11.32 s
$ /nix/store/9ypz3flqsrl5xl495mm8h645gadjsxi1-coreutils-9.11/bin/timeout --kill-after=15s 7200s /nix/store/bcnisk3ydfgv26v2gw3zlky24g00yww2-git-2.54.0/bin/git -c advice.detachedHead=false checkout ff11577b1777f94f30ac4c8d99e2f898d5902f7b
11.49 s
HEAD is now at ff11577b1 update Symbolica to 0084bc7c
11.51 s
$ /nix/store/9ypz3flqsrl5xl495mm8h645gadjsxi1-coreutils-9.11/bin/timeout --kill-after=15s 7200s /nix/store/23zk8sgzamrbmj1fday15szf7f2279s8-nix-2.34.7/bin/nix --extra-experimental-features nix-command --extra-experimental-features flakes --log-format internal-json run .#packages.x86_64-linux.nix-ci-check-gammaloop-nextest-vakint --print-build-logs
15.17 s
19.11 s
evaluating derivation 'g
copying '/nix/store/zvcs
evaluating derivation 'g
querying gammaloop-nexte
querying info about miss
querying gammaloop-nexte
[0 /1 built, 0.0 KiB DL]
[1 /0 /1 built, 0.0 KiB DLgammaloop-nextest-vakint> Extracting 9 binaries, 1 build script output directory, and 1 linked path to /build/nextest-archive-TjsY9c
19.90 s
gammaloop-nextest-vakint> Extracted 15 files to /build/nextest-archive-TjsY9c in 0.79s
19.91 s
gammaloop-nextest-vakint> ------------
19.91 s
gammaloop-nextest-vakint> Nextest run ID 5be7100e-f029-41e8-b21d-e799c17c5540 with nextest profile: ci_gammaloop
19.91 s
gammaloop-nextest-vakint> Starting 74 tests across 9 binaries
20.06 s
gammaloop-nextest-vakint> FAIL [ 0.044s] ( 5/74) vakint::input_matching_tests test_2l_matching_pinched
20.06 s
gammaloop-nextest-vakint> stdout ---
20.06 s
gammaloop-nextest-vakint>
20.06 s
gammaloop-nextest-vakint> running 1 test
20.06 s
gammaloop-nextest-vakint> test test_2l_matching_pinched ... FAILED
20.06 s
gammaloop-nextest-vakint>
20.06 s
gammaloop-nextest-vakint> failures:
20.06 s
gammaloop-nextest-vakint>
20.06 s
gammaloop-nextest-vakint> failures:
20.06 s
gammaloop-nextest-vakint> test_2l_matching_pinched
20.06 s
gammaloop-nextest-vakint>
20.06 s
gammaloop-nextest-vakint> test result: FAILED. 0 passed; 1 failed; 0 ignored; 0 measured; 5 filtered out; finished in 0.04s
20.06 s
gammaloop-nextest-vakint>
20.06 s
gammaloop-nextest-vakint> stderr ---
20.06 s
gammaloop-nextest-vakint>
20.06 s
gammaloop-nextest-vakint> thread 'test_2l_matching_pinched' (170) panicked at crates/vakint/tests/test_utils.rs:202:21:
20.06 s
gammaloop-nextest-vakint> Error: the following integral could not be identified using any of the supported topologies: topo(I2L_pinch_3(mUVsq,2,1,0))
20.06 s
gammaloop-nextest-vakint> stack backtrace:
20.06 s
gammaloop-nextest-vakint> 0: __rustc::rust_begin_unwind
20.06 s
gammaloop-nextest-vakint> 1: core::panicking::panic_fmt
20.06 s
gammaloop-nextest-vakint> 2: input_matching_tests::test_utils::compare_output
20.06 s
gammaloop-nextest-vakint> 3: <input_matching_tests::test_2l_matching_pinched::{closure#0} as core::ops::function::FnOnce<()>>::call_once
20.06 s
gammaloop-nextest-vakint> note: Some details are omitted, run with `RUST_BACKTRACE=full` for a verbose backtrace.
20.06 s
gammaloop-nextest-vakint>
23.72 s
gammaloop-nextest-vakint> FAIL [ 0.288s] (12/74) vakint::integral_alphaloop_vs_matad_tests test_integrate_1l_no_numerator_squared_mass
23.72 s
gammaloop-nextest-vakint> stdout ---
23.72 s
gammaloop-nextest-vakint>
23.72 s
gammaloop-nextest-vakint> running 1 test
23.72 s
gammaloop-nextest-vakint>
23.72 s
gammaloop-nextest-vakint> <><><><><>
23.72 s
gammaloop-nextest-vakint>
23.72 s
gammaloop-nextest-vakint>
23.72 s
gammaloop-nextest-vakint> <><><><><>
23.72 s
gammaloop-nextest-vakint>
23.72 s
gammaloop-nextest-vakint> test test_integrate_1l_no_numerator_squared_mass ... FAILED
23.72 s
gammaloop-nextest-vakint>
23.72 s
gammaloop-nextest-vakint> failures:
23.72 s
gammaloop-nextest-vakint>
23.72 s
gammaloop-nextest-vakint> failures:
23.72 s
gammaloop-nextest-vakint> test_integrate_1l_no_numerator_squared_mass
23.72 s
gammaloop-nextest-vakint>
23.72 s
gammaloop-nextest-vakint> test result: FAILED. 0 passed; 1 failed; 0 ignored; 0 measured; 9 filtered out; finished in 0.28s
23.72 s
gammaloop-nextest-vakint>
23.72 s
gammaloop-nextest-vakint> stderr ---
23.72 s
gammaloop-nextest-vakint> [INFO integral_alphaloop_vs_matad_tests::test_utils] Benchmark [AlphaLoop (susbstitute_masters=true)] :: central :
23.72 s
gammaloop-nextest-vakint> ε^-1 : (1.000000000000000000000000000000+0i)
23.72 s
gammaloop-nextest-vakint> ε^ 0 : (4.227843350984671393934879099176e-1+0i)
23.72 s
gammaloop-nextest-vakint> ε^+1 : (1.411840330426439694788883561418+0i)
23.72 s
gammaloop-nextest-vakint> ε^+2 : (5.043612543455534057723233940620e-1+0i)
23.72 s
gammaloop-nextest-vakint> [INFO integral_alphaloop_vs_matad_tests::test_utils] Tested [MATAD (expand_masters=true, susbstitute_masters=true, substitute_hpls=true, direct_numerical_substition=true)] :: central :
23.72 s
gammaloop-nextest-vakint> ε^-1 : (1.000000000000000000000000000000+0i)
23.72 s
gammaloop-nextest-vakint> ε^ 0 : (4.227843350984671393934879099176e-1+0i)
23.72 s
gammaloop-nextest-vakint> ε^+1 : (1.411840330426439694788883561418+0i)
23.72 s
gammaloop-nextest-vakint> ε^+2 : (5.043612543455534057723233940620e-1+0i)
23.72 s
gammaloop-nextest-vakint> [INFO integral_alphaloop_vs_matad_tests::test_utils] matches!
23.72 s
gammaloop-nextest-vakint>
23.72 s
gammaloop-nextest-vakint> thread 'test_integrate_1l_no_numerator_squared_mass' (231) panicked at crates/vakint/tests/test_utils.rs:416:13:
23.72 s
gammaloop-nextest-vakint> Error during numerical evaluation of benchmark result with [MATAD (expand_masters=true, susbstitute_masters=true, substitute_hpls=true, direct_numerical_substition=true)] :: error:
23.72 s
gammaloop-nextest-vakint> Numerical evaluation error: Is some tensor structure left? | Expression: '-1*user_space::{}::muv^2+2*vakint::{}::M' | Error: 'variable M is not in a parameter map and does not have an evaluator'
23.72 s
gammaloop-nextest-vakint> stack backtrace:
23.72 s
gammaloop-nextest-vakint> 0: __rustc::rust_begin_unwind
23.72 s
gammaloop-nextest-vakint> 1: core::panicking::panic_fmt
23.72 s
gammaloop-nextest-vakint> 2: integral_alphaloop_vs_matad_tests::test_utils::compare_two_evaluations
23.72 s
gammaloop-nextest-vakint> 3: <integral_alphaloop_vs_matad_tests::test_integrate_1l_no_numerator_squared_mass::{closure#0} as core::ops::function::FnOnce<()>>::call_once
23.72 s
gammaloop-nextest-vakint> note: Some details are omitted, run with `RUST_BACKTRACE=full` for a verbose backtrace.
23.72 s
gammaloop-nextest-vakint>
23.98 s
gammaloop-nextest-vakint> FAIL [ 0.072s] (14/74) vakint::integral_alphaloop_vs_matad_tests test_integrate_3l_basketball_a
23.98 s
gammaloop-nextest-vakint> stdout ---
23.98 s
gammaloop-nextest-vakint>
23.98 s
gammaloop-nextest-vakint> running 1 test
23.98 s
gammaloop-nextest-vakint> test test_integrate_3l_basketball_a ... FAILED
23.98 s
gammaloop-nextest-vakint>
23.98 s
gammaloop-nextest-vakint> failures:
23.98 s
gammaloop-nextest-vakint>
23.98 s
gammaloop-nextest-vakint> failures:
23.98 s
gammaloop-nextest-vakint> test_integrate_3l_basketball_a
23.98 s
gammaloop-nextest-vakint>
23.98 s
gammaloop-nextest-vakint> test result: FAILED. 0 passed; 1 failed; 0 ignored; 0 measured; 9 filtered out; finished in 0.07s
23.98 s
gammaloop-nextest-vakint>
23.98 s
gammaloop-nextest-vakint> stderr ---
23.98 s
gammaloop-nextest-vakint>
23.98 s
gammaloop-nextest-vakint> thread 'test_integrate_3l_basketball_a' (252) panicked at crates/vakint/tests/test_utils.rs:350:13:
23.98 s
gammaloop-nextest-vakint> Error during benchmark integral evaluation with [AlphaLoop (susbstitute_masters=true)] :: error :
23.98 s
gammaloop-nextest-vakint> the following integral could not be identified using any of the supported topologies: topo(I3L_pinch_1_6(muvsq,0,1,1,1,1,0))
23.98 s
gammaloop-nextest-vakint> stack backtrace:
23.98 s
gammaloop-nextest-vakint> 0: __rustc::rust_begin_unwind
23.98 s
gammaloop-nextest-vakint> 1: core::panicking::panic_fmt
23.98 s
gammaloop-nextest-vakint> 2: integral_alphaloop_vs_matad_tests::test_utils::compare_two_evaluations
23.98 s
gammaloop-nextest-vakint> 3: <integral_alphaloop_vs_matad_tests::test_integrate_3l_basketball_a::{closure#0} as core::ops::function::FnOnce<()>>::call_once
23.98 s
gammaloop-nextest-vakint> note: Some details are omitted, run with `RUST_BACKTRACE=full` for a verbose backtrace.
23.98 s
gammaloop-nextest-vakint>
24.05 s
gammaloop-nextest-vakint> FAIL [ 0.071s] (15/74) vakint::integral_alphaloop_vs_matad_tests test_integrate_3l_basketball_b
24.05 s
gammaloop-nextest-vakint> stdout ---
24.05 s
gammaloop-nextest-vakint>
24.05 s
gammaloop-nextest-vakint> running 1 test
24.05 s
gammaloop-nextest-vakint> test test_integrate_3l_basketball_b ... FAILED
24.05 s
gammaloop-nextest-vakint>
24.05 s
gammaloop-nextest-vakint> failures:
24.05 s
gammaloop-nextest-vakint>
24.05 s
gammaloop-nextest-vakint> failures:
24.05 s
gammaloop-nextest-vakint> test_integrate_3l_basketball_b
24.05 s
gammaloop-nextest-vakint>
24.05 s
gammaloop-nextest-vakint> test result: FAILED. 0 passed; 1 failed; 0 ignored; 0 measured; 9 filtered out; finished in 0.06s
24.05 s
gammaloop-nextest-vakint>
24.05 s
gammaloop-nextest-vakint> stderr ---
24.05 s
gammaloop-nextest-vakint>
24.05 s
gammaloop-nextest-vakint> thread 'test_integrate_3l_basketball_b' (257) panicked at crates/vakint/tests/test_utils.rs:350:13:
24.05 s
gammaloop-nextest-vakint> Error during benchmark integral evaluation with [AlphaLoop (susbstitute_masters=true)] :: error :
24.05 s
gammaloop-nextest-vakint> the following integral could not be identified using any of the supported topologies: topo(I3L_pinch_1_6(muvsq,0,1,1,1,1,0))
24.05 s
gammaloop-nextest-vakint> stack backtrace:
24.05 s
gammaloop-nextest-vakint> 0: __rustc::rust_begin_unwind
24.05 s
gammaloop-nextest-vakint> 1: core::panicking::panic_fmt
24.05 s
gammaloop-nextest-vakint> 2: integral_alphaloop_vs_matad_tests::test_utils::compare_two_evaluations
24.05 s
gammaloop-nextest-vakint> 3: <integral_alphaloop_vs_matad_tests::test_integrate_3l_basketball_b::{closure#0} as core::ops::function::FnOnce<()>>::call_once
24.05 s
gammaloop-nextest-vakint> note: Some details are omitted, run with `RUST_BACKTRACE=full` for a verbose backtrace.
24.05 s
gammaloop-nextest-vakint>
27.21 s
gammaloop-nextest-vakint> FAIL [ 0.127s] (46/74) vakint::integral_evaluation_analytic_tests test_integrate_4l_PR9d_from_FG_pinch
27.21 s
gammaloop-nextest-vakint> stdout ---
27.21 s
gammaloop-nextest-vakint>
27.21 s
gammaloop-nextest-vakint> running 1 test
27.21 s
gammaloop-nextest-vakint> test test_integrate_4l_PR9d_from_FG_pinch ... FAILED
27.21 s
gammaloop-nextest-vakint>
27.21 s
gammaloop-nextest-vakint> failures:
27.21 s
gammaloop-nextest-vakint>
27.21 s
gammaloop-nextest-vakint> failures:
27.21 s
gammaloop-nextest-vakint> test_integrate_4l_PR9d_from_FG_pinch
27.21 s
gammaloop-nextest-vakint>
27.21 s
gammaloop-nextest-vakint> test result: FAILED. 0 passed; 1 failed; 0 ignored; 0 measured; 26 filtered out; finished in 0.12s
27.21 s
gammaloop-nextest-vakint>
27.21 s
gammaloop-nextest-vakint> stderr ---
27.21 s
gammaloop-nextest-vakint>
27.21 s
gammaloop-nextest-vakint> thread 'test_integrate_4l_PR9d_from_FG_pinch' (402) panicked at crates/vakint/tests/test_utils.rs:554:30:
27.21 s
gammaloop-nextest-vakint> Failed to evaluate integral: the following integral could not be identified using any of the supported topologies: topo(I4L_FG_pinch_4(muvsq,1,2,1,0,1,1,1,1))
27.21 s
gammaloop-nextest-vakint> stack backtrace:
27.21 s
gammaloop-nextest-vakint> 0: __rustc::rust_begin_unwind
27.21 s
gammaloop-nextest-vakint> 1: core::panicking::panic_fmt
27.21 s
gammaloop-nextest-vakint> 2: integral_evaluation_analytic_tests::test_utils::compare_vakint_evaluation_vs_reference::{closure#0}
27.21 s
gammaloop-nextest-vakint> 3: integral_evaluation_analytic_tests::test_utils::compare_vakint_evaluation_vs_reference
27.21 s
gammaloop-nextest-vakint> 4: <integral_evaluation_analytic_tests::test_integrate_4l_PR9d_from_FG_pinch::{closure#0} as core::ops::function::FnOnce<()>>::call_once
27.21 s
gammaloop-nextest-vakint> note: Some details are omitted, run with `RUST_BACKTRACE=full` for a verbose backtrace.
27.21 s
gammaloop-nextest-vakint>
27.60 s
gammaloop-nextest-vakint> FAIL [ 0.194s] (48/74) vakint::integral_evaluation_analytic_tests test_integrate_4l_PR9d_from_H_pinch
27.60 s
gammaloop-nextest-vakint> stdout ---
27.60 s
gammaloop-nextest-vakint>
27.60 s
gammaloop-nextest-vakint> running 1 test
27.60 s
gammaloop-nextest-vakint> test test_integrate_4l_PR9d_from_H_pinch ... FAILED
27.60 s
gammaloop-nextest-vakint>
27.60 s
gammaloop-nextest-vakint> failures:
27.60 s
gammaloop-nextest-vakint>
27.60 s
gammaloop-nextest-vakint> failures:
27.60 s
gammaloop-nextest-vakint> test_integrate_4l_PR9d_from_H_pinch
27.60 s
gammaloop-nextest-vakint>
27.60 s
gammaloop-nextest-vakint> test result: FAILED. 0 passed; 1 failed; 0 ignored; 0 measured; 26 filtered out; finished in 0.19s
27.60 s
gammaloop-nextest-vakint>
27.60 s
gammaloop-nextest-vakint> stderr ---
27.60 s
gammaloop-nextest-vakint>
27.60 s
gammaloop-nextest-vakint> thread 'test_integrate_4l_PR9d_from_H_pinch' (413) panicked at crates/vakint/tests/test_utils.rs:554:30:
27.60 s
gammaloop-nextest-vakint> Failed to evaluate integral: the following integral could not be identified using any of the supported topologies: topo(I4L_FG_pinch_4(muvsq,1,2,1,0,1,1,1,1))
27.60 s
gammaloop-nextest-vakint> stack backtrace:
27.60 s
gammaloop-nextest-vakint> 0: __rustc::rust_begin_unwind
27.60 s
gammaloop-nextest-vakint> 1: core::panicking::panic_fmt
27.60 s
gammaloop-nextest-vakint> 2: integral_evaluation_analytic_tests::test_utils::compare_vakint_evaluation_vs_reference::{closure#0}
27.60 s
gammaloop-nextest-vakint> 3: integral_evaluation_analytic_tests::test_utils::compare_vakint_evaluation_vs_reference
27.60 s
gammaloop-nextest-vakint> 4: <integral_evaluation_analytic_tests::test_integrate_4l_PR9d_from_H_pinch::{closure#0} as core::ops::function::FnOnce<()>>::call_once
27.60 s
gammaloop-nextest-vakint> note: Some details are omitted, run with `RUST_BACKTRACE=full` for a verbose backtrace.
27.60 s
gammaloop-nextest-vakint>
28.01 s
gammaloop-nextest-vakint> FAIL [ 0.187s] (50/74) vakint::integral_evaluation_analytic_tests test_integrate_4l_clover
28.01 s
gammaloop-nextest-vakint> stdout ---
28.01 s
gammaloop-nextest-vakint>
28.01 s
gammaloop-nextest-vakint> running 1 test
28.01 s
gammaloop-nextest-vakint> test test_integrate_4l_clover ... FAILED
28.01 s
gammaloop-nextest-vakint>
28.01 s
gammaloop-nextest-vakint> failures:
28.01 s
gammaloop-nextest-vakint>
28.01 s
gammaloop-nextest-vakint> failures:
28.01 s
gammaloop-nextest-vakint> test_integrate_4l_clover
28.01 s
gammaloop-nextest-vakint>
28.01 s
gammaloop-nextest-vakint> test result: FAILED. 0 passed; 1 failed; 0 ignored; 0 measured; 26 filtered out; finished in 0.18s
28.01 s
gammaloop-nextest-vakint>
28.01 s
gammaloop-nextest-vakint> stderr ---
28.01 s
gammaloop-nextest-vakint>
28.01 s
gammaloop-nextest-vakint> thread 'test_integrate_4l_clover' (424) panicked at crates/vakint/tests/test_utils.rs:554:30:
28.01 s
gammaloop-nextest-vakint> Failed to evaluate integral: the following integral could not be identified using any of the supported topologies: topo(I4L_FG_pinch_4_6_7_8(muvsq,1,1,1,0,1,0,0,0))
28.01 s
gammaloop-nextest-vakint> stack backtrace:
28.01 s
gammaloop-nextest-vakint> 0: __rustc::rust_begin_unwind
28.01 s
gammaloop-nextest-vakint> 1: core::panicking::panic_fmt
28.01 s
gammaloop-nextest-vakint> 2: integral_evaluation_analytic_tests::test_utils::compare_vakint_evaluation_vs_reference::{closure#0}
28.01 s
gammaloop-nextest-vakint> 3: integral_evaluation_analytic_tests::test_utils::compare_vakint_evaluation_vs_reference
28.01 s
gammaloop-nextest-vakint> 4: <integral_evaluation_analytic_tests::test_integrate_4l_clover::{closure#0} as core::ops::function::FnOnce<()>>::call_once
28.01 s
gammaloop-nextest-vakint> note: Some details are omitted, run with `RUST_BACKTRACE=full` for a verbose backtrace.
28.01 s
gammaloop-nextest-vakint>
28.21 s
gammaloop-nextest-vakint> FAIL [ 0.195s] (51/74) vakint::integral_evaluation_analytic_tests test_integrate_4l_clover_with_non_unit_scales
28.21 s
gammaloop-nextest-vakint> stdout ---
28.21 s
gammaloop-nextest-vakint>
28.21 s
gammaloop-nextest-vakint> running 1 test
28.21 s
gammaloop-nextest-vakint> test test_integrate_4l_clover_with_non_unit_scales ... FAILED
28.21 s
gammaloop-nextest-vakint>
28.21 s
gammaloop-nextest-vakint> failures:
28.21 s
gammaloop-nextest-vakint>
28.21 s
gammaloop-nextest-vakint> failures:
28.21 s
gammaloop-nextest-vakint> test_integrate_4l_clover_with_non_unit_scales
28.21 s
gammaloop-nextest-vakint>
28.21 s
gammaloop-nextest-vakint> test result: FAILED. 0 passed; 1 failed; 0 ignored; 0 measured; 26 filtered out; finished in 0.19s
28.21 s
gammaloop-nextest-vakint>
28.21 s
gammaloop-nextest-vakint> stderr ---
28.21 s
gammaloop-nextest-vakint>
28.21 s
gammaloop-nextest-vakint> thread 'test_integrate_4l_clover_with_non_unit_scales' (429) panicked at crates/vakint/tests/test_utils.rs:554:30:
28.21 s
gammaloop-nextest-vakint> Failed to evaluate integral: the following integral could not be identified using any of the supported topologies: topo(I4L_FG_pinch_4_6_7_8(muvsq,1,1,1,0,1,0,0,0))
28.21 s
gammaloop-nextest-vakint> stack backtrace:
28.21 s
gammaloop-nextest-vakint> 0: __rustc::rust_begin_unwind
28.21 s
gammaloop-nextest-vakint> 1: core::panicking::panic_fmt
28.21 s
gammaloop-nextest-vakint> 2: integral_evaluation_analytic_tests::test_utils::compare_vakint_evaluation_vs_reference::{closure#0}
28.21 s
gammaloop-nextest-vakint> 3: integral_evaluation_analytic_tests::test_utils::compare_vakint_evaluation_vs_reference
28.21 s
gammaloop-nextest-vakint> 4: <integral_evaluation_analytic_tests::test_integrate_4l_clover_with_non_unit_scales::{closure#0} as core::ops::function::FnOnce<()>>::call_once
28.21 s
gammaloop-nextest-vakint> note: Some details are omitted, run with `RUST_BACKTRACE=full` for a verbose backtrace.
28.21 s
gammaloop-nextest-vakint>
28.40 s
gammaloop-nextest-vakint> FAIL [ 0.186s] (52/74) vakint::integral_evaluation_analytic_tests test_integrate_4l_clover_with_numerator
28.40 s
gammaloop-nextest-vakint> stdout ---
28.40 s
gammaloop-nextest-vakint>
28.40 s
gammaloop-nextest-vakint> running 1 test
28.40 s
gammaloop-nextest-vakint> test test_integrate_4l_clover_with_numerator ... FAILED
28.40 s
gammaloop-nextest-vakint>
28.40 s
gammaloop-nextest-vakint> failures:
28.40 s
gammaloop-nextest-vakint>
28.40 s
gammaloop-nextest-vakint> failures:
28.40 s
gammaloop-nextest-vakint> test_integrate_4l_clover_with_numerator
28.40 s
gammaloop-nextest-vakint>
28.40 s
gammaloop-nextest-vakint> test result: FAILED. 0 passed; 1 failed; 0 ignored; 0 measured; 26 filtered out; finished in 0.18s
28.40 s
gammaloop-nextest-vakint>
28.40 s
gammaloop-nextest-vakint> stderr ---
28.40 s
gammaloop-nextest-vakint>
28.40 s
gammaloop-nextest-vakint> thread 'test_integrate_4l_clover_with_numerator' (434) panicked at crates/vakint/tests/test_utils.rs:554:30:
28.40 s
gammaloop-nextest-vakint> Failed to evaluate integral: the following integral could not be identified using any of the supported topologies: topo(I4L_FG_pinch_4_6_7_8(muvsq,2,1,1,0,1,0,0,0))
28.40 s
gammaloop-nextest-vakint> stack backtrace:
28.40 s
gammaloop-nextest-vakint> 0: __rustc::rust_begin_unwind
28.40 s
gammaloop-nextest-vakint> 1: core::panicking::panic_fmt
28.40 s
gammaloop-nextest-vakint> 2: integral_evaluation_analytic_tests::test_utils::compare_vakint_evaluation_vs_reference::{closure#0}
28.40 s
gammaloop-nextest-vakint> 3: integral_evaluation_analytic_tests::test_utils::compare_vakint_evaluation_vs_reference
28.40 s
gammaloop-nextest-vakint> 4: <integral_evaluation_analytic_tests::test_integrate_4l_clover_with_numerator::{closure#0} as core::ops::function::FnOnce<()>>::call_once
28.40 s
gammaloop-nextest-vakint> note: Some details are omitted, run with `RUST_BACKTRACE=full` for a verbose backtrace.
28.40 s
gammaloop-nextest-vakint>
28.59 s
gammaloop-nextest-vakint> FAIL [ 0.197s] (53/74) vakint::integral_evaluation_analytic_tests test_integrate_4l_dotted_clover
28.59 s
gammaloop-nextest-vakint> stdout ---
28.59 s
gammaloop-nextest-vakint>
28.59 s
gammaloop-nextest-vakint> running 1 test
28.59 s
gammaloop-nextest-vakint> test test_integrate_4l_dotted_clover ... FAILED
28.59 s
gammaloop-nextest-vakint>
28.59 s
gammaloop-nextest-vakint> failures:
28.59 s
gammaloop-nextest-vakint>
28.59 s
gammaloop-nextest-vakint> failures:
28.59 s
gammaloop-nextest-vakint> test_integrate_4l_dotted_clover
28.59 s
gammaloop-nextest-vakint>
28.59 s
gammaloop-nextest-vakint> test result: FAILED. 0 passed; 1 failed; 0 ignored; 0 measured; 26 filtered out; finished in 0.19s
28.59 s
gammaloop-nextest-vakint>
28.59 s
gammaloop-nextest-vakint> stderr ---
28.59 s
gammaloop-nextest-vakint>
28.59 s
gammaloop-nextest-vakint> thread 'test_integrate_4l_dotted_clover' (439) panicked at crates/vakint/tests/test_utils.rs:554:30:
28.59 s
gammaloop-nextest-vakint> Failed to evaluate integral: the following integral could not be identified using any of the supported topologies: topo(I4L_FG_pinch_4_6_7_8(muvsq,2,1,1,0,1,0,0,0))
28.59 s
gammaloop-nextest-vakint> stack backtrace:
28.59 s
gammaloop-nextest-vakint> 0: __rustc::rust_begin_unwind
28.59 s
gammaloop-nextest-vakint> 1: core::panicking::panic_fmt
28.59 s
gammaloop-nextest-vakint> 2: integral_evaluation_analytic_tests::test_utils::compare_vakint_evaluation_vs_reference::{closure#0}
28.59 s
gammaloop-nextest-vakint> 3: integral_evaluation_analytic_tests::test_utils::compare_vakint_evaluation_vs_reference
28.59 s
gammaloop-nextest-vakint> 4: <integral_evaluation_analytic_tests::test_integrate_4l_dotted_clover::{closure#0} as core::ops::function::FnOnce<()>>::call_once
28.59 s
gammaloop-nextest-vakint> note: Some details are omitted, run with `RUST_BACKTRACE=full` for a verbose backtrace.
28.59 s
gammaloop-nextest-vakint>
31.44 s
gammaloop-nextest-vakint> FAIL [ 0.111s] (58/74) vakint::integral_evaluation_freeform_tests test_integrate_1l_decorated_indices_alphaloop
31.44 s
gammaloop-nextest-vakint> stdout ---
31.44 s
gammaloop-nextest-vakint>
31.44 s
gammaloop-nextest-vakint> running 1 test
31.44 s
gammaloop-nextest-vakint> test test_integrate_1l_decorated_indices_alphaloop ... FAILED
31.44 s
gammaloop-nextest-vakint>
31.44 s
gammaloop-nextest-vakint> failures:
31.44 s
gammaloop-nextest-vakint>
31.44 s
gammaloop-nextest-vakint> failures:
31.44 s
gammaloop-nextest-vakint> test_integrate_1l_decorated_indices_alphaloop
31.44 s
gammaloop-nextest-vakint>
31.44 s
gammaloop-nextest-vakint> test result: FAILED. 0 passed; 1 failed; 0 ignored; 0 measured; 3 filtered out; finished in 0.10s
31.44 s
gammaloop-nextest-vakint>
31.44 s
gammaloop-nextest-vakint> stderr ---
31.44 s
gammaloop-nextest-vakint>
31.44 s
gammaloop-nextest-vakint> thread 'test_integrate_1l_decorated_indices_alphaloop' (468) panicked at crates/vakint/tests/test_utils.rs:563:6:
31.44 s
gammaloop-nextest-vakint> called `Result::unwrap()` on an `Err` value: EvaluationError("Is some tensor structure left? | Expression: '(1/4*user_space::{real}::DDMUVsq^2*vakint::{symmetric}::g(user_space::{}::mink4(4,11),user_space::{}::mink4(4,22))+user_space::{real}::DDMUVsq*user_space::{scalar}::DDsigma2(user_space::{}::some_args)*vakint::{symmetric,linear}::dot(vakint::{}::p(1),vakint::{}::p(2))*vakint::{}::vec1(vakint::{}::p(1),13370003)*vakint::{}::vec1(vakint::{}::p(2),13370003)+user_space::{real}::DDMUVsq*user_space::{symmetric,real}::DDsigma3(user_space::{}::some_args)*vakint::{symmetric,linear}::dot(vakint::{}::p(1),vakint::{}::p(2))*vakint::{}::vec1(vakint::{}::p(1),13370003)*vakint::{}::vec1(vakint::{}::p(2),13370003)+user_space::{real}::DDMUVsq*user_space::{}::DDsigma(user_space::{}::some_args)*vakint::{symmetric,linear}::dot(vakint::{}::p(1),vakint::{}::p(2))*vakint::{}::vec1(vakint::{}::p(1),13370003)*vakint::{}::vec1(vakint::{}::p(2),13370003))*1/16*vakint::{}::𝑖*𝜋^(-2)' | Error: 'function vec1(p(1),13370003) is not in a parameter map and does not have an evaluator'")
31.44 s
gammaloop-nextest-vakint> stack backtrace:
31.44 s
gammaloop-nextest-vakint> 0: __rustc::rust_begin_unwind
31.44 s
gammaloop-nextest-vakint> 1: core::panicking::panic_fmt
31.44 s
gammaloop-nextest-vakint> 2: core::result::unwrap_failed
31.44 s
gammaloop-nextest-vakint> 3: integral_evaluation_freeform_tests::test_utils::compare_vakint_evaluation_vs_reference
31.44 s
gammaloop-nextest-vakint> 4: <integral_evaluation_freeform_tests::test_integrate_1l_decorated_indices_alphaloop::{closure#0} as core::ops::function::FnOnce<()>>::call_once
31.44 s
gammaloop-nextest-vakint> note: Some details are omitted, run with `RUST_BACKTRACE=full` for a verbose backtrace.
31.44 s
gammaloop-nextest-vakint>
31.63 s
gammaloop-nextest-vakint> FAIL [ 0.192s] (59/74) vakint::integral_evaluation_freeform_tests test_integrate_1l_decorated_indices_fmft
31.63 s
gammaloop-nextest-vakint> stdout ---
31.63 s
gammaloop-nextest-vakint>
31.63 s
gammaloop-nextest-vakint> running 1 test
31.63 s
gammaloop-nextest-vakint> test test_integrate_1l_decorated_indices_fmft ... FAILED
31.63 s
gammaloop-nextest-vakint>
31.63 s
gammaloop-nextest-vakint> failures:
31.63 s
gammaloop-nextest-vakint>
31.63 s
gammaloop-nextest-vakint> failures:
31.63 s
gammaloop-nextest-vakint> test_integrate_1l_decorated_indices_fmft
31.63 s
gammaloop-nextest-vakint>
31.63 s
gammaloop-nextest-vakint> test result: FAILED. 0 passed; 1 failed; 0 ignored; 0 measured; 3 filtered out; finished in 0.19s
31.63 s
gammaloop-nextest-vakint>
31.63 s
gammaloop-nextest-vakint> stderr ---
31.63 s
gammaloop-nextest-vakint>
31.63 s
gammaloop-nextest-vakint> thread 'test_integrate_1l_decorated_indices_fmft' (474) panicked at crates/vakint/tests/test_utils.rs:554:30:
31.63 s
gammaloop-nextest-vakint> Failed to evaluate integral: the following integral could not be identified using any of the supported topologies: topo(I4L_FG_pinch_4_6_7_8(BBMUVsq,1,1,1,0,1,0,0,0))
31.63 s
gammaloop-nextest-vakint> stack backtrace:
31.63 s
gammaloop-nextest-vakint> 0: __rustc::rust_begin_unwind
31.63 s
gammaloop-nextest-vakint> 1: core::panicking::panic_fmt
31.63 s
gammaloop-nextest-vakint> 2: integral_evaluation_freeform_tests::test_utils::compare_vakint_evaluation_vs_reference::{closure#0}
31.63 s
gammaloop-nextest-vakint> 3: integral_evaluation_freeform_tests::test_utils::compare_vakint_evaluation_vs_reference
31.63 s
gammaloop-nextest-vakint> 4: <integral_evaluation_freeform_tests::test_integrate_1l_decorated_indices_fmft::{closure#0} as core::ops::function::FnOnce<()>>::call_once
31.63 s
gammaloop-nextest-vakint> note: Some details are omitted, run with `RUST_BACKTRACE=full` for a verbose backtrace.
31.63 s
gammaloop-nextest-vakint>
31.76 s
gammaloop-nextest-vakint> FAIL [ 0.131s] (60/74) vakint::integral_evaluation_freeform_tests test_integrate_1l_decorated_indices_matad
31.76 s
gammaloop-nextest-vakint> stdout ---
31.76 s
gammaloop-nextest-vakint>
31.76 s
gammaloop-nextest-vakint> running 1 test
31.76 s
gammaloop-nextest-vakint> test test_integrate_1l_decorated_indices_matad ... FAILED
31.76 s
gammaloop-nextest-vakint>
31.76 s
gammaloop-nextest-vakint> failures:
31.76 s
gammaloop-nextest-vakint>
31.76 s
gammaloop-nextest-vakint> failures:
31.76 s
gammaloop-nextest-vakint> test_integrate_1l_decorated_indices_matad
31.76 s
gammaloop-nextest-vakint>
31.76 s
gammaloop-nextest-vakint> test result: FAILED. 0 passed; 1 failed; 0 ignored; 0 measured; 3 filtered out; finished in 0.12s
31.76 s
gammaloop-nextest-vakint>
31.76 s
gammaloop-nextest-vakint> stderr ---
31.76 s
gammaloop-nextest-vakint>
31.76 s
gammaloop-nextest-vakint> thread 'test_integrate_1l_decorated_indices_matad' (479) panicked at crates/vakint/tests/test_utils.rs:554:30:
31.76 s
gammaloop-nextest-vakint> Failed to evaluate integral: FORM run crashed with the following error:
31.76 s
gammaloop-nextest-vakint> stderr:
31.76 s
gammaloop-nextest-vakint> stdout: FORM 5.0.0 (Jan 1 1980) Run: Sat Sep 12 20:40:56 2026
31.76 s
gammaloop-nextest-vakint> #-
31.76 s
gammaloop-nextest-vakint> run_matad.frm Line 11 --> Undeclared variable vec1
31.76 s
gammaloop-nextest-vakint> ~~~" "
31.76 s
gammaloop-nextest-vakint> ~~~" "
31.76 s
gammaloop-nextest-vakint> ~~~" _____ _____ _____ _____ ____ "
31.76 s
gammaloop-nextest-vakint> ~~~" | | _ |_ _| _ | \ ___ ___ ___ "
31.76 s
gammaloop-nextest-vakint> ~~~" | | | | | | | | | | |___| | . | "
31.76 s
gammaloop-nextest-vakint> ~~~" |_|_|_|__|__| |_| |__|__|____/ |_|_|_ | "
31.76 s
gammaloop-nextest-vakint> ~~~" |___| "
31.76 s
gammaloop-nextest-vakint> ~~~" "
31.76 s
gammaloop-nextest-vakint> ~~~" "
31.76 s
gammaloop-nextest-vakint> ~~~" Originally written by M.Steinhauser "
31.76 s
gammaloop-nextest-vakint> ~~~" About exact version contact to: "
31.76 s
gammaloop-nextest-vakint> ~~~" pikelner[at]theor.jinr.ru, Andrey Pikelner "
31.76 s
gammaloop-nextest-vakint> ~~~" "
31.76 s
gammaloop-nextest-vakint> ~~~MATAD called for 1-loop integral
31.76 s
gammaloop-nextest-vakint> Program terminating at -->
31.76 s
gammaloop-nextest-vakint> Terminate called from pre.c:1086 (PreProcessor)
31.76 s
gammaloop-nextest-vakint> 0.00 sec out of 0.00 sec
31.76 s
gammaloop-nextest-vakint>
31.76 s
gammaloop-nextest-vakint> You can rerun the script using:
31.76 s
gammaloop-nextest-vakint> cd "/build/vakint_temp_pid478_1789245656255368531_1" && "form" "run_matad.frm"
31.76 s
gammaloop-nextest-vakint> stack backtrace:
31.76 s
gammaloop-nextest-vakint> 0: __rustc::rust_begin_unwind
31.76 s
gammaloop-nextest-vakint> 1: core::panicking::panic_fmt
31.76 s
gammaloop-nextest-vakint> 2: integral_evaluation_freeform_tests::test_utils::compare_vakint_evaluation_vs_reference::{closure#0}
31.76 s
gammaloop-nextest-vakint> 3: integral_evaluation_freeform_tests::test_utils::compare_vakint_evaluation_vs_reference
31.76 s
gammaloop-nextest-vakint> 4: <integral_evaluation_freeform_tests::test_integrate_1l_decorated_indices_matad::{closure#0} as core::ops::function::FnOnce<()>>::call_once
31.76 s
gammaloop-nextest-vakint> note: Some details are omitted, run with `RUST_BACKTRACE=full` for a verbose backtrace.
31.76 s
gammaloop-nextest-vakint>
32.00 s
gammaloop-nextest-vakint> ------------
32.00 s
gammaloop-nextest-vakint> Summary [ 12.089s] 74 tests run: 61 passed , 13 failed , 0 skipped
32.00 s
gammaloop-nextest-vakint> FAIL [ 0.044s] ( 5/74) vakint::input_matching_tests test_2l_matching_pinched
32.00 s
gammaloop-nextest-vakint> stdout ---
32.00 s
gammaloop-nextest-vakint>
32.00 s
gammaloop-nextest-vakint> running 1 test
32.00 s
gammaloop-nextest-vakint> test test_2l_matching_pinched ... FAILED
32.00 s
gammaloop-nextest-vakint>
32.00 s
gammaloop-nextest-vakint> failures:
32.00 s
gammaloop-nextest-vakint>
32.00 s
gammaloop-nextest-vakint> failures:
32.00 s
gammaloop-nextest-vakint> test_2l_matching_pinched
32.00 s
gammaloop-nextest-vakint>
32.00 s
gammaloop-nextest-vakint> test result: FAILED. 0 passed; 1 failed; 0 ignored; 0 measured; 5 filtered out; finished in 0.04s
32.00 s
gammaloop-nextest-vakint>
32.00 s
gammaloop-nextest-vakint> stderr ---
32.00 s
gammaloop-nextest-vakint>
32.00 s
gammaloop-nextest-vakint> thread 'test_2l_matching_pinched' (170) panicked at crates/vakint/tests/test_utils.rs:202:21:
32.00 s
gammaloop-nextest-vakint> Error: the following integral could not be identified using any of the supported topologies: topo(I2L_pinch_3(mUVsq,2,1,0))
32.00 s
gammaloop-nextest-vakint> stack backtrace:
32.00 s
gammaloop-nextest-vakint> 0: __rustc::rust_begin_unwind
32.00 s
gammaloop-nextest-vakint> 1: core::panicking::panic_fmt
32.00 s
gammaloop-nextest-vakint> 2: input_matching_tests::test_utils::compare_output
32.00 s
gammaloop-nextest-vakint> 3: <input_matching_tests::test_2l_matching_pinched::{closure#0} as core::ops::function::FnOnce<()>>::call_once
32.00 s
gammaloop-nextest-vakint> note: Some details are omitted, run with `RUST_BACKTRACE=full` for a verbose backtrace.
32.00 s
gammaloop-nextest-vakint>
32.00 s
gammaloop-nextest-vakint> FAIL [ 0.288s] (12/74) vakint::integral_alphaloop_vs_matad_tests test_integrate_1l_no_numerator_squared_mass
32.00 s
gammaloop-nextest-vakint> stdout ---
32.00 s
gammaloop-nextest-vakint>
32.00 s
gammaloop-nextest-vakint> running 1 test
32.00 s
gammaloop-nextest-vakint>
32.00 s
gammaloop-nextest-vakint> <><><><><>
32.00 s
gammaloop-nextest-vakint>
32.00 s
gammaloop-nextest-vakint>
32.00 s
gammaloop-nextest-vakint> <><><><><>
32.00 s
gammaloop-nextest-vakint>
32.00 s
gammaloop-nextest-vakint> test test_integrate_1l_no_numerator_squared_mass ... FAILED
32.00 s
gammaloop-nextest-vakint>
32.00 s
gammaloop-nextest-vakint> failures:
32.00 s
gammaloop-nextest-vakint>
32.00 s
gammaloop-nextest-vakint> failures:
32.00 s
gammaloop-nextest-vakint> test_integrate_1l_no_numerator_squared_mass
32.00 s
gammaloop-nextest-vakint>
32.00 s
gammaloop-nextest-vakint> test result: FAILED. 0 passed; 1 failed; 0 ignored; 0 measured; 9 filtered out; finished in 0.28s
32.00 s
gammaloop-nextest-vakint>
32.00 s
gammaloop-nextest-vakint> stderr ---
32.00 s
gammaloop-nextest-vakint> [INFO integral_alphaloop_vs_matad_tests::test_utils] Benchmark [AlphaLoop (susbstitute_masters=true)] :: central :
32.00 s
gammaloop-nextest-vakint> ε^-1 : (1.000000000000000000000000000000+0i)
32.00 s
gammaloop-nextest-vakint> ε^ 0 : (4.227843350984671393934879099176e-1+0i)
32.00 s
gammaloop-nextest-vakint> ε^+1 : (1.411840330426439694788883561418+0i)
32.00 s
gammaloop-nextest-vakint> ε^+2 : (5.043612543455534057723233940620e-1+0i)
32.00 s
gammaloop-nextest-vakint> [INFO integral_alphaloop_vs_matad_tests::test_utils] Tested [MATAD (expand_masters=true, susbstitute_masters=true, substitute_hpls=true, direct_numerical_substition=true)] :: central :
32.00 s
gammaloop-nextest-vakint> ε^-1 : (1.000000000000000000000000000000+0i)
32.00 s
gammaloop-nextest-vakint> ε^ 0 : (4.227843350984671393934879099176e-1+0i)
32.00 s
gammaloop-nextest-vakint> ε^+1 : (1.411840330426439694788883561418+0i)
32.00 s
gammaloop-nextest-vakint> ε^+2 : (5.043612543455534057723233940620e-1+0i)
32.00 s
gammaloop-nextest-vakint> [INFO integral_alphaloop_vs_matad_tests::test_utils] matches!
32.00 s
gammaloop-nextest-vakint>
32.00 s
gammaloop-nextest-vakint> thread 'test_integrate_1l_no_numerator_squared_mass' (231) panicked at crates/vakint/tests/test_utils.rs:416:13:
32.00 s
gammaloop-nextest-vakint> Error during numerical evaluation of benchmark result with [MATAD (expand_masters=true, susbstitute_masters=true, substitute_hpls=true, direct_numerical_substition=true)] :: error:
32.00 s
gammaloop-nextest-vakint> Numerical evaluation error: Is some tensor structure left? | Expression: '-1*user_space::{}::muv^2+2*vakint::{}::M' | Error: 'variable M is not in a parameter map and does not have an evaluator'
32.00 s
gammaloop-nextest-vakint> stack backtrace:
32.00 s
gammaloop-nextest-vakint> 0: __rustc::rust_begin_unwind
32.00 s
gammaloop-nextest-vakint> 1: core::panicking::panic_fmt
32.00 s
gammaloop-nextest-vakint> 2: integral_alphaloop_vs_matad_tests::test_utils::compare_two_evaluations
32.00 s
gammaloop-nextest-vakint> 3: <integral_alphaloop_vs_matad_tests::test_integrate_1l_no_numerator_squared_mass::{closure#0} as core::ops::function::FnOnce<()>>::call_once
32.00 s
gammaloop-nextest-vakint> note: Some details are omitted, run with `RUST_BACKTRACE=full` for a verbose backtrace.
32.00 s
gammaloop-nextest-vakint>
32.00 s
gammaloop-nextest-vakint> FAIL [ 0.072s] (14/74) vakint::integral_alphaloop_vs_matad_tests test_integrate_3l_basketball_a
32.00 s
gammaloop-nextest-vakint> stdout ---
32.00 s
gammaloop-nextest-vakint>
32.00 s
gammaloop-nextest-vakint> running 1 test
32.00 s
gammaloop-nextest-vakint> test test_integrate_3l_basketball_a ... FAILED
32.00 s
gammaloop-nextest-vakint>
32.00 s
gammaloop-nextest-vakint> failures:
32.00 s
gammaloop-nextest-vakint>
32.00 s
gammaloop-nextest-vakint> failures:
32.01 s
gammaloop-nextest-vakint> test_integrate_3l_basketball_a
32.01 s
gammaloop-nextest-vakint>
32.01 s
gammaloop-nextest-vakint> test result: FAILED. 0 passed; 1 failed; 0 ignored; 0 measured; 9 filtered out; finished in 0.07s
32.01 s
gammaloop-nextest-vakint>
32.01 s
gammaloop-nextest-vakint> stderr ---
32.01 s
gammaloop-nextest-vakint>
32.01 s
gammaloop-nextest-vakint> thread 'test_integrate_3l_basketball_a' (252) panicked at crates/vakint/tests/test_utils.rs:350:13:
32.01 s
gammaloop-nextest-vakint> Error during benchmark integral evaluation with [AlphaLoop (susbstitute_masters=true)] :: error :
32.01 s
gammaloop-nextest-vakint> the following integral could not be identified using any of the supported topologies: topo(I3L_pinch_1_6(muvsq,0,1,1,1,1,0))
32.01 s
gammaloop-nextest-vakint> stack backtrace:
32.01 s
gammaloop-nextest-vakint> 0: __rustc::rust_begin_unwind
32.01 s
gammaloop-nextest-vakint> 1: core::panicking::panic_fmt
32.01 s
gammaloop-nextest-vakint> 2: integral_alphaloop_vs_matad_tests::test_utils::compare_two_evaluations
32.01 s
gammaloop-nextest-vakint> 3: <integral_alphaloop_vs_matad_tests::test_integrate_3l_basketball_a::{closure#0} as core::ops::function::FnOnce<()>>::call_once
32.01 s
gammaloop-nextest-vakint> note: Some details are omitted, run with `RUST_BACKTRACE=full` for a verbose backtrace.
32.01 s
gammaloop-nextest-vakint>
32.01 s
gammaloop-nextest-vakint> FAIL [ 0.071s] (15/74) vakint::integral_alphaloop_vs_matad_tests test_integrate_3l_basketball_b
32.01 s
gammaloop-nextest-vakint> stdout ---
32.01 s
gammaloop-nextest-vakint>
32.01 s
gammaloop-nextest-vakint> running 1 test
32.01 s
gammaloop-nextest-vakint> test test_integrate_3l_basketball_b ... FAILED
32.01 s
gammaloop-nextest-vakint>
32.01 s
gammaloop-nextest-vakint> failures:
32.01 s
gammaloop-nextest-vakint>
32.01 s
gammaloop-nextest-vakint> failures:
32.01 s
gammaloop-nextest-vakint> test_integrate_3l_basketball_b
32.01 s
gammaloop-nextest-vakint>
32.01 s
gammaloop-nextest-vakint> test result: FAILED. 0 passed; 1 failed; 0 ignored; 0 measured; 9 filtered out; finished in 0.06s
32.01 s
gammaloop-nextest-vakint>
32.01 s
gammaloop-nextest-vakint> stderr ---
32.01 s
gammaloop-nextest-vakint>
32.01 s
gammaloop-nextest-vakint> thread 'test_integrate_3l_basketball_b' (257) panicked at crates/vakint/tests/test_utils.rs:350:13:
32.01 s
gammaloop-nextest-vakint> Error during benchmark integral evaluation with [AlphaLoop (susbstitute_masters=true)] :: error :
32.01 s
gammaloop-nextest-vakint> the following integral could not be identified using any of the supported topologies: topo(I3L_pinch_1_6(muvsq,0,1,1,1,1,0))
32.01 s
gammaloop-nextest-vakint> stack backtrace:
32.01 s
gammaloop-nextest-vakint> 0: __rustc::rust_begin_unwind
32.01 s
gammaloop-nextest-vakint> 1: core::panicking::panic_fmt
32.01 s
gammaloop-nextest-vakint> 2: integral_alphaloop_vs_matad_tests::test_utils::compare_two_evaluations
32.01 s
gammaloop-nextest-vakint> 3: <integral_alphaloop_vs_matad_tests::test_integrate_3l_basketball_b::{closure#0} as core::ops::function::FnOnce<()>>::call_once
32.01 s
gammaloop-nextest-vakint> note: Some details are omitted, run with `RUST_BACKTRACE=full` for a verbose backtrace.
32.01 s
gammaloop-nextest-vakint>
32.01 s
gammaloop-nextest-vakint> FAIL [ 0.127s] (46/74) vakint::integral_evaluation_analytic_tests test_integrate_4l_PR9d_from_FG_pinch
32.01 s
gammaloop-nextest-vakint> stdout ---
32.01 s
gammaloop-nextest-vakint>
32.01 s
gammaloop-nextest-vakint> running 1 test
32.01 s
gammaloop-nextest-vakint> test test_integrate_4l_PR9d_from_FG_pinch ... FAILED
32.01 s
gammaloop-nextest-vakint>
32.01 s
gammaloop-nextest-vakint> failures:
32.01 s
gammaloop-nextest-vakint>
32.01 s
gammaloop-nextest-vakint> failures:
32.01 s
gammaloop-nextest-vakint> test_integrate_4l_PR9d_from_FG_pinch
32.01 s
gammaloop-nextest-vakint>
32.01 s
gammaloop-nextest-vakint> test result: FAILED. 0 passed; 1 failed; 0 ignored; 0 measured; 26 filtered out; finished in 0.12s
32.01 s
gammaloop-nextest-vakint>
32.01 s
gammaloop-nextest-vakint> stderr ---
32.01 s
gammaloop-nextest-vakint>
32.01 s
gammaloop-nextest-vakint> thread 'test_integrate_4l_PR9d_from_FG_pinch' (402) panicked at crates/vakint/tests/test_utils.rs:554:30:
32.01 s
gammaloop-nextest-vakint> Failed to evaluate integral: the following integral could not be identified using any of the supported topologies: topo(I4L_FG_pinch_4(muvsq,1,2,1,0,1,1,1,1))
32.01 s
gammaloop-nextest-vakint> stack backtrace:
32.01 s
gammaloop-nextest-vakint> 0: __rustc::rust_begin_unwind
32.01 s
gammaloop-nextest-vakint> 1: core::panicking::panic_fmt
32.01 s
gammaloop-nextest-vakint> 2: integral_evaluation_analytic_tests::test_utils::compare_vakint_evaluation_vs_reference::{closure#0}
32.01 s
gammaloop-nextest-vakint> 3: integral_evaluation_analytic_tests::test_utils::compare_vakint_evaluation_vs_reference
32.01 s
gammaloop-nextest-vakint> 4: <integral_evaluation_analytic_tests::test_integrate_4l_PR9d_from_FG_pinch::{closure#0} as core::ops::function::FnOnce<()>>::call_once
32.01 s
gammaloop-nextest-vakint> note: Some details are omitted, run with `RUST_BACKTRACE=full` for a verbose backtrace.
32.01 s
gammaloop-nextest-vakint>
32.01 s
gammaloop-nextest-vakint> FAIL [ 0.194s] (48/74) vakint::integral_evaluation_analytic_tests test_integrate_4l_PR9d_from_H_pinch
32.01 s
gammaloop-nextest-vakint> stdout ---
32.01 s
gammaloop-nextest-vakint>
32.01 s
gammaloop-nextest-vakint> running 1 test
32.01 s
gammaloop-nextest-vakint> test test_integrate_4l_PR9d_from_H_pinch ... FAILED
32.01 s
gammaloop-nextest-vakint>
32.01 s
gammaloop-nextest-vakint> failures:
32.01 s
gammaloop-nextest-vakint>
32.01 s
gammaloop-nextest-vakint> failures:
32.01 s
gammaloop-nextest-vakint> test_integrate_4l_PR9d_from_H_pinch
32.01 s
gammaloop-nextest-vakint>
32.01 s
gammaloop-nextest-vakint> test result: FAILED. 0 passed; 1 failed; 0 ignored; 0 measured; 26 filtered out; finished in 0.19s
32.01 s
gammaloop-nextest-vakint>
32.01 s
gammaloop-nextest-vakint> stderr ---
32.01 s
gammaloop-nextest-vakint>
32.01 s
gammaloop-nextest-vakint> thread 'test_integrate_4l_PR9d_from_H_pinch' (413) panicked at crates/vakint/tests/test_utils.rs:554:30:
32.01 s
gammaloop-nextest-vakint> Failed to evaluate integral: the following integral could not be identified using any of the supported topologies: topo(I4L_FG_pinch_4(muvsq,1,2,1,0,1,1,1,1))
32.01 s
gammaloop-nextest-vakint> stack backtrace:
32.01 s
gammaloop-nextest-vakint> 0: __rustc::rust_begin_unwind
32.01 s
gammaloop-nextest-vakint> 1: core::panicking::panic_fmt
32.01 s
gammaloop-nextest-vakint> 2: integral_evaluation_analytic_tests::test_utils::compare_vakint_evaluation_vs_reference::{closure#0}
32.01 s
gammaloop-nextest-vakint> 3: integral_evaluation_analytic_tests::test_utils::compare_vakint_evaluation_vs_reference
32.01 s
gammaloop-nextest-vakint> 4: <integral_evaluation_analytic_tests::test_integrate_4l_PR9d_from_H_pinch::{closure#0} as core::ops::function::FnOnce<()>>::call_once
32.01 s
gammaloop-nextest-vakint> note: Some details are omitted, run with `RUST_BACKTRACE=full` for a verbose backtrace.
32.01 s
gammaloop-nextest-vakint>
32.01 s
gammaloop-nextest-vakint> FAIL [ 0.187s] (50/74) vakint::integral_evaluation_analytic_tests test_integrate_4l_clover
32.01 s
gammaloop-nextest-vakint> stdout ---
32.01 s
gammaloop-nextest-vakint>
32.01 s
gammaloop-nextest-vakint> running 1 test
32.01 s
gammaloop-nextest-vakint> test test_integrate_4l_clover ... FAILED
32.01 s
gammaloop-nextest-vakint>
32.01 s
gammaloop-nextest-vakint> failures:
32.01 s
gammaloop-nextest-vakint>
32.01 s
gammaloop-nextest-vakint> failures:
32.01 s
gammaloop-nextest-vakint> test_integrate_4l_clover
32.01 s
gammaloop-nextest-vakint>
32.01 s
gammaloop-nextest-vakint> test result: FAILED. 0 passed; 1 failed; 0 ignored; 0 measured; 26 filtered out; finished in 0.18s
32.01 s
gammaloop-nextest-vakint>
32.01 s
gammaloop-nextest-vakint> stderr ---
32.01 s
gammaloop-nextest-vakint>
32.01 s
gammaloop-nextest-vakint> thread 'test_integrate_4l_clover' (424) panicked at crates/vakint/tests/test_utils.rs:554:30:
32.01 s
gammaloop-nextest-vakint> Failed to evaluate integral: the following integral could not be identified using any of the supported topologies: topo(I4L_FG_pinch_4_6_7_8(muvsq,1,1,1,0,1,0,0,0))
32.01 s
gammaloop-nextest-vakint> stack backtrace:
32.01 s
gammaloop-nextest-vakint> 0: __rustc::rust_begin_unwind
32.01 s
gammaloop-nextest-vakint> 1: core::panicking::panic_fmt
32.01 s
gammaloop-nextest-vakint> 2: integral_evaluation_analytic_tests::test_utils::compare_vakint_evaluation_vs_reference::{closure#0}
32.01 s
gammaloop-nextest-vakint> 3: integral_evaluation_analytic_tests::test_utils::compare_vakint_evaluation_vs_reference
32.01 s
gammaloop-nextest-vakint> 4: <integral_evaluation_analytic_tests::test_integrate_4l_clover::{closure#0} as core::ops::function::FnOnce<()>>::call_once
32.01 s
gammaloop-nextest-vakint> note: Some details are omitted, run with `RUST_BACKTRACE=full` for a verbose backtrace.
32.01 s
gammaloop-nextest-vakint>
32.01 s
gammaloop-nextest-vakint> FAIL [ 0.195s] (51/74) vakint::integral_evaluation_analytic_tests test_integrate_4l_clover_with_non_unit_scales
32.01 s
gammaloop-nextest-vakint> stdout ---
32.01 s
gammaloop-nextest-vakint>
32.01 s
gammaloop-nextest-vakint> running 1 test
32.01 s
gammaloop-nextest-vakint> test test_integrate_4l_clover_with_non_unit_scales ... FAILED
32.01 s
gammaloop-nextest-vakint>
32.01 s
gammaloop-nextest-vakint> failures:
32.01 s
gammaloop-nextest-vakint>
32.01 s
gammaloop-nextest-vakint> failures:
32.01 s
gammaloop-nextest-vakint> test_integrate_4l_clover_with_non_unit_scales
32.01 s
gammaloop-nextest-vakint>
32.01 s
gammaloop-nextest-vakint> test result: FAILED. 0 passed; 1 failed; 0 ignored; 0 measured; 26 filtered out; finished in 0.19s
32.01 s
gammaloop-nextest-vakint>
32.01 s
gammaloop-nextest-vakint> stderr ---
32.01 s
gammaloop-nextest-vakint>
32.01 s
gammaloop-nextest-vakint> thread 'test_integrate_4l_clover_with_non_unit_scales' (429) panicked at crates/vakint/tests/test_utils.rs:554:30:
32.01 s
gammaloop-nextest-vakint> Failed to evaluate integral: the following integral could not be identified using any of the supported topologies: topo(I4L_FG_pinch_4_6_7_8(muvsq,1,1,1,0,1,0,0,0))
32.01 s
gammaloop-nextest-vakint> stack backtrace:
32.01 s
gammaloop-nextest-vakint> 0: __rustc::rust_begin_unwind
32.01 s
gammaloop-nextest-vakint> 1: core::panicking::panic_fmt
32.01 s
gammaloop-nextest-vakint> 2: integral_evaluation_analytic_tests::test_utils::compare_vakint_evaluation_vs_reference::{closure#0}
32.01 s
gammaloop-nextest-vakint> 3: integral_evaluation_analytic_tests::test_utils::compare_vakint_evaluation_vs_reference
32.01 s
gammaloop-nextest-vakint> 4: <integral_evaluation_analytic_tests::test_integrate_4l_clover_with_non_unit_scales::{closure#0} as core::ops::function::FnOnce<()>>::call_once
32.01 s
gammaloop-nextest-vakint> note: Some details are omitted, run with `RUST_BACKTRACE=full` for a verbose backtrace.
32.01 s
gammaloop-nextest-vakint>
32.01 s
gammaloop-nextest-vakint> FAIL [ 0.186s] (52/74) vakint::integral_evaluation_analytic_tests test_integrate_4l_clover_with_numerator
32.01 s
gammaloop-nextest-vakint> stdout ---
32.01 s
gammaloop-nextest-vakint>
32.01 s
gammaloop-nextest-vakint> running 1 test
32.01 s
gammaloop-nextest-vakint> test test_integrate_4l_clover_with_numerator ... FAILED
32.01 s
gammaloop-nextest-vakint>
32.01 s
gammaloop-nextest-vakint> failures:
32.01 s
gammaloop-nextest-vakint>
32.01 s
gammaloop-nextest-vakint> failures:
32.01 s
gammaloop-nextest-vakint> test_integrate_4l_clover_with_numerator
32.01 s
gammaloop-nextest-vakint>
32.01 s
gammaloop-nextest-vakint> test result: FAILED. 0 passed; 1 failed; 0 ignored; 0 measured; 26 filtered out; finished in 0.18s
32.01 s
gammaloop-nextest-vakint>
32.01 s
gammaloop-nextest-vakint> stderr ---
32.01 s
gammaloop-nextest-vakint>
32.01 s
gammaloop-nextest-vakint> thread 'test_integrate_4l_clover_with_numerator' (434) panicked at crates/vakint/tests/test_utils.rs:554:30:
32.01 s
gammaloop-nextest-vakint> Failed to evaluate integral: the following integral could not be identified using any of the supported topologies: topo(I4L_FG_pinch_4_6_7_8(muvsq,2,1,1,0,1,0,0,0))
32.01 s
gammaloop-nextest-vakint> stack backtrace:
32.01 s
gammaloop-nextest-vakint> 0: __rustc::rust_begin_unwind
32.01 s
gammaloop-nextest-vakint> 1: core::panicking::panic_fmt
32.01 s
gammaloop-nextest-vakint> 2: integral_evaluation_analytic_tests::test_utils::compare_vakint_evaluation_vs_reference::{closure#0}
32.01 s
gammaloop-nextest-vakint> 3: integral_evaluation_analytic_tests::test_utils::compare_vakint_evaluation_vs_reference
32.01 s
gammaloop-nextest-vakint> 4: <integral_evaluation_analytic_tests::test_integrate_4l_clover_with_numerator::{closure#0} as core::ops::function::FnOnce<()>>::call_once
32.01 s
gammaloop-nextest-vakint> note: Some details are omitted, run with `RUST_BACKTRACE=full` for a verbose backtrace.
32.01 s
gammaloop-nextest-vakint>
32.01 s
gammaloop-nextest-vakint> FAIL [ 0.197s] (53/74) vakint::integral_evaluation_analytic_tests test_integrate_4l_dotted_clover
32.01 s
gammaloop-nextest-vakint> stdout ---
32.01 s
gammaloop-nextest-vakint>
32.01 s
gammaloop-nextest-vakint> running 1 test
32.01 s
gammaloop-nextest-vakint> test test_integrate_4l_dotted_clover ... FAILED
32.01 s
gammaloop-nextest-vakint>
32.01 s
gammaloop-nextest-vakint> failures:
32.01 s
gammaloop-nextest-vakint>
32.01 s
gammaloop-nextest-vakint> failures:
32.01 s
gammaloop-nextest-vakint> test_integrate_4l_dotted_clover
32.01 s
gammaloop-nextest-vakint>
32.01 s
gammaloop-nextest-vakint> test result: FAILED. 0 passed; 1 failed; 0 ignored; 0 measured; 26 filtered out; finished in 0.19s
32.01 s
gammaloop-nextest-vakint>
32.01 s
gammaloop-nextest-vakint> stderr ---
32.01 s
gammaloop-nextest-vakint>
32.01 s
gammaloop-nextest-vakint> thread 'test_integrate_4l_dotted_clover' (439) panicked at crates/vakint/tests/test_utils.rs:554:30:
32.01 s
gammaloop-nextest-vakint> Failed to evaluate integral: the following integral could not be identified using any of the supported topologies: topo(I4L_FG_pinch_4_6_7_8(muvsq,2,1,1,0,1,0,0,0))
32.01 s
gammaloop-nextest-vakint> stack backtrace:
32.01 s
gammaloop-nextest-vakint> 0: __rustc::rust_begin_unwind
32.01 s
gammaloop-nextest-vakint> 1: core::panicking::panic_fmt
32.01 s
gammaloop-nextest-vakint> 2: integral_evaluation_analytic_tests::test_utils::compare_vakint_evaluation_vs_reference::{closure#0}
32.01 s
gammaloop-nextest-vakint> 3: integral_evaluation_analytic_tests::test_utils::compare_vakint_evaluation_vs_reference
32.01 s
gammaloop-nextest-vakint> 4: <integral_evaluation_analytic_tests::test_integrate_4l_dotted_clover::{closure#0} as core::ops::function::FnOnce<()>>::call_once
32.01 s
gammaloop-nextest-vakint> note: Some details are omitted, run with `RUST_BACKTRACE=full` for a verbose backtrace.
32.01 s
gammaloop-nextest-vakint>
32.01 s
gammaloop-nextest-vakint> FAIL [ 0.111s] (58/74) vakint::integral_evaluation_freeform_tests test_integrate_1l_decorated_indices_alphaloop
32.01 s
gammaloop-nextest-vakint> stdout ---
32.01 s
gammaloop-nextest-vakint>
32.01 s
gammaloop-nextest-vakint> running 1 test
32.01 s
gammaloop-nextest-vakint> test test_integrate_1l_decorated_indices_alphaloop ... FAILED
32.01 s
gammaloop-nextest-vakint>
32.01 s
gammaloop-nextest-vakint> failures:
32.01 s
gammaloop-nextest-vakint>
32.01 s
gammaloop-nextest-vakint> failures:
32.01 s
gammaloop-nextest-vakint> test_integrate_1l_decorated_indices_alphaloop
32.01 s
gammaloop-nextest-vakint>
32.01 s
gammaloop-nextest-vakint> test result: FAILED. 0 passed; 1 failed; 0 ignored; 0 measured; 3 filtered out; finished in 0.10s
32.01 s
gammaloop-nextest-vakint>
32.01 s
gammaloop-nextest-vakint> stderr ---
32.01 s
gammaloop-nextest-vakint>
32.01 s
gammaloop-nextest-vakint> thread 'test_integrate_1l_decorated_indices_alphaloop' (468) panicked at crates/vakint/tests/test_utils.rs:563:6:
32.01 s
gammaloop-nextest-vakint> called `Result::unwrap()` on an `Err` value: EvaluationError("Is some tensor structure left? | Expression: '(1/4*user_space::{real}::DDMUVsq^2*vakint::{symmetric}::g(user_space::{}::mink4(4,11),user_space::{}::mink4(4,22))+user_space::{real}::DDMUVsq*user_space::{scalar}::DDsigma2(user_space::{}::some_args)*vakint::{symmetric,linear}::dot(vakint::{}::p(1),vakint::{}::p(2))*vakint::{}::vec1(vakint::{}::p(1),13370003)*vakint::{}::vec1(vakint::{}::p(2),13370003)+user_space::{real}::DDMUVsq*user_space::{symmetric,real}::DDsigma3(user_space::{}::some_args)*vakint::{symmetric,linear}::dot(vakint::{}::p(1),vakint::{}::p(2))*vakint::{}::vec1(vakint::{}::p(1),13370003)*vakint::{}::vec1(vakint::{}::p(2),13370003)+user_space::{real}::DDMUVsq*user_space::{}::DDsigma(user_space::{}::some_args)*vakint::{symmetric,linear}::dot(vakint::{}::p(1),vakint::{}::p(2))*vakint::{}::vec1(vakint::{}::p(1),13370003)*vakint::{}::vec1(vakint::{}::p(2),13370003))*1/16*vakint::{}::𝑖*𝜋^(-2)' | Error: 'function vec1(p(1),13370003) is not in a parameter map and does not have an evaluator'")
32.01 s
gammaloop-nextest-vakint> stack backtrace:
32.01 s
gammaloop-nextest-vakint> 0: __rustc::rust_begin_unwind
32.01 s
gammaloop-nextest-vakint> 1: core::panicking::panic_fmt
32.01 s
gammaloop-nextest-vakint> 2: core::result::unwrap_failed
32.01 s
gammaloop-nextest-vakint> 3: integral_evaluation_freeform_tests::test_utils::compare_vakint_evaluation_vs_reference
32.01 s
gammaloop-nextest-vakint> 4: <integral_evaluation_freeform_tests::test_integrate_1l_decorated_indices_alphaloop::{closure#0} as core::ops::function::FnOnce<()>>::call_once
32.01 s
gammaloop-nextest-vakint> note: Some details are omitted, run with `RUST_BACKTRACE=full` for a verbose backtrace.
32.01 s
gammaloop-nextest-vakint>
32.01 s
gammaloop-nextest-vakint> FAIL [ 0.192s] (59/74) vakint::integral_evaluation_freeform_tests test_integrate_1l_decorated_indices_fmft
32.01 s
gammaloop-nextest-vakint> stdout ---
32.01 s
gammaloop-nextest-vakint>
32.01 s
gammaloop-nextest-vakint> running 1 test
32.01 s
gammaloop-nextest-vakint> test test_integrate_1l_decorated_indices_fmft ... FAILED
32.01 s
gammaloop-nextest-vakint>
32.01 s
gammaloop-nextest-vakint> failures:
32.01 s
gammaloop-nextest-vakint>
32.01 s
gammaloop-nextest-vakint> failures:
32.01 s
gammaloop-nextest-vakint> test_integrate_1l_decorated_indices_fmft
32.01 s
gammaloop-nextest-vakint>
32.01 s
gammaloop-nextest-vakint> test result: FAILED. 0 passed; 1 failed; 0 ignored; 0 measured; 3 filtered out; finished in 0.19s
32.01 s
gammaloop-nextest-vakint>
32.01 s
gammaloop-nextest-vakint> stderr ---
32.01 s
gammaloop-nextest-vakint>
32.01 s
gammaloop-nextest-vakint> thread 'test_integrate_1l_decorated_indices_fmft' (474) panicked at crates/vakint/tests/test_utils.rs:554:30:
32.01 s
gammaloop-nextest-vakint> Failed to evaluate integral: the following integral could not be identified using any of the supported topologies: topo(I4L_FG_pinch_4_6_7_8(BBMUVsq,1,1,1,0,1,0,0,0))
32.01 s
gammaloop-nextest-vakint> stack backtrace:
32.01 s
gammaloop-nextest-vakint> 0: __rustc::rust_begin_unwind
32.01 s
gammaloop-nextest-vakint> 1: core::panicking::panic_fmt
32.01 s
gammaloop-nextest-vakint> 2: integral_evaluation_freeform_tests::test_utils::compare_vakint_evaluation_vs_reference::{closure#0}
32.01 s
gammaloop-nextest-vakint> 3: integral_evaluation_freeform_tests::test_utils::compare_vakint_evaluation_vs_reference
32.01 s
gammaloop-nextest-vakint> 4: <integral_evaluation_freeform_tests::test_integrate_1l_decorated_indices_fmft::{closure#0} as core::ops::function::FnOnce<()>>::call_once
32.01 s
gammaloop-nextest-vakint> note: Some details are omitted, run with `RUST_BACKTRACE=full` for a verbose backtrace.
32.01 s
gammaloop-nextest-vakint>
32.01 s
gammaloop-nextest-vakint> FAIL [ 0.131s] (60/74) vakint::integral_evaluation_freeform_tests test_integrate_1l_decorated_indices_matad
32.01 s
gammaloop-nextest-vakint> stdout ---
32.01 s
gammaloop-nextest-vakint>
32.01 s
gammaloop-nextest-vakint> running 1 test
32.01 s
gammaloop-nextest-vakint> test test_integrate_1l_decorated_indices_matad ... FAILED
32.01 s
gammaloop-nextest-vakint>
32.01 s
gammaloop-nextest-vakint> failures:
32.01 s
gammaloop-nextest-vakint>
32.01 s
gammaloop-nextest-vakint> failures:
32.01 s
gammaloop-nextest-vakint> test_integrate_1l_decorated_indices_matad
32.01 s
gammaloop-nextest-vakint>
32.01 s
gammaloop-nextest-vakint> test result: FAILED. 0 passed; 1 failed; 0 ignored; 0 measured; 3 filtered out; finished in 0.12s
32.01 s
gammaloop-nextest-vakint>
32.01 s
gammaloop-nextest-vakint> stderr ---
32.01 s
gammaloop-nextest-vakint>
32.01 s
gammaloop-nextest-vakint> thread 'test_integrate_1l_decorated_indices_matad' (479) panicked at crates/vakint/tests/test_utils.rs:554:30:
32.01 s
gammaloop-nextest-vakint> Failed to evaluate integral: FORM run crashed with the following error:
32.01 s
gammaloop-nextest-vakint> stderr:
32.01 s
gammaloop-nextest-vakint> stdout: FORM 5.0.0 (Jan 1 1980) Run: Sat Sep 12 20:40:56 2026
32.01 s
gammaloop-nextest-vakint> #-
32.01 s
gammaloop-nextest-vakint> run_matad.frm Line 11 --> Undeclared variable vec1
32.01 s
gammaloop-nextest-vakint> ~~~" "
32.01 s
gammaloop-nextest-vakint> ~~~" "
32.01 s
gammaloop-nextest-vakint> ~~~" _____ _____ _____ _____ ____ "
32.01 s
gammaloop-nextest-vakint> ~~~" | | _ |_ _| _ | \ ___ ___ ___ "
32.01 s
gammaloop-nextest-vakint> ~~~" | | | | | | | | | | |___| | . | "
32.01 s
gammaloop-nextest-vakint> ~~~" |_|_|_|__|__| |_| |__|__|____/ |_|_|_ | "
32.01 s
gammaloop-nextest-vakint> ~~~" |___| "
32.01 s
gammaloop-nextest-vakint> ~~~" "
32.01 s
gammaloop-nextest-vakint> ~~~" "
32.01 s
gammaloop-nextest-vakint> ~~~" Originally written by M.Steinhauser "
32.01 s
gammaloop-nextest-vakint> ~~~" About exact version contact to: "
32.01 s
gammaloop-nextest-vakint> ~~~" pikelner[at]theor.jinr.ru, Andrey Pikelner "
32.01 s
gammaloop-nextest-vakint> ~~~" "
32.01 s
gammaloop-nextest-vakint> ~~~MATAD called for 1-loop integral
32.01 s
gammaloop-nextest-vakint> Program terminating at -->
32.01 s
gammaloop-nextest-vakint> Terminate called from pre.c:1086 (PreProcessor)
32.01 s
gammaloop-nextest-vakint> 0.00 sec out of 0.00 sec
32.01 s
gammaloop-nextest-vakint>
32.01 s
gammaloop-nextest-vakint> You can rerun the script using:
32.01 s
gammaloop-nextest-vakint> cd "/build/vakint_temp_pid478_1789245656255368531_1" && "form" "run_matad.frm"
32.01 s
gammaloop-nextest-vakint> stack backtrace:
32.01 s
gammaloop-nextest-vakint> 0: __rustc::rust_begin_unwind
32.01 s
gammaloop-nextest-vakint> 1: core::panicking::panic_fmt
32.01 s
gammaloop-nextest-vakint> 2: integral_evaluation_freeform_tests::test_utils::compare_vakint_evaluation_vs_reference::{closure#0}
32.01 s
gammaloop-nextest-vakint> 3: integral_evaluation_freeform_tests::test_utils::compare_vakint_evaluation_vs_reference
32.01 s
gammaloop-nextest-vakint> 4: <integral_evaluation_freeform_tests::test_integrate_1l_decorated_indices_matad::{closure#0} as core::ops::function::FnOnce<()>>::call_once
32.01 s
gammaloop-nextest-vakint> note: Some details are omitted, run with `RUST_BACKTRACE=full` for a verbose backtrace.
32.01 s
gammaloop-nextest-vakint>
32.14 s
gammaloop-nextest-vakint> error : test run failed
32.20 s
gammaloop-nextest-vakint>
32.20 s
gammaloop-nextest-vakint> ========== nextest test summary ==========
32.20 s
gammaloop-nextest-vakint> report: target/nextest/ci_gammaloop/junit.xml
32.20 s
gammaloop-nextest-vakint> tests: 74, failures: 13, errors: 0
32.20 s
gammaloop-nextest-vakint>
32.20 s
gammaloop-nextest-vakint> 1. vakint::input_matching_tests::test_2l_matching_pinched
32.20 s
gammaloop-nextest-vakint> failure: test failure with exit code 101
32.20 s
gammaloop-nextest-vakint> thread 'test_2l_matching_pinched' (170) panicked at crates/vakint/tests/test_utils.rs:202:21:
32.20 s
gammaloop-nextest-vakint> Error: the following integral could not be identified using any of the supported topologies: topo(I2L_pinch_3(mUVsq,2,1,0))
32.20 s
gammaloop-nextest-vakint> stack backtrace:
32.20 s
gammaloop-nextest-vakint> 0: __rustc::rust_begin_unwind
32.20 s
gammaloop-nextest-vakint> 1: core::panicking::panic_fmt
32.20 s
gammaloop-nextest-vakint> 2: input_matching_tests::test_utils::compare_output
32.20 s
gammaloop-nextest-vakint> 3: <input_matching_tests::test_2l_matching_pinched::{closure#0} as core::ops::function::FnOnce<()>>::call_once
32.20 s
gammaloop-nextest-vakint> note: Some details are omitted, run with `RUST_BACKTRACE=full` for a verbose backtrace.
32.20 s
gammaloop-nextest-vakint> system-out
32.20 s
gammaloop-nextest-vakint> running 1 test
32.20 s
gammaloop-nextest-vakint> test test_2l_matching_pinched ... FAILED
32.20 s
gammaloop-nextest-vakint>
32.20 s
gammaloop-nextest-vakint> failures:
32.20 s
gammaloop-nextest-vakint>
32.20 s
gammaloop-nextest-vakint> failures:
32.20 s
gammaloop-nextest-vakint> test_2l_matching_pinched
32.20 s
gammaloop-nextest-vakint>
32.20 s
gammaloop-nextest-vakint> test result: FAILED. 0 passed; 1 failed; 0 ignored; 0 measured; 5 filtered out; finished in 0.04s
32.20 s
gammaloop-nextest-vakint> system-err
32.20 s
gammaloop-nextest-vakint> thread 'test_2l_matching_pinched' (170) panicked at crates/vakint/tests/test_utils.rs:202:21:
32.20 s
gammaloop-nextest-vakint> Error: the following integral could not be identified using any of the supported topologies: topo(I2L_pinch_3(mUVsq,2,1,0))
32.20 s
gammaloop-nextest-vakint> stack backtrace:
32.20 s
gammaloop-nextest-vakint> 0: __rustc::rust_begin_unwind
32.20 s
gammaloop-nextest-vakint> 1: core::panicking::panic_fmt
32.20 s
gammaloop-nextest-vakint> 2: input_matching_tests::test_utils::compare_output
32.20 s
gammaloop-nextest-vakint> 3: <input_matching_tests::test_2l_matching_pinched::{closure#0} as core::ops::function::FnOnce<()>>::call_once
32.20 s
gammaloop-nextest-vakint> note: Some details are omitted, run with `RUST_BACKTRACE=full` for a verbose backtrace.
32.20 s
gammaloop-nextest-vakint>
32.20 s
gammaloop-nextest-vakint> 2. vakint::integral_alphaloop_vs_matad_tests::test_integrate_1l_no_numerator_squared_mass
32.20 s
gammaloop-nextest-vakint> failure: test failure with exit code 101
32.20 s
gammaloop-nextest-vakint> thread 'test_integrate_1l_no_numerator_squared_mass' (231) panicked at crates/vakint/tests/test_utils.rs:416:13:
32.20 s
gammaloop-nextest-vakint> Error during numerical evaluation of benchmark result with [MATAD (expand_masters=true, susbstitute_masters=true, substitute_hpls=true, direct_numerical_substition=true)] :: error:
32.20 s
gammaloop-nextest-vakint> Numerical evaluation error: Is some tensor structure left? | Expression: '-1*user_space::{}::muv^2+2*vakint::{}::M' | Error: 'variable M is not in a parameter map and does not have an evaluator'
32.20 s
gammaloop-nextest-vakint> stack backtrace:
32.20 s
gammaloop-nextest-vakint> 0: __rustc::rust_begin_unwind
32.20 s
gammaloop-nextest-vakint> 1: core::panicking::panic_fmt
32.20 s
gammaloop-nextest-vakint> 2: integral_alphaloop_vs_matad_tests::test_utils::compare_two_evaluations
32.20 s
gammaloop-nextest-vakint> 3: <integral_alphaloop_vs_matad_tests::test_integrate_1l_no_numerator_squared_mass::{closure#0} as core::ops::function::FnOnce<()>>::call_once
32.20 s
gammaloop-nextest-vakint> note: Some details are omitted, run with `RUST_BACKTRACE=full` for a verbose backtrace.
32.20 s
gammaloop-nextest-vakint> system-out
32.20 s
gammaloop-nextest-vakint> running 1 test
32.20 s
gammaloop-nextest-vakint>
32.20 s
gammaloop-nextest-vakint> <><><><><>
32.20 s
gammaloop-nextest-vakint>
32.20 s
gammaloop-nextest-vakint>
32.20 s
gammaloop-nextest-vakint> <><><><><>
32.20 s
gammaloop-nextest-vakint>
32.20 s
gammaloop-nextest-vakint> test test_integrate_1l_no_numerator_squared_mass ... FAILED
32.20 s
gammaloop-nextest-vakint>
32.20 s
gammaloop-nextest-vakint> failures:
32.20 s
gammaloop-nextest-vakint>
32.20 s
gammaloop-nextest-vakint> failures:
32.20 s
gammaloop-nextest-vakint> test_integrate_1l_no_numerator_squared_mass
32.20 s
gammaloop-nextest-vakint>
32.20 s
gammaloop-nextest-vakint> test result: FAILED. 0 passed; 1 failed; 0 ignored; 0 measured; 9 filtered out; finished in 0.28s
32.20 s
gammaloop-nextest-vakint> system-err
32.20 s
gammaloop-nextest-vakint> [INFO integral_alphaloop_vs_matad_tests::test_utils] Benchmark [AlphaLoop (susbstitute_masters=true)] :: central :
32.20 s
gammaloop-nextest-vakint> ε^-1 : (1.000000000000000000000000000000+0i)
32.20 s
gammaloop-nextest-vakint> ε^ 0 : (4.227843350984671393934879099176e-1+0i)
32.20 s
gammaloop-nextest-vakint> ε^+1 : (1.411840330426439694788883561418+0i)
32.20 s
gammaloop-nextest-vakint> ε^+2 : (5.043612543455534057723233940620e-1+0i)
32.20 s
gammaloop-nextest-vakint> [INFO integral_alphaloop_vs_matad_tests::test_utils] Tested [MATAD (expand_masters=true, susbstitute_masters=true, substitute_hpls=true, direct_numerical_substition=true)] :: central :
32.20 s
gammaloop-nextest-vakint> ε^-1 : (1.000000000000000000000000000000+0i)
32.20 s
gammaloop-nextest-vakint> ε^ 0 : (4.227843350984671393934879099176e-1+0i)
32.20 s
gammaloop-nextest-vakint> ε^+1 : (1.411840330426439694788883561418+0i)
32.20 s
gammaloop-nextest-vakint> ε^+2 : (5.043612543455534057723233940620e-1+0i)
32.20 s
gammaloop-nextest-vakint> [INFO integral_alphaloop_vs_matad_tests::test_utils] matches!
32.20 s
gammaloop-nextest-vakint>
32.20 s
gammaloop-nextest-vakint> thread 'test_integrate_1l_no_numerator_squared_mass' (231) panicked at crates/vakint/tests/test_utils.rs:416:13:
32.20 s
gammaloop-nextest-vakint> Error during numerical evaluation of benchmark result with [MATAD (expand_masters=true, susbstitute_masters=true, substitute_hpls=true, direct_numerical_substition=true)] :: error:
32.20 s
gammaloop-nextest-vakint> Numerical evaluation error: Is some tensor structure left? | Expression: '-1*user_space::{}::muv^2+2*vakint::{}::M' | Error: 'variable M is not in a parameter map and does not have an evaluator'
32.20 s
gammaloop-nextest-vakint> stack backtrace:
32.20 s
gammaloop-nextest-vakint> 0: __rustc::rust_begin_unwind
32.20 s
gammaloop-nextest-vakint> 1: core::panicking::panic_fmt
32.20 s
gammaloop-nextest-vakint> 2: integral_alphaloop_vs_matad_tests::test_utils::compare_two_evaluations
32.20 s
gammaloop-nextest-vakint> 3: <integral_alphaloop_vs_matad_tests::test_integrate_1l_no_numerator_squared_mass::{closure#0} as core::ops::function::FnOnce<()>>::call_once
32.20 s
gammaloop-nextest-vakint> note: Some details are omitted, run with `RUST_BACKTRACE=full` for a verbose backtrace.
32.20 s
gammaloop-nextest-vakint>
32.20 s
gammaloop-nextest-vakint> 3. vakint::integral_alphaloop_vs_matad_tests::test_integrate_3l_basketball_a
32.20 s
gammaloop-nextest-vakint> failure: test failure with exit code 101
32.20 s
gammaloop-nextest-vakint> thread 'test_integrate_3l_basketball_a' (252) panicked at crates/vakint/tests/test_utils.rs:350:13:
32.20 s
gammaloop-nextest-vakint> Error during benchmark integral evaluation with [AlphaLoop (susbstitute_masters=true)] :: error :
32.20 s
gammaloop-nextest-vakint> the following integral could not be identified using any of the supported topologies: topo(I3L_pinch_1_6(muvsq,0,1,1,1,1,0))
32.20 s
gammaloop-nextest-vakint> stack backtrace:
32.20 s
gammaloop-nextest-vakint> 0: __rustc::rust_begin_unwind
32.20 s
gammaloop-nextest-vakint> 1: core::panicking::panic_fmt
32.20 s
gammaloop-nextest-vakint> 2: integral_alphaloop_vs_matad_tests::test_utils::compare_two_evaluations
32.20 s
gammaloop-nextest-vakint> 3: <integral_alphaloop_vs_matad_tests::test_integrate_3l_basketball_a::{closure#0} as core::ops::function::FnOnce<()>>::call_once
32.20 s
gammaloop-nextest-vakint> note: Some details are omitted, run with `RUST_BACKTRACE=full` for a verbose backtrace.
32.20 s
gammaloop-nextest-vakint> system-out
32.20 s
gammaloop-nextest-vakint> running 1 test
32.20 s
gammaloop-nextest-vakint> test test_integrate_3l_basketball_a ... FAILED
32.20 s
gammaloop-nextest-vakint>
32.20 s
gammaloop-nextest-vakint> failures:
32.20 s
gammaloop-nextest-vakint>
32.20 s
gammaloop-nextest-vakint> failures:
32.20 s
gammaloop-nextest-vakint> test_integrate_3l_basketball_a
32.20 s
gammaloop-nextest-vakint>
32.20 s
gammaloop-nextest-vakint> test result: FAILED. 0 passed; 1 failed; 0 ignored; 0 measured; 9 filtered out; finished in 0.07s
32.20 s
gammaloop-nextest-vakint> system-err
32.20 s
gammaloop-nextest-vakint> thread 'test_integrate_3l_basketball_a' (252) panicked at crates/vakint/tests/test_utils.rs:350:13:
32.20 s
gammaloop-nextest-vakint> Error during benchmark integral evaluation with [AlphaLoop (susbstitute_masters=true)] :: error :
32.20 s
gammaloop-nextest-vakint> the following integral could not be identified using any of the supported topologies: topo(I3L_pinch_1_6(muvsq,0,1,1,1,1,0))
32.20 s
gammaloop-nextest-vakint> stack backtrace:
32.20 s
gammaloop-nextest-vakint> 0: __rustc::rust_begin_unwind
32.20 s
gammaloop-nextest-vakint> 1: core::panicking::panic_fmt
32.20 s
gammaloop-nextest-vakint> 2: integral_alphaloop_vs_matad_tests::test_utils::compare_two_evaluations
32.20 s
gammaloop-nextest-vakint> 3: <integral_alphaloop_vs_matad_tests::test_integrate_3l_basketball_a::{closure#0} as core::ops::function::FnOnce<()>>::call_once
32.20 s
gammaloop-nextest-vakint> note: Some details are omitted, run with `RUST_BACKTRACE=full` for a verbose backtrace.
32.20 s
gammaloop-nextest-vakint>
32.20 s
gammaloop-nextest-vakint> 4. vakint::integral_alphaloop_vs_matad_tests::test_integrate_3l_basketball_b
32.20 s
gammaloop-nextest-vakint> failure: test failure with exit code 101
32.20 s
gammaloop-nextest-vakint> thread 'test_integrate_3l_basketball_b' (257) panicked at crates/vakint/tests/test_utils.rs:350:13:
32.20 s
gammaloop-nextest-vakint> Error during benchmark integral evaluation with [AlphaLoop (susbstitute_masters=true)] :: error :
32.20 s
gammaloop-nextest-vakint> the following integral could not be identified using any of the supported topologies: topo(I3L_pinch_1_6(muvsq,0,1,1,1,1,0))
32.20 s
gammaloop-nextest-vakint> stack backtrace:
32.20 s
gammaloop-nextest-vakint> 0: __rustc::rust_begin_unwind
32.20 s
gammaloop-nextest-vakint> 1: core::panicking::panic_fmt
32.20 s
gammaloop-nextest-vakint> 2: integral_alphaloop_vs_matad_tests::test_utils::compare_two_evaluations
32.20 s
gammaloop-nextest-vakint> 3: <integral_alphaloop_vs_matad_tests::test_integrate_3l_basketball_b::{closure#0} as core::ops::function::FnOnce<()>>::call_once
32.20 s
gammaloop-nextest-vakint> note: Some details are omitted, run with `RUST_BACKTRACE=full` for a verbose backtrace.
32.20 s
gammaloop-nextest-vakint> system-out
32.20 s
gammaloop-nextest-vakint> running 1 test
32.20 s
gammaloop-nextest-vakint> test test_integrate_3l_basketball_b ... FAILED
32.20 s
gammaloop-nextest-vakint>
32.20 s
gammaloop-nextest-vakint> failures:
32.20 s
gammaloop-nextest-vakint>
32.20 s
gammaloop-nextest-vakint> failures:
32.20 s
gammaloop-nextest-vakint> test_integrate_3l_basketball_b
32.20 s
gammaloop-nextest-vakint>
32.20 s
gammaloop-nextest-vakint> test result: FAILED. 0 passed; 1 failed; 0 ignored; 0 measured; 9 filtered out; finished in 0.06s
32.20 s
gammaloop-nextest-vakint> system-err
32.20 s
gammaloop-nextest-vakint> thread 'test_integrate_3l_basketball_b' (257) panicked at crates/vakint/tests/test_utils.rs:350:13:
32.20 s
gammaloop-nextest-vakint> Error during benchmark integral evaluation with [AlphaLoop (susbstitute_masters=true)] :: error :
32.20 s
gammaloop-nextest-vakint> the following integral could not be identified using any of the supported topologies: topo(I3L_pinch_1_6(muvsq,0,1,1,1,1,0))
32.20 s
gammaloop-nextest-vakint> stack backtrace:
32.20 s
gammaloop-nextest-vakint> 0: __rustc::rust_begin_unwind
32.20 s
gammaloop-nextest-vakint> 1: core::panicking::panic_fmt
32.20 s
gammaloop-nextest-vakint> 2: integral_alphaloop_vs_matad_tests::test_utils::compare_two_evaluations
32.20 s
gammaloop-nextest-vakint> 3: <integral_alphaloop_vs_matad_tests::test_integrate_3l_basketball_b::{closure#0} as core::ops::function::FnOnce<()>>::call_once
32.20 s
gammaloop-nextest-vakint> note: Some details are omitted, run with `RUST_BACKTRACE=full` for a verbose backtrace.
32.20 s
gammaloop-nextest-vakint>
32.20 s
gammaloop-nextest-vakint> 5. vakint::integral_evaluation_analytic_tests::test_integrate_4l_PR9d_from_FG_pinch
32.20 s
gammaloop-nextest-vakint> failure: test failure with exit code 101
32.20 s
gammaloop-nextest-vakint> thread 'test_integrate_4l_PR9d_from_FG_pinch' (402) panicked at crates/vakint/tests/test_utils.rs:554:30:
32.20 s
gammaloop-nextest-vakint> Failed to evaluate integral: the following integral could not be identified using any of the supported topologies: topo(I4L_FG_pinch_4(muvsq,1,2,1,0,1,1,1,1))
32.20 s
gammaloop-nextest-vakint> stack backtrace:
32.20 s
gammaloop-nextest-vakint> 0: __rustc::rust_begin_unwind
32.20 s
gammaloop-nextest-vakint> 1: core::panicking::panic_fmt
32.20 s
gammaloop-nextest-vakint> 2: integral_evaluation_analytic_tests::test_utils::compare_vakint_evaluation_vs_reference::{closure#0}
32.20 s
gammaloop-nextest-vakint> 3: integral_evaluation_analytic_tests::test_utils::compare_vakint_evaluation_vs_reference
32.20 s
gammaloop-nextest-vakint> 4: <integral_evaluation_analytic_tests::test_integrate_4l_PR9d_from_FG_pinch::{closure#0} as core::ops::function::FnOnce<()>>::call_once
32.20 s
gammaloop-nextest-vakint> note: Some details are omitted, run with `RUST_BACKTRACE=full` for a verbose backtrace.
32.20 s
gammaloop-nextest-vakint> system-out
32.20 s
gammaloop-nextest-vakint> running 1 test
32.20 s
gammaloop-nextest-vakint> test test_integrate_4l_PR9d_from_FG_pinch ... FAILED
32.20 s
gammaloop-nextest-vakint>
32.20 s
gammaloop-nextest-vakint> failures:
32.20 s
gammaloop-nextest-vakint>
32.20 s
gammaloop-nextest-vakint> failures:
32.20 s
gammaloop-nextest-vakint> test_integrate_4l_PR9d_from_FG_pinch
32.20 s
gammaloop-nextest-vakint>
32.20 s
gammaloop-nextest-vakint> test result: FAILED. 0 passed; 1 failed; 0 ignored; 0 measured; 26 filtered out; finished in 0.12s
32.20 s
gammaloop-nextest-vakint> system-err
32.20 s
gammaloop-nextest-vakint> thread 'test_integrate_4l_PR9d_from_FG_pinch' (402) panicked at crates/vakint/tests/test_utils.rs:554:30:
32.20 s
gammaloop-nextest-vakint> Failed to evaluate integral: the following integral could not be identified using any of the supported topologies: topo(I4L_FG_pinch_4(muvsq,1,2,1,0,1,1,1,1))
32.20 s
gammaloop-nextest-vakint> stack backtrace:
32.20 s
gammaloop-nextest-vakint> 0: __rustc::rust_begin_unwind
32.20 s
gammaloop-nextest-vakint> 1: core::panicking::panic_fmt
32.20 s
gammaloop-nextest-vakint> 2: integral_evaluation_analytic_tests::test_utils::compare_vakint_evaluation_vs_reference::{closure#0}
32.20 s
gammaloop-nextest-vakint> 3: integral_evaluation_analytic_tests::test_utils::compare_vakint_evaluation_vs_reference
32.20 s
gammaloop-nextest-vakint> 4: <integral_evaluation_analytic_tests::test_integrate_4l_PR9d_from_FG_pinch::{closure#0} as core::ops::function::FnOnce<()>>::call_once
32.20 s
gammaloop-nextest-vakint> note: Some details are omitted, run with `RUST_BACKTRACE=full` for a verbose backtrace.
32.20 s
gammaloop-nextest-vakint>
32.20 s
gammaloop-nextest-vakint> 6. vakint::integral_evaluation_analytic_tests::test_integrate_4l_PR9d_from_H_pinch
32.20 s
gammaloop-nextest-vakint> failure: test failure with exit code 101
32.20 s
gammaloop-nextest-vakint> thread 'test_integrate_4l_PR9d_from_H_pinch' (413) panicked at crates/vakint/tests/test_utils.rs:554:30:
32.20 s
gammaloop-nextest-vakint> Failed to evaluate integral: the following integral could not be identified using any of the supported topologies: topo(I4L_FG_pinch_4(muvsq,1,2,1,0,1,1,1,1))
32.20 s
gammaloop-nextest-vakint> stack backtrace:
32.20 s
gammaloop-nextest-vakint> 0: __rustc::rust_begin_unwind
32.20 s
gammaloop-nextest-vakint> 1: core::panicking::panic_fmt
32.20 s
gammaloop-nextest-vakint> 2: integral_evaluation_analytic_tests::test_utils::compare_vakint_evaluation_vs_reference::{closure#0}
32.20 s
gammaloop-nextest-vakint> 3: integral_evaluation_analytic_tests::test_utils::compare_vakint_evaluation_vs_reference
32.20 s
gammaloop-nextest-vakint> 4: <integral_evaluation_analytic_tests::test_integrate_4l_PR9d_from_H_pinch::{closure#0} as core::ops::function::FnOnce<()>>::call_once
32.20 s
gammaloop-nextest-vakint> note: Some details are omitted, run with `RUST_BACKTRACE=full` for a verbose backtrace.
32.20 s
gammaloop-nextest-vakint> system-out
32.20 s
gammaloop-nextest-vakint> running 1 test
32.20 s
gammaloop-nextest-vakint> test test_integrate_4l_PR9d_from_H_pinch ... FAILED
32.20 s
gammaloop-nextest-vakint>
32.20 s
gammaloop-nextest-vakint> failures:
32.20 s
gammaloop-nextest-vakint>
32.20 s
gammaloop-nextest-vakint> failures:
32.21 s
gammaloop-nextest-vakint> test_integrate_4l_PR9d_from_H_pinch
32.21 s
gammaloop-nextest-vakint>
32.21 s
gammaloop-nextest-vakint> test result: FAILED. 0 passed; 1 failed; 0 ignored; 0 measured; 26 filtered out; finished in 0.19s
32.21 s
gammaloop-nextest-vakint> system-err
32.21 s
gammaloop-nextest-vakint> thread 'test_integrate_4l_PR9d_from_H_pinch' (413) panicked at crates/vakint/tests/test_utils.rs:554:30:
32.21 s
gammaloop-nextest-vakint> Failed to evaluate integral: the following integral could not be identified using any of the supported topologies: topo(I4L_FG_pinch_4(muvsq,1,2,1,0,1,1,1,1))
32.21 s
gammaloop-nextest-vakint> stack backtrace:
32.21 s
gammaloop-nextest-vakint> 0: __rustc::rust_begin_unwind
32.21 s
gammaloop-nextest-vakint> 1: core::panicking::panic_fmt
32.21 s
gammaloop-nextest-vakint> 2: integral_evaluation_analytic_tests::test_utils::compare_vakint_evaluation_vs_reference::{closure#0}
32.21 s
gammaloop-nextest-vakint> 3: integral_evaluation_analytic_tests::test_utils::compare_vakint_evaluation_vs_reference
32.21 s
gammaloop-nextest-vakint> 4: <integral_evaluation_analytic_tests::test_integrate_4l_PR9d_from_H_pinch::{closure#0} as core::ops::function::FnOnce<()>>::call_once
32.21 s
gammaloop-nextest-vakint> note: Some details are omitted, run with `RUST_BACKTRACE=full` for a verbose backtrace.
32.21 s
gammaloop-nextest-vakint>
32.21 s
gammaloop-nextest-vakint> 7. vakint::integral_evaluation_analytic_tests::test_integrate_4l_clover
32.21 s
gammaloop-nextest-vakint> failure: test failure with exit code 101
32.21 s
gammaloop-nextest-vakint> thread 'test_integrate_4l_clover' (424) panicked at crates/vakint/tests/test_utils.rs:554:30:
32.21 s
gammaloop-nextest-vakint> Failed to evaluate integral: the following integral could not be identified using any of the supported topologies: topo(I4L_FG_pinch_4_6_7_8(muvsq,1,1,1,0,1,0,0,0))
32.21 s
gammaloop-nextest-vakint> stack backtrace:
32.21 s
gammaloop-nextest-vakint> 0: __rustc::rust_begin_unwind
32.21 s
gammaloop-nextest-vakint> 1: core::panicking::panic_fmt
32.21 s
gammaloop-nextest-vakint> 2: integral_evaluation_analytic_tests::test_utils::compare_vakint_evaluation_vs_reference::{closure#0}
32.21 s
gammaloop-nextest-vakint> 3: integral_evaluation_analytic_tests::test_utils::compare_vakint_evaluation_vs_reference
32.21 s
gammaloop-nextest-vakint> 4: <integral_evaluation_analytic_tests::test_integrate_4l_clover::{closure#0} as core::ops::function::FnOnce<()>>::call_once
32.21 s
gammaloop-nextest-vakint> note: Some details are omitted, run with `RUST_BACKTRACE=full` for a verbose backtrace.
32.21 s
gammaloop-nextest-vakint> system-out
32.21 s
gammaloop-nextest-vakint> running 1 test
32.21 s
gammaloop-nextest-vakint> test test_integrate_4l_clover ... FAILED
32.21 s
gammaloop-nextest-vakint>
32.21 s
gammaloop-nextest-vakint> failures:
32.21 s
gammaloop-nextest-vakint>
32.21 s
gammaloop-nextest-vakint> failures:
32.21 s
gammaloop-nextest-vakint> test_integrate_4l_clover
32.21 s
gammaloop-nextest-vakint>
32.21 s
gammaloop-nextest-vakint> test result: FAILED. 0 passed; 1 failed; 0 ignored; 0 measured; 26 filtered out; finished in 0.18s
32.21 s
gammaloop-nextest-vakint> system-err
32.21 s
gammaloop-nextest-vakint> thread 'test_integrate_4l_clover' (424) panicked at crates/vakint/tests/test_utils.rs:554:30:
32.21 s
gammaloop-nextest-vakint> Failed to evaluate integral: the following integral could not be identified using any of the supported topologies: topo(I4L_FG_pinch_4_6_7_8(muvsq,1,1,1,0,1,0,0,0))
32.21 s
gammaloop-nextest-vakint> stack backtrace:
32.21 s
gammaloop-nextest-vakint> 0: __rustc::rust_begin_unwind
32.21 s
gammaloop-nextest-vakint> 1: core::panicking::panic_fmt
32.21 s
gammaloop-nextest-vakint> 2: integral_evaluation_analytic_tests::test_utils::compare_vakint_evaluation_vs_reference::{closure#0}
32.21 s
gammaloop-nextest-vakint> 3: integral_evaluation_analytic_tests::test_utils::compare_vakint_evaluation_vs_reference
32.21 s
gammaloop-nextest-vakint> 4: <integral_evaluation_analytic_tests::test_integrate_4l_clover::{closure#0} as core::ops::function::FnOnce<()>>::call_once
32.21 s
gammaloop-nextest-vakint> note: Some details are omitted, run with `RUST_BACKTRACE=full` for a verbose backtrace.
32.21 s
gammaloop-nextest-vakint>
32.21 s
gammaloop-nextest-vakint> 8. vakint::integral_evaluation_analytic_tests::test_integrate_4l_clover_with_non_unit_scales
32.21 s
gammaloop-nextest-vakint> failure: test failure with exit code 101
32.21 s
gammaloop-nextest-vakint> thread 'test_integrate_4l_clover_with_non_unit_scales' (429) panicked at crates/vakint/tests/test_utils.rs:554:30:
32.21 s
gammaloop-nextest-vakint> Failed to evaluate integral: the following integral could not be identified using any of the supported topologies: topo(I4L_FG_pinch_4_6_7_8(muvsq,1,1,1,0,1,0,0,0))
32.21 s
gammaloop-nextest-vakint> stack backtrace:
32.21 s
gammaloop-nextest-vakint> 0: __rustc::rust_begin_unwind
32.21 s
gammaloop-nextest-vakint> 1: core::panicking::panic_fmt
32.21 s
gammaloop-nextest-vakint> 2: integral_evaluation_analytic_tests::test_utils::compare_vakint_evaluation_vs_reference::{closure#0}
32.21 s
gammaloop-nextest-vakint> 3: integral_evaluation_analytic_tests::test_utils::compare_vakint_evaluation_vs_reference
32.21 s
gammaloop-nextest-vakint> 4: <integral_evaluation_analytic_tests::test_integrate_4l_clover_with_non_unit_scales::{closure#0} as core::ops::function::FnOnce<()>>::call_once
32.21 s
gammaloop-nextest-vakint> note: Some details are omitted, run with `RUST_BACKTRACE=full` for a verbose backtrace.
32.21 s
gammaloop-nextest-vakint> system-out
32.21 s
gammaloop-nextest-vakint> running 1 test
32.21 s
gammaloop-nextest-vakint> test test_integrate_4l_clover_with_non_unit_scales ... FAILED
32.21 s
gammaloop-nextest-vakint>
32.21 s
gammaloop-nextest-vakint> failures:
32.21 s
gammaloop-nextest-vakint>
32.21 s
gammaloop-nextest-vakint> failures:
32.21 s
gammaloop-nextest-vakint> test_integrate_4l_clover_with_non_unit_scales
32.21 s
gammaloop-nextest-vakint>
32.21 s
gammaloop-nextest-vakint> test result: FAILED. 0 passed; 1 failed; 0 ignored; 0 measured; 26 filtered out; finished in 0.19s
32.21 s
gammaloop-nextest-vakint> system-err
32.21 s
gammaloop-nextest-vakint> thread 'test_integrate_4l_clover_with_non_unit_scales' (429) panicked at crates/vakint/tests/test_utils.rs:554:30:
32.21 s
gammaloop-nextest-vakint> Failed to evaluate integral: the following integral could not be identified using any of the supported topologies: topo(I4L_FG_pinch_4_6_7_8(muvsq,1,1,1,0,1,0,0,0))
32.21 s
gammaloop-nextest-vakint> stack backtrace:
32.21 s
gammaloop-nextest-vakint> 0: __rustc::rust_begin_unwind
32.21 s
gammaloop-nextest-vakint> 1: core::panicking::panic_fmt
32.21 s
gammaloop-nextest-vakint> 2: integral_evaluation_analytic_tests::test_utils::compare_vakint_evaluation_vs_reference::{closure#0}
32.21 s
gammaloop-nextest-vakint> 3: integral_evaluation_analytic_tests::test_utils::compare_vakint_evaluation_vs_reference
32.21 s
gammaloop-nextest-vakint> 4: <integral_evaluation_analytic_tests::test_integrate_4l_clover_with_non_unit_scales::{closure#0} as core::ops::function::FnOnce<()>>::call_once
32.21 s
gammaloop-nextest-vakint> note: Some details are omitted, run with `RUST_BACKTRACE=full` for a verbose backtrace.
32.21 s
gammaloop-nextest-vakint>
32.21 s
gammaloop-nextest-vakint> 9. vakint::integral_evaluation_analytic_tests::test_integrate_4l_clover_with_numerator
32.21 s
gammaloop-nextest-vakint> failure: test failure with exit code 101
32.21 s
gammaloop-nextest-vakint> thread 'test_integrate_4l_clover_with_numerator' (434) panicked at crates/vakint/tests/test_utils.rs:554:30:
32.21 s
gammaloop-nextest-vakint> Failed to evaluate integral: the following integral could not be identified using any of the supported topologies: topo(I4L_FG_pinch_4_6_7_8(muvsq,2,1,1,0,1,0,0,0))
32.21 s
gammaloop-nextest-vakint> stack backtrace:
32.21 s
gammaloop-nextest-vakint> 0: __rustc::rust_begin_unwind
32.21 s
gammaloop-nextest-vakint> 1: core::panicking::panic_fmt
32.21 s
gammaloop-nextest-vakint> 2: integral_evaluation_analytic_tests::test_utils::compare_vakint_evaluation_vs_reference::{closure#0}
32.21 s
gammaloop-nextest-vakint> 3: integral_evaluation_analytic_tests::test_utils::compare_vakint_evaluation_vs_reference
32.21 s
gammaloop-nextest-vakint> 4: <integral_evaluation_analytic_tests::test_integrate_4l_clover_with_numerator::{closure#0} as core::ops::function::FnOnce<()>>::call_once
32.21 s
gammaloop-nextest-vakint> note: Some details are omitted, run with `RUST_BACKTRACE=full` for a verbose backtrace.
32.21 s
gammaloop-nextest-vakint> system-out
32.21 s
gammaloop-nextest-vakint> running 1 test
32.21 s
gammaloop-nextest-vakint> test test_integrate_4l_clover_with_numerator ... FAILED
32.21 s
gammaloop-nextest-vakint>
32.21 s
gammaloop-nextest-vakint> failures:
32.21 s
gammaloop-nextest-vakint>
32.21 s
gammaloop-nextest-vakint> failures:
32.21 s
gammaloop-nextest-vakint> test_integrate_4l_clover_with_numerator
32.21 s
gammaloop-nextest-vakint>
32.21 s
gammaloop-nextest-vakint> test result: FAILED. 0 passed; 1 failed; 0 ignored; 0 measured; 26 filtered out; finished in 0.18s
32.21 s
gammaloop-nextest-vakint> system-err
32.21 s
gammaloop-nextest-vakint> thread 'test_integrate_4l_clover_with_numerator' (434) panicked at crates/vakint/tests/test_utils.rs:554:30:
32.21 s
gammaloop-nextest-vakint> Failed to evaluate integral: the following integral could not be identified using any of the supported topologies: topo(I4L_FG_pinch_4_6_7_8(muvsq,2,1,1,0,1,0,0,0))
32.21 s
gammaloop-nextest-vakint> stack backtrace:
32.21 s
gammaloop-nextest-vakint> 0: __rustc::rust_begin_unwind
32.21 s
gammaloop-nextest-vakint> 1: core::panicking::panic_fmt
32.21 s
gammaloop-nextest-vakint> 2: integral_evaluation_analytic_tests::test_utils::compare_vakint_evaluation_vs_reference::{closure#0}
32.21 s
gammaloop-nextest-vakint> 3: integral_evaluation_analytic_tests::test_utils::compare_vakint_evaluation_vs_reference
32.21 s
gammaloop-nextest-vakint> 4: <integral_evaluation_analytic_tests::test_integrate_4l_clover_with_numerator::{closure#0} as core::ops::function::FnOnce<()>>::call_once
32.21 s
gammaloop-nextest-vakint> note: Some details are omitted, run with `RUST_BACKTRACE=full` for a verbose backtrace.
32.21 s
gammaloop-nextest-vakint>
32.21 s
gammaloop-nextest-vakint> 10. vakint::integral_evaluation_analytic_tests::test_integrate_4l_dotted_clover
32.21 s
gammaloop-nextest-vakint> failure: test failure with exit code 101
32.21 s
gammaloop-nextest-vakint> thread 'test_integrate_4l_dotted_clover' (439) panicked at crates/vakint/tests/test_utils.rs:554:30:
32.21 s
gammaloop-nextest-vakint> Failed to evaluate integral: the following integral could not be identified using any of the supported topologies: topo(I4L_FG_pinch_4_6_7_8(muvsq,2,1,1,0,1,0,0,0))
32.21 s
gammaloop-nextest-vakint> stack backtrace:
32.21 s
gammaloop-nextest-vakint> 0: __rustc::rust_begin_unwind
32.21 s
gammaloop-nextest-vakint> 1: core::panicking::panic_fmt
32.21 s
gammaloop-nextest-vakint> 2: integral_evaluation_analytic_tests::test_utils::compare_vakint_evaluation_vs_reference::{closure#0}
32.21 s
gammaloop-nextest-vakint> 3: integral_evaluation_analytic_tests::test_utils::compare_vakint_evaluation_vs_reference
32.21 s
gammaloop-nextest-vakint> 4: <integral_evaluation_analytic_tests::test_integrate_4l_dotted_clover::{closure#0} as core::ops::function::FnOnce<()>>::call_once
32.21 s
gammaloop-nextest-vakint> note: Some details are omitted, run with `RUST_BACKTRACE=full` for a verbose backtrace.
32.21 s
gammaloop-nextest-vakint> system-out
32.21 s
gammaloop-nextest-vakint> running 1 test
32.21 s
gammaloop-nextest-vakint> test test_integrate_4l_dotted_clover ... FAILED
32.21 s
gammaloop-nextest-vakint>
32.21 s
gammaloop-nextest-vakint> failures:
32.21 s
gammaloop-nextest-vakint>
32.21 s
gammaloop-nextest-vakint> failures:
32.21 s
gammaloop-nextest-vakint> test_integrate_4l_dotted_clover
32.21 s
gammaloop-nextest-vakint>
32.21 s
gammaloop-nextest-vakint> test result: FAILED. 0 passed; 1 failed; 0 ignored; 0 measured; 26 filtered out; finished in 0.19s
32.21 s
gammaloop-nextest-vakint> system-err
32.21 s
gammaloop-nextest-vakint> thread 'test_integrate_4l_dotted_clover' (439) panicked at crates/vakint/tests/test_utils.rs:554:30:
32.21 s
gammaloop-nextest-vakint> Failed to evaluate integral: the following integral could not be identified using any of the supported topologies: topo(I4L_FG_pinch_4_6_7_8(muvsq,2,1,1,0,1,0,0,0))
32.21 s
gammaloop-nextest-vakint> stack backtrace:
32.21 s
gammaloop-nextest-vakint> 0: __rustc::rust_begin_unwind
32.21 s
gammaloop-nextest-vakint> 1: core::panicking::panic_fmt
32.21 s
gammaloop-nextest-vakint> 2: integral_evaluation_analytic_tests::test_utils::compare_vakint_evaluation_vs_reference::{closure#0}
32.21 s
gammaloop-nextest-vakint> 3: integral_evaluation_analytic_tests::test_utils::compare_vakint_evaluation_vs_reference
32.21 s
gammaloop-nextest-vakint> 4: <integral_evaluation_analytic_tests::test_integrate_4l_dotted_clover::{closure#0} as core::ops::function::FnOnce<()>>::call_once
32.21 s
gammaloop-nextest-vakint> note: Some details are omitted, run with `RUST_BACKTRACE=full` for a verbose backtrace.
32.21 s
gammaloop-nextest-vakint>
32.21 s
gammaloop-nextest-vakint> 11. vakint::integral_evaluation_freeform_tests::test_integrate_1l_decorated_indices_alphaloop
32.21 s
gammaloop-nextest-vakint> failure: test failure with exit code 101
32.21 s
gammaloop-nextest-vakint> thread 'test_integrate_1l_decorated_indices_alphaloop' (468) panicked at crates/vakint/tests/test_utils.rs:563:6:
32.21 s
gammaloop-nextest-vakint> called `Result::unwrap()` on an `Err` value: EvaluationError("Is some tensor structure left? | Expression: '(1/4*user_space::{real}::DDMUVsq^2*vakint::{symmetric}::g(user_space::{}::mink4(4,11),user_space::{}::mink4(4,22))+user_space::{real}::DDMUVsq*user_space::{scalar}::DDsigma2(user_space::{}::some_args)*vakint::{symmetric,linear}::dot(vakint::{}::p(1),vakint::{}::p(2))*vakint::{}::vec1(vakint::{}::p(1),13370003)*vakint::{}::vec1(vakint::{}::p(2),13370003)+user_space::{real}::DDMUVsq*user_space::{symmetric,real}::DDsigma3(user_space::{}::some_args)*vakint::{symmetric,linear}::dot(vakint::{}::p(1),vakint::{}::p(2))*vakint::{}::vec1(vakint::{}::p(1),13370003)*vakint::{}::vec1(vakint::{}::p(2),13370003)+user_space::{real}::DDMUVsq*user_space::{}::DDsigma(user_space::{}::some_args)*vakint::{symmetric,linear}::dot(vakint::{}::p(1),vakint::{}::p(2))*vakint::{}::vec1(vakint::{}::p(1),13370003)*vakint::{}::vec1(vakint::{}::p(2),13370003))*1/16*vakint::{}::𝑖*𝜋^(-2)' | Error: 'function vec1(p(1),13370003) is not in a parameter map and does not have an evaluator'")
32.21 s
gammaloop-nextest-vakint> stack backtrace:
32.21 s
gammaloop-nextest-vakint> 0: __rustc::rust_begin_unwind
32.21 s
gammaloop-nextest-vakint> 1: core::panicking::panic_fmt
32.21 s
gammaloop-nextest-vakint> 2: core::result::unwrap_failed
32.21 s
gammaloop-nextest-vakint> 3: integral_evaluation_freeform_tests::test_utils::compare_vakint_evaluation_vs_reference
32.21 s
gammaloop-nextest-vakint> 4: <integral_evaluation_freeform_tests::test_integrate_1l_decorated_indices_alphaloop::{closure#0} as core::ops::function::FnOnce<()>>::call_once
32.21 s
gammaloop-nextest-vakint> note: Some details are omitted, run with `RUST_BACKTRACE=full` for a verbose backtrace.
32.21 s
gammaloop-nextest-vakint> system-out
32.21 s
gammaloop-nextest-vakint> running 1 test
32.21 s
gammaloop-nextest-vakint> test test_integrate_1l_decorated_indices_alphaloop ... FAILED
32.21 s
gammaloop-nextest-vakint>
32.21 s
gammaloop-nextest-vakint> failures:
32.21 s
gammaloop-nextest-vakint>
32.21 s
gammaloop-nextest-vakint> failures:
32.21 s
gammaloop-nextest-vakint> test_integrate_1l_decorated_indices_alphaloop
32.21 s
gammaloop-nextest-vakint>
32.21 s
gammaloop-nextest-vakint> test result: FAILED. 0 passed; 1 failed; 0 ignored; 0 measured; 3 filtered out; finished in 0.10s
32.21 s
gammaloop-nextest-vakint> system-err
32.21 s
gammaloop-nextest-vakint> thread 'test_integrate_1l_decorated_indices_alphaloop' (468) panicked at crates/vakint/tests/test_utils.rs:563:6:
32.21 s
gammaloop-nextest-vakint> called `Result::unwrap()` on an `Err` value: EvaluationError("Is some tensor structure left? | Expression: '(1/4*user_space::{real}::DDMUVsq^2*vakint::{symmetric}::g(user_space::{}::mink4(4,11),user_space::{}::mink4(4,22))+user_space::{real}::DDMUVsq*user_space::{scalar}::DDsigma2(user_space::{}::some_args)*vakint::{symmetric,linear}::dot(vakint::{}::p(1),vakint::{}::p(2))*vakint::{}::vec1(vakint::{}::p(1),13370003)*vakint::{}::vec1(vakint::{}::p(2),13370003)+user_space::{real}::DDMUVsq*user_space::{symmetric,real}::DDsigma3(user_space::{}::some_args)*vakint::{symmetric,linear}::dot(vakint::{}::p(1),vakint::{}::p(2))*vakint::{}::vec1(vakint::{}::p(1),13370003)*vakint::{}::vec1(vakint::{}::p(2),13370003)+user_space::{real}::DDMUVsq*user_space::{}::DDsigma(user_space::{}::some_args)*vakint::{symmetric,linear}::dot(vakint::{}::p(1),vakint::{}::p(2))*vakint::{}::vec1(vakint::{}::p(1),13370003)*vakint::{}::vec1(vakint::{}::p(2),13370003))*1/16*vakint::{}::𝑖*𝜋^(-2)' | Error: 'function vec1(p(1),13370003) is not in a parameter map and does not have an evaluator'")
32.21 s
gammaloop-nextest-vakint> stack backtrace:
32.21 s
gammaloop-nextest-vakint> 0: __rustc::rust_begin_unwind
32.21 s
gammaloop-nextest-vakint> 1: core::panicking::panic_fmt
32.21 s
gammaloop-nextest-vakint> 2: core::result::unwrap_failed
32.21 s
gammaloop-nextest-vakint> 3: integral_evaluation_freeform_tests::test_utils::compare_vakint_evaluation_vs_reference
32.21 s
gammaloop-nextest-vakint> 4: <integral_evaluation_freeform_tests::test_integrate_1l_decorated_indices_alphaloop::{closure#0} as core::ops::function::FnOnce<()>>::call_once
32.21 s
gammaloop-nextest-vakint> note: Some details are omitted, run with `RUST_BACKTRACE=full` for a verbose backtrace.
32.21 s
gammaloop-nextest-vakint>
32.21 s
gammaloop-nextest-vakint> 12. vakint::integral_evaluation_freeform_tests::test_integrate_1l_decorated_indices_fmft
32.21 s
gammaloop-nextest-vakint> failure: test failure with exit code 101
32.21 s
gammaloop-nextest-vakint> thread 'test_integrate_1l_decorated_indices_fmft' (474) panicked at crates/vakint/tests/test_utils.rs:554:30:
32.21 s
gammaloop-nextest-vakint> Failed to evaluate integral: the following integral could not be identified using any of the supported topologies: topo(I4L_FG_pinch_4_6_7_8(BBMUVsq,1,1,1,0,1,0,0,0))
32.21 s
gammaloop-nextest-vakint> stack backtrace:
32.21 s
gammaloop-nextest-vakint> 0: __rustc::rust_begin_unwind
32.21 s
gammaloop-nextest-vakint> 1: core::panicking::panic_fmt
32.21 s
gammaloop-nextest-vakint> 2: integral_evaluation_freeform_tests::test_utils::compare_vakint_evaluation_vs_reference::{closure#0}
32.21 s
gammaloop-nextest-vakint> 3: integral_evaluation_freeform_tests::test_utils::compare_vakint_evaluation_vs_reference
32.21 s
gammaloop-nextest-vakint> 4: <integral_evaluation_freeform_tests::test_integrate_1l_decorated_indices_fmft::{closure#0} as core::ops::function::FnOnce<()>>::call_once
32.21 s
gammaloop-nextest-vakint> note: Some details are omitted, run with `RUST_BACKTRACE=full` for a verbose backtrace.
32.21 s
gammaloop-nextest-vakint> system-out
32.21 s
gammaloop-nextest-vakint> running 1 test
32.21 s
gammaloop-nextest-vakint> test test_integrate_1l_decorated_indices_fmft ... FAILED
32.21 s
gammaloop-nextest-vakint>
32.21 s
gammaloop-nextest-vakint> failures:
32.21 s
gammaloop-nextest-vakint>
32.21 s
gammaloop-nextest-vakint> failures:
32.21 s
gammaloop-nextest-vakint> test_integrate_1l_decorated_indices_fmft
32.21 s
gammaloop-nextest-vakint>
32.21 s
gammaloop-nextest-vakint> test result: FAILED. 0 passed; 1 failed; 0 ignored; 0 measured; 3 filtered out; finished in 0.19s
32.21 s
gammaloop-nextest-vakint> system-err
32.21 s
gammaloop-nextest-vakint> thread 'test_integrate_1l_decorated_indices_fmft' (474) panicked at crates/vakint/tests/test_utils.rs:554:30:
32.21 s
gammaloop-nextest-vakint> Failed to evaluate integral: the following integral could not be identified using any of the supported topologies: topo(I4L_FG_pinch_4_6_7_8(BBMUVsq,1,1,1,0,1,0,0,0))
32.21 s
gammaloop-nextest-vakint> stack backtrace:
32.21 s
gammaloop-nextest-vakint> 0: __rustc::rust_begin_unwind
32.21 s
gammaloop-nextest-vakint> 1: core::panicking::panic_fmt
32.21 s
gammaloop-nextest-vakint> 2: integral_evaluation_freeform_tests::test_utils::compare_vakint_evaluation_vs_reference::{closure#0}
32.21 s
gammaloop-nextest-vakint> 3: integral_evaluation_freeform_tests::test_utils::compare_vakint_evaluation_vs_reference
32.21 s
gammaloop-nextest-vakint> 4: <integral_evaluation_freeform_tests::test_integrate_1l_decorated_indices_fmft::{closure#0} as core::ops::function::FnOnce<()>>::call_once
32.21 s
gammaloop-nextest-vakint> note: Some details are omitted, run with `RUST_BACKTRACE=full` for a verbose backtrace.
32.21 s
gammaloop-nextest-vakint>
32.21 s
gammaloop-nextest-vakint> 13. vakint::integral_evaluation_freeform_tests::test_integrate_1l_decorated_indices_matad
32.21 s
gammaloop-nextest-vakint> failure: test failure with exit code 101
32.21 s
gammaloop-nextest-vakint> thread 'test_integrate_1l_decorated_indices_matad' (479) panicked at crates/vakint/tests/test_utils.rs:554:30:
32.21 s
gammaloop-nextest-vakint> Failed to evaluate integral: FORM run crashed with the following error:
32.21 s
gammaloop-nextest-vakint> stderr:
32.21 s
gammaloop-nextest-vakint> stdout: FORM 5.0.0 (Jan 1 1980) Run: Sat Sep 12 20:40:56 2026
32.21 s
gammaloop-nextest-vakint> #-
32.21 s
gammaloop-nextest-vakint> run_matad.frm Line 11 --> Undeclared variable vec1
32.21 s
gammaloop-nextest-vakint> ~~~" "
32.21 s
gammaloop-nextest-vakint> ~~~" "
32.21 s
gammaloop-nextest-vakint> ~~~" _____ _____ _____ _____ ____ "
32.21 s
gammaloop-nextest-vakint> ~~~" | | _ |_ _| _ | \ ___ ___ ___ "
32.21 s
gammaloop-nextest-vakint> ~~~" | | | | | | | | | | |___| | . | "
32.21 s
gammaloop-nextest-vakint> ~~~" |_|_|_|__|__| |_| |__|__|____/ |_|_|_ | "
32.21 s
gammaloop-nextest-vakint> ~~~" |___| "
32.21 s
gammaloop-nextest-vakint> ~~~" "
32.21 s
gammaloop-nextest-vakint> ~~~" "
32.21 s
gammaloop-nextest-vakint> ~~~" Originally written by M.Steinhauser "
32.21 s
gammaloop-nextest-vakint> ~~~" About exact version contact to: "
32.21 s
gammaloop-nextest-vakint> ~~~" pikelner[at]theor.jinr.ru, Andrey Pikelner "
32.21 s
gammaloop-nextest-vakint> ~~~" "
32.21 s
gammaloop-nextest-vakint> ~~~MATAD called for 1-loop integral
32.21 s
gammaloop-nextest-vakint> Program terminating at -->
32.21 s
gammaloop-nextest-vakint> Terminate called from pre.c:1086 (PreProcessor)
32.21 s
gammaloop-nextest-vakint> 0.00 sec out of 0.00 sec
32.21 s
gammaloop-nextest-vakint>
32.21 s
gammaloop-nextest-vakint> You can rerun the script using:
32.21 s
gammaloop-nextest-vakint> cd "/build/vakint_temp_pid478_1789245656255368531_1" && "form" "run_matad.frm"
32.21 s
gammaloop-nextest-vakint> stack backtrace:
32.21 s
gammaloop-nextest-vakint> 0: __rustc::rust_begin_unwind
32.21 s
gammaloop-nextest-vakint> 1: core::panicking::panic_fmt
32.21 s
gammaloop-nextest-vakint> 2: integral_evaluation_freeform_tests::test_utils::compare_vakint_evaluation_vs_reference::{closure#0}
32.21 s
gammaloop-nextest-vakint> 3: integral_evaluation_freeform_tests::test_utils::compare_vakint_evaluation_vs_reference
32.21 s
gammaloop-nextest-vakint> 4: <integral_evaluation_freeform_tests::test_integrate_1l_decorated_indices_matad::{closure#0} as core::ops::function::FnOnce<()>>::call_once
32.21 s
gammaloop-nextest-vakint> note: Some details are omitted, run with `RUST_BACKTRACE=full` for a verbose backtrace.
32.21 s
gammaloop-nextest-vakint> system-out
32.21 s
gammaloop-nextest-vakint> running 1 test
32.21 s
gammaloop-nextest-vakint> test test_integrate_1l_decorated_indices_matad ... FAILED
32.21 s
gammaloop-nextest-vakint>
32.21 s
gammaloop-nextest-vakint> failures:
32.21 s
gammaloop-nextest-vakint>
32.21 s
gammaloop-nextest-vakint> failures:
32.21 s
gammaloop-nextest-vakint> test_integrate_1l_decorated_indices_matad
32.21 s
gammaloop-nextest-vakint>
32.21 s
gammaloop-nextest-vakint> test result: FAILED. 0 passed; 1 failed; 0 ignored; 0 measured; 3 filtered out; finished in 0.12s
32.21 s
gammaloop-nextest-vakint> system-err
32.21 s
gammaloop-nextest-vakint> thread 'test_integrate_1l_decorated_indices_matad' (479) panicked at crates/vakint/tests/test_utils.rs:554:30:
32.21 s
gammaloop-nextest-vakint> Failed to evaluate integral: FORM run crashed with the following error:
32.21 s
gammaloop-nextest-vakint> stderr:
32.21 s
gammaloop-nextest-vakint> stdout: FORM 5.0.0 (Jan 1 1980) Run: Sat Sep 12 20:40:56 2026
32.21 s
gammaloop-nextest-vakint> #-
32.21 s
gammaloop-nextest-vakint> run_matad.frm Line 11 --> Undeclared variable vec1
32.21 s
gammaloop-nextest-vakint> ~~~" "
32.21 s
gammaloop-nextest-vakint> ~~~" "
32.21 s
gammaloop-nextest-vakint> ~~~" _____ _____ _____ _____ ____ "
32.21 s
gammaloop-nextest-vakint> ~~~" | | _ |_ _| _ | \ ___ ___ ___ "
32.21 s
gammaloop-nextest-vakint> ~~~" | | | | | | | | | | |___| | . | "
32.21 s
gammaloop-nextest-vakint> ~~~" |_|_|_|__|__| |_| |__|__|____/ |_|_|_ | "
32.21 s
gammaloop-nextest-vakint> ~~~" |___| "
32.21 s
gammaloop-nextest-vakint> ~~~" "
32.21 s
gammaloop-nextest-vakint> ~~~" "
32.21 s
gammaloop-nextest-vakint> ~~~" Originally written by M.Steinhauser "
32.21 s
gammaloop-nextest-vakint> ~~~" About exact version contact to: "
32.21 s
gammaloop-nextest-vakint> ~~~" pikelner[at]theor.jinr.ru, Andrey Pikelner "
32.21 s
gammaloop-nextest-vakint> ~~~" "
32.21 s
gammaloop-nextest-vakint> ~~~MATAD called for 1-loop integral
32.21 s
gammaloop-nextest-vakint> Program terminating at -->
32.21 s
gammaloop-nextest-vakint> Terminate called from pre.c:1086 (PreProcessor)
32.21 s
gammaloop-nextest-vakint> 0.00 sec out of 0.00 sec
32.21 s
gammaloop-nextest-vakint>
32.21 s
gammaloop-nextest-vakint> You can rerun the script using:
32.21 s
gammaloop-nextest-vakint> cd "/build/vakint_temp_pid478_1789245656255368531_1" && "form" "run_matad.frm"
32.21 s
gammaloop-nextest-vakint> stack backtrace:
32.21 s
gammaloop-nextest-vakint> 0: __rustc::rust_begin_unwind
32.21 s
gammaloop-nextest-vakint> 1: core::panicking::panic_fmt
32.21 s
gammaloop-nextest-vakint> 2: integral_evaluation_freeform_tests::test_utils::compare_vakint_evaluation_vs_reference::{closure#0}
32.21 s
gammaloop-nextest-vakint> 3: integral_evaluation_freeform_tests::test_utils::compare_vakint_evaluation_vs_reference
32.21 s
gammaloop-nextest-vakint> 4: <integral_evaluation_freeform_tests::test_integrate_1l_decorated_indices_matad::{closure#0} as core::ops::function::FnOnce<()>>::call_once
32.21 s
gammaloop-nextest-vakint> note: Some details are omitted, run with `RUST_BACKTRACE=full` for a verbose backtrace.
32.21 s
gammaloop-nextest-vakint> =========================================
32.25 s
[0 built (1 failed ), 0.0 error: Cannot build '/nix/store/y7jldak46jgknws0nim0216sgb1hli86-gammaloop-nextest-vakint.drv '.
32.25 s
Reason: builder failed with exit code 100 .
32.25 s
Output paths:
32.25 s
/nix/store/b8y76r6sr4fjrz3agqhd4b30bmdn4yxa-gammaloop-nextest-vakint
32.25 s
Last 1223 log lines:
32.25 s
> Extracting 9 binaries, 1 build script output directory, and 1 linked path to /build/nextest-archive-TjsY9c
32.25 s
> Extracted 15 files to /build/nextest-archive-TjsY9c in 0.79s
32.25 s
> ------------
32.25 s
> Nextest run ID 5be7100e-f029-41e8-b21d-e799c17c5540 with nextest profile: ci_gammaloop
32.25 s
> Starting 74 tests across 9 binaries
32.25 s
> FAIL [ 0.044s] ( 5/74) vakint::input_matching_tests test_2l_matching_pinched
32.25 s
> stdout ---
32.25 s
>
32.25 s
> running 1 test
32.25 s
> test test_2l_matching_pinched ... FAILED
32.25 s
>
32.25 s
> failures:
32.25 s
>
32.25 s
> failures:
32.25 s
> test_2l_matching_pinched
32.25 s
>
32.25 s
> test result: FAILED. 0 passed; 1 failed; 0 ignored; 0 measured; 5 filtered out; finished in 0.04s
32.25 s
>
32.25 s
> stderr ---
32.25 s
>
32.25 s
> thread 'test_2l_matching_pinched' (170) panicked at crates/vakint/tests/test_utils.rs:202:21:
32.25 s
> Error: the following integral could not be identified using any of the supported topologies: topo(I2L_pinch_3(mUVsq,2,1,0))
32.25 s
> stack backtrace:
32.25 s
> 0: __rustc::rust_begin_unwind
32.25 s
> 1: core::panicking::panic_fmt
32.25 s
> 2: input_matching_tests::test_utils::compare_output
32.25 s
> 3: <input_matching_tests::test_2l_matching_pinched::{closure#0} as core::ops::function::FnOnce<()>>::call_once
32.25 s
> note: Some details are omitted, run with `RUST_BACKTRACE=full` for a verbose backtrace.
32.25 s
>
32.25 s
> FAIL [ 0.288s] (12/74) vakint::integral_alphaloop_vs_matad_tests test_integrate_1l_no_numerator_squared_mass
32.25 s
> stdout ---
32.25 s
>
32.25 s
> running 1 test
32.25 s
>
32.25 s
> <><><><><>
32.25 s
>
32.25 s
>
32.25 s
> <><><><><>
32.25 s
>
32.25 s
> test test_integrate_1l_no_numerator_squared_mass ... FAILED
32.25 s
>
32.25 s
> failures:
32.25 s
>
32.25 s
> failures:
32.25 s
> test_integrate_1l_no_numerator_squared_mass
32.25 s
>
32.25 s
> test result: FAILED. 0 passed; 1 failed; 0 ignored; 0 measured; 9 filtered out; finished in 0.28s
32.25 s
>
32.25 s
> stderr ---
32.25 s
> [INFO integral_alphaloop_vs_matad_tests::test_utils] Benchmark [AlphaLoop (susbstitute_masters=true)] :: central :
32.25 s
> ε^-1 : (1.000000000000000000000000000000+0i)
32.25 s
> ε^ 0 : (4.227843350984671393934879099176e-1+0i)
32.25 s
> ε^+1 : (1.411840330426439694788883561418+0i)
32.25 s
> ε^+2 : (5.043612543455534057723233940620e-1+0i)
32.25 s
> [INFO integral_alphaloop_vs_matad_tests::test_utils] Tested [MATAD (expand_masters=true, susbstitute_masters=true, substitute_hpls=true, direct_numerical_substition=true)] :: central :
32.25 s
> ε^-1 : (1.000000000000000000000000000000+0i)
32.25 s
> ε^ 0 : (4.227843350984671393934879099176e-1+0i)
32.25 s
> ε^+1 : (1.411840330426439694788883561418+0i)
32.25 s
> ε^+2 : (5.043612543455534057723233940620e-1+0i)
32.25 s
> [INFO integral_alphaloop_vs_matad_tests::test_utils] matches!
32.25 s
>
32.25 s
> thread 'test_integrate_1l_no_numerator_squared_mass' (231) panicked at crates/vakint/tests/test_utils.rs:416:13:
32.25 s
> Error during numerical evaluation of benchmark result with [MATAD (expand_masters=true, susbstitute_masters=true, substitute_hpls=true, direct_numerical_substition=true)] :: error:
32.25 s
> Numerical evaluation error: Is some tensor structure left? | Expression: '-1*user_space::{}::muv^2+2*vakint::{}::M' | Error: 'variable M is not in a parameter map and does not have an evaluator'
32.25 s
> stack backtrace:
32.25 s
> 0: __rustc::rust_begin_unwind
32.25 s
> 1: core::panicking::panic_fmt
32.25 s
> 2: integral_alphaloop_vs_matad_tests::test_utils::compare_two_evaluations
32.25 s
> 3: <integral_alphaloop_vs_matad_tests::test_integrate_1l_no_numerator_squared_mass::{closure#0} as core::ops::function::FnOnce<()>>::call_once
32.25 s
> note: Some details are omitted, run with `RUST_BACKTRACE=full` for a verbose backtrace.
32.25 s
>
32.25 s
> FAIL [ 0.072s] (14/74) vakint::integral_alphaloop_vs_matad_tests test_integrate_3l_basketball_a
32.25 s
> stdout ---
32.25 s
>
32.25 s
> running 1 test
32.25 s
> test test_integrate_3l_basketball_a ... FAILED
32.25 s
>
32.25 s
> failures:
32.25 s
>
32.25 s
> failures:
32.25 s
> test_integrate_3l_basketball_a
32.25 s
>
32.25 s
> test result: FAILED. 0 passed; 1 failed; 0 ignored; 0 measured; 9 filtered out; finished in 0.07s
32.25 s
>
32.25 s
> stderr ---
32.25 s
>
32.25 s
> thread 'test_integrate_3l_basketball_a' (252) panicked at crates/vakint/tests/test_utils.rs:350:13:
32.25 s
> Error during benchmark integral evaluation with [AlphaLoop (susbstitute_masters=true)] :: error :
32.25 s
> the following integral could not be identified using any of the supported topologies: topo(I3L_pinch_1_6(muvsq,0,1,1,1,1,0))
32.25 s
> stack backtrace:
32.25 s
> 0: __rustc::rust_begin_unwind
32.25 s
> 1: core::panicking::panic_fmt
32.25 s
> 2: integral_alphaloop_vs_matad_tests::test_utils::compare_two_evaluations
32.25 s
> 3: <integral_alphaloop_vs_matad_tests::test_integrate_3l_basketball_a::{closure#0} as core::ops::function::FnOnce<()>>::call_once
32.25 s
> note: Some details are omitted, run with `RUST_BACKTRACE=full` for a verbose backtrace.
32.25 s
>
32.25 s
> FAIL [ 0.071s] (15/74) vakint::integral_alphaloop_vs_matad_tests test_integrate_3l_basketball_b
32.25 s
> stdout ---
32.25 s
>
32.25 s
> running 1 test
32.25 s
> test test_integrate_3l_basketball_b ... FAILED
32.25 s
>
32.25 s
> failures:
32.25 s
>
32.25 s
> failures:
32.25 s
> test_integrate_3l_basketball_b
32.25 s
>
32.25 s
> test result: FAILED. 0 passed; 1 failed; 0 ignored; 0 measured; 9 filtered out; finished in 0.06s
32.25 s
>
32.25 s
> stderr ---
32.25 s
>
32.25 s
> thread 'test_integrate_3l_basketball_b' (257) panicked at crates/vakint/tests/test_utils.rs:350:13:
32.25 s
> Error during benchmark integral evaluation with [AlphaLoop (susbstitute_masters=true)] :: error :
32.25 s
> the following integral could not be identified using any of the supported topologies: topo(I3L_pinch_1_6(muvsq,0,1,1,1,1,0))
32.25 s
> stack backtrace:
32.25 s
> 0: __rustc::rust_begin_unwind
32.25 s
> 1: core::panicking::panic_fmt
32.25 s
> 2: integral_alphaloop_vs_matad_tests::test_utils::compare_two_evaluations
32.25 s
> 3: <integral_alphaloop_vs_matad_tests::test_integrate_3l_basketball_b::{closure#0} as core::ops::function::FnOnce<()>>::call_once
32.25 s
> note: Some details are omitted, run with `RUST_BACKTRACE=full` for a verbose backtrace.
32.25 s
>
32.25 s
> FAIL [ 0.127s] (46/74) vakint::integral_evaluation_analytic_tests test_integrate_4l_PR9d_from_FG_pinch
32.25 s
> stdout ---
32.25 s
>
32.25 s
> running 1 test
32.25 s
> test test_integrate_4l_PR9d_from_FG_pinch ... FAILED
32.25 s
>
32.25 s
> failures:
32.25 s
>
32.25 s
> failures:
32.25 s
> test_integrate_4l_PR9d_from_FG_pinch
32.25 s
>
32.25 s
> test result: FAILED. 0 passed; 1 failed; 0 ignored; 0 measured; 26 filtered out; finished in 0.12s
32.25 s
>
32.25 s
> stderr ---
32.25 s
>
32.25 s
> thread 'test_integrate_4l_PR9d_from_FG_pinch' (402) panicked at crates/vakint/tests/test_utils.rs:554:30:
32.25 s
> Failed to evaluate integral: the following integral could not be identified using any of the supported topologies: topo(I4L_FG_pinch_4(muvsq,1,2,1,0,1,1,1,1))
32.25 s
> stack backtrace:
32.25 s
> 0: __rustc::rust_begin_unwind
32.25 s
> 1: core::panicking::panic_fmt
32.25 s
> 2: integral_evaluation_analytic_tests::test_utils::compare_vakint_evaluation_vs_reference::{closure#0}
32.25 s
> 3: integral_evaluation_analytic_tests::test_utils::compare_vakint_evaluation_vs_reference
32.25 s
> 4: <integral_evaluation_analytic_tests::test_integrate_4l_PR9d_from_FG_pinch::{closure#0} as core::ops::function::FnOnce<()>>::call_once
32.25 s
> note: Some details are omitted, run with `RUST_BACKTRACE=full` for a verbose backtrace.
32.25 s
>
32.25 s
> FAIL [ 0.194s] (48/74) vakint::integral_evaluation_analytic_tests test_integrate_4l_PR9d_from_H_pinch
32.25 s
> stdout ---
32.25 s
>
32.25 s
> running 1 test
32.25 s
> test test_integrate_4l_PR9d_from_H_pinch ... FAILED
32.25 s
>
32.25 s
> failures:
32.25 s
>
32.25 s
> failures:
32.25 s
> test_integrate_4l_PR9d_from_H_pinch
32.25 s
>
32.25 s
> test result: FAILED. 0 passed; 1 failed; 0 ignored; 0 measured; 26 filtered out; finished in 0.19s
32.25 s
>
32.25 s
> stderr ---
32.25 s
>
32.25 s
> thread 'test_integrate_4l_PR9d_from_H_pinch' (413) panicked at crates/vakint/tests/test_utils.rs:554:30:
32.25 s
> Failed to evaluate integral: the following integral could not be identified using any of the supported topologies: topo(I4L_FG_pinch_4(muvsq,1,2,1,0,1,1,1,1))
32.25 s
> stack backtrace:
32.25 s
> 0: __rustc::rust_begin_unwind
32.25 s
> 1: core::panicking::panic_fmt
32.25 s
> 2: integral_evaluation_analytic_tests::test_utils::compare_vakint_evaluation_vs_reference::{closure#0}
32.25 s
> 3: integral_evaluation_analytic_tests::test_utils::compare_vakint_evaluation_vs_reference
32.25 s
> 4: <integral_evaluation_analytic_tests::test_integrate_4l_PR9d_from_H_pinch::{closure#0} as core::ops::function::FnOnce<()>>::call_once
32.25 s
> note: Some details are omitted, run with `RUST_BACKTRACE=full` for a verbose backtrace.
32.25 s
>
32.25 s
> FAIL [ 0.187s] (50/74) vakint::integral_evaluation_analytic_tests test_integrate_4l_clover
32.25 s
> stdout ---
32.25 s
>
32.25 s
> running 1 test
32.25 s
> test test_integrate_4l_clover ... FAILED
32.25 s
>
32.25 s
> failures:
32.25 s
>
32.25 s
> failures:
32.25 s
> test_integrate_4l_clover
32.25 s
>
32.25 s
> test result: FAILED. 0 passed; 1 failed; 0 ignored; 0 measured; 26 filtered out; finished in 0.18s
32.25 s
>
32.25 s
> stderr ---
32.25 s
>
32.25 s
> thread 'test_integrate_4l_clover' (424) panicked at crates/vakint/tests/test_utils.rs:554:30:
32.25 s
> Failed to evaluate integral: the following integral could not be identified using any of the supported topologies: topo(I4L_FG_pinch_4_6_7_8(muvsq,1,1,1,0,1,0,0,0))
32.25 s
> stack backtrace:
32.25 s
> 0: __rustc::rust_begin_unwind
32.25 s
> 1: core::panicking::panic_fmt
32.25 s
> 2: integral_evaluation_analytic_tests::test_utils::compare_vakint_evaluation_vs_reference::{closure#0}
32.25 s
> 3: integral_evaluation_analytic_tests::test_utils::compare_vakint_evaluation_vs_reference
32.25 s
> 4: <integral_evaluation_analytic_tests::test_integrate_4l_clover::{closure#0} as core::ops::function::FnOnce<()>>::call_once
32.25 s
> note: Some details are omitted, run with `RUST_BACKTRACE=full` for a verbose backtrace.
32.25 s
>
32.25 s
> FAIL [ 0.195s] (51/74) vakint::integral_evaluation_analytic_tests test_integrate_4l_clover_with_non_unit_scales
32.25 s
> stdout ---
32.25 s
>
32.25 s
> running 1 test
32.25 s
> test test_integrate_4l_clover_with_non_unit_scales ... FAILED
32.25 s
>
32.25 s
> failures:
32.25 s
>
32.25 s
> failures:
32.25 s
> test_integrate_4l_clover_with_non_unit_scales
32.25 s
>
32.25 s
> test result: FAILED. 0 passed; 1 failed; 0 ignored; 0 measured; 26 filtered out; finished in 0.19s
32.25 s
>
32.25 s
> stderr ---
32.25 s
>
32.25 s
> thread 'test_integrate_4l_clover_with_non_unit_scales' (429) panicked at crates/vakint/tests/test_utils.rs:554:30:
32.25 s
> Failed to evaluate integral: the following integral could not be identified using any of the supported topologies: topo(I4L_FG_pinch_4_6_7_8(muvsq,1,1,1,0,1,0,0,0))
32.25 s
> stack backtrace:
32.25 s
> 0: __rustc::rust_begin_unwind
32.25 s
> 1: core::panicking::panic_fmt
32.25 s
> 2: integral_evaluation_analytic_tests::test_utils::compare_vakint_evaluation_vs_reference::{closure#0}
32.25 s
> 3: integral_evaluation_analytic_tests::test_utils::compare_vakint_evaluation_vs_reference
32.25 s
> 4: <integral_evaluation_analytic_tests::test_integrate_4l_clover_with_non_unit_scales::{closure#0} as core::ops::function::FnOnce<()>>::call_once
32.25 s
> note: Some details are omitted, run with `RUST_BACKTRACE=full` for a verbose backtrace.
32.25 s
>
32.25 s
> FAIL [ 0.186s] (52/74) vakint::integral_evaluation_analytic_tests test_integrate_4l_clover_with_numerator
32.25 s
> stdout ---
32.25 s
>
32.25 s
> running 1 test
32.25 s
> test test_integrate_4l_clover_with_numerator ... FAILED
32.25 s
>
32.25 s
> failures:
32.25 s
>
32.25 s
> failures:
32.25 s
> test_integrate_4l_clover_with_numerator
32.25 s
>
32.25 s
> test result: FAILED. 0 passed; 1 failed; 0 ignored; 0 measured; 26 filtered out; finished in 0.18s
32.25 s
>
32.25 s
> stderr ---
32.25 s
>
32.25 s
> thread 'test_integrate_4l_clover_with_numerator' (434) panicked at crates/vakint/tests/test_utils.rs:554:30:
32.25 s
> Failed to evaluate integral: the following integral could not be identified using any of the supported topologies: topo(I4L_FG_pinch_4_6_7_8(muvsq,2,1,1,0,1,0,0,0))
32.25 s
> stack backtrace:
32.25 s
> 0: __rustc::rust_begin_unwind
32.25 s
> 1: core::panicking::panic_fmt
32.25 s
> 2: integral_evaluation_analytic_tests::test_utils::compare_vakint_evaluation_vs_reference::{closure#0}
32.25 s
> 3: integral_evaluation_analytic_tests::test_utils::compare_vakint_evaluation_vs_reference
32.25 s
> 4: <integral_evaluation_analytic_tests::test_integrate_4l_clover_with_numerator::{closure#0} as core::ops::function::FnOnce<()>>::call_once
32.25 s
> note: Some details are omitted, run with `RUST_BACKTRACE=full` for a verbose backtrace.
32.25 s
>
32.25 s
> FAIL [ 0.197s] (53/74) vakint::integral_evaluation_analytic_tests test_integrate_4l_dotted_clover
32.25 s
> stdout ---
32.25 s
>
32.25 s
> running 1 test
32.25 s
> test test_integrate_4l_dotted_clover ... FAILED
32.25 s
>
32.25 s
> failures:
32.25 s
>
32.25 s
> failures:
32.25 s
> test_integrate_4l_dotted_clover
32.25 s
>
32.25 s
> test result: FAILED. 0 passed; 1 failed; 0 ignored; 0 measured; 26 filtered out; finished in 0.19s
32.25 s
>
32.25 s
> stderr ---
32.25 s
>
32.25 s
> thread 'test_integrate_4l_dotted_clover' (439) panicked at crates/vakint/tests/test_utils.rs:554:30:
32.25 s
> Failed to evaluate integral: the following integral could not be identified using any of the supported topologies: topo(I4L_FG_pinch_4_6_7_8(muvsq,2,1,1,0,1,0,0,0))
32.25 s
> stack backtrace:
32.25 s
> 0: __rustc::rust_begin_unwind
32.25 s
> 1: core::panicking::panic_fmt
32.25 s
> 2: integral_evaluation_analytic_tests::test_utils::compare_vakint_evaluation_vs_reference::{closure#0}
32.25 s
> 3: integral_evaluation_analytic_tests::test_utils::compare_vakint_evaluation_vs_reference
32.25 s
> 4: <integral_evaluation_analytic_tests::test_integrate_4l_dotted_clover::{closure#0} as core::ops::function::FnOnce<()>>::call_once
32.25 s
> note: Some details are omitted, run with `RUST_BACKTRACE=full` for a verbose backtrace.
32.25 s
>
32.25 s
> FAIL [ 0.111s] (58/74) vakint::integral_evaluation_freeform_tests test_integrate_1l_decorated_indices_alphaloop
32.25 s
> stdout ---
32.25 s
>
32.25 s
> running 1 test
32.25 s
> test test_integrate_1l_decorated_indices_alphaloop ... FAILED
32.25 s
>
32.25 s
> failures:
32.25 s
>
32.25 s
> failures:
32.25 s
> test_integrate_1l_decorated_indices_alphaloop
32.25 s
>
32.25 s
> test result: FAILED. 0 passed; 1 failed; 0 ignored; 0 measured; 3 filtered out; finished in 0.10s
32.25 s
>
32.25 s
> stderr ---
32.25 s
>
32.25 s
> thread 'test_integrate_1l_decorated_indices_alphaloop' (468) panicked at crates/vakint/tests/test_utils.rs:563:6:
32.25 s
> called `Result::unwrap()` on an `Err` value: EvaluationError("Is some tensor structure left? | Expression: '(1/4*user_space::{real}::DDMUVsq^2*vakint::{symmetric}::g(user_space::{}::mink4(4,11),user_space::{}::mink4(4,22))+user_space::{real}::DDMUVsq*user_space::{scalar}::DDsigma2(user_space::{}::some_args)*vakint::{symmetric,linear}::dot(vakint::{}::p(1),vakint::{}::p(2))*vakint::{}::vec1(vakint::{}::p(1),13370003)*vakint::{}::vec1(vakint::{}::p(2),13370003)+user_space::{real}::DDMUVsq*user_space::{symmetric,real}::DDsigma3(user_space::{}::some_args)*vakint::{symmetric,linear}::dot(vakint::{}::p(1),vakint::{}::p(2))*vakint::{}::vec1(vakint::{}::p(1),13370003)*vakint::{}::vec1(vakint::{}::p(2),13370003)+user_space::{real}::DDMUVsq*user_space::{}::DDsigma(user_space::{}::some_args)*vakint::{symmetric,linear}::dot(vakint::{}::p(1),vakint::{}::p(2))*vakint::{}::vec1(vakint::{}::p(1),13370003)*vakint::{}::vec1(vakint::{}::p(2),13370003))*1/16*vakint::{}::𝑖*𝜋^(-2)' | Error: 'function vec1(p(1),13370003) is not in a parameter map and does not have an evaluator'")
32.25 s
> stack backtrace:
32.25 s
> 0: __rustc::rust_begin_unwind
32.25 s
> 1: core::panicking::panic_fmt
32.25 s
> 2: core::result::unwrap_failed
32.25 s
> 3: integral_evaluation_freeform_tests::test_utils::compare_vakint_evaluation_vs_reference
32.25 s
> 4: <integral_evaluation_freeform_tests::test_integrate_1l_decorated_indices_alphaloop::{closure#0} as core::ops::function::FnOnce<()>>::call_once
32.25 s
> note: Some details are omitted, run with `RUST_BACKTRACE=full` for a verbose backtrace.
32.25 s
>
32.25 s
> FAIL [ 0.192s] (59/74) vakint::integral_evaluation_freeform_tests test_integrate_1l_decorated_indices_fmft
32.25 s
> stdout ---
32.25 s
>
32.25 s
> running 1 test
32.25 s
> test test_integrate_1l_decorated_indices_fmft ... FAILED
32.25 s
>
32.25 s
> failures:
32.25 s
>
32.25 s
> failures:
32.25 s
> test_integrate_1l_decorated_indices_fmft
32.25 s
>
32.25 s
> test result: FAILED. 0 passed; 1 failed; 0 ignored; 0 measured; 3 filtered out; finished in 0.19s
32.25 s
>
32.25 s
> stderr ---
32.25 s
>
32.25 s
> thread 'test_integrate_1l_decorated_indices_fmft' (474) panicked at crates/vakint/tests/test_utils.rs:554:30:
32.25 s
> Failed to evaluate integral: the following integral could not be identified using any of the supported topologies: topo(I4L_FG_pinch_4_6_7_8(BBMUVsq,1,1,1,0,1,0,0,0))
32.25 s
> stack backtrace:
32.25 s
> 0: __rustc::rust_begin_unwind
32.25 s
> 1: core::panicking::panic_fmt
32.25 s
> 2: integral_evaluation_freeform_tests::test_utils::compare_vakint_evaluation_vs_reference::{closure#0}
32.25 s
> 3: integral_evaluation_freeform_tests::test_utils::compare_vakint_evaluation_vs_reference
32.25 s
> 4: <integral_evaluation_freeform_tests::test_integrate_1l_decorated_indices_fmft::{closure#0} as core::ops::function::FnOnce<()>>::call_once
32.25 s
> note: Some details are omitted, run with `RUST_BACKTRACE=full` for a verbose backtrace.
32.25 s
>
32.25 s
> FAIL [ 0.131s] (60/74) vakint::integral_evaluation_freeform_tests test_integrate_1l_decorated_indices_matad
32.25 s
> stdout ---
32.25 s
>
32.25 s
> running 1 test
32.25 s
> test test_integrate_1l_decorated_indices_matad ... FAILED
32.25 s
>
32.25 s
> failures:
32.25 s
>
32.25 s
> failures:
32.25 s
> test_integrate_1l_decorated_indices_matad
32.25 s
>
32.25 s
> test result: FAILED. 0 passed; 1 failed; 0 ignored; 0 measured; 3 filtered out; finished in 0.12s
32.25 s
>
32.25 s
> stderr ---
32.25 s
>
32.25 s
> thread 'test_integrate_1l_decorated_indices_matad' (479) panicked at crates/vakint/tests/test_utils.rs:554:30:
32.25 s
> Failed to evaluate integral: FORM run crashed with the following error:
32.25 s
> stderr:
32.25 s
> stdout: FORM 5.0.0 (Jan 1 1980) Run: Sat Sep 12 20:40:56 2026
32.25 s
> #-
32.25 s
> run_matad.frm Line 11 --> Undeclared variable vec1
32.25 s
> ~~~" "
32.25 s
> ~~~" "
32.25 s
> ~~~" _____ _____ _____ _____ ____ "
32.25 s
> ~~~" | | _ |_ _| _ | \ ___ ___ ___ "
32.25 s
> ~~~" | | | | | | | | | | |___| | . | "
32.25 s
> ~~~" |_|_|_|__|__| |_| |__|__|____/ |_|_|_ | "
32.25 s
> ~~~" |___| "
32.25 s
> ~~~" "
32.25 s
> ~~~" "
32.25 s
> ~~~" Originally written by M.Steinhauser "
32.25 s
> ~~~" About exact version contact to: "
32.25 s
> ~~~" pikelner[at]theor.jinr.ru, Andrey Pikelner "
32.25 s
> ~~~" "
32.25 s
> ~~~MATAD called for 1-loop integral
32.25 s
> Program terminating at -->
32.25 s
> Terminate called from pre.c:1086 (PreProcessor)
32.25 s
> 0.00 sec out of 0.00 sec
32.25 s
>
32.25 s
> You can rerun the script using:
32.25 s
> cd "/build/vakint_temp_pid478_1789245656255368531_1" && "form" "run_matad.frm"
32.25 s
> stack backtrace:
32.25 s
> 0: __rustc::rust_begin_unwind
32.25 s
> 1: core::panicking::panic_fmt
32.25 s
> 2: integral_evaluation_freeform_tests::test_utils::compare_vakint_evaluation_vs_reference::{closure#0}
32.25 s
> 3: integral_evaluation_freeform_tests::test_utils::compare_vakint_evaluation_vs_reference
32.25 s
> 4: <integral_evaluation_freeform_tests::test_integrate_1l_decorated_indices_matad::{closure#0} as core::ops::function::FnOnce<()>>::call_once
32.25 s
> note: Some details are omitted, run with `RUST_BACKTRACE=full` for a verbose backtrace.
32.25 s
>
32.25 s
> ------------
32.25 s
> Summary [ 12.089s] 74 tests run: 61 passed , 13 failed , 0 skipped
32.25 s
> FAIL [ 0.044s] ( 5/74) vakint::input_matching_tests test_2l_matching_pinched
32.25 s
> stdout ---
32.25 s
>
32.25 s
> running 1 test
32.25 s
> test test_2l_matching_pinched ... FAILED
32.25 s
>
32.25 s
> failures:
32.25 s
>
32.25 s
> failures:
32.25 s
> test_2l_matching_pinched
32.25 s
>
32.25 s
> test result: FAILED. 0 passed; 1 failed; 0 ignored; 0 measured; 5 filtered out; finished in 0.04s
32.25 s
>
32.25 s
> stderr ---
32.25 s
>
32.25 s
> thread 'test_2l_matching_pinched' (170) panicked at crates/vakint/tests/test_utils.rs:202:21:
32.25 s
> Error: the following integral could not be identified using any of the supported topologies: topo(I2L_pinch_3(mUVsq,2,1,0))
32.25 s
> stack backtrace:
32.25 s
> 0: __rustc::rust_begin_unwind
32.25 s
> 1: core::panicking::panic_fmt
32.25 s
> 2: input_matching_tests::test_utils::compare_output
32.25 s
> 3: <input_matching_tests::test_2l_matching_pinched::{closure#0} as core::ops::function::FnOnce<()>>::call_once
32.25 s
> note: Some details are omitted, run with `RUST_BACKTRACE=full` for a verbose backtrace.
32.25 s
>
32.25 s
> FAIL [ 0.288s] (12/74) vakint::integral_alphaloop_vs_matad_tests test_integrate_1l_no_numerator_squared_mass
32.25 s
> stdout ---
32.25 s
>
32.25 s
> running 1 test
32.25 s
>
32.25 s
> <><><><><>
32.25 s
>
32.25 s
>
32.25 s
> <><><><><>
32.25 s
>
32.25 s
> test test_integrate_1l_no_numerator_squared_mass ... FAILED
32.25 s
>
32.25 s
> failures:
32.25 s
>
32.25 s
> failures:
32.25 s
> test_integrate_1l_no_numerator_squared_mass
32.25 s
>
32.25 s
> test result: FAILED. 0 passed; 1 failed; 0 ignored; 0 measured; 9 filtered out; finished in 0.28s
32.25 s
>
32.25 s
> stderr ---
32.25 s
> [INFO integral_alphaloop_vs_matad_tests::test_utils] Benchmark [AlphaLoop (susbstitute_masters=true)] :: central :
32.25 s
> ε^-1 : (1.000000000000000000000000000000+0i)
32.25 s
> ε^ 0 : (4.227843350984671393934879099176e-1+0i)
32.25 s
> ε^+1 : (1.411840330426439694788883561418+0i)
32.25 s
> ε^+2 : (5.043612543455534057723233940620e-1+0i)
32.25 s
> [INFO integral_alphaloop_vs_matad_tests::test_utils] Tested [MATAD (expand_masters=true, susbstitute_masters=true, substitute_hpls=true, direct_numerical_substition=true)] :: central :
32.25 s
> ε^-1 : (1.000000000000000000000000000000+0i)
32.25 s
> ε^ 0 : (4.227843350984671393934879099176e-1+0i)
32.25 s
> ε^+1 : (1.411840330426439694788883561418+0i)
32.25 s
> ε^+2 : (5.043612543455534057723233940620e-1+0i)
32.25 s
> [INFO integral_alphaloop_vs_matad_tests::test_utils] matches!
32.25 s
>
32.25 s
> thread 'test_integrate_1l_no_numerator_squared_mass' (231) panicked at crates/vakint/tests/test_utils.rs:416:13:
32.25 s
> Error during numerical evaluation of benchmark result with [MATAD (expand_masters=true, susbstitute_masters=true, substitute_hpls=true, direct_numerical_substition=true)] :: error:
32.25 s
> Numerical evaluation error: Is some tensor structure left? | Expression: '-1*user_space::{}::muv^2+2*vakint::{}::M' | Error: 'variable M is not in a parameter map and does not have an evaluator'
32.25 s
> stack backtrace:
32.25 s
> 0: __rustc::rust_begin_unwind
32.25 s
> 1: core::panicking::panic_fmt
32.25 s
> 2: integral_alphaloop_vs_matad_tests::test_utils::compare_two_evaluations
32.25 s
> 3: <integral_alphaloop_vs_matad_tests::test_integrate_1l_no_numerator_squared_mass::{closure#0} as core::ops::function::FnOnce<()>>::call_once
32.25 s
> note: Some details are omitted, run with `RUST_BACKTRACE=full` for a verbose backtrace.
32.25 s
>
32.25 s
> FAIL [ 0.072s] (14/74) vakint::integral_alphaloop_vs_matad_tests test_integrate_3l_basketball_a
32.25 s
> stdout ---
32.25 s
>
32.25 s
> running 1 test
32.25 s
> test test_integrate_3l_basketball_a ... FAILED
32.25 s
>
32.25 s
> failures:
32.25 s
>
32.25 s
> failures:
32.25 s
> test_integrate_3l_basketball_a
32.25 s
>
32.25 s
> test result: FAILED. 0 passed; 1 failed; 0 ignored; 0 measured; 9 filtered out; finished in 0.07s
32.25 s
>
32.25 s
> stderr ---
32.25 s
>
32.25 s
> thread 'test_integrate_3l_basketball_a' (252) panicked at crates/vakint/tests/test_utils.rs:350:13:
32.25 s
> Error during benchmark integral evaluation with [AlphaLoop (susbstitute_masters=true)] :: error :
32.25 s
> the following integral could not be identified using any of the supported topologies: topo(I3L_pinch_1_6(muvsq,0,1,1,1,1,0))
32.25 s
> stack backtrace:
32.25 s
> 0: __rustc::rust_begin_unwind
32.25 s
> 1: core::panicking::panic_fmt
32.25 s
> 2: integral_alphaloop_vs_matad_tests::test_utils::compare_two_evaluations
32.25 s
> 3: <integral_alphaloop_vs_matad_tests::test_integrate_3l_basketball_a::{closure#0} as core::ops::function::FnOnce<()>>::call_once
32.25 s
> note: Some details are omitted, run with `RUST_BACKTRACE=full` for a verbose backtrace.
32.25 s
>
32.25 s
> FAIL [ 0.071s] (15/74) vakint::integral_alphaloop_vs_matad_tests test_integrate_3l_basketball_b
32.25 s
> stdout ---
32.25 s
>
32.25 s
> running 1 test
32.25 s
> test test_integrate_3l_basketball_b ... FAILED
32.25 s
>
32.25 s
> failures:
32.25 s
>
32.25 s
> failures:
32.25 s
> test_integrate_3l_basketball_b
32.25 s
>
32.25 s
> test result: FAILED. 0 passed; 1 failed; 0 ignored; 0 measured; 9 filtered out; finished in 0.06s
32.25 s
>
32.25 s
> stderr ---
32.25 s
>
32.25 s
> thread 'test_integrate_3l_basketball_b' (257) panicked at crates/vakint/tests/test_utils.rs:350:13:
32.25 s
> Error during benchmark integral evaluation with [AlphaLoop (susbstitute_masters=true)] :: error :
32.25 s
> the following integral could not be identified using any of the supported topologies: topo(I3L_pinch_1_6(muvsq,0,1,1,1,1,0))
32.25 s
> stack backtrace:
32.25 s
> 0: __rustc::rust_begin_unwind
32.25 s
> 1: core::panicking::panic_fmt
32.25 s
> 2: integral_alphaloop_vs_matad_tests::test_utils::compare_two_evaluations
32.25 s
> 3: <integral_alphaloop_vs_matad_tests::test_integrate_3l_basketball_b::{closure#0} as core::ops::function::FnOnce<()>>::call_once
32.25 s
> note: Some details are omitted, run with `RUST_BACKTRACE=full` for a verbose backtrace.
32.25 s
>
32.25 s
> FAIL [ 0.127s] (46/74) vakint::integral_evaluation_analytic_tests test_integrate_4l_PR9d_from_FG_pinch
32.25 s
> stdout ---
32.25 s
>
32.25 s
> running 1 test
32.25 s
> test test_integrate_4l_PR9d_from_FG_pinch ... FAILED
32.25 s
>
32.25 s
> failures:
32.25 s
>
32.25 s
> failures:
32.25 s
> test_integrate_4l_PR9d_from_FG_pinch
32.25 s
>
32.25 s
> test result: FAILED. 0 passed; 1 failed; 0 ignored; 0 measured; 26 filtered out; finished in 0.12s
32.25 s
>
32.25 s
> stderr ---
32.25 s
>
32.25 s
> thread 'test_integrate_4l_PR9d_from_FG_pinch' (402) panicked at crates/vakint/tests/test_utils.rs:554:30:
32.25 s
> Failed to evaluate integral: the following integral could not be identified using any of the supported topologies: topo(I4L_FG_pinch_4(muvsq,1,2,1,0,1,1,1,1))
32.25 s
> stack backtrace:
32.25 s
> 0: __rustc::rust_begin_unwind
32.25 s
> 1: core::panicking::panic_fmt
32.25 s
> 2: integral_evaluation_analytic_tests::test_utils::compare_vakint_evaluation_vs_reference::{closure#0}
32.25 s
> 3: integral_evaluation_analytic_tests::test_utils::compare_vakint_evaluation_vs_reference
32.25 s
> 4: <integral_evaluation_analytic_tests::test_integrate_4l_PR9d_from_FG_pinch::{closure#0} as core::ops::function::FnOnce<()>>::call_once
32.25 s
> note: Some details are omitted, run with `RUST_BACKTRACE=full` for a verbose backtrace.
32.25 s
>
32.25 s
> FAIL [ 0.194s] (48/74) vakint::integral_evaluation_analytic_tests test_integrate_4l_PR9d_from_H_pinch
32.25 s
> stdout ---
32.25 s
>
32.25 s
> running 1 test
32.25 s
> test test_integrate_4l_PR9d_from_H_pinch ... FAILED
32.25 s
>
32.25 s
> failures:
32.25 s
>
32.25 s
> failures:
32.25 s
> test_integrate_4l_PR9d_from_H_pinch
32.25 s
>
32.25 s
> test result: FAILED. 0 passed; 1 failed; 0 ignored; 0 measured; 26 filtered out; finished in 0.19s
32.25 s
>
32.25 s
> stderr ---
32.25 s
>
32.25 s
> thread 'test_integrate_4l_PR9d_from_H_pinch' (413) panicked at crates/vakint/tests/test_utils.rs:554:30:
32.25 s
> Failed to evaluate integral: the following integral could not be identified using any of the supported topologies: topo(I4L_FG_pinch_4(muvsq,1,2,1,0,1,1,1,1))
32.25 s
> stack backtrace:
32.25 s
> 0: __rustc::rust_begin_unwind
32.25 s
> 1: core::panicking::panic_fmt
32.25 s
> 2: integral_evaluation_analytic_tests::test_utils::compare_vakint_evaluation_vs_reference::{closure#0}
32.25 s
> 3: integral_evaluation_analytic_tests::test_utils::compare_vakint_evaluation_vs_reference
32.25 s
> 4: <integral_evaluation_analytic_tests::test_integrate_4l_PR9d_from_H_pinch::{closure#0} as core::ops::function::FnOnce<()>>::call_once
32.25 s
> note: Some details are omitted, run with `RUST_BACKTRACE=full` for a verbose backtrace.
32.25 s
>
32.25 s
> FAIL [ 0.187s] (50/74) vakint::integral_evaluation_analytic_tests test_integrate_4l_clover
32.25 s
> stdout ---
32.25 s
>
32.25 s
> running 1 test
32.25 s
> test test_integrate_4l_clover ... FAILED
32.25 s
>
32.25 s
> failures:
32.25 s
>
32.25 s
> failures:
32.25 s
> test_integrate_4l_clover
32.25 s
>
32.25 s
> test result: FAILED. 0 passed; 1 failed; 0 ignored; 0 measured; 26 filtered out; finished in 0.18s
32.25 s
>
32.25 s
> stderr ---
32.25 s
>
32.25 s
> thread 'test_integrate_4l_clover' (424) panicked at crates/vakint/tests/test_utils.rs:554:30:
32.25 s
> Failed to evaluate integral: the following integral could not be identified using any of the supported topologies: topo(I4L_FG_pinch_4_6_7_8(muvsq,1,1,1,0,1,0,0,0))
32.25 s
> stack backtrace:
32.25 s
> 0: __rustc::rust_begin_unwind
32.25 s
> 1: core::panicking::panic_fmt
32.25 s
> 2: integral_evaluation_analytic_tests::test_utils::compare_vakint_evaluation_vs_reference::{closure#0}
32.25 s
> 3: integral_evaluation_analytic_tests::test_utils::compare_vakint_evaluation_vs_reference
32.25 s
> 4: <integral_evaluation_analytic_tests::test_integrate_4l_clover::{closure#0} as core::ops::function::FnOnce<()>>::call_once
32.25 s
> note: Some details are omitted, run with `RUST_BACKTRACE=full` for a verbose backtrace.
32.25 s
>
32.25 s
> FAIL [ 0.195s] (51/74) vakint::integral_evaluation_analytic_tests test_integrate_4l_clover_with_non_unit_scales
32.25 s
> stdout ---
32.25 s
>
32.25 s
> running 1 test
32.25 s
> test test_integrate_4l_clover_with_non_unit_scales ... FAILED
32.25 s
>
32.25 s
> failures:
32.25 s
>
32.25 s
> failures:
32.25 s
> test_integrate_4l_clover_with_non_unit_scales
32.25 s
>
32.25 s
> test result: FAILED. 0 passed; 1 failed; 0 ignored; 0 measured; 26 filtered out; finished in 0.19s
32.25 s
>
32.25 s
> stderr ---
32.25 s
>
32.25 s
> thread 'test_integrate_4l_clover_with_non_unit_scales' (429) panicked at crates/vakint/tests/test_utils.rs:554:30:
32.25 s
> Failed to evaluate integral: the following integral could not be identified using any of the supported topologies: topo(I4L_FG_pinch_4_6_7_8(muvsq,1,1,1,0,1,0,0,0))
32.25 s
> stack backtrace:
32.25 s
> 0: __rustc::rust_begin_unwind
32.25 s
> 1: core::panicking::panic_fmt
32.25 s
> 2: integral_evaluation_analytic_tests::test_utils::compare_vakint_evaluation_vs_reference::{closure#0}
32.25 s
> 3: integral_evaluation_analytic_tests::test_utils::compare_vakint_evaluation_vs_reference
32.25 s
> 4: <integral_evaluation_analytic_tests::test_integrate_4l_clover_with_non_unit_scales::{closure#0} as core::ops::function::FnOnce<()>>::call_once
32.25 s
> note: Some details are omitted, run with `RUST_BACKTRACE=full` for a verbose backtrace.
32.25 s
>
32.25 s
> FAIL [ 0.186s] (52/74) vakint::integral_evaluation_analytic_tests test_integrate_4l_clover_with_numerator
32.25 s
> stdout ---
32.25 s
>
32.25 s
> running 1 test
32.25 s
> test test_integrate_4l_clover_with_numerator ... FAILED
32.25 s
>
32.25 s
> failures:
32.25 s
>
32.25 s
> failures:
32.25 s
> test_integrate_4l_clover_with_numerator
32.25 s
>
32.25 s
> test result: FAILED. 0 passed; 1 failed; 0 ignored; 0 measured; 26 filtered out; finished in 0.18s
32.25 s
>
32.25 s
> stderr ---
32.25 s
>
32.25 s
> thread 'test_integrate_4l_clover_with_numerator' (434) panicked at crates/vakint/tests/test_utils.rs:554:30:
32.25 s
> Failed to evaluate integral: the following integral could not be identified using any of the supported topologies: topo(I4L_FG_pinch_4_6_7_8(muvsq,2,1,1,0,1,0,0,0))
32.25 s
> stack backtrace:
32.25 s
> 0: __rustc::rust_begin_unwind
32.25 s
> 1: core::panicking::panic_fmt
32.25 s
> 2: integral_evaluation_analytic_tests::test_utils::compare_vakint_evaluation_vs_reference::{closure#0}
32.25 s
> 3: integral_evaluation_analytic_tests::test_utils::compare_vakint_evaluation_vs_reference
32.25 s
> 4: <integral_evaluation_analytic_tests::test_integrate_4l_clover_with_numerator::{closure#0} as core::ops::function::FnOnce<()>>::call_once
32.25 s
> note: Some details are omitted, run with `RUST_BACKTRACE=full` for a verbose backtrace.
32.25 s
>
32.25 s
> FAIL [ 0.197s] (53/74) vakint::integral_evaluation_analytic_tests test_integrate_4l_dotted_clover
32.25 s
> stdout ---
32.25 s
>
32.25 s
> running 1 test
32.25 s
> test test_integrate_4l_dotted_clover ... FAILED
32.25 s
>
32.25 s
> failures:
32.25 s
>
32.25 s
> failures:
32.25 s
> test_integrate_4l_dotted_clover
32.25 s
>
32.25 s
> test result: FAILED. 0 passed; 1 failed; 0 ignored; 0 measured; 26 filtered out; finished in 0.19s
32.25 s
>
32.25 s
> stderr ---
32.25 s
>
32.25 s
> thread 'test_integrate_4l_dotted_clover' (439) panicked at crates/vakint/tests/test_utils.rs:554:30:
32.25 s
> Failed to evaluate integral: the following integral could not be identified using any of the supported topologies: topo(I4L_FG_pinch_4_6_7_8(muvsq,2,1,1,0,1,0,0,0))
32.25 s
> stack backtrace:
32.25 s
> 0: __rustc::rust_begin_unwind
32.25 s
> 1: core::panicking::panic_fmt
32.25 s
> 2: integral_evaluation_analytic_tests::test_utils::compare_vakint_evaluation_vs_reference::{closure#0}
32.25 s
> 3: integral_evaluation_analytic_tests::test_utils::compare_vakint_evaluation_vs_reference
32.25 s
> 4: <integral_evaluation_analytic_tests::test_integrate_4l_dotted_clover::{closure#0} as core::ops::function::FnOnce<()>>::call_once
32.25 s
> note: Some details are omitted, run with `RUST_BACKTRACE=full` for a verbose backtrace.
32.25 s
>
32.25 s
> FAIL [ 0.111s] (58/74) vakint::integral_evaluation_freeform_tests test_integrate_1l_decorated_indices_alphaloop
32.25 s
> stdout ---
32.25 s
>
32.25 s
> running 1 test
32.25 s
> test test_integrate_1l_decorated_indices_alphaloop ... FAILED
32.25 s
>
32.25 s
> failures:
32.25 s
>
32.25 s
> failures:
32.25 s
> test_integrate_1l_decorated_indices_alphaloop
32.25 s
>
32.25 s
> test result: FAILED. 0 passed; 1 failed; 0 ignored; 0 measured; 3 filtered out; finished in 0.10s
32.25 s
>
32.25 s
> stderr ---
32.25 s
>
32.25 s
> thread 'test_integrate_1l_decorated_indices_alphaloop' (468) panicked at crates/vakint/tests/test_utils.rs:563:6:
32.25 s
> called `Result::unwrap()` on an `Err` value: EvaluationError("Is some tensor structure left? | Expression: '(1/4*user_space::{real}::DDMUVsq^2*vakint::{symmetric}::g(user_space::{}::mink4(4,11),user_space::{}::mink4(4,22))+user_space::{real}::DDMUVsq*user_space::{scalar}::DDsigma2(user_space::{}::some_args)*vakint::{symmetric,linear}::dot(vakint::{}::p(1),vakint::{}::p(2))*vakint::{}::vec1(vakint::{}::p(1),13370003)*vakint::{}::vec1(vakint::{}::p(2),13370003)+user_space::{real}::DDMUVsq*user_space::{symmetric,real}::DDsigma3(user_space::{}::some_args)*vakint::{symmetric,linear}::dot(vakint::{}::p(1),vakint::{}::p(2))*vakint::{}::vec1(vakint::{}::p(1),13370003)*vakint::{}::vec1(vakint::{}::p(2),13370003)+user_space::{real}::DDMUVsq*user_space::{}::DDsigma(user_space::{}::some_args)*vakint::{symmetric,linear}::dot(vakint::{}::p(1),vakint::{}::p(2))*vakint::{}::vec1(vakint::{}::p(1),13370003)*vakint::{}::vec1(vakint::{}::p(2),13370003))*1/16*vakint::{}::𝑖*𝜋^(-2)' | Error: 'function vec1(p(1),13370003) is not in a parameter map and does not have an evaluator'")
32.25 s
> stack backtrace:
32.25 s
> 0: __rustc::rust_begin_unwind
32.25 s
> 1: core::panicking::panic_fmt
32.25 s
> 2: core::result::unwrap_failed
32.25 s
> 3: integral_evaluation_freeform_tests::test_utils::compare_vakint_evaluation_vs_reference
32.25 s
> 4: <integral_evaluation_freeform_tests::test_integrate_1l_decorated_indices_alphaloop::{closure#0} as core::ops::function::FnOnce<()>>::call_once
32.25 s
> note: Some details are omitted, run with `RUST_BACKTRACE=full` for a verbose backtrace.
32.25 s
>
32.25 s
> FAIL [ 0.192s] (59/74) vakint::integral_evaluation_freeform_tests test_integrate_1l_decorated_indices_fmft
32.25 s
> stdout ---
32.25 s
>
32.25 s
> running 1 test
32.25 s
> test test_integrate_1l_decorated_indices_fmft ... FAILED
32.25 s
>
32.25 s
> failures:
32.25 s
>
32.25 s
> failures:
32.25 s
> test_integrate_1l_decorated_indices_fmft
32.25 s
>
32.25 s
> test result: FAILED. 0 passed; 1 failed; 0 ignored; 0 measured; 3 filtered out; finished in 0.19s
32.25 s
>
32.25 s
> stderr ---
32.25 s
>
32.25 s
> thread 'test_integrate_1l_decorated_indices_fmft' (474) panicked at crates/vakint/tests/test_utils.rs:554:30:
32.25 s
> Failed to evaluate integral: the following integral could not be identified using any of the supported topologies: topo(I4L_FG_pinch_4_6_7_8(BBMUVsq,1,1,1,0,1,0,0,0))
32.25 s
> stack backtrace:
32.25 s
> 0: __rustc::rust_begin_unwind
32.25 s
> 1: core::panicking::panic_fmt
32.25 s
> 2: integral_evaluation_freeform_tests::test_utils::compare_vakint_evaluation_vs_reference::{closure#0}
32.25 s
> 3: integral_evaluation_freeform_tests::test_utils::compare_vakint_evaluation_vs_reference
32.25 s
> 4: <integral_evaluation_freeform_tests::test_integrate_1l_decorated_indices_fmft::{closure#0} as core::ops::function::FnOnce<()>>::call_once
32.25 s
> note: Some details are omitted, run with `RUST_BACKTRACE=full` for a verbose backtrace.
32.25 s
>
32.25 s
> FAIL [ 0.131s] (60/74) vakint::integral_evaluation_freeform_tests test_integrate_1l_decorated_indices_matad
32.25 s
> stdout ---
32.25 s
>
32.25 s
> running 1 test
32.25 s
> test test_integrate_1l_decorated_indices_matad ... FAILED
32.25 s
>
32.25 s
> failures:
32.25 s
>
32.25 s
> failures:
32.25 s
> test_integrate_1l_decorated_indices_matad
32.25 s
>
32.25 s
> test result: FAILED. 0 passed; 1 failed; 0 ignored; 0 measured; 3 filtered out; finished in 0.12s
32.25 s
>
32.25 s
> stderr ---
32.25 s
>
32.25 s
> thread 'test_integrate_1l_decorated_indices_matad' (479) panicked at crates/vakint/tests/test_utils.rs:554:30:
32.25 s
> Failed to evaluate integral: FORM run crashed with the following error:
32.25 s
> stderr:
32.25 s
> stdout: FORM 5.0.0 (Jan 1 1980) Run: Sat Sep 12 20:40:56 2026
32.25 s
> #-
32.25 s
> run_matad.frm Line 11 --> Undeclared variable vec1
32.25 s
> ~~~" "
32.25 s
> ~~~" "
32.25 s
> ~~~" _____ _____ _____ _____ ____ "
32.25 s
> ~~~" | | _ |_ _| _ | \ ___ ___ ___ "
32.25 s
> ~~~" | | | | | | | | | | |___| | . | "
32.25 s
> ~~~" |_|_|_|__|__| |_| |__|__|____/ |_|_|_ | "
32.25 s
> ~~~" |___| "
32.25 s
> ~~~" "
32.25 s
> ~~~" "
32.25 s
> ~~~" Originally written by M.Steinhauser "
32.25 s
> ~~~" About exact version contact to: "
32.25 s
> ~~~" pikelner[at]theor.jinr.ru, Andrey Pikelner "
32.25 s
> ~~~" "
32.25 s
> ~~~MATAD called for 1-loop integral
32.25 s
> Program terminating at -->
32.25 s
> Terminate called from pre.c:1086 (PreProcessor)
32.25 s
> 0.00 sec out of 0.00 sec
32.25 s
>
32.25 s
> You can rerun the script using:
32.25 s
> cd "/build/vakint_temp_pid478_1789245656255368531_1" && "form" "run_matad.frm"
32.25 s
> stack backtrace:
32.25 s
> 0: __rustc::rust_begin_unwind
32.25 s
> 1: core::panicking::panic_fmt
32.25 s
> 2: integral_evaluation_freeform_tests::test_utils::compare_vakint_evaluation_vs_reference::{closure#0}
32.25 s
> 3: integral_evaluation_freeform_tests::test_utils::compare_vakint_evaluation_vs_reference
32.25 s
> 4: <integral_evaluation_freeform_tests::test_integrate_1l_decorated_indices_matad::{closure#0} as core::ops::function::FnOnce<()>>::call_once
32.25 s
> note: Some details are omitted, run with `RUST_BACKTRACE=full` for a verbose backtrace.
32.25 s
>
32.25 s
> error : test run failed
32.25 s
>
32.25 s
> ========== nextest test summary ==========
32.25 s
> report: target/nextest/ci_gammaloop/junit.xml
32.25 s
> tests: 74, failures: 13, errors: 0
32.25 s
>
32.25 s
> 1. vakint::input_matching_tests::test_2l_matching_pinched
32.25 s
> failure: test failure with exit code 101
32.25 s
> thread 'test_2l_matching_pinched' (170) panicked at crates/vakint/tests/test_utils.rs:202:21:
32.25 s
> Error: the following integral could not be identified using any of the supported topologies: topo(I2L_pinch_3(mUVsq,2,1,0))
32.25 s
> stack backtrace:
32.25 s
> 0: __rustc::rust_begin_unwind
32.25 s
> 1: core::panicking::panic_fmt
32.25 s
> 2: input_matching_tests::test_utils::compare_output
32.25 s
> 3: <input_matching_tests::test_2l_matching_pinched::{closure#0} as core::ops::function::FnOnce<()>>::call_once
32.25 s
> note: Some details are omitted, run with `RUST_BACKTRACE=full` for a verbose backtrace.
32.25 s
> system-out
32.25 s
> running 1 test
32.25 s
> test test_2l_matching_pinched ... FAILED
32.25 s
>
32.25 s
> failures:
32.25 s
>
32.25 s
> failures:
32.25 s
> test_2l_matching_pinched
32.25 s
>
32.25 s
> test result: FAILED. 0 passed; 1 failed; 0 ignored; 0 measured; 5 filtered out; finished in 0.04s
32.25 s
> system-err
32.25 s
> thread 'test_2l_matching_pinched' (170) panicked at crates/vakint/tests/test_utils.rs:202:21:
32.25 s
> Error: the following integral could not be identified using any of the supported topologies: topo(I2L_pinch_3(mUVsq,2,1,0))
32.25 s
> stack backtrace:
32.25 s
> 0: __rustc::rust_begin_unwind
32.25 s
> 1: core::panicking::panic_fmt
32.25 s
> 2: input_matching_tests::test_utils::compare_output
32.25 s
> 3: <input_matching_tests::test_2l_matching_pinched::{closure#0} as core::ops::function::FnOnce<()>>::call_once
32.25 s
> note: Some details are omitted, run with `RUST_BACKTRACE=full` for a verbose backtrace.
32.25 s
>
32.25 s
> 2. vakint::integral_alphaloop_vs_matad_tests::test_integrate_1l_no_numerator_squared_mass
32.25 s
> failure: test failure with exit code 101
32.25 s
> thread 'test_integrate_1l_no_numerator_squared_mass' (231) panicked at crates/vakint/tests/test_utils.rs:416:13:
32.25 s
> Error during numerical evaluation of benchmark result with [MATAD (expand_masters=true, susbstitute_masters=true, substitute_hpls=true, direct_numerical_substition=true)] :: error:
32.25 s
> Numerical evaluation error: Is some tensor structure left? | Expression: '-1*user_space::{}::muv^2+2*vakint::{}::M' | Error: 'variable M is not in a parameter map and does not have an evaluator'
32.25 s
> stack backtrace:
32.25 s
> 0: __rustc::rust_begin_unwind
32.25 s
> 1: core::panicking::panic_fmt
32.25 s
> 2: integral_alphaloop_vs_matad_tests::test_utils::compare_two_evaluations
32.25 s
> 3: <integral_alphaloop_vs_matad_tests::test_integrate_1l_no_numerator_squared_mass::{closure#0} as core::ops::function::FnOnce<()>>::call_once
32.25 s
> note: Some details are omitted, run with `RUST_BACKTRACE=full` for a verbose backtrace.
32.25 s
> system-out
32.25 s
> running 1 test
32.25 s
>
32.25 s
> <><><><><>
32.25 s
>
32.25 s
>
32.25 s
> <><><><><>
32.25 s
>
32.25 s
> test test_integrate_1l_no_numerator_squared_mass ... FAILED
32.25 s
>
32.25 s
> failures:
32.25 s
>
32.25 s
> failures:
32.25 s
> test_integrate_1l_no_numerator_squared_mass
32.25 s
>
32.25 s
> test result: FAILED. 0 passed; 1 failed; 0 ignored; 0 measured; 9 filtered out; finished in 0.28s
32.25 s
> system-err
32.25 s
> [INFO integral_alphaloop_vs_matad_tests::test_utils] Benchmark [AlphaLoop (susbstitute_masters=true)] :: central :
32.25 s
> ε^-1 : (1.000000000000000000000000000000+0i)
32.25 s
> ε^ 0 : (4.227843350984671393934879099176e-1+0i)
32.25 s
> ε^+1 : (1.411840330426439694788883561418+0i)
32.25 s
> ε^+2 : (5.043612543455534057723233940620e-1+0i)
32.25 s
> [INFO integral_alphaloop_vs_matad_tests::test_utils] Tested [MATAD (expand_masters=true, susbstitute_masters=true, substitute_hpls=true, direct_numerical_substition=true)] :: central :
32.25 s
> ε^-1 : (1.000000000000000000000000000000+0i)
32.25 s
> ε^ 0 : (4.227843350984671393934879099176e-1+0i)
32.25 s
> ε^+1 : (1.411840330426439694788883561418+0i)
32.25 s
> ε^+2 : (5.043612543455534057723233940620e-1+0i)
32.25 s
> [INFO integral_alphaloop_vs_matad_tests::test_utils] matches!
32.25 s
>
32.25 s
> thread 'test_integrate_1l_no_numerator_squared_mass' (231) panicked at crates/vakint/tests/test_utils.rs:416:13:
32.25 s
> Error during numerical evaluation of benchmark result with [MATAD (expand_masters=true, susbstitute_masters=true, substitute_hpls=true, direct_numerical_substition=true)] :: error:
32.25 s
> Numerical evaluation error: Is some tensor structure left? | Expression: '-1*user_space::{}::muv^2+2*vakint::{}::M' | Error: 'variable M is not in a parameter map and does not have an evaluator'
32.25 s
> stack backtrace:
32.25 s
> 0: __rustc::rust_begin_unwind
32.25 s
> 1: core::panicking::panic_fmt
32.25 s
> 2: integral_alphaloop_vs_matad_tests::test_utils::compare_two_evaluations
32.25 s
> 3: <integral_alphaloop_vs_matad_tests::test_integrate_1l_no_numerator_squared_mass::{closure#0} as core::ops::function::FnOnce<()>>::call_once
32.25 s
> note: Some details are omitted, run with `RUST_BACKTRACE=full` for a verbose backtrace.
32.25 s
>
32.25 s
> 3. vakint::integral_alphaloop_vs_matad_tests::test_integrate_3l_basketball_a
32.25 s
> failure: test failure with exit code 101
32.25 s
> thread 'test_integrate_3l_basketball_a' (252) panicked at crates/vakint/tests/test_utils.rs:350:13:
32.25 s
> Error during benchmark integral evaluation with [AlphaLoop (susbstitute_masters=true)] :: error :
32.25 s
> the following integral could not be identified using any of the supported topologies: topo(I3L_pinch_1_6(muvsq,0,1,1,1,1,0))
32.25 s
> stack backtrace:
32.25 s
> 0: __rustc::rust_begin_unwind
32.25 s
> 1: core::panicking::panic_fmt
32.25 s
> 2: integral_alphaloop_vs_matad_tests::test_utils::compare_two_evaluations
32.25 s
> 3: <integral_alphaloop_vs_matad_tests::test_integrate_3l_basketball_a::{closure#0} as core::ops::function::FnOnce<()>>::call_once
32.25 s
> note: Some details are omitted, run with `RUST_BACKTRACE=full` for a verbose backtrace.
32.25 s
> system-out
32.25 s
> running 1 test
32.25 s
> test test_integrate_3l_basketball_a ... FAILED
32.25 s
>
32.25 s
> failures:
32.25 s
>
32.25 s
> failures:
32.25 s
> test_integrate_3l_basketball_a
32.25 s
>
32.25 s
> test result: FAILED. 0 passed; 1 failed; 0 ignored; 0 measured; 9 filtered out; finished in 0.07s
32.25 s
> system-err
32.25 s
> thread 'test_integrate_3l_basketball_a' (252) panicked at crates/vakint/tests/test_utils.rs:350:13:
32.25 s
> Error during benchmark integral evaluation with [AlphaLoop (susbstitute_masters=true)] :: error :
32.25 s
> the following integral could not be identified using any of the supported topologies: topo(I3L_pinch_1_6(muvsq,0,1,1,1,1,0))
32.25 s
> stack backtrace:
32.25 s
> 0: __rustc::rust_begin_unwind
32.25 s
> 1: core::panicking::panic_fmt
32.25 s
> 2: integral_alphaloop_vs_matad_tests::test_utils::compare_two_evaluations
32.25 s
> 3: <integral_alphaloop_vs_matad_tests::test_integrate_3l_basketball_a::{closure#0} as core::ops::function::FnOnce<()>>::call_once
32.25 s
> note: Some details are omitted, run with `RUST_BACKTRACE=full` for a verbose backtrace.
32.25 s
>
32.25 s
> 4. vakint::integral_alphaloop_vs_matad_tests::test_integrate_3l_basketball_b
32.25 s
> failure: test failure with exit code 101
32.25 s
> thread 'test_integrate_3l_basketball_b' (257) panicked at crates/vakint/tests/test_utils.rs:350:13:
32.25 s
> Error during benchmark integral evaluation with [AlphaLoop (susbstitute_masters=true)] :: error :
32.25 s
> the following integral could not be identified using any of the supported topologies: topo(I3L_pinch_1_6(muvsq,0,1,1,1,1,0))
32.25 s
> stack backtrace:
32.25 s
> 0: __rustc::rust_begin_unwind
32.25 s
> 1: core::panicking::panic_fmt
32.25 s
> 2: integral_alphaloop_vs_matad_tests::test_utils::compare_two_evaluations
32.25 s
> 3: <integral_alphaloop_vs_matad_tests::test_integrate_3l_basketball_b::{closure#0} as core::ops::function::FnOnce<()>>::call_once
32.25 s
> note: Some details are omitted, run with `RUST_BACKTRACE=full` for a verbose backtrace.
32.25 s
> system-out
32.25 s
> running 1 test
32.25 s
> test test_integrate_3l_basketball_b ... FAILED
32.25 s
>
32.25 s
> failures:
32.25 s
>
32.25 s
> failures:
32.25 s
> test_integrate_3l_basketball_b
32.25 s
>
32.25 s
> test result: FAILED. 0 passed; 1 failed; 0 ignored; 0 measured; 9 filtered out; finished in 0.06s
32.25 s
> system-err
32.25 s
> thread 'test_integrate_3l_basketball_b' (257) panicked at crates/vakint/tests/test_utils.rs:350:13:
32.25 s
> Error during benchmark integral evaluation with [AlphaLoop (susbstitute_masters=true)] :: error :
32.25 s
> the following integral could not be identified using any of the supported topologies: topo(I3L_pinch_1_6(muvsq,0,1,1,1,1,0))
32.25 s
> stack backtrace:
32.25 s
> 0: __rustc::rust_begin_unwind
32.25 s
> 1: core::panicking::panic_fmt
32.25 s
> 2: integral_alphaloop_vs_matad_tests::test_utils::compare_two_evaluations
32.25 s
> 3: <integral_alphaloop_vs_matad_tests::test_integrate_3l_basketball_b::{closure#0} as core::ops::function::FnOnce<()>>::call_once
32.25 s
> note: Some details are omitted, run with `RUST_BACKTRACE=full` for a verbose backtrace.
32.25 s
>
32.25 s
> 5. vakint::integral_evaluation_analytic_tests::test_integrate_4l_PR9d_from_FG_pinch
32.25 s
> failure: test failure with exit code 101
32.25 s
> thread 'test_integrate_4l_PR9d_from_FG_pinch' (402) panicked at crates/vakint/tests/test_utils.rs:554:30:
32.25 s
> Failed to evaluate integral: the following integral could not be identified using any of the supported topologies: topo(I4L_FG_pinch_4(muvsq,1,2,1,0,1,1,1,1))
32.25 s
> stack backtrace:
32.25 s
> 0: __rustc::rust_begin_unwind
32.25 s
> 1: core::panicking::panic_fmt
32.25 s
> 2: integral_evaluation_analytic_tests::test_utils::compare_vakint_evaluation_vs_reference::{closure#0}
32.25 s
> 3: integral_evaluation_analytic_tests::test_utils::compare_vakint_evaluation_vs_reference
32.25 s
> 4: <integral_evaluation_analytic_tests::test_integrate_4l_PR9d_from_FG_pinch::{closure#0} as core::ops::function::FnOnce<()>>::call_once
32.25 s
> note: Some details are omitted, run with `RUST_BACKTRACE=full` for a verbose backtrace.
32.25 s
> system-out
32.25 s
> running 1 test
32.25 s
> test test_integrate_4l_PR9d_from_FG_pinch ... FAILED
32.25 s
>
32.25 s
> failures:
32.25 s
>
32.25 s
> failures:
32.25 s
> test_integrate_4l_PR9d_from_FG_pinch
32.25 s
>
32.25 s
> test result: FAILED. 0 passed; 1 failed; 0 ignored; 0 measured; 26 filtered out; finished in 0.12s
32.25 s
> system-err
32.25 s
> thread 'test_integrate_4l_PR9d_from_FG_pinch' (402) panicked at crates/vakint/tests/test_utils.rs:554:30:
32.25 s
> Failed to evaluate integral: the following integral could not be identified using any of the supported topologies: topo(I4L_FG_pinch_4(muvsq,1,2,1,0,1,1,1,1))
32.25 s
> stack backtrace:
32.25 s
> 0: __rustc::rust_begin_unwind
32.25 s
> 1: core::panicking::panic_fmt
32.25 s
> 2: integral_evaluation_analytic_tests::test_utils::compare_vakint_evaluation_vs_reference::{closure#0}
32.26 s
> 3: integral_evaluation_analytic_tests::test_utils::compare_vakint_evaluation_vs_reference
32.26 s
> 4: <integral_evaluation_analytic_tests::test_integrate_4l_PR9d_from_FG_pinch::{closure#0} as core::ops::function::FnOnce<()>>::call_once
32.26 s
> note: Some details are omitted, run with `RUST_BACKTRACE=full` for a verbose backtrace.
32.26 s
>
32.26 s
> 6. vakint::integral_evaluation_analytic_tests::test_integrate_4l_PR9d_from_H_pinch
32.26 s
> failure: test failure with exit code 101
32.26 s
> thread 'test_integrate_4l_PR9d_from_H_pinch' (413) panicked at crates/vakint/tests/test_utils.rs:554:30:
32.26 s
> Failed to evaluate integral: the following integral could not be identified using any of the supported topologies: topo(I4L_FG_pinch_4(muvsq,1,2,1,0,1,1,1,1))
32.26 s
> stack backtrace:
32.26 s
> 0: __rustc::rust_begin_unwind
32.26 s
> 1: core::panicking::panic_fmt
32.26 s
> 2: integral_evaluation_analytic_tests::test_utils::compare_vakint_evaluation_vs_reference::{closure#0}
32.26 s
> 3: integral_evaluation_analytic_tests::test_utils::compare_vakint_evaluation_vs_reference
32.26 s
> 4: <integral_evaluation_analytic_tests::test_integrate_4l_PR9d_from_H_pinch::{closure#0} as core::ops::function::FnOnce<()>>::call_once
32.26 s
> note: Some details are omitted, run with `RUST_BACKTRACE=full` for a verbose backtrace.
32.26 s
> system-out
32.26 s
> running 1 test
32.26 s
> test test_integrate_4l_PR9d_from_H_pinch ... FAILED
32.26 s
>
32.26 s
> failures:
32.26 s
>
32.26 s
> failures:
32.26 s
> test_integrate_4l_PR9d_from_H_pinch
32.26 s
>
32.26 s
> test result: FAILED. 0 passed; 1 failed; 0 ignored; 0 measured; 26 filtered out; finished in 0.19s
32.26 s
> system-err
32.26 s
> thread 'test_integrate_4l_PR9d_from_H_pinch' (413) panicked at crates/vakint/tests/test_utils.rs:554:30:
32.26 s
> Failed to evaluate integral: the following integral could not be identified using any of the supported topologies: topo(I4L_FG_pinch_4(muvsq,1,2,1,0,1,1,1,1))
32.26 s
> stack backtrace:
32.26 s
> 0: __rustc::rust_begin_unwind
32.26 s
> 1: core::panicking::panic_fmt
32.26 s
> 2: integral_evaluation_analytic_tests::test_utils::compare_vakint_evaluation_vs_reference::{closure#0}
32.26 s
> 3: integral_evaluation_analytic_tests::test_utils::compare_vakint_evaluation_vs_reference
32.26 s
> 4: <integral_evaluation_analytic_tests::test_integrate_4l_PR9d_from_H_pinch::{closure#0} as core::ops::function::FnOnce<()>>::call_once
32.26 s
> note: Some details are omitted, run with `RUST_BACKTRACE=full` for a verbose backtrace.
32.26 s
>
32.26 s
> 7. vakint::integral_evaluation_analytic_tests::test_integrate_4l_clover
32.26 s
> failure: test failure with exit code 101
32.26 s
> thread 'test_integrate_4l_clover' (424) panicked at crates/vakint/tests/test_utils.rs:554:30:
32.26 s
> Failed to evaluate integral: the following integral could not be identified using any of the supported topologies: topo(I4L_FG_pinch_4_6_7_8(muvsq,1,1,1,0,1,0,0,0))
32.26 s
> stack backtrace:
32.26 s
> 0: __rustc::rust_begin_unwind
32.26 s
> 1: core::panicking::panic_fmt
32.26 s
> 2: integral_evaluation_analytic_tests::test_utils::compare_vakint_evaluation_vs_reference::{closure#0}
32.26 s
> 3: integral_evaluation_analytic_tests::test_utils::compare_vakint_evaluation_vs_reference
32.26 s
> 4: <integral_evaluation_analytic_tests::test_integrate_4l_clover::{closure#0} as core::ops::function::FnOnce<()>>::call_once
32.26 s
> note: Some details are omitted, run with `RUST_BACKTRACE=full` for a verbose backtrace.
32.26 s
> system-out
32.26 s
> running 1 test
32.26 s
> test test_integrate_4l_clover ... FAILED
32.26 s
>
32.26 s
> failures:
32.26 s
>
32.26 s
> failures:
32.26 s
> test_integrate_4l_clover
32.26 s
>
32.26 s
> test result: FAILED. 0 passed; 1 failed; 0 ignored; 0 measured; 26 filtered out; finished in 0.18s
32.26 s
> system-err
32.26 s
> thread 'test_integrate_4l_clover' (424) panicked at crates/vakint/tests/test_utils.rs:554:30:
32.26 s
> Failed to evaluate integral: the following integral could not be identified using any of the supported topologies: topo(I4L_FG_pinch_4_6_7_8(muvsq,1,1,1,0,1,0,0,0))
32.26 s
> stack backtrace:
32.26 s
> 0: __rustc::rust_begin_unwind
32.26 s
> 1: core::panicking::panic_fmt
32.26 s
> 2: integral_evaluation_analytic_tests::test_utils::compare_vakint_evaluation_vs_reference::{closure#0}
32.26 s
> 3: integral_evaluation_analytic_tests::test_utils::compare_vakint_evaluation_vs_reference
32.26 s
> 4: <integral_evaluation_analytic_tests::test_integrate_4l_clover::{closure#0} as core::ops::function::FnOnce<()>>::call_once
32.26 s
> note: Some details are omitted, run with `RUST_BACKTRACE=full` for a verbose backtrace.
32.26 s
>
32.26 s
> 8. vakint::integral_evaluation_analytic_tests::test_integrate_4l_clover_with_non_unit_scales
32.26 s
> failure: test failure with exit code 101
32.26 s
> thread 'test_integrate_4l_clover_with_non_unit_scales' (429) panicked at crates/vakint/tests/test_utils.rs:554:30:
32.26 s
> Failed to evaluate integral: the following integral could not be identified using any of the supported topologies: topo(I4L_FG_pinch_4_6_7_8(muvsq,1,1,1,0,1,0,0,0))
32.26 s
> stack backtrace:
32.26 s
> 0: __rustc::rust_begin_unwind
32.26 s
> 1: core::panicking::panic_fmt
32.26 s
> 2: integral_evaluation_analytic_tests::test_utils::compare_vakint_evaluation_vs_reference::{closure#0}
32.26 s
> 3: integral_evaluation_analytic_tests::test_utils::compare_vakint_evaluation_vs_reference
32.26 s
> 4: <integral_evaluation_analytic_tests::test_integrate_4l_clover_with_non_unit_scales::{closure#0} as core::ops::function::FnOnce<()>>::call_once
32.26 s
> note: Some details are omitted, run with `RUST_BACKTRACE=full` for a verbose backtrace.
32.26 s
> system-out
32.26 s
> running 1 test
32.26 s
> test test_integrate_4l_clover_with_non_unit_scales ... FAILED
32.26 s
>
32.26 s
> failures:
32.26 s
>
32.26 s
> failures:
32.26 s
> test_integrate_4l_clover_with_non_unit_scales
32.26 s
>
32.26 s
> test result: FAILED. 0 passed; 1 failed; 0 ignored; 0 measured; 26 filtered out; finished in 0.19s
32.26 s
> system-err
32.26 s
> thread 'test_integrate_4l_clover_with_non_unit_scales' (429) panicked at crates/vakint/tests/test_utils.rs:554:30:
32.26 s
> Failed to evaluate integral: the following integral could not be identified using any of the supported topologies: topo(I4L_FG_pinch_4_6_7_8(muvsq,1,1,1,0,1,0,0,0))
32.26 s
> stack backtrace:
32.26 s
> 0: __rustc::rust_begin_unwind
32.26 s
> 1: core::panicking::panic_fmt
32.26 s
> 2: integral_evaluation_analytic_tests::test_utils::compare_vakint_evaluation_vs_reference::{closure#0}
32.26 s
> 3: integral_evaluation_analytic_tests::test_utils::compare_vakint_evaluation_vs_reference
32.26 s
> 4: <integral_evaluation_analytic_tests::test_integrate_4l_clover_with_non_unit_scales::{closure#0} as core::ops::function::FnOnce<()>>::call_once
32.26 s
> note: Some details are omitted, run with `RUST_BACKTRACE=full` for a verbose backtrace.
32.26 s
>
32.26 s
> 9. vakint::integral_evaluation_analytic_tests::test_integrate_4l_clover_with_numerator
32.26 s
> failure: test failure with exit code 101
32.26 s
> thread 'test_integrate_4l_clover_with_numerator' (434) panicked at crates/vakint/tests/test_utils.rs:554:30:
32.26 s
> Failed to evaluate integral: the following integral could not be identified using any of the supported topologies: topo(I4L_FG_pinch_4_6_7_8(muvsq,2,1,1,0,1,0,0,0))
32.26 s
> stack backtrace:
32.26 s
> 0: __rustc::rust_begin_unwind
32.26 s
> 1: core::panicking::panic_fmt
32.26 s
> 2: integral_evaluation_analytic_tests::test_utils::compare_vakint_evaluation_vs_reference::{closure#0}
32.26 s
> 3: integral_evaluation_analytic_tests::test_utils::compare_vakint_evaluation_vs_reference
32.26 s
> 4: <integral_evaluation_analytic_tests::test_integrate_4l_clover_with_numerator::{closure#0} as core::ops::function::FnOnce<()>>::call_once
32.26 s
> note: Some details are omitted, run with `RUST_BACKTRACE=full` for a verbose backtrace.
32.26 s
> system-out
32.26 s
> running 1 test
32.26 s
> test test_integrate_4l_clover_with_numerator ... FAILED
32.26 s
>
32.26 s
> failures:
32.26 s
>
32.26 s
> failures:
32.26 s
> test_integrate_4l_clover_with_numerator
32.26 s
>
32.26 s
> test result: FAILED. 0 passed; 1 failed; 0 ignored; 0 measured; 26 filtered out; finished in 0.18s
32.26 s
> system-err
32.26 s
> thread 'test_integrate_4l_clover_with_numerator' (434) panicked at crates/vakint/tests/test_utils.rs:554:30:
32.26 s
> Failed to evaluate integral: the following integral could not be identified using any of the supported topologies: topo(I4L_FG_pinch_4_6_7_8(muvsq,2,1,1,0,1,0,0,0))
32.26 s
> stack backtrace:
32.26 s
> 0: __rustc::rust_begin_unwind
32.26 s
> 1: core::panicking::panic_fmt
32.26 s
> 2: integral_evaluation_analytic_tests::test_utils::compare_vakint_evaluation_vs_reference::{closure#0}
32.26 s
> 3: integral_evaluation_analytic_tests::test_utils::compare_vakint_evaluation_vs_reference
32.26 s
> 4: <integral_evaluation_analytic_tests::test_integrate_4l_clover_with_numerator::{closure#0} as core::ops::function::FnOnce<()>>::call_once
32.26 s
> note: Some details are omitted, run with `RUST_BACKTRACE=full` for a verbose backtrace.
32.26 s
>
32.26 s
> 10. vakint::integral_evaluation_analytic_tests::test_integrate_4l_dotted_clover
32.26 s
> failure: test failure with exit code 101
32.26 s
> thread 'test_integrate_4l_dotted_clover' (439) panicked at crates/vakint/tests/test_utils.rs:554:30:
32.26 s
> Failed to evaluate integral: the following integral could not be identified using any of the supported topologies: topo(I4L_FG_pinch_4_6_7_8(muvsq,2,1,1,0,1,0,0,0))
32.26 s
> stack backtrace:
32.26 s
> 0: __rustc::rust_begin_unwind
32.26 s
> 1: core::panicking::panic_fmt
32.26 s
> 2: integral_evaluation_analytic_tests::test_utils::compare_vakint_evaluation_vs_reference::{closure#0}
32.26 s
> 3: integral_evaluation_analytic_tests::test_utils::compare_vakint_evaluation_vs_reference
32.26 s
> 4: <integral_evaluation_analytic_tests::test_integrate_4l_dotted_clover::{closure#0} as core::ops::function::FnOnce<()>>::call_once
32.26 s
> note: Some details are omitted, run with `RUST_BACKTRACE=full` for a verbose backtrace.
32.26 s
> system-out
32.26 s
> running 1 test
32.26 s
> test test_integrate_4l_dotted_clover ... FAILED
32.26 s
>
32.26 s
> failures:
32.26 s
>
32.26 s
> failures:
32.26 s
> test_integrate_4l_dotted_clover
32.26 s
>
32.26 s
> test result: FAILED. 0 passed; 1 failed; 0 ignored; 0 measured; 26 filtered out; finished in 0.19s
32.26 s
> system-err
32.26 s
> thread 'test_integrate_4l_dotted_clover' (439) panicked at crates/vakint/tests/test_utils.rs:554:30:
32.26 s
> Failed to evaluate integral: the following integral could not be identified using any of the supported topologies: topo(I4L_FG_pinch_4_6_7_8(muvsq,2,1,1,0,1,0,0,0))
32.26 s
> stack backtrace:
32.26 s
> 0: __rustc::rust_begin_unwind
32.26 s
> 1: core::panicking::panic_fmt
32.26 s
> 2: integral_evaluation_analytic_tests::test_utils::compare_vakint_evaluation_vs_reference::{closure#0}
32.26 s
> 3: integral_evaluation_analytic_tests::test_utils::compare_vakint_evaluation_vs_reference
32.26 s
> 4: <integral_evaluation_analytic_tests::test_integrate_4l_dotted_clover::{closure#0} as core::ops::function::FnOnce<()>>::call_once
32.26 s
> note: Some details are omitted, run with `RUST_BACKTRACE=full` for a verbose backtrace.
32.26 s
>
32.26 s
> 11. vakint::integral_evaluation_freeform_tests::test_integrate_1l_decorated_indices_alphaloop
32.26 s
> failure: test failure with exit code 101
32.26 s
> thread 'test_integrate_1l_decorated_indices_alphaloop' (468) panicked at crates/vakint/tests/test_utils.rs:563:6:
32.26 s
> called `Result::unwrap()` on an `Err` value: EvaluationError("Is some tensor structure left? | Expression: '(1/4*user_space::{real}::DDMUVsq^2*vakint::{symmetric}::g(user_space::{}::mink4(4,11),user_space::{}::mink4(4,22))+user_space::{real}::DDMUVsq*user_space::{scalar}::DDsigma2(user_space::{}::some_args)*vakint::{symmetric,linear}::dot(vakint::{}::p(1),vakint::{}::p(2))*vakint::{}::vec1(vakint::{}::p(1),13370003)*vakint::{}::vec1(vakint::{}::p(2),13370003)+user_space::{real}::DDMUVsq*user_space::{symmetric,real}::DDsigma3(user_space::{}::some_args)*vakint::{symmetric,linear}::dot(vakint::{}::p(1),vakint::{}::p(2))*vakint::{}::vec1(vakint::{}::p(1),13370003)*vakint::{}::vec1(vakint::{}::p(2),13370003)+user_space::{real}::DDMUVsq*user_space::{}::DDsigma(user_space::{}::some_args)*vakint::{symmetric,linear}::dot(vakint::{}::p(1),vakint::{}::p(2))*vakint::{}::vec1(vakint::{}::p(1),13370003)*vakint::{}::vec1(vakint::{}::p(2),13370003))*1/16*vakint::{}::𝑖*𝜋^(-2)' | Error: 'function vec1(p(1),13370003) is not in a parameter map and does not have an evaluator'")
32.26 s
> stack backtrace:
32.26 s
> 0: __rustc::rust_begin_unwind
32.26 s
> 1: core::panicking::panic_fmt
32.26 s
> 2: core::result::unwrap_failed
32.26 s
> 3: integral_evaluation_freeform_tests::test_utils::compare_vakint_evaluation_vs_reference
32.26 s
> 4: <integral_evaluation_freeform_tests::test_integrate_1l_decorated_indices_alphaloop::{closure#0} as core::ops::function::FnOnce<()>>::call_once
32.26 s
> note: Some details are omitted, run with `RUST_BACKTRACE=full` for a verbose backtrace.
32.26 s
> system-out
32.26 s
> running 1 test
32.26 s
> test test_integrate_1l_decorated_indices_alphaloop ... FAILED
32.26 s
>
32.26 s
> failures:
32.26 s
>
32.26 s
> failures:
32.26 s
> test_integrate_1l_decorated_indices_alphaloop
32.26 s
>
32.26 s
> test result: FAILED. 0 passed; 1 failed; 0 ignored; 0 measured; 3 filtered out; finished in 0.10s
32.26 s
> system-err
32.26 s
> thread 'test_integrate_1l_decorated_indices_alphaloop' (468) panicked at crates/vakint/tests/test_utils.rs:563:6:
32.26 s
> called `Result::unwrap()` on an `Err` value: EvaluationError("Is some tensor structure left? | Expression: '(1/4*user_space::{real}::DDMUVsq^2*vakint::{symmetric}::g(user_space::{}::mink4(4,11),user_space::{}::mink4(4,22))+user_space::{real}::DDMUVsq*user_space::{scalar}::DDsigma2(user_space::{}::some_args)*vakint::{symmetric,linear}::dot(vakint::{}::p(1),vakint::{}::p(2))*vakint::{}::vec1(vakint::{}::p(1),13370003)*vakint::{}::vec1(vakint::{}::p(2),13370003)+user_space::{real}::DDMUVsq*user_space::{symmetric,real}::DDsigma3(user_space::{}::some_args)*vakint::{symmetric,linear}::dot(vakint::{}::p(1),vakint::{}::p(2))*vakint::{}::vec1(vakint::{}::p(1),13370003)*vakint::{}::vec1(vakint::{}::p(2),13370003)+user_space::{real}::DDMUVsq*user_space::{}::DDsigma(user_space::{}::some_args)*vakint::{symmetric,linear}::dot(vakint::{}::p(1),vakint::{}::p(2))*vakint::{}::vec1(vakint::{}::p(1),13370003)*vakint::{}::vec1(vakint::{}::p(2),13370003))*1/16*vakint::{}::𝑖*𝜋^(-2)' | Error: 'function vec1(p(1),13370003) is not in a parameter map and does not have an evaluator'")
32.26 s
> stack backtrace:
32.26 s
> 0: __rustc::rust_begin_unwind
32.26 s
> 1: core::panicking::panic_fmt
32.26 s
> 2: core::result::unwrap_failed
32.26 s
> 3: integral_evaluation_freeform_tests::test_utils::compare_vakint_evaluation_vs_reference
32.26 s
> 4: <integral_evaluation_freeform_tests::test_integrate_1l_decorated_indices_alphaloop::{closure#0} as core::ops::function::FnOnce<()>>::call_once
32.26 s
> note: Some details are omitted, run with `RUST_BACKTRACE=full` for a verbose backtrace.
32.26 s
>
32.26 s
> 12. vakint::integral_evaluation_freeform_tests::test_integrate_1l_decorated_indices_fmft
32.26 s
> failure: test failure with exit code 101
32.26 s
> thread 'test_integrate_1l_decorated_indices_fmft' (474) panicked at crates/vakint/tests/test_utils.rs:554:30:
32.26 s
> Failed to evaluate integral: the following integral could not be identified using any of the supported topologies: topo(I4L_FG_pinch_4_6_7_8(BBMUVsq,1,1,1,0,1,0,0,0))
32.26 s
> stack backtrace:
32.26 s
> 0: __rustc::rust_begin_unwind
32.26 s
> 1: core::panicking::panic_fmt
32.26 s
> 2: integral_evaluation_freeform_tests::test_utils::compare_vakint_evaluation_vs_reference::{closure#0}
32.26 s
> 3: integral_evaluation_freeform_tests::test_utils::compare_vakint_evaluation_vs_reference
32.26 s
> 4: <integral_evaluation_freeform_tests::test_integrate_1l_decorated_indices_fmft::{closure#0} as core::ops::function::FnOnce<()>>::call_once
32.26 s
> note: Some details are omitted, run with `RUST_BACKTRACE=full` for a verbose backtrace.
32.26 s
> system-out
32.26 s
> running 1 test
32.26 s
> test test_integrate_1l_decorated_indices_fmft ... FAILED
32.26 s
>
32.26 s
> failures:
32.26 s
>
32.26 s
> failures:
32.26 s
> test_integrate_1l_decorated_indices_fmft
32.26 s
>
32.26 s
> test result: FAILED. 0 passed; 1 failed; 0 ignored; 0 measured; 3 filtered out; finished in 0.19s
32.26 s
> system-err
32.26 s
> thread 'test_integrate_1l_decorated_indices_fmft' (474) panicked at crates/vakint/tests/test_utils.rs:554:30:
32.26 s
> Failed to evaluate integral: the following integral could not be identified using any of the supported topologies: topo(I4L_FG_pinch_4_6_7_8(BBMUVsq,1,1,1,0,1,0,0,0))
32.26 s
> stack backtrace:
32.26 s
> 0: __rustc::rust_begin_unwind
32.26 s
> 1: core::panicking::panic_fmt
32.26 s
> 2: integral_evaluation_freeform_tests::test_utils::compare_vakint_evaluation_vs_reference::{closure#0}
32.26 s
> 3: integral_evaluation_freeform_tests::test_utils::compare_vakint_evaluation_vs_reference
32.26 s
> 4: <integral_evaluation_freeform_tests::test_integrate_1l_decorated_indices_fmft::{closure#0} as core::ops::function::FnOnce<()>>::call_once
32.26 s
> note: Some details are omitted, run with `RUST_BACKTRACE=full` for a verbose backtrace.
32.26 s
>
32.26 s
> 13. vakint::integral_evaluation_freeform_tests::test_integrate_1l_decorated_indices_matad
32.26 s
> failure: test failure with exit code 101
32.26 s
> thread 'test_integrate_1l_decorated_indices_matad' (479) panicked at crates/vakint/tests/test_utils.rs:554:30:
32.26 s
> Failed to evaluate integral: FORM run crashed with the following error:
32.26 s
> stderr:
32.26 s
> stdout: FORM 5.0.0 (Jan 1 1980) Run: Sat Sep 12 20:40:56 2026
32.26 s
> #-
32.26 s
> run_matad.frm Line 11 --> Undeclared variable vec1
32.26 s
> ~~~" "
32.26 s
> ~~~" "
32.26 s
> ~~~" _____ _____ _____ _____ ____ "
32.26 s
> ~~~" | | _ |_ _| _ | \ ___ ___ ___ "
32.26 s
> ~~~" | | | | | | | | | | |___| | . | "
32.26 s
> ~~~" |_|_|_|__|__| |_| |__|__|____/ |_|_|_ | "
32.26 s
> ~~~" |___| "
32.26 s
> ~~~" "
32.26 s
> ~~~" "
32.26 s
> ~~~" Originally written by M.Steinhauser "
32.26 s
> ~~~" About exact version contact to: "
32.26 s
> ~~~" pikelner[at]theor.jinr.ru, Andrey Pikelner "
32.26 s
> ~~~" "
32.26 s
> ~~~MATAD called for 1-loop integral
32.26 s
> Program terminating at -->
32.26 s
> Terminate called from pre.c:1086 (PreProcessor)
32.26 s
> 0.00 sec out of 0.00 sec
32.26 s
>
32.26 s
> You can rerun the script using:
32.26 s
> cd "/build/vakint_temp_pid478_1789245656255368531_1" && "form" "run_matad.frm"
32.26 s
> stack backtrace:
32.26 s
> 0: __rustc::rust_begin_unwind
32.26 s
> 1: core::panicking::panic_fmt
32.26 s
> 2: integral_evaluation_freeform_tests::test_utils::compare_vakint_evaluation_vs_reference::{closure#0}
32.26 s
> 3: integral_evaluation_freeform_tests::test_utils::compare_vakint_evaluation_vs_reference
32.26 s
> 4: <integral_evaluation_freeform_tests::test_integrate_1l_decorated_indices_matad::{closure#0} as core::ops::function::FnOnce<()>>::call_once
32.26 s
> note: Some details are omitted, run with `RUST_BACKTRACE=full` for a verbose backtrace.
32.26 s
> system-out
32.26 s
> running 1 test
32.26 s
> test test_integrate_1l_decorated_indices_matad ... FAILED
32.26 s
>
32.26 s
> failures:
32.26 s
>
32.26 s
> failures:
32.26 s
> test_integrate_1l_decorated_indices_matad
32.26 s
>
32.26 s
> test result: FAILED. 0 passed; 1 failed; 0 ignored; 0 measured; 3 filtered out; finished in 0.12s
32.26 s
> system-err
32.26 s
> thread 'test_integrate_1l_decorated_indices_matad' (479) panicked at crates/vakint/tests/test_utils.rs:554:30:
32.26 s
> Failed to evaluate integral: FORM run crashed with the following error:
32.26 s
> stderr:
32.26 s
> stdout: FORM 5.0.0 (Jan 1 1980) Run: Sat Sep 12 20:40:56 2026
32.26 s
> #-
32.26 s
> run_matad.frm Line 11 --> Undeclared variable vec1
32.26 s
> ~~~" "
32.26 s
> ~~~" "
32.26 s
> ~~~" _____ _____ _____ _____ ____ "
32.26 s
> ~~~" | | _ |_ _| _ | \ ___ ___ ___ "
32.26 s
> ~~~" | | | | | | | | | | |___| | . | "
32.26 s
> ~~~" |_|_|_|__|__| |_| |__|__|____/ |_|_|_ | "
32.26 s
> ~~~" |___| "
32.26 s
> ~~~" "
32.26 s
> ~~~" "
32.26 s
> ~~~" Originally written by M.Steinhauser "
32.26 s
> ~~~" About exact version contact to: "
32.26 s
> ~~~" pikelner[at]theor.jinr.ru, Andrey Pikelner "
32.26 s
> ~~~" "
32.26 s
> ~~~MATAD called for 1-loop integral
32.26 s
> Program terminating at -->
32.26 s
> Terminate called from pre.c:1086 (PreProcessor)
32.26 s
> 0.00 sec out of 0.00 sec
32.26 s
>
32.26 s
> You can rerun the script using:
32.26 s
> cd "/build/vakint_temp_pid478_1789245656255368531_1" && "form" "run_matad.frm"
32.26 s
> stack backtrace:
32.26 s
> 0: __rustc::rust_begin_unwind
32.26 s
> 1: core::panicking::panic_fmt
32.26 s
> 2: integral_evaluation_freeform_tests::test_utils::compare_vakint_evaluation_vs_reference::{closure#0}
32.26 s
> 3: integral_evaluation_freeform_tests::test_utils::compare_vakint_evaluation_vs_reference
32.26 s
> 4: <integral_evaluation_freeform_tests::test_integrate_1l_decorated_indices_matad::{closure#0} as core::ops::function::FnOnce<()>>::call_once
32.26 s
> note: Some details are omitted, run with `RUST_BACKTRACE=full` for a verbose backtrace.
32.26 s
> =========================================
32.26 s
For full logs, run:
32.26 s
nix log /nix/store/y7jldak46jgknws0nim0216sgb1hli86-gammaloop-nextest-vakint.drv
32.39 s
Run failed.