1. 0.00 s $ /nix/store/9ypz3flqsrl5xl495mm8h645gadjsxi1-coreutils-9.11/bin/timeout --kill-after=15s 7200s /nix/store/23zk8sgzamrbmj1fday15szf7f2279s8-nix-2.34.7/bin/nix --extra-experimental-features nix-command --extra-experimental-features flakes flake clone git+https://github.com/alphal00p/gammaloop --dest /tmp/nix-ci-worker/stable-pwd/repo/
  2. 0.23 s Cloning into '/tmp/nix-ci-worker/stable-pwd/repo'...
  3. 1.03 s remote: Enumerating objects: 84275, done.
  4. 1.13 s remote: Counting objects: 0% (1/8564) remote: Counting objects: 1% (86/8564) remote: Counting objects: 2% (172/8564) remote: Counting objects: 3% (257/8564) remote: Counting objects: 4% (343/8564) remote: Counting objects: 5% (429/8564) remote: Counting objects: 6% (514/8564) remote: Counting objects: 7% (600/8564) remote: Counting objects: 8% (686/8564) remote: Counting objects: 9% (771/8564) remote: Counting objects: 10% (857/8564) remote: Counting objects: 11% (943/8564) remote: Counting objects: 12% (1028/8564) remote: Counting objects: 13% (1114/8564) remote: Counting objects: 14% (1199/8564) remote: Counting objects: 15% (1285/8564) remote: Counting objects: 16% (1371/8564) remote: Counting objects: 17% (1456/8564) remote: Counting objects: 18% (1542/8564) remote: Counting objects: 19% (1628/8564) remote: Counting objects: 20% (1713/8564) remote: Counting objects: 21% (1799/8564) remote: Counting objects: 22% (1885/8564) remote: Counting objects: 23% (1970/8564) remote: Counting objects: 24% (2056/8564) remote: Counting objects: 25% (2141/8564) remote: Counting objects: 26% (2227/8564) remote: Counting objects: 27% (2313/8564) remote: Counting objects: 28% (2398/8564) remote: Counting objects: 29% (2484/8564) remote: Counting objects: 30% (2570/8564) remote: Counting objects: 31% (2655/8564) remote: Counting objects: 32% (2741/8564) remote: Counting objects: 33% (2827/8564) remote: Counting objects: 34% (2912/8564) remote: Counting objects: 35% (2998/8564) remote: Counting objects: 36% (3084/8564) remote: Counting objects: 37% (3169/8564) remote: Counting objects: 38% (3255/8564) remote: Counting objects: 39% (3340/8564) remote: Counting objects: 40% (3426/8564) remote: Counting objects: 41% (3512/8564) remote: Counting objects: 42% (3597/8564) remote: Counting objects: 43% (3683/8564) remote: Counting objects: 44% (3769/8564) remote: Counting objects: 45% (3854/8564) remote: Counting objects: 46% (3940/8564) remote: Counting objects: 47% (4026/8564) remote: Counting objects: 48% (4111/8564) remote: Counting objects: 49% (4197/8564) remote: Counting objects: 50% (4282/8564) remote: Counting objects: 51% (4368/8564) remote: Counting objects: 52% (4454/8564) remote: Counting objects: 53% (4539/8564) remote: Counting objects: 54% (4625/8564) remote: Counting objects: 55% (4711/8564) remote: Counting objects: 56% (4796/8564) remote: Counting objects: 57% (4882/8564) remote: Counting objects: 58% (4968/8564) remote: Counting objects: 59% (5053/8564) remote: Counting objects: 60% (5139/8564) remote: Counting objects: 61% (5225/8564) remote: Counting objects: 62% (5310/8564) remote: Counting objects: 63% (5396/8564) remote: Counting objects: 64% (5481/8564) remote: Counting objects: 65% (5567/8564) remote: Counting objects: 66% (5653/8564) remote: Counting objects: 67% (5738/8564) remote: Counting objects: 68% (5824/8564) remote: Counting objects: 69% (5910/8564) remote: Counting objects: 70% (5995/8564) remote: Counting objects: 71% (6081/8564) remote: Counting objects: 72% (6167/8564) remote: Counting objects: 73% (6252/8564) remote: Counting objects: 74% (6338/8564) remote: Counting objects: 75% (6423/8564) remote: Counting objects: 76% (6509/8564) remote: Counting objects: 77% (6595/8564) remote: Counting objects: 78% (6680/8564) remote: Counting objects: 79% (6766/8564) remote: Counting objects: 80% (6852/8564) remote: Counting objects: 81% (6937/8564) remote: Counting objects: 82% (7023/8564) remote: Counting objects: 83% (7109/8564) remote: Counting objects: 84% (7194/8564) remote: Counting objects: 85% (7280/8564) remote: Counting objects: 86% (7366/8564) remote: Counting objects: 87% (7451/8564) remote: Counting objects: 88% (7537/8564) remote: Counting objects: 89% (7622/8564) remote: Counting objects: 90% (7708/8564) remote: Counting objects: 91% (7794/8564) remote: Counting objects: 92% (7879/8564) remote: Counting objects: 93% (7965/8564) remote: Counting objects: 94% (8051/8564) remote: Counting objects: 95% (8136/8564) remote: Counting objects: 96% (8222/8564) remote: Counting objects: 97% (8308/8564) remote: Counting objects: 98% (8393/8564) remote: Counting objects: 99% (8479/8564) remote: Counting objects: 100% (8564/8564) remote: Counting objects: 100% (8564/8564), done.
  5. 2.86 s remote: Compressing objects: 0% (1/1729) remote: Compressing objects: 1% (18/1729) remote: Compressing objects: 2% (35/1729) remote: Compressing objects: 3% (52/1729) remote: Compressing objects: 4% (70/1729) remote: Compressing objects: 5% (87/1729) remote: Compressing objects: 6% (104/1729) remote: Compressing objects: 7% (122/1729) remote: Compressing objects: 8% (139/1729) remote: Compressing objects: 9% (156/1729) remote: Compressing objects: 10% (173/1729) remote: Compressing objects: 10% (186/1729) remote: Compressing objects: 11% (191/1729) remote: Compressing objects: 12% (208/1729) remote: Compressing objects: 13% (225/1729) remote: Compressing objects: 14% (243/1729) remote: Compressing objects: 15% (260/1729) remote: Compressing objects: 16% (277/1729) remote: Compressing objects: 17% (294/1729) remote: Compressing objects: 18% (312/1729) remote: Compressing objects: 19% (329/1729) remote: Compressing objects: 20% (346/1729) remote: Compressing objects: 21% (364/1729) remote: Compressing objects: 22% (381/1729) remote: Compressing objects: 23% (398/1729) remote: Compressing objects: 24% (415/1729) remote: Compressing objects: 25% (433/1729) remote: Compressing objects: 26% (450/1729) remote: Compressing objects: 27% (467/1729) remote: Compressing objects: 28% (485/1729) remote: Compressing objects: 29% (502/1729) remote: Compressing objects: 30% (519/1729) remote: Compressing objects: 31% (536/1729) remote: Compressing objects: 32% (554/1729) remote: Compressing objects: 33% (571/1729) remote: Compressing objects: 34% (588/1729) remote: Compressing objects: 35% (606/1729) remote: Compressing objects: 36% (623/1729) remote: Compressing objects: 37% (640/1729) remote: Compressing objects: 38% (658/1729) remote: Compressing objects: 39% (675/1729) remote: Compressing objects: 40% (692/1729) remote: Compressing objects: 41% (709/1729) remote: Compressing objects: 42% (727/1729) remote: Compressing objects: 43% (744/1729) remote: Compressing objects: 44% (761/1729) remote: Compressing objects: 45% (779/1729) remote: Compressing objects: 46% (796/1729) remote: Compressing objects: 47% (813/1729) remote: Compressing objects: 48% (830/1729) remote: Compressing objects: 49% (848/1729) remote: Compressing objects: 50% (865/1729) remote: Compressing objects: 51% (882/1729) remote: Compressing objects: 52% (900/1729) remote: Compressing objects: 53% (917/1729) remote: Compressing objects: 54% (934/1729) remote: Compressing objects: 55% (951/1729) remote: Compressing objects: 56% (969/1729) remote: Compressing objects: 57% (986/1729) remote: Compressing objects: 58% (1003/1729) remote: Compressing objects: 59% (1021/1729) remote: Compressing objects: 60% (1038/1729) remote: Compressing objects: 61% (1055/1729) remote: Compressing objects: 62% (1072/1729) remote: Compressing objects: 63% (1090/1729) remote: Compressing objects: 64% (1107/1729) remote: Compressing objects: 65% (1124/1729) remote: Compressing objects: 66% (1142/1729) remote: Compressing objects: 67% (1159/1729) remote: Compressing objects: 68% (1176/1729) remote: Compressing objects: 69% (1194/1729) remote: Compressing objects: 70% (1211/1729) remote: Compressing objects: 71% (1228/1729) remote: Compressing objects: 72% (1245/1729) remote: Compressing objects: 73% (1263/1729) remote: Compressing objects: 74% (1280/1729) remote: Compressing objects: 75% (1297/1729) remote: Compressing objects: 76% (1315/1729) remote: Compressing objects: 77% (1332/1729) remote: Compressing objects: 78% (1349/1729) remote: Compressing objects: 79% (1366/1729) remote: Compressing objects: 80% (1384/1729) remote: Compressing objects: 81% (1401/1729) remote: Compressing objects: 82% (1418/1729) remote: Compressing objects: 83% (1436/1729) remote: Compressing objects: 84% (1453/1729) remote: Compressing objects: 85% (1470/1729) remote: Compressing objects: 86% (1487/1729) remote: Compressing objects: 87% (1505/1729) remote: Compressing objects: 88% (1522/1729) remote: Compressing objects: 89% (1539/1729) remote: Compressing objects: 90% (1557/1729) remote: Compressing objects: 91% (1574/1729) remote: Compressing objects: 92% (1591/1729) remote: Compressing objects: 93% (1608/1729) remote: Compressing objects: 94% (1626/1729) remote: Compressing objects: 95% (1643/1729) remote: Compressing objects: 96% (1660/1729) remote: Compressing objects: 97% (1678/1729) remote: Compressing objects: 98% (1695/1729) remote: Compressing objects: 99% (1712/1729) remote: Compressing objects: 100% (1729/1729) remote: Compressing objects: 100% (1729/1729), done.
  6. 7.37 s Receiving objects: 0% (1/84275) Receiving objects: 1% (843/84275) Receiving objects: 2% (1686/84275) Receiving objects: 3% (2529/84275) Receiving objects: 4% (3371/84275) Receiving objects: 5% (4214/84275) Receiving objects: 6% (5057/84275) Receiving objects: 7% (5900/84275) Receiving objects: 8% (6742/84275) Receiving objects: 9% (7585/84275), 11.50 MiB | 22.99 MiB/s Receiving objects: 10% (8428/84275), 11.50 MiB | 22.99 MiB/s Receiving objects: 11% (9271/84275), 11.50 MiB | 22.99 MiB/s Receiving objects: 12% (10113/84275), 11.50 MiB | 22.99 MiB/s Receiving objects: 13% (10956/84275), 11.50 MiB | 22.99 MiB/s Receiving objects: 14% (11799/84275), 11.50 MiB | 22.99 MiB/s Receiving objects: 15% (12642/84275), 11.50 MiB | 22.99 MiB/s Receiving objects: 16% (13484/84275), 11.50 MiB | 22.99 MiB/s Receiving objects: 17% (14327/84275), 11.50 MiB | 22.99 MiB/s Receiving objects: 18% (15170/84275), 11.50 MiB | 22.99 MiB/s Receiving objects: 19% (16013/84275), 11.50 MiB | 22.99 MiB/s Receiving objects: 20% (16855/84275), 11.50 MiB | 22.99 MiB/s Receiving objects: 21% (17698/84275), 11.50 MiB | 22.99 MiB/s Receiving objects: 22% (18541/84275), 11.50 MiB | 22.99 MiB/s Receiving objects: 23% (19384/84275), 11.50 MiB | 22.99 MiB/s Receiving objects: 24% (20226/84275), 11.50 MiB | 22.99 MiB/s Receiving objects: 25% (21069/84275), 11.50 MiB | 22.99 MiB/s Receiving objects: 26% (21912/84275), 11.50 MiB | 22.99 MiB/s Receiving objects: 27% (22755/84275), 11.50 MiB | 22.99 MiB/s Receiving objects: 28% (23597/84275), 11.50 MiB | 22.99 MiB/s Receiving objects: 29% (24440/84275), 11.50 MiB | 22.99 MiB/s Receiving objects: 30% (25283/84275), 11.50 MiB | 22.99 MiB/s Receiving objects: 31% (26126/84275), 11.50 MiB | 22.99 MiB/s Receiving objects: 32% (26968/84275), 11.50 MiB | 22.99 MiB/s Receiving objects: 33% (27811/84275), 11.50 MiB | 22.99 MiB/s Receiving objects: 34% (28654/84275), 11.50 MiB | 22.99 MiB/s Receiving objects: 35% (29497/84275), 11.50 MiB | 22.99 MiB/s Receiving objects: 36% (30339/84275), 11.50 MiB | 22.99 MiB/s Receiving objects: 37% (31182/84275), 11.50 MiB | 22.99 MiB/s Receiving objects: 38% (32025/84275), 11.50 MiB | 22.99 MiB/s Receiving objects: 39% (32868/84275), 11.50 MiB | 22.99 MiB/s Receiving objects: 39% (33073/84275), 30.92 MiB | 30.91 MiB/s Receiving objects: 40% (33710/84275), 30.92 MiB | 30.91 MiB/s Receiving objects: 41% (34553/84275), 30.92 MiB | 30.91 MiB/s Receiving objects: 42% (35396/84275), 30.92 MiB | 30.91 MiB/s Receiving objects: 43% (36239/84275), 30.92 MiB | 30.91 MiB/s Receiving objects: 44% (37081/84275), 30.92 MiB | 30.91 MiB/s Receiving objects: 45% (37924/84275), 30.92 MiB | 30.91 MiB/s Receiving objects: 46% (38767/84275), 30.92 MiB | 30.91 MiB/s Receiving objects: 47% (39610/84275), 30.92 MiB | 30.91 MiB/s Receiving objects: 48% (40452/84275), 30.92 MiB | 30.91 MiB/s Receiving objects: 49% (41295/84275), 48.65 MiB | 32.38 MiB/s Receiving objects: 50% (42138/84275), 48.65 MiB | 32.38 MiB/s Receiving objects: 51% (42981/84275), 48.65 MiB | 32.38 MiB/s Receiving objects: 52% (43823/84275), 48.65 MiB | 32.38 MiB/s Receiving objects: 53% (44666/84275), 48.65 MiB | 32.38 MiB/s Receiving objects: 54% (45509/84275), 48.65 MiB | 32.38 MiB/s Receiving objects: 55% (46352/84275), 48.65 MiB | 32.38 MiB/s Receiving objects: 56% (47194/84275), 48.65 MiB | 32.38 MiB/s Receiving objects: 57% (48037/84275), 48.65 MiB | 32.38 MiB/s Receiving objects: 57% (48754/84275), 65.36 MiB | 32.64 MiB/s Receiving objects: 58% (48880/84275), 65.36 MiB | 32.64 MiB/s Receiving objects: 59% (49723/84275), 65.36 MiB | 32.64 MiB/s Receiving objects: 60% (50565/84275), 65.36 MiB | 32.64 MiB/s Receiving objects: 61% (51408/84275), 65.36 MiB | 32.64 MiB/s Receiving objects: 62% (52251/84275), 65.36 MiB | 32.64 MiB/s Receiving objects: 63% (53094/84275), 65.36 MiB | 32.64 MiB/s Receiving objects: 64% (53936/84275), 65.36 MiB | 32.64 MiB/s Receiving objects: 65% (54779/84275), 65.36 MiB | 32.64 MiB/s Receiving objects: 66% (55622/84275), 65.36 MiB | 32.64 MiB/s Receiving objects: 67% (56465/84275), 65.36 MiB | 32.64 MiB/s Receiving objects: 68% (57307/84275), 82.83 MiB | 33.10 MiB/s Receiving objects: 68% (57371/84275), 100.89 MiB | 33.54 MiB/s Receiving objects: 69% (58150/84275), 100.89 MiB | 33.54 MiB/s Receiving objects: 70% (58993/84275), 100.89 MiB | 33.54 MiB/s Receiving objects: 71% (59836/84275), 100.89 MiB | 33.54 MiB/s Receiving objects: 72% (60678/84275), 100.89 MiB | 33.54 MiB/s Receiving objects: 73% (61521/84275), 100.89 MiB | 33.54 MiB/s Receiving objects: 74% (62364/84275), 100.89 MiB | 33.54 MiB/s Receiving objects: 75% (63207/84275), 100.89 MiB | 33.54 MiB/s Receiving objects: 76% (64049/84275), 118.49 MiB | 33.78 MiB/s Receiving objects: 77% (64892/84275), 118.49 MiB | 33.78 MiB/s Receiving objects: 78% (65735/84275), 118.49 MiB | 33.78 MiB/s Receiving objects: 79% (66578/84275), 118.49 MiB | 33.78 MiB/s Receiving objects: 80% (67420/84275), 118.49 MiB | 33.78 MiB/s Receiving objects: 81% (68263/84275), 118.49 MiB | 33.78 MiB/s Receiving objects: 82% (69106/84275), 118.49 MiB | 33.78 MiB/s Receiving objects: 83% (69949/84275), 118.49 MiB | 33.78 MiB/s Receiving objects: 83% (70715/84275), 118.49 MiB | 33.78 MiB/s Receiving objects: 84% (70791/84275), 136.38 MiB | 33.92 MiB/s Receiving objects: 85% (71634/84275), 136.38 MiB | 33.92 MiB/s Receiving objects: 86% (72477/84275), 136.38 MiB | 33.92 MiB/s Receiving objects: 87% (73320/84275), 136.38 MiB | 33.92 MiB/s Receiving objects: 88% (74162/84275), 136.38 MiB | 33.92 MiB/s Receiving objects: 89% (75005/84275), 136.38 MiB | 33.92 MiB/s Receiving objects: 90% (75848/84275), 136.38 MiB | 33.92 MiB/s Receiving objects: 91% (76691/84275), 136.38 MiB | 33.92 MiB/s Receiving objects: 92% (77533/84275), 136.38 MiB | 33.92 MiB/s Receiving objects: 93% (78376/84275), 136.38 MiB | 33.92 MiB/s Receiving objects: 94% (79219/84275), 136.38 MiB | 33.92 MiB/s Receiving objects: 95% (80062/84275), 136.38 MiB | 33.92 MiB/s Receiving objects: 96% (80904/84275), 136.38 MiB | 33.92 MiB/s Receiving objects: 97% (81747/84275), 136.38 MiB | 33.92 MiB/s Receiving objects: 98% (82590/84275), 136.38 MiB | 33.92 MiB/s Receiving objects: 99% (83433/84275), 136.38 MiB | 33.92 MiB/s remote: Total 84275 (delta 7443), reused 6856 (delta 6833), pack-reused 75711 (from 2)
  7. 7.37 s Receiving objects: 100% (84275/84275), 136.38 MiB | 33.92 MiB/s Receiving objects: 100% (84275/84275), 153.42 MiB | 34.05 MiB/s, done.
  8. 9.54 s Resolving deltas: 0% (0/57012) Resolving deltas: 1% (571/57012) Resolving deltas: 2% (1141/57012) Resolving deltas: 3% (1711/57012) Resolving deltas: 4% (2281/57012) Resolving deltas: 5% (2851/57012) Resolving deltas: 6% (3421/57012) Resolving deltas: 7% (3992/57012) Resolving deltas: 8% (4561/57012) Resolving deltas: 9% (5132/57012) Resolving deltas: 10% (5702/57012) Resolving deltas: 11% (6272/57012) Resolving deltas: 12% (6842/57012) Resolving deltas: 13% (7412/57012) Resolving deltas: 14% (7982/57012) Resolving deltas: 15% (8552/57012) Resolving deltas: 16% (9122/57012) Resolving deltas: 17% (9693/57012) Resolving deltas: 18% (10263/57012) Resolving deltas: 19% (10833/57012) Resolving deltas: 20% (11403/57012) Resolving deltas: 21% (11973/57012) Resolving deltas: 22% (12543/57012) Resolving deltas: 23% (13113/57012) Resolving deltas: 24% (13683/57012) Resolving deltas: 25% (14253/57012) Resolving deltas: 26% (14824/57012) Resolving deltas: 27% (15394/57012) Resolving deltas: 28% (15964/57012) Resolving deltas: 29% (16534/57012) Resolving deltas: 30% (17104/57012) Resolving deltas: 31% (17674/57012) Resolving deltas: 32% (18244/57012) Resolving deltas: 33% (18814/57012) Resolving deltas: 34% (19385/57012) Resolving deltas: 35% (19955/57012) Resolving deltas: 36% (20525/57012) Resolving deltas: 37% (21095/57012) Resolving deltas: 38% (21665/57012) Resolving deltas: 39% (22235/57012) Resolving deltas: 40% (22805/57012) Resolving deltas: 41% (23375/57012) Resolving deltas: 42% (23946/57012) Resolving deltas: 43% (24516/57012) Resolving deltas: 44% (25086/57012) Resolving deltas: 45% (25656/57012) Resolving deltas: 46% (26226/57012) Resolving deltas: 47% (26796/57012) Resolving deltas: 48% (27366/57012) Resolving deltas: 49% (27936/57012) Resolving deltas: 50% (28506/57012) Resolving deltas: 51% (29077/57012) Resolving deltas: 52% (29647/57012) Resolving deltas: 53% (30217/57012) Resolving deltas: 54% (30787/57012) Resolving deltas: 55% (31357/57012) Resolving deltas: 56% (31927/57012) Resolving deltas: 56% (32450/57012) Resolving deltas: 57% (32497/57012) Resolving deltas: 58% (33067/57012) Resolving deltas: 59% (33638/57012) Resolving deltas: 60% (34208/57012) Resolving deltas: 61% (34778/57012) Resolving deltas: 62% (35348/57012) Resolving deltas: 63% (35918/57012) Resolving deltas: 64% (36488/57012) Resolving deltas: 65% (37058/57012) Resolving deltas: 66% (37628/57012) Resolving deltas: 67% (38200/57012) Resolving deltas: 68% (38769/57012) Resolving deltas: 69% (39339/57012) Resolving deltas: 70% (39909/57012) Resolving deltas: 71% (40479/57012) Resolving deltas: 72% (41049/57012) Resolving deltas: 73% (41619/57012) Resolving deltas: 74% (42189/57012) Resolving deltas: 75% (42759/57012) Resolving deltas: 76% (43330/57012) Resolving deltas: 77% (43900/57012) Resolving deltas: 78% (44470/57012) Resolving deltas: 79% (45040/57012) Resolving deltas: 80% (45611/57012) Resolving deltas: 81% (46180/57012) Resolving deltas: 82% (46752/57012) Resolving deltas: 83% (47320/57012) Resolving deltas: 84% (47891/57012) Resolving deltas: 85% (48461/57012) Resolving deltas: 86% (49031/57012) Resolving deltas: 87% (49601/57012) Resolving deltas: 88% (50171/57012) Resolving deltas: 89% (50741/57012) Resolving deltas: 90% (51311/57012) Resolving deltas: 91% (51881/57012) Resolving deltas: 92% (52452/57012) Resolving deltas: 93% (53022/57012) Resolving deltas: 93% (53206/57012) Resolving deltas: 94% (53592/57012) Resolving deltas: 95% (54162/57012) Resolving deltas: 96% (54732/57012) Resolving deltas: 97% (55302/57012) Resolving deltas: 98% (55872/57012) Resolving deltas: 99% (56442/57012) Resolving deltas: 100% (57012/57012) Resolving deltas: 100% (57012/57012), done.
  9. 9.99 s Fetching commit ff11577b1777f94f30ac4c8d99e2f898d5902f7b for simplify-spenso-api ...
  10. 9.99 s $ /nix/store/bcnisk3ydfgv26v2gw3zlky24g00yww2-git-2.54.0/bin/git fetch origin ff11577b1777f94f30ac4c8d99e2f898d5902f7b
  11. 10.60 s From https://github.com/alphal00p/gammaloop
  12. 10.60 s * branch ff11577b1777f94f30ac4c8d99e2f898d5902f7b -> FETCH_HEAD
  13. 10.65 s $ /nix/store/9ypz3flqsrl5xl495mm8h645gadjsxi1-coreutils-9.11/bin/timeout --kill-after=15s 7200s /nix/store/bcnisk3ydfgv26v2gw3zlky24g00yww2-git-2.54.0/bin/git -c advice.detachedHead=false checkout ff11577b1777f94f30ac4c8d99e2f898d5902f7b
  14. 10.94 s HEAD is now at ff11577b1 update Symbolica to 0084bc7c
  15. 10.95 s $ /nix/store/9ypz3flqsrl5xl495mm8h645gadjsxi1-coreutils-9.11/bin/timeout --kill-after=15s 7200s /nix/store/23zk8sgzamrbmj1fday15szf7f2279s8-nix-2.34.7/bin/nix --extra-experimental-features nix-command --extra-experimental-features flakes --log-format internal-json run .#packages.x86_64-linux.nix-ci-check-gammaloop-nextest-vakint --print-build-logs
  16. 14.69 s
  17. 19.63 s evaluating derivation 'g copying '/nix/store/zvcs evaluating derivation 'g [0/1 built] [1/0/1 built] building ggammaloop-nextest-vakint> Extracting 9 binaries, 1 build script output directory, and 1 linked path to /build/nextest-archive-Yz5vPM
  18. 20.54 s gammaloop-nextest-vakint> Extracted 15 files to /build/nextest-archive-Yz5vPM in 0.92s
  19. 20.62 s gammaloop-nextest-vakint> ------------
  20. 20.62 s gammaloop-nextest-vakint> Nextest run ID b0b7e267-001c-4cee-a432-1b957573fd5c with nextest profile: ci_gammaloop
  21. 20.62 s gammaloop-nextest-vakint> Starting 74 tests across 9 binaries
  22. 20.84 s gammaloop-nextest-vakint> FAIL [ 0.077s] ( 5/74) vakint::input_matching_tests test_2l_matching_pinched
  23. 20.84 s gammaloop-nextest-vakint> stdout ---
  24. 20.84 s gammaloop-nextest-vakint>
  25. 20.84 s gammaloop-nextest-vakint> running 1 test
  26. 20.84 s gammaloop-nextest-vakint> test test_2l_matching_pinched ... FAILED
  27. 20.84 s gammaloop-nextest-vakint>
  28. 20.84 s gammaloop-nextest-vakint> failures:
  29. 20.84 s gammaloop-nextest-vakint>
  30. 20.84 s gammaloop-nextest-vakint> failures:
  31. 20.84 s gammaloop-nextest-vakint> test_2l_matching_pinched
  32. 20.84 s gammaloop-nextest-vakint>
  33. 20.84 s gammaloop-nextest-vakint> test result: FAILED. 0 passed; 1 failed; 0 ignored; 0 measured; 5 filtered out; finished in 0.07s
  34. 20.84 s gammaloop-nextest-vakint>
  35. 20.84 s gammaloop-nextest-vakint> stderr ---
  36. 20.84 s gammaloop-nextest-vakint>
  37. 20.84 s gammaloop-nextest-vakint> thread 'test_2l_matching_pinched' (170) panicked at crates/vakint/tests/test_utils.rs:202:21:
  38. 20.84 s gammaloop-nextest-vakint> Error: the following integral could not be identified using any of the supported topologies: topo(I2L_pinch_3(mUVsq,2,1,0))
  39. 20.84 s gammaloop-nextest-vakint> stack backtrace:
  40. 20.84 s gammaloop-nextest-vakint> 0: __rustc::rust_begin_unwind
  41. 20.84 s gammaloop-nextest-vakint> 1: core::panicking::panic_fmt
  42. 20.84 s gammaloop-nextest-vakint> 2: input_matching_tests::test_utils::compare_output
  43. 20.84 s gammaloop-nextest-vakint> 3: <input_matching_tests::test_2l_matching_pinched::{closure#0} as core::ops::function::FnOnce<()>>::call_once
  44. 20.84 s gammaloop-nextest-vakint> note: Some details are omitted, run with `RUST_BACKTRACE=full` for a verbose backtrace.
  45. 20.84 s gammaloop-nextest-vakint>
  46. 25.37 s gammaloop-nextest-vakint> FAIL [ 0.380s] (12/74) vakint::integral_alphaloop_vs_matad_tests test_integrate_1l_no_numerator_squared_mass
  47. 25.37 s gammaloop-nextest-vakint> stdout ---
  48. 25.37 s gammaloop-nextest-vakint>
  49. 25.37 s gammaloop-nextest-vakint> running 1 test
  50. 25.37 s gammaloop-nextest-vakint>
  51. 25.37 s gammaloop-nextest-vakint> <><><><><>
  52. 25.37 s gammaloop-nextest-vakint>
  53. 25.37 s gammaloop-nextest-vakint>
  54. 25.37 s gammaloop-nextest-vakint> <><><><><>
  55. 25.37 s gammaloop-nextest-vakint>
  56. 25.37 s gammaloop-nextest-vakint> test test_integrate_1l_no_numerator_squared_mass ... FAILED
  57. 25.37 s gammaloop-nextest-vakint>
  58. 25.37 s gammaloop-nextest-vakint> failures:
  59. 25.37 s gammaloop-nextest-vakint>
  60. 25.37 s gammaloop-nextest-vakint> failures:
  61. 25.37 s gammaloop-nextest-vakint> test_integrate_1l_no_numerator_squared_mass
  62. 25.37 s gammaloop-nextest-vakint>
  63. 25.37 s gammaloop-nextest-vakint> test result: FAILED. 0 passed; 1 failed; 0 ignored; 0 measured; 9 filtered out; finished in 0.37s
  64. 25.37 s gammaloop-nextest-vakint>
  65. 25.37 s gammaloop-nextest-vakint> stderr ---
  66. 25.37 s gammaloop-nextest-vakint> [INFO integral_alphaloop_vs_matad_tests::test_utils] Benchmark [AlphaLoop (susbstitute_masters=true)] :: central :
  67. 25.37 s gammaloop-nextest-vakint> ε^-1 : (1.000000000000000000000000000000+0i)
  68. 25.37 s gammaloop-nextest-vakint> ε^ 0 : (4.227843350984671393934879099176e-1+0i)
  69. 25.37 s gammaloop-nextest-vakint> ε^+1 : (1.411840330426439694788883561418+0i)
  70. 25.37 s gammaloop-nextest-vakint> ε^+2 : (5.043612543455534057723233940620e-1+0i)
  71. 25.37 s gammaloop-nextest-vakint> [INFO integral_alphaloop_vs_matad_tests::test_utils] Tested [MATAD (expand_masters=true, susbstitute_masters=true, substitute_hpls=true, direct_numerical_substition=true)] :: central :
  72. 25.37 s gammaloop-nextest-vakint> ε^-1 : (1.000000000000000000000000000000+0i)
  73. 25.37 s gammaloop-nextest-vakint> ε^ 0 : (4.227843350984671393934879099176e-1+0i)
  74. 25.37 s gammaloop-nextest-vakint> ε^+1 : (1.411840330426439694788883561418+0i)
  75. 25.37 s gammaloop-nextest-vakint> ε^+2 : (5.043612543455534057723233940620e-1+0i)
  76. 25.37 s gammaloop-nextest-vakint> [INFO integral_alphaloop_vs_matad_tests::test_utils] matches!
  77. 25.37 s gammaloop-nextest-vakint>
  78. 25.37 s gammaloop-nextest-vakint> thread 'test_integrate_1l_no_numerator_squared_mass' (231) panicked at crates/vakint/tests/test_utils.rs:416:13:
  79. 25.37 s gammaloop-nextest-vakint> Error during numerical evaluation of benchmark result with [MATAD (expand_masters=true, susbstitute_masters=true, substitute_hpls=true, direct_numerical_substition=true)] :: error:
  80. 25.37 s gammaloop-nextest-vakint> Numerical evaluation error: Is some tensor structure left? | Expression: '-1*user_space::{}::muv^2+2*vakint::{}::M' | Error: 'variable M is not in a parameter map and does not have an evaluator'
  81. 25.37 s gammaloop-nextest-vakint> stack backtrace:
  82. 25.37 s gammaloop-nextest-vakint> 0: __rustc::rust_begin_unwind
  83. 25.37 s gammaloop-nextest-vakint> 1: core::panicking::panic_fmt
  84. 25.37 s gammaloop-nextest-vakint> 2: integral_alphaloop_vs_matad_tests::test_utils::compare_two_evaluations
  85. 25.37 s gammaloop-nextest-vakint> 3: <integral_alphaloop_vs_matad_tests::test_integrate_1l_no_numerator_squared_mass::{closure#0} as core::ops::function::FnOnce<()>>::call_once
  86. 25.37 s gammaloop-nextest-vakint> note: Some details are omitted, run with `RUST_BACKTRACE=full` for a verbose backtrace.
  87. 25.37 s gammaloop-nextest-vakint>
  88. 25.70 s gammaloop-nextest-vakint> FAIL [ 0.088s] (14/74) vakint::integral_alphaloop_vs_matad_tests test_integrate_3l_basketball_a
  89. 25.70 s gammaloop-nextest-vakint> stdout ---
  90. 25.70 s gammaloop-nextest-vakint>
  91. 25.70 s gammaloop-nextest-vakint> running 1 test
  92. 25.70 s gammaloop-nextest-vakint> test test_integrate_3l_basketball_a ... FAILED
  93. 25.70 s gammaloop-nextest-vakint>
  94. 25.70 s gammaloop-nextest-vakint> failures:
  95. 25.70 s gammaloop-nextest-vakint>
  96. 25.70 s gammaloop-nextest-vakint> failures:
  97. 25.70 s gammaloop-nextest-vakint> test_integrate_3l_basketball_a
  98. 25.70 s gammaloop-nextest-vakint>
  99. 25.70 s gammaloop-nextest-vakint> test result: FAILED. 0 passed; 1 failed; 0 ignored; 0 measured; 9 filtered out; finished in 0.08s
  100. 25.70 s gammaloop-nextest-vakint>
  101. 25.70 s gammaloop-nextest-vakint> stderr ---
  102. 25.70 s gammaloop-nextest-vakint>
  103. 25.70 s gammaloop-nextest-vakint> thread 'test_integrate_3l_basketball_a' (252) panicked at crates/vakint/tests/test_utils.rs:350:13:
  104. 25.70 s gammaloop-nextest-vakint> Error during benchmark integral evaluation with [AlphaLoop (susbstitute_masters=true)] :: error :
  105. 25.70 s gammaloop-nextest-vakint> the following integral could not be identified using any of the supported topologies: topo(I3L_pinch_1_6(muvsq,0,1,1,1,1,0))
  106. 25.70 s gammaloop-nextest-vakint> stack backtrace:
  107. 25.70 s gammaloop-nextest-vakint> 0: __rustc::rust_begin_unwind
  108. 25.70 s gammaloop-nextest-vakint> 1: core::panicking::panic_fmt
  109. 25.70 s gammaloop-nextest-vakint> 2: integral_alphaloop_vs_matad_tests::test_utils::compare_two_evaluations
  110. 25.70 s gammaloop-nextest-vakint> 3: <integral_alphaloop_vs_matad_tests::test_integrate_3l_basketball_a::{closure#0} as core::ops::function::FnOnce<()>>::call_once
  111. 25.70 s gammaloop-nextest-vakint> note: Some details are omitted, run with `RUST_BACKTRACE=full` for a verbose backtrace.
  112. 25.70 s gammaloop-nextest-vakint>
  113. 25.78 s gammaloop-nextest-vakint> FAIL [ 0.083s] (15/74) vakint::integral_alphaloop_vs_matad_tests test_integrate_3l_basketball_b
  114. 25.78 s gammaloop-nextest-vakint> stdout ---
  115. 25.78 s gammaloop-nextest-vakint>
  116. 25.78 s gammaloop-nextest-vakint> running 1 test
  117. 25.78 s gammaloop-nextest-vakint> test test_integrate_3l_basketball_b ... FAILED
  118. 25.78 s gammaloop-nextest-vakint>
  119. 25.78 s gammaloop-nextest-vakint> failures:
  120. 25.78 s gammaloop-nextest-vakint>
  121. 25.78 s gammaloop-nextest-vakint> failures:
  122. 25.78 s gammaloop-nextest-vakint> test_integrate_3l_basketball_b
  123. 25.78 s gammaloop-nextest-vakint>
  124. 25.78 s gammaloop-nextest-vakint> test result: FAILED. 0 passed; 1 failed; 0 ignored; 0 measured; 9 filtered out; finished in 0.08s
  125. 25.78 s gammaloop-nextest-vakint>
  126. 25.78 s gammaloop-nextest-vakint> stderr ---
  127. 25.78 s gammaloop-nextest-vakint>
  128. 25.78 s gammaloop-nextest-vakint> thread 'test_integrate_3l_basketball_b' (257) panicked at crates/vakint/tests/test_utils.rs:350:13:
  129. 25.78 s gammaloop-nextest-vakint> Error during benchmark integral evaluation with [AlphaLoop (susbstitute_masters=true)] :: error :
  130. 25.78 s gammaloop-nextest-vakint> the following integral could not be identified using any of the supported topologies: topo(I3L_pinch_1_6(muvsq,0,1,1,1,1,0))
  131. 25.78 s gammaloop-nextest-vakint> stack backtrace:
  132. 25.78 s gammaloop-nextest-vakint> 0: __rustc::rust_begin_unwind
  133. 25.78 s gammaloop-nextest-vakint> 1: core::panicking::panic_fmt
  134. 25.78 s gammaloop-nextest-vakint> 2: integral_alphaloop_vs_matad_tests::test_utils::compare_two_evaluations
  135. 25.78 s gammaloop-nextest-vakint> 3: <integral_alphaloop_vs_matad_tests::test_integrate_3l_basketball_b::{closure#0} as core::ops::function::FnOnce<()>>::call_once
  136. 25.78 s gammaloop-nextest-vakint> note: Some details are omitted, run with `RUST_BACKTRACE=full` for a verbose backtrace.
  137. 25.78 s gammaloop-nextest-vakint>
  138. 29.36 s gammaloop-nextest-vakint> FAIL [ 0.124s] (46/74) vakint::integral_evaluation_analytic_tests test_integrate_4l_PR9d_from_FG_pinch
  139. 29.36 s gammaloop-nextest-vakint> stdout ---
  140. 29.36 s gammaloop-nextest-vakint>
  141. 29.36 s gammaloop-nextest-vakint> running 1 test
  142. 29.36 s gammaloop-nextest-vakint> test test_integrate_4l_PR9d_from_FG_pinch ... FAILED
  143. 29.36 s gammaloop-nextest-vakint>
  144. 29.36 s gammaloop-nextest-vakint> failures:
  145. 29.36 s gammaloop-nextest-vakint>
  146. 29.36 s gammaloop-nextest-vakint> failures:
  147. 29.36 s gammaloop-nextest-vakint> test_integrate_4l_PR9d_from_FG_pinch
  148. 29.36 s gammaloop-nextest-vakint>
  149. 29.36 s gammaloop-nextest-vakint> test result: FAILED. 0 passed; 1 failed; 0 ignored; 0 measured; 26 filtered out; finished in 0.12s
  150. 29.36 s gammaloop-nextest-vakint>
  151. 29.36 s gammaloop-nextest-vakint> stderr ---
  152. 29.36 s gammaloop-nextest-vakint>
  153. 29.36 s gammaloop-nextest-vakint> thread 'test_integrate_4l_PR9d_from_FG_pinch' (402) panicked at crates/vakint/tests/test_utils.rs:554:30:
  154. 29.36 s gammaloop-nextest-vakint> Failed to evaluate integral: the following integral could not be identified using any of the supported topologies: topo(I4L_FG_pinch_4(muvsq,1,2,1,0,1,1,1,1))
  155. 29.36 s gammaloop-nextest-vakint> stack backtrace:
  156. 29.36 s gammaloop-nextest-vakint> 0: __rustc::rust_begin_unwind
  157. 29.36 s gammaloop-nextest-vakint> 1: core::panicking::panic_fmt
  158. 29.36 s gammaloop-nextest-vakint> 2: integral_evaluation_analytic_tests::test_utils::compare_vakint_evaluation_vs_reference::{closure#0}
  159. 29.36 s gammaloop-nextest-vakint> 3: integral_evaluation_analytic_tests::test_utils::compare_vakint_evaluation_vs_reference
  160. 29.36 s gammaloop-nextest-vakint> 4: <integral_evaluation_analytic_tests::test_integrate_4l_PR9d_from_FG_pinch::{closure#0} as core::ops::function::FnOnce<()>>::call_once
  161. 29.36 s gammaloop-nextest-vakint> note: Some details are omitted, run with `RUST_BACKTRACE=full` for a verbose backtrace.
  162. 29.36 s gammaloop-nextest-vakint>
  163. 29.87 s gammaloop-nextest-vakint> FAIL [ 0.255s] (48/74) vakint::integral_evaluation_analytic_tests test_integrate_4l_PR9d_from_H_pinch
  164. 29.88 s gammaloop-nextest-vakint> stdout ---
  165. 29.88 s gammaloop-nextest-vakint>
  166. 29.88 s gammaloop-nextest-vakint> running 1 test
  167. 29.88 s gammaloop-nextest-vakint> test test_integrate_4l_PR9d_from_H_pinch ... FAILED
  168. 29.88 s gammaloop-nextest-vakint>
  169. 29.88 s gammaloop-nextest-vakint> failures:
  170. 29.88 s gammaloop-nextest-vakint>
  171. 29.88 s gammaloop-nextest-vakint> failures:
  172. 29.88 s gammaloop-nextest-vakint> test_integrate_4l_PR9d_from_H_pinch
  173. 29.88 s gammaloop-nextest-vakint>
  174. 29.88 s gammaloop-nextest-vakint> test result: FAILED. 0 passed; 1 failed; 0 ignored; 0 measured; 26 filtered out; finished in 0.25s
  175. 29.88 s gammaloop-nextest-vakint>
  176. 29.88 s gammaloop-nextest-vakint> stderr ---
  177. 29.88 s gammaloop-nextest-vakint>
  178. 29.88 s gammaloop-nextest-vakint> thread 'test_integrate_4l_PR9d_from_H_pinch' (413) panicked at crates/vakint/tests/test_utils.rs:554:30:
  179. 29.88 s gammaloop-nextest-vakint> Failed to evaluate integral: the following integral could not be identified using any of the supported topologies: topo(I4L_FG_pinch_4(muvsq,1,2,1,0,1,1,1,1))
  180. 29.88 s gammaloop-nextest-vakint> stack backtrace:
  181. 29.88 s gammaloop-nextest-vakint> 0: __rustc::rust_begin_unwind
  182. 29.88 s gammaloop-nextest-vakint> 1: core::panicking::panic_fmt
  183. 29.88 s gammaloop-nextest-vakint> 2: integral_evaluation_analytic_tests::test_utils::compare_vakint_evaluation_vs_reference::{closure#0}
  184. 29.88 s gammaloop-nextest-vakint> 3: integral_evaluation_analytic_tests::test_utils::compare_vakint_evaluation_vs_reference
  185. 29.88 s gammaloop-nextest-vakint> 4: <integral_evaluation_analytic_tests::test_integrate_4l_PR9d_from_H_pinch::{closure#0} as core::ops::function::FnOnce<()>>::call_once
  186. 29.88 s gammaloop-nextest-vakint> note: Some details are omitted, run with `RUST_BACKTRACE=full` for a verbose backtrace.
  187. 29.88 s gammaloop-nextest-vakint>
  188. 30.53 s gammaloop-nextest-vakint> FAIL [ 0.189s] (50/74) vakint::integral_evaluation_analytic_tests test_integrate_4l_clover
  189. 30.53 s gammaloop-nextest-vakint> stdout ---
  190. 30.53 s gammaloop-nextest-vakint>
  191. 30.53 s gammaloop-nextest-vakint> running 1 test
  192. 30.53 s gammaloop-nextest-vakint> test test_integrate_4l_clover ... FAILED
  193. 30.53 s gammaloop-nextest-vakint>
  194. 30.53 s gammaloop-nextest-vakint> failures:
  195. 30.53 s gammaloop-nextest-vakint>
  196. 30.53 s gammaloop-nextest-vakint> failures:
  197. 30.53 s gammaloop-nextest-vakint> test_integrate_4l_clover
  198. 30.53 s gammaloop-nextest-vakint>
  199. 30.53 s gammaloop-nextest-vakint> test result: FAILED. 0 passed; 1 failed; 0 ignored; 0 measured; 26 filtered out; finished in 0.18s
  200. 30.53 s gammaloop-nextest-vakint>
  201. 30.53 s gammaloop-nextest-vakint> stderr ---
  202. 30.53 s gammaloop-nextest-vakint>
  203. 30.53 s gammaloop-nextest-vakint> thread 'test_integrate_4l_clover' (424) panicked at crates/vakint/tests/test_utils.rs:554:30:
  204. 30.53 s gammaloop-nextest-vakint> Failed to evaluate integral: the following integral could not be identified using any of the supported topologies: topo(I4L_FG_pinch_4_6_7_8(muvsq,1,1,1,0,1,0,0,0))
  205. 30.53 s gammaloop-nextest-vakint> stack backtrace:
  206. 30.53 s gammaloop-nextest-vakint> 0: __rustc::rust_begin_unwind
  207. 30.53 s gammaloop-nextest-vakint> 1: core::panicking::panic_fmt
  208. 30.53 s gammaloop-nextest-vakint> 2: integral_evaluation_analytic_tests::test_utils::compare_vakint_evaluation_vs_reference::{closure#0}
  209. 30.53 s gammaloop-nextest-vakint> 3: integral_evaluation_analytic_tests::test_utils::compare_vakint_evaluation_vs_reference
  210. 30.53 s gammaloop-nextest-vakint> 4: <integral_evaluation_analytic_tests::test_integrate_4l_clover::{closure#0} as core::ops::function::FnOnce<()>>::call_once
  211. 30.53 s gammaloop-nextest-vakint> note: Some details are omitted, run with `RUST_BACKTRACE=full` for a verbose backtrace.
  212. 30.53 s gammaloop-nextest-vakint>
  213. 30.75 s gammaloop-nextest-vakint> FAIL [ 0.226s] (51/74) vakint::integral_evaluation_analytic_tests test_integrate_4l_clover_with_non_unit_scales
  214. 30.75 s gammaloop-nextest-vakint> stdout ---
  215. 30.75 s gammaloop-nextest-vakint>
  216. 30.75 s gammaloop-nextest-vakint> running 1 test
  217. 30.75 s gammaloop-nextest-vakint> test test_integrate_4l_clover_with_non_unit_scales ... FAILED
  218. 30.75 s gammaloop-nextest-vakint>
  219. 30.75 s gammaloop-nextest-vakint> failures:
  220. 30.75 s gammaloop-nextest-vakint>
  221. 30.75 s gammaloop-nextest-vakint> failures:
  222. 30.75 s gammaloop-nextest-vakint> test_integrate_4l_clover_with_non_unit_scales
  223. 30.75 s gammaloop-nextest-vakint>
  224. 30.75 s gammaloop-nextest-vakint> test result: FAILED. 0 passed; 1 failed; 0 ignored; 0 measured; 26 filtered out; finished in 0.22s
  225. 30.75 s gammaloop-nextest-vakint>
  226. 30.75 s gammaloop-nextest-vakint> stderr ---
  227. 30.75 s gammaloop-nextest-vakint>
  228. 30.75 s gammaloop-nextest-vakint> thread 'test_integrate_4l_clover_with_non_unit_scales' (429) panicked at crates/vakint/tests/test_utils.rs:554:30:
  229. 30.75 s gammaloop-nextest-vakint> Failed to evaluate integral: the following integral could not be identified using any of the supported topologies: topo(I4L_FG_pinch_4_6_7_8(muvsq,1,1,1,0,1,0,0,0))
  230. 30.75 s gammaloop-nextest-vakint> stack backtrace:
  231. 30.75 s gammaloop-nextest-vakint> 0: __rustc::rust_begin_unwind
  232. 30.75 s gammaloop-nextest-vakint> 1: core::panicking::panic_fmt
  233. 30.75 s gammaloop-nextest-vakint> 2: integral_evaluation_analytic_tests::test_utils::compare_vakint_evaluation_vs_reference::{closure#0}
  234. 30.75 s gammaloop-nextest-vakint> 3: integral_evaluation_analytic_tests::test_utils::compare_vakint_evaluation_vs_reference
  235. 30.75 s gammaloop-nextest-vakint> 4: <integral_evaluation_analytic_tests::test_integrate_4l_clover_with_non_unit_scales::{closure#0} as core::ops::function::FnOnce<()>>::call_once
  236. 30.75 s gammaloop-nextest-vakint> note: Some details are omitted, run with `RUST_BACKTRACE=full` for a verbose backtrace.
  237. 30.75 s gammaloop-nextest-vakint>
  238. 30.98 s gammaloop-nextest-vakint> FAIL [ 0.225s] (52/74) vakint::integral_evaluation_analytic_tests test_integrate_4l_clover_with_numerator
  239. 30.98 s gammaloop-nextest-vakint> stdout ---
  240. 30.98 s gammaloop-nextest-vakint>
  241. 30.98 s gammaloop-nextest-vakint> running 1 test
  242. 30.98 s gammaloop-nextest-vakint> test test_integrate_4l_clover_with_numerator ... FAILED
  243. 30.98 s gammaloop-nextest-vakint>
  244. 30.98 s gammaloop-nextest-vakint> failures:
  245. 30.98 s gammaloop-nextest-vakint>
  246. 30.98 s gammaloop-nextest-vakint> failures:
  247. 30.98 s gammaloop-nextest-vakint> test_integrate_4l_clover_with_numerator
  248. 30.98 s gammaloop-nextest-vakint>
  249. 30.98 s gammaloop-nextest-vakint> test result: FAILED. 0 passed; 1 failed; 0 ignored; 0 measured; 26 filtered out; finished in 0.22s
  250. 30.98 s gammaloop-nextest-vakint>
  251. 30.98 s gammaloop-nextest-vakint> stderr ---
  252. 30.98 s gammaloop-nextest-vakint>
  253. 30.98 s gammaloop-nextest-vakint> thread 'test_integrate_4l_clover_with_numerator' (434) panicked at crates/vakint/tests/test_utils.rs:554:30:
  254. 30.98 s gammaloop-nextest-vakint> Failed to evaluate integral: the following integral could not be identified using any of the supported topologies: topo(I4L_FG_pinch_4_6_7_8(muvsq,2,1,1,0,1,0,0,0))
  255. 30.98 s gammaloop-nextest-vakint> stack backtrace:
  256. 30.98 s gammaloop-nextest-vakint> 0: __rustc::rust_begin_unwind
  257. 30.98 s gammaloop-nextest-vakint> 1: core::panicking::panic_fmt
  258. 30.98 s gammaloop-nextest-vakint> 2: integral_evaluation_analytic_tests::test_utils::compare_vakint_evaluation_vs_reference::{closure#0}
  259. 30.98 s gammaloop-nextest-vakint> 3: integral_evaluation_analytic_tests::test_utils::compare_vakint_evaluation_vs_reference
  260. 30.98 s gammaloop-nextest-vakint> 4: <integral_evaluation_analytic_tests::test_integrate_4l_clover_with_numerator::{closure#0} as core::ops::function::FnOnce<()>>::call_once
  261. 30.98 s gammaloop-nextest-vakint> note: Some details are omitted, run with `RUST_BACKTRACE=full` for a verbose backtrace.
  262. 30.98 s gammaloop-nextest-vakint>
  263. 31.37 s gammaloop-nextest-vakint> FAIL [ 0.395s] (53/74) vakint::integral_evaluation_analytic_tests test_integrate_4l_dotted_clover
  264. 31.37 s gammaloop-nextest-vakint> stdout ---
  265. 31.37 s gammaloop-nextest-vakint>
  266. 31.37 s gammaloop-nextest-vakint> running 1 test
  267. 31.37 s gammaloop-nextest-vakint> test test_integrate_4l_dotted_clover ... FAILED
  268. 31.37 s gammaloop-nextest-vakint>
  269. 31.37 s gammaloop-nextest-vakint> failures:
  270. 31.37 s gammaloop-nextest-vakint>
  271. 31.37 s gammaloop-nextest-vakint> failures:
  272. 31.37 s gammaloop-nextest-vakint> test_integrate_4l_dotted_clover
  273. 31.37 s gammaloop-nextest-vakint>
  274. 31.37 s gammaloop-nextest-vakint> test result: FAILED. 0 passed; 1 failed; 0 ignored; 0 measured; 26 filtered out; finished in 0.39s
  275. 31.37 s gammaloop-nextest-vakint>
  276. 31.37 s gammaloop-nextest-vakint> stderr ---
  277. 31.37 s gammaloop-nextest-vakint>
  278. 31.37 s gammaloop-nextest-vakint> thread 'test_integrate_4l_dotted_clover' (439) panicked at crates/vakint/tests/test_utils.rs:554:30:
  279. 31.37 s gammaloop-nextest-vakint> Failed to evaluate integral: the following integral could not be identified using any of the supported topologies: topo(I4L_FG_pinch_4_6_7_8(muvsq,2,1,1,0,1,0,0,0))
  280. 31.37 s gammaloop-nextest-vakint> stack backtrace:
  281. 31.37 s gammaloop-nextest-vakint> 0: __rustc::rust_begin_unwind
  282. 31.37 s gammaloop-nextest-vakint> 1: core::panicking::panic_fmt
  283. 31.37 s gammaloop-nextest-vakint> 2: integral_evaluation_analytic_tests::test_utils::compare_vakint_evaluation_vs_reference::{closure#0}
  284. 31.37 s gammaloop-nextest-vakint> 3: integral_evaluation_analytic_tests::test_utils::compare_vakint_evaluation_vs_reference
  285. 31.37 s gammaloop-nextest-vakint> 4: <integral_evaluation_analytic_tests::test_integrate_4l_dotted_clover::{closure#0} as core::ops::function::FnOnce<()>>::call_once
  286. 31.37 s gammaloop-nextest-vakint> note: Some details are omitted, run with `RUST_BACKTRACE=full` for a verbose backtrace.
  287. 31.37 s gammaloop-nextest-vakint>
  288. 34.27 s gammaloop-nextest-vakint> FAIL [ 0.106s] (58/74) vakint::integral_evaluation_freeform_tests test_integrate_1l_decorated_indices_alphaloop
  289. 34.27 s gammaloop-nextest-vakint> stdout ---
  290. 34.27 s gammaloop-nextest-vakint>
  291. 34.27 s gammaloop-nextest-vakint> running 1 test
  292. 34.27 s gammaloop-nextest-vakint> test test_integrate_1l_decorated_indices_alphaloop ... FAILED
  293. 34.27 s gammaloop-nextest-vakint>
  294. 34.27 s gammaloop-nextest-vakint> failures:
  295. 34.27 s gammaloop-nextest-vakint>
  296. 34.27 s gammaloop-nextest-vakint> failures:
  297. 34.27 s gammaloop-nextest-vakint> test_integrate_1l_decorated_indices_alphaloop
  298. 34.27 s gammaloop-nextest-vakint>
  299. 34.27 s gammaloop-nextest-vakint> test result: FAILED. 0 passed; 1 failed; 0 ignored; 0 measured; 3 filtered out; finished in 0.10s
  300. 34.27 s gammaloop-nextest-vakint>
  301. 34.27 s gammaloop-nextest-vakint> stderr ---
  302. 34.27 s gammaloop-nextest-vakint>
  303. 34.27 s gammaloop-nextest-vakint> thread 'test_integrate_1l_decorated_indices_alphaloop' (468) panicked at crates/vakint/tests/test_utils.rs:563:6:
  304. 34.27 s gammaloop-nextest-vakint> called `Result::unwrap()` on an `Err` value: EvaluationError("Is some tensor structure left? | Expression: '(1/4*user_space::{real}::DDMUVsq^2*vakint::{symmetric}::g(user_space::{}::mink4(4,11),user_space::{}::mink4(4,22))+user_space::{real}::DDMUVsq*user_space::{scalar}::DDsigma2(user_space::{}::some_args)*vakint::{symmetric,linear}::dot(vakint::{}::p(1),vakint::{}::p(2))*vakint::{}::vec1(vakint::{}::p(1),13370002)*vakint::{}::vec1(vakint::{}::p(2),13370003)+user_space::{real}::DDMUVsq*user_space::{symmetric,real}::DDsigma3(user_space::{}::some_args)*vakint::{symmetric,linear}::dot(vakint::{}::p(1),vakint::{}::p(2))*vakint::{}::vec1(vakint::{}::p(1),13370002)*vakint::{}::vec1(vakint::{}::p(2),13370003)+user_space::{real}::DDMUVsq*user_space::{}::DDsigma(user_space::{}::some_args)*vakint::{symmetric,linear}::dot(vakint::{}::p(1),vakint::{}::p(2))*vakint::{}::vec1(vakint::{}::p(1),13370002)*vakint::{}::vec1(vakint::{}::p(2),13370003))*1/16*vakint::{}::𝑖*𝜋^(-2)' | Error: 'function vec1(p(1),13370002) is not in a parameter map and does not have an evaluator'")
  305. 34.27 s gammaloop-nextest-vakint> stack backtrace:
  306. 34.27 s gammaloop-nextest-vakint> 0: __rustc::rust_begin_unwind
  307. 34.27 s gammaloop-nextest-vakint> 1: core::panicking::panic_fmt
  308. 34.27 s gammaloop-nextest-vakint> 2: core::result::unwrap_failed
  309. 34.27 s gammaloop-nextest-vakint> 3: integral_evaluation_freeform_tests::test_utils::compare_vakint_evaluation_vs_reference
  310. 34.27 s gammaloop-nextest-vakint> 4: <integral_evaluation_freeform_tests::test_integrate_1l_decorated_indices_alphaloop::{closure#0} as core::ops::function::FnOnce<()>>::call_once
  311. 34.27 s gammaloop-nextest-vakint> note: Some details are omitted, run with `RUST_BACKTRACE=full` for a verbose backtrace.
  312. 34.27 s gammaloop-nextest-vakint>
  313. 34.46 s gammaloop-nextest-vakint> FAIL [ 0.186s] (59/74) vakint::integral_evaluation_freeform_tests test_integrate_1l_decorated_indices_fmft
  314. 34.46 s gammaloop-nextest-vakint> stdout ---
  315. 34.46 s gammaloop-nextest-vakint>
  316. 34.46 s gammaloop-nextest-vakint> running 1 test
  317. 34.46 s gammaloop-nextest-vakint> test test_integrate_1l_decorated_indices_fmft ... FAILED
  318. 34.46 s gammaloop-nextest-vakint>
  319. 34.46 s gammaloop-nextest-vakint> failures:
  320. 34.46 s gammaloop-nextest-vakint>
  321. 34.46 s gammaloop-nextest-vakint> failures:
  322. 34.46 s gammaloop-nextest-vakint> test_integrate_1l_decorated_indices_fmft
  323. 34.46 s gammaloop-nextest-vakint>
  324. 34.46 s gammaloop-nextest-vakint> test result: FAILED. 0 passed; 1 failed; 0 ignored; 0 measured; 3 filtered out; finished in 0.18s
  325. 34.46 s gammaloop-nextest-vakint>
  326. 34.46 s gammaloop-nextest-vakint> stderr ---
  327. 34.46 s gammaloop-nextest-vakint>
  328. 34.46 s gammaloop-nextest-vakint> thread 'test_integrate_1l_decorated_indices_fmft' (474) panicked at crates/vakint/tests/test_utils.rs:554:30:
  329. 34.46 s gammaloop-nextest-vakint> Failed to evaluate integral: the following integral could not be identified using any of the supported topologies: topo(I4L_FG_pinch_4_6_7_8(BBMUVsq,1,1,1,0,1,0,0,0))
  330. 34.46 s gammaloop-nextest-vakint> stack backtrace:
  331. 34.46 s gammaloop-nextest-vakint> 0: __rustc::rust_begin_unwind
  332. 34.46 s gammaloop-nextest-vakint> 1: core::panicking::panic_fmt
  333. 34.46 s gammaloop-nextest-vakint> 2: integral_evaluation_freeform_tests::test_utils::compare_vakint_evaluation_vs_reference::{closure#0}
  334. 34.46 s gammaloop-nextest-vakint> 3: integral_evaluation_freeform_tests::test_utils::compare_vakint_evaluation_vs_reference
  335. 34.46 s gammaloop-nextest-vakint> 4: <integral_evaluation_freeform_tests::test_integrate_1l_decorated_indices_fmft::{closure#0} as core::ops::function::FnOnce<()>>::call_once
  336. 34.46 s gammaloop-nextest-vakint> note: Some details are omitted, run with `RUST_BACKTRACE=full` for a verbose backtrace.
  337. 34.46 s gammaloop-nextest-vakint>
  338. 34.54 s gammaloop-nextest-vakint> FAIL [ 0.082s] (60/74) vakint::integral_evaluation_freeform_tests test_integrate_1l_decorated_indices_matad
  339. 34.54 s gammaloop-nextest-vakint> stdout ---
  340. 34.54 s gammaloop-nextest-vakint>
  341. 34.54 s gammaloop-nextest-vakint> running 1 test
  342. 34.54 s gammaloop-nextest-vakint> test test_integrate_1l_decorated_indices_matad ... FAILED
  343. 34.54 s gammaloop-nextest-vakint>
  344. 34.54 s gammaloop-nextest-vakint> failures:
  345. 34.54 s gammaloop-nextest-vakint>
  346. 34.54 s gammaloop-nextest-vakint> failures:
  347. 34.54 s gammaloop-nextest-vakint> test_integrate_1l_decorated_indices_matad
  348. 34.54 s gammaloop-nextest-vakint>
  349. 34.54 s gammaloop-nextest-vakint> test result: FAILED. 0 passed; 1 failed; 0 ignored; 0 measured; 3 filtered out; finished in 0.08s
  350. 34.54 s gammaloop-nextest-vakint>
  351. 34.54 s gammaloop-nextest-vakint> stderr ---
  352. 34.54 s gammaloop-nextest-vakint>
  353. 34.54 s gammaloop-nextest-vakint> thread 'test_integrate_1l_decorated_indices_matad' (479) panicked at crates/vakint/tests/test_utils.rs:554:30:
  354. 34.54 s gammaloop-nextest-vakint> Failed to evaluate integral: FORM run crashed with the following error:
  355. 34.54 s gammaloop-nextest-vakint> stderr:
  356. 34.54 s gammaloop-nextest-vakint> stdout: FORM 5.0.0 (Jan 1 1980) Run: Sat Sep 12 20:41:33 2026
  357. 34.54 s gammaloop-nextest-vakint> #-
  358. 34.54 s gammaloop-nextest-vakint> run_matad.frm Line 11 --> Undeclared variable vec1
  359. 34.54 s gammaloop-nextest-vakint> ~~~" "
  360. 34.54 s gammaloop-nextest-vakint> ~~~" "
  361. 34.54 s gammaloop-nextest-vakint> ~~~" _____ _____ _____ _____ ____ "
  362. 34.54 s gammaloop-nextest-vakint> ~~~" | | _ |_ _| _ | \ ___ ___ ___ "
  363. 34.54 s gammaloop-nextest-vakint> ~~~" | | | | | | | | | | |___| | . | "
  364. 34.54 s gammaloop-nextest-vakint> ~~~" |_|_|_|__|__| |_| |__|__|____/ |_|_|_ | "
  365. 34.54 s gammaloop-nextest-vakint> ~~~" |___| "
  366. 34.54 s gammaloop-nextest-vakint> ~~~" "
  367. 34.54 s gammaloop-nextest-vakint> ~~~" "
  368. 34.54 s gammaloop-nextest-vakint> ~~~" Originally written by M.Steinhauser "
  369. 34.54 s gammaloop-nextest-vakint> ~~~" About exact version contact to: "
  370. 34.54 s gammaloop-nextest-vakint> ~~~" pikelner[at]theor.jinr.ru, Andrey Pikelner "
  371. 34.54 s gammaloop-nextest-vakint> ~~~" "
  372. 34.54 s gammaloop-nextest-vakint> ~~~MATAD called for 1-loop integral
  373. 34.54 s gammaloop-nextest-vakint> Program terminating at -->
  374. 34.54 s gammaloop-nextest-vakint> Terminate called from pre.c:1086 (PreProcessor)
  375. 34.54 s gammaloop-nextest-vakint> 0.00 sec out of 0.00 sec
  376. 34.54 s gammaloop-nextest-vakint>
  377. 34.54 s gammaloop-nextest-vakint> You can rerun the script using:
  378. 34.54 s gammaloop-nextest-vakint> cd "/build/vakint_temp_pid478_1789245693849342430_1" && "form" "run_matad.frm"
  379. 34.54 s gammaloop-nextest-vakint> stack backtrace:
  380. 34.54 s gammaloop-nextest-vakint> 0: __rustc::rust_begin_unwind
  381. 34.54 s gammaloop-nextest-vakint> 1: core::panicking::panic_fmt
  382. 34.54 s gammaloop-nextest-vakint> 2: integral_evaluation_freeform_tests::test_utils::compare_vakint_evaluation_vs_reference::{closure#0}
  383. 34.54 s gammaloop-nextest-vakint> 3: integral_evaluation_freeform_tests::test_utils::compare_vakint_evaluation_vs_reference
  384. 34.54 s gammaloop-nextest-vakint> 4: <integral_evaluation_freeform_tests::test_integrate_1l_decorated_indices_matad::{closure#0} as core::ops::function::FnOnce<()>>::call_once
  385. 34.54 s gammaloop-nextest-vakint> note: Some details are omitted, run with `RUST_BACKTRACE=full` for a verbose backtrace.
  386. 34.54 s gammaloop-nextest-vakint>
  387. 34.76 s gammaloop-nextest-vakint> ------------
  388. 34.76 s gammaloop-nextest-vakint> Summary [ 14.143s] 74 tests run: 61 passed, 13 failed, 0 skipped
  389. 34.76 s gammaloop-nextest-vakint> FAIL [ 0.077s] ( 5/74) vakint::input_matching_tests test_2l_matching_pinched
  390. 34.76 s gammaloop-nextest-vakint> stdout ---
  391. 34.76 s gammaloop-nextest-vakint>
  392. 34.76 s gammaloop-nextest-vakint> running 1 test
  393. 34.76 s gammaloop-nextest-vakint> test test_2l_matching_pinched ... FAILED
  394. 34.76 s gammaloop-nextest-vakint>
  395. 34.76 s gammaloop-nextest-vakint> failures:
  396. 34.76 s gammaloop-nextest-vakint>
  397. 34.76 s gammaloop-nextest-vakint> failures:
  398. 34.76 s gammaloop-nextest-vakint> test_2l_matching_pinched
  399. 34.76 s gammaloop-nextest-vakint>
  400. 34.76 s gammaloop-nextest-vakint> test result: FAILED. 0 passed; 1 failed; 0 ignored; 0 measured; 5 filtered out; finished in 0.07s
  401. 34.76 s gammaloop-nextest-vakint>
  402. 34.76 s gammaloop-nextest-vakint> stderr ---
  403. 34.76 s gammaloop-nextest-vakint>
  404. 34.76 s gammaloop-nextest-vakint> thread 'test_2l_matching_pinched' (170) panicked at crates/vakint/tests/test_utils.rs:202:21:
  405. 34.76 s gammaloop-nextest-vakint> Error: the following integral could not be identified using any of the supported topologies: topo(I2L_pinch_3(mUVsq,2,1,0))
  406. 34.76 s gammaloop-nextest-vakint> stack backtrace:
  407. 34.76 s gammaloop-nextest-vakint> 0: __rustc::rust_begin_unwind
  408. 34.76 s gammaloop-nextest-vakint> 1: core::panicking::panic_fmt
  409. 34.76 s gammaloop-nextest-vakint> 2: input_matching_tests::test_utils::compare_output
  410. 34.76 s gammaloop-nextest-vakint> 3: <input_matching_tests::test_2l_matching_pinched::{closure#0} as core::ops::function::FnOnce<()>>::call_once
  411. 34.76 s gammaloop-nextest-vakint> note: Some details are omitted, run with `RUST_BACKTRACE=full` for a verbose backtrace.
  412. 34.76 s gammaloop-nextest-vakint>
  413. 34.76 s gammaloop-nextest-vakint> FAIL [ 0.380s] (12/74) vakint::integral_alphaloop_vs_matad_tests test_integrate_1l_no_numerator_squared_mass
  414. 34.76 s gammaloop-nextest-vakint> stdout ---
  415. 34.76 s gammaloop-nextest-vakint>
  416. 34.76 s gammaloop-nextest-vakint> running 1 test
  417. 34.76 s gammaloop-nextest-vakint>
  418. 34.76 s gammaloop-nextest-vakint> <><><><><>
  419. 34.76 s gammaloop-nextest-vakint>
  420. 34.76 s gammaloop-nextest-vakint>
  421. 34.76 s gammaloop-nextest-vakint> <><><><><>
  422. 34.76 s gammaloop-nextest-vakint>
  423. 34.76 s gammaloop-nextest-vakint> test test_integrate_1l_no_numerator_squared_mass ... FAILED
  424. 34.76 s gammaloop-nextest-vakint>
  425. 34.76 s gammaloop-nextest-vakint> failures:
  426. 34.76 s gammaloop-nextest-vakint>
  427. 34.76 s gammaloop-nextest-vakint> failures:
  428. 34.76 s gammaloop-nextest-vakint> test_integrate_1l_no_numerator_squared_mass
  429. 34.76 s gammaloop-nextest-vakint>
  430. 34.76 s gammaloop-nextest-vakint> test result: FAILED. 0 passed; 1 failed; 0 ignored; 0 measured; 9 filtered out; finished in 0.37s
  431. 34.76 s gammaloop-nextest-vakint>
  432. 34.76 s gammaloop-nextest-vakint> stderr ---
  433. 34.76 s gammaloop-nextest-vakint> [INFO integral_alphaloop_vs_matad_tests::test_utils] Benchmark [AlphaLoop (susbstitute_masters=true)] :: central :
  434. 34.76 s gammaloop-nextest-vakint> ε^-1 : (1.000000000000000000000000000000+0i)
  435. 34.76 s gammaloop-nextest-vakint> ε^ 0 : (4.227843350984671393934879099176e-1+0i)
  436. 34.76 s gammaloop-nextest-vakint> ε^+1 : (1.411840330426439694788883561418+0i)
  437. 34.76 s gammaloop-nextest-vakint> ε^+2 : (5.043612543455534057723233940620e-1+0i)
  438. 34.76 s gammaloop-nextest-vakint> [INFO integral_alphaloop_vs_matad_tests::test_utils] Tested [MATAD (expand_masters=true, susbstitute_masters=true, substitute_hpls=true, direct_numerical_substition=true)] :: central :
  439. 34.76 s gammaloop-nextest-vakint> ε^-1 : (1.000000000000000000000000000000+0i)
  440. 34.76 s gammaloop-nextest-vakint> ε^ 0 : (4.227843350984671393934879099176e-1+0i)
  441. 34.76 s gammaloop-nextest-vakint> ε^+1 : (1.411840330426439694788883561418+0i)
  442. 34.76 s gammaloop-nextest-vakint> ε^+2 : (5.043612543455534057723233940620e-1+0i)
  443. 34.76 s gammaloop-nextest-vakint> [INFO integral_alphaloop_vs_matad_tests::test_utils] matches!
  444. 34.76 s gammaloop-nextest-vakint>
  445. 34.76 s gammaloop-nextest-vakint> thread 'test_integrate_1l_no_numerator_squared_mass' (231) panicked at crates/vakint/tests/test_utils.rs:416:13:
  446. 34.76 s gammaloop-nextest-vakint> Error during numerical evaluation of benchmark result with [MATAD (expand_masters=true, susbstitute_masters=true, substitute_hpls=true, direct_numerical_substition=true)] :: error:
  447. 34.76 s gammaloop-nextest-vakint> Numerical evaluation error: Is some tensor structure left? | Expression: '-1*user_space::{}::muv^2+2*vakint::{}::M' | Error: 'variable M is not in a parameter map and does not have an evaluator'
  448. 34.76 s gammaloop-nextest-vakint> stack backtrace:
  449. 34.76 s gammaloop-nextest-vakint> 0: __rustc::rust_begin_unwind
  450. 34.76 s gammaloop-nextest-vakint> 1: core::panicking::panic_fmt
  451. 34.76 s gammaloop-nextest-vakint> 2: integral_alphaloop_vs_matad_tests::test_utils::compare_two_evaluations
  452. 34.76 s gammaloop-nextest-vakint> 3: <integral_alphaloop_vs_matad_tests::test_integrate_1l_no_numerator_squared_mass::{closure#0} as core::ops::function::FnOnce<()>>::call_once
  453. 34.76 s gammaloop-nextest-vakint> note: Some details are omitted, run with `RUST_BACKTRACE=full` for a verbose backtrace.
  454. 34.76 s gammaloop-nextest-vakint>
  455. 34.76 s gammaloop-nextest-vakint> FAIL [ 0.088s] (14/74) vakint::integral_alphaloop_vs_matad_tests test_integrate_3l_basketball_a
  456. 34.76 s gammaloop-nextest-vakint> stdout ---
  457. 34.76 s gammaloop-nextest-vakint>
  458. 34.76 s gammaloop-nextest-vakint> running 1 test
  459. 34.76 s gammaloop-nextest-vakint> test test_integrate_3l_basketball_a ... FAILED
  460. 34.76 s gammaloop-nextest-vakint>
  461. 34.76 s gammaloop-nextest-vakint> failures:
  462. 34.76 s gammaloop-nextest-vakint>
  463. 34.77 s gammaloop-nextest-vakint> failures:
  464. 34.77 s gammaloop-nextest-vakint> test_integrate_3l_basketball_a
  465. 34.77 s gammaloop-nextest-vakint>
  466. 34.77 s gammaloop-nextest-vakint> test result: FAILED. 0 passed; 1 failed; 0 ignored; 0 measured; 9 filtered out; finished in 0.08s
  467. 34.77 s gammaloop-nextest-vakint>
  468. 34.77 s gammaloop-nextest-vakint> stderr ---
  469. 34.77 s gammaloop-nextest-vakint>
  470. 34.77 s gammaloop-nextest-vakint> thread 'test_integrate_3l_basketball_a' (252) panicked at crates/vakint/tests/test_utils.rs:350:13:
  471. 34.77 s gammaloop-nextest-vakint> Error during benchmark integral evaluation with [AlphaLoop (susbstitute_masters=true)] :: error :
  472. 34.77 s gammaloop-nextest-vakint> the following integral could not be identified using any of the supported topologies: topo(I3L_pinch_1_6(muvsq,0,1,1,1,1,0))
  473. 34.77 s gammaloop-nextest-vakint> stack backtrace:
  474. 34.77 s gammaloop-nextest-vakint> 0: __rustc::rust_begin_unwind
  475. 34.77 s gammaloop-nextest-vakint> 1: core::panicking::panic_fmt
  476. 34.77 s gammaloop-nextest-vakint> 2: integral_alphaloop_vs_matad_tests::test_utils::compare_two_evaluations
  477. 34.77 s gammaloop-nextest-vakint> 3: <integral_alphaloop_vs_matad_tests::test_integrate_3l_basketball_a::{closure#0} as core::ops::function::FnOnce<()>>::call_once
  478. 34.77 s gammaloop-nextest-vakint> note: Some details are omitted, run with `RUST_BACKTRACE=full` for a verbose backtrace.
  479. 34.77 s gammaloop-nextest-vakint>
  480. 34.77 s gammaloop-nextest-vakint> FAIL [ 0.083s] (15/74) vakint::integral_alphaloop_vs_matad_tests test_integrate_3l_basketball_b
  481. 34.77 s gammaloop-nextest-vakint> stdout ---
  482. 34.77 s gammaloop-nextest-vakint>
  483. 34.77 s gammaloop-nextest-vakint> running 1 test
  484. 34.77 s gammaloop-nextest-vakint> test test_integrate_3l_basketball_b ... FAILED
  485. 34.77 s gammaloop-nextest-vakint>
  486. 34.77 s gammaloop-nextest-vakint> failures:
  487. 34.77 s gammaloop-nextest-vakint>
  488. 34.77 s gammaloop-nextest-vakint> failures:
  489. 34.77 s gammaloop-nextest-vakint> test_integrate_3l_basketball_b
  490. 34.77 s gammaloop-nextest-vakint>
  491. 34.77 s gammaloop-nextest-vakint> test result: FAILED. 0 passed; 1 failed; 0 ignored; 0 measured; 9 filtered out; finished in 0.08s
  492. 34.77 s gammaloop-nextest-vakint>
  493. 34.77 s gammaloop-nextest-vakint> stderr ---
  494. 34.77 s gammaloop-nextest-vakint>
  495. 34.77 s gammaloop-nextest-vakint> thread 'test_integrate_3l_basketball_b' (257) panicked at crates/vakint/tests/test_utils.rs:350:13:
  496. 34.77 s gammaloop-nextest-vakint> Error during benchmark integral evaluation with [AlphaLoop (susbstitute_masters=true)] :: error :
  497. 34.77 s gammaloop-nextest-vakint> the following integral could not be identified using any of the supported topologies: topo(I3L_pinch_1_6(muvsq,0,1,1,1,1,0))
  498. 34.77 s gammaloop-nextest-vakint> stack backtrace:
  499. 34.77 s gammaloop-nextest-vakint> 0: __rustc::rust_begin_unwind
  500. 34.77 s gammaloop-nextest-vakint> 1: core::panicking::panic_fmt
  501. 34.77 s gammaloop-nextest-vakint> 2: integral_alphaloop_vs_matad_tests::test_utils::compare_two_evaluations
  502. 34.77 s gammaloop-nextest-vakint> 3: <integral_alphaloop_vs_matad_tests::test_integrate_3l_basketball_b::{closure#0} as core::ops::function::FnOnce<()>>::call_once
  503. 34.77 s gammaloop-nextest-vakint> note: Some details are omitted, run with `RUST_BACKTRACE=full` for a verbose backtrace.
  504. 34.77 s gammaloop-nextest-vakint>
  505. 34.77 s gammaloop-nextest-vakint> FAIL [ 0.124s] (46/74) vakint::integral_evaluation_analytic_tests test_integrate_4l_PR9d_from_FG_pinch
  506. 34.77 s gammaloop-nextest-vakint> stdout ---
  507. 34.77 s gammaloop-nextest-vakint>
  508. 34.77 s gammaloop-nextest-vakint> running 1 test
  509. 34.77 s gammaloop-nextest-vakint> test test_integrate_4l_PR9d_from_FG_pinch ... FAILED
  510. 34.77 s gammaloop-nextest-vakint>
  511. 34.77 s gammaloop-nextest-vakint> failures:
  512. 34.77 s gammaloop-nextest-vakint>
  513. 34.77 s gammaloop-nextest-vakint> failures:
  514. 34.77 s gammaloop-nextest-vakint> test_integrate_4l_PR9d_from_FG_pinch
  515. 34.77 s gammaloop-nextest-vakint>
  516. 34.77 s gammaloop-nextest-vakint> test result: FAILED. 0 passed; 1 failed; 0 ignored; 0 measured; 26 filtered out; finished in 0.12s
  517. 34.77 s gammaloop-nextest-vakint>
  518. 34.77 s gammaloop-nextest-vakint> stderr ---
  519. 34.77 s gammaloop-nextest-vakint>
  520. 34.77 s gammaloop-nextest-vakint> thread 'test_integrate_4l_PR9d_from_FG_pinch' (402) panicked at crates/vakint/tests/test_utils.rs:554:30:
  521. 34.77 s gammaloop-nextest-vakint> Failed to evaluate integral: the following integral could not be identified using any of the supported topologies: topo(I4L_FG_pinch_4(muvsq,1,2,1,0,1,1,1,1))
  522. 34.77 s gammaloop-nextest-vakint> stack backtrace:
  523. 34.77 s gammaloop-nextest-vakint> 0: __rustc::rust_begin_unwind
  524. 34.77 s gammaloop-nextest-vakint> 1: core::panicking::panic_fmt
  525. 34.77 s gammaloop-nextest-vakint> 2: integral_evaluation_analytic_tests::test_utils::compare_vakint_evaluation_vs_reference::{closure#0}
  526. 34.77 s gammaloop-nextest-vakint> 3: integral_evaluation_analytic_tests::test_utils::compare_vakint_evaluation_vs_reference
  527. 34.77 s gammaloop-nextest-vakint> 4: <integral_evaluation_analytic_tests::test_integrate_4l_PR9d_from_FG_pinch::{closure#0} as core::ops::function::FnOnce<()>>::call_once
  528. 34.77 s gammaloop-nextest-vakint> note: Some details are omitted, run with `RUST_BACKTRACE=full` for a verbose backtrace.
  529. 34.77 s gammaloop-nextest-vakint>
  530. 34.77 s gammaloop-nextest-vakint> FAIL [ 0.255s] (48/74) vakint::integral_evaluation_analytic_tests test_integrate_4l_PR9d_from_H_pinch
  531. 34.77 s gammaloop-nextest-vakint> stdout ---
  532. 34.77 s gammaloop-nextest-vakint>
  533. 34.77 s gammaloop-nextest-vakint> running 1 test
  534. 34.77 s gammaloop-nextest-vakint> test test_integrate_4l_PR9d_from_H_pinch ... FAILED
  535. 34.77 s gammaloop-nextest-vakint>
  536. 34.77 s gammaloop-nextest-vakint> failures:
  537. 34.77 s gammaloop-nextest-vakint>
  538. 34.77 s gammaloop-nextest-vakint> failures:
  539. 34.77 s gammaloop-nextest-vakint> test_integrate_4l_PR9d_from_H_pinch
  540. 34.77 s gammaloop-nextest-vakint>
  541. 34.77 s gammaloop-nextest-vakint> test result: FAILED. 0 passed; 1 failed; 0 ignored; 0 measured; 26 filtered out; finished in 0.25s
  542. 34.77 s gammaloop-nextest-vakint>
  543. 34.77 s gammaloop-nextest-vakint> stderr ---
  544. 34.77 s gammaloop-nextest-vakint>
  545. 34.77 s gammaloop-nextest-vakint> thread 'test_integrate_4l_PR9d_from_H_pinch' (413) panicked at crates/vakint/tests/test_utils.rs:554:30:
  546. 34.78 s gammaloop-nextest-vakint> Failed to evaluate integral: the following integral could not be identified using any of the supported topologies: topo(I4L_FG_pinch_4(muvsq,1,2,1,0,1,1,1,1))
  547. 34.78 s gammaloop-nextest-vakint> stack backtrace:
  548. 34.78 s gammaloop-nextest-vakint> 0: __rustc::rust_begin_unwind
  549. 34.78 s gammaloop-nextest-vakint> 1: core::panicking::panic_fmt
  550. 34.78 s gammaloop-nextest-vakint> 2: integral_evaluation_analytic_tests::test_utils::compare_vakint_evaluation_vs_reference::{closure#0}
  551. 34.78 s gammaloop-nextest-vakint> 3: integral_evaluation_analytic_tests::test_utils::compare_vakint_evaluation_vs_reference
  552. 34.78 s gammaloop-nextest-vakint> 4: <integral_evaluation_analytic_tests::test_integrate_4l_PR9d_from_H_pinch::{closure#0} as core::ops::function::FnOnce<()>>::call_once
  553. 34.78 s gammaloop-nextest-vakint> note: Some details are omitted, run with `RUST_BACKTRACE=full` for a verbose backtrace.
  554. 34.78 s gammaloop-nextest-vakint>
  555. 34.78 s gammaloop-nextest-vakint> FAIL [ 0.189s] (50/74) vakint::integral_evaluation_analytic_tests test_integrate_4l_clover
  556. 34.78 s gammaloop-nextest-vakint> stdout ---
  557. 34.78 s gammaloop-nextest-vakint>
  558. 34.78 s gammaloop-nextest-vakint> running 1 test
  559. 34.78 s gammaloop-nextest-vakint> test test_integrate_4l_clover ... FAILED
  560. 34.78 s gammaloop-nextest-vakint>
  561. 34.78 s gammaloop-nextest-vakint> failures:
  562. 34.78 s gammaloop-nextest-vakint>
  563. 34.78 s gammaloop-nextest-vakint> failures:
  564. 34.78 s gammaloop-nextest-vakint> test_integrate_4l_clover
  565. 34.78 s gammaloop-nextest-vakint>
  566. 34.78 s gammaloop-nextest-vakint> test result: FAILED. 0 passed; 1 failed; 0 ignored; 0 measured; 26 filtered out; finished in 0.18s
  567. 34.78 s gammaloop-nextest-vakint>
  568. 34.78 s gammaloop-nextest-vakint> stderr ---
  569. 34.78 s gammaloop-nextest-vakint>
  570. 34.78 s gammaloop-nextest-vakint> thread 'test_integrate_4l_clover' (424) panicked at crates/vakint/tests/test_utils.rs:554:30:
  571. 34.78 s gammaloop-nextest-vakint> Failed to evaluate integral: the following integral could not be identified using any of the supported topologies: topo(I4L_FG_pinch_4_6_7_8(muvsq,1,1,1,0,1,0,0,0))
  572. 34.78 s gammaloop-nextest-vakint> stack backtrace:
  573. 34.78 s gammaloop-nextest-vakint> 0: __rustc::rust_begin_unwind
  574. 34.78 s gammaloop-nextest-vakint> 1: core::panicking::panic_fmt
  575. 34.78 s gammaloop-nextest-vakint> 2: integral_evaluation_analytic_tests::test_utils::compare_vakint_evaluation_vs_reference::{closure#0}
  576. 34.78 s gammaloop-nextest-vakint> 3: integral_evaluation_analytic_tests::test_utils::compare_vakint_evaluation_vs_reference
  577. 34.78 s gammaloop-nextest-vakint> 4: <integral_evaluation_analytic_tests::test_integrate_4l_clover::{closure#0} as core::ops::function::FnOnce<()>>::call_once
  578. 34.78 s gammaloop-nextest-vakint> note: Some details are omitted, run with `RUST_BACKTRACE=full` for a verbose backtrace.
  579. 34.78 s gammaloop-nextest-vakint>
  580. 34.78 s gammaloop-nextest-vakint> FAIL [ 0.226s] (51/74) vakint::integral_evaluation_analytic_tests test_integrate_4l_clover_with_non_unit_scales
  581. 34.78 s gammaloop-nextest-vakint> stdout ---
  582. 34.78 s gammaloop-nextest-vakint>
  583. 34.78 s gammaloop-nextest-vakint> running 1 test
  584. 34.78 s gammaloop-nextest-vakint> test test_integrate_4l_clover_with_non_unit_scales ... FAILED
  585. 34.78 s gammaloop-nextest-vakint>
  586. 34.78 s gammaloop-nextest-vakint> failures:
  587. 34.78 s gammaloop-nextest-vakint>
  588. 34.78 s gammaloop-nextest-vakint> failures:
  589. 34.78 s gammaloop-nextest-vakint> test_integrate_4l_clover_with_non_unit_scales
  590. 34.78 s gammaloop-nextest-vakint>
  591. 34.78 s gammaloop-nextest-vakint> test result: FAILED. 0 passed; 1 failed; 0 ignored; 0 measured; 26 filtered out; finished in 0.22s
  592. 34.78 s gammaloop-nextest-vakint>
  593. 34.78 s gammaloop-nextest-vakint> stderr ---
  594. 34.78 s gammaloop-nextest-vakint>
  595. 34.78 s gammaloop-nextest-vakint> thread 'test_integrate_4l_clover_with_non_unit_scales' (429) panicked at crates/vakint/tests/test_utils.rs:554:30:
  596. 34.78 s gammaloop-nextest-vakint> Failed to evaluate integral: the following integral could not be identified using any of the supported topologies: topo(I4L_FG_pinch_4_6_7_8(muvsq,1,1,1,0,1,0,0,0))
  597. 34.78 s gammaloop-nextest-vakint> stack backtrace:
  598. 34.78 s gammaloop-nextest-vakint> 0: __rustc::rust_begin_unwind
  599. 34.78 s gammaloop-nextest-vakint> 1: core::panicking::panic_fmt
  600. 34.78 s gammaloop-nextest-vakint> 2: integral_evaluation_analytic_tests::test_utils::compare_vakint_evaluation_vs_reference::{closure#0}
  601. 34.78 s gammaloop-nextest-vakint> 3: integral_evaluation_analytic_tests::test_utils::compare_vakint_evaluation_vs_reference
  602. 34.78 s gammaloop-nextest-vakint> 4: <integral_evaluation_analytic_tests::test_integrate_4l_clover_with_non_unit_scales::{closure#0} as core::ops::function::FnOnce<()>>::call_once
  603. 34.78 s gammaloop-nextest-vakint> note: Some details are omitted, run with `RUST_BACKTRACE=full` for a verbose backtrace.
  604. 34.78 s gammaloop-nextest-vakint>
  605. 34.78 s gammaloop-nextest-vakint> FAIL [ 0.225s] (52/74) vakint::integral_evaluation_analytic_tests test_integrate_4l_clover_with_numerator
  606. 34.78 s gammaloop-nextest-vakint> stdout ---
  607. 34.78 s gammaloop-nextest-vakint>
  608. 34.78 s gammaloop-nextest-vakint> running 1 test
  609. 34.78 s gammaloop-nextest-vakint> test test_integrate_4l_clover_with_numerator ... FAILED
  610. 34.78 s gammaloop-nextest-vakint>
  611. 34.78 s gammaloop-nextest-vakint> failures:
  612. 34.78 s gammaloop-nextest-vakint>
  613. 34.78 s gammaloop-nextest-vakint> failures:
  614. 34.78 s gammaloop-nextest-vakint> test_integrate_4l_clover_with_numerator
  615. 34.78 s gammaloop-nextest-vakint>
  616. 34.78 s gammaloop-nextest-vakint> test result: FAILED. 0 passed; 1 failed; 0 ignored; 0 measured; 26 filtered out; finished in 0.22s
  617. 34.78 s gammaloop-nextest-vakint>
  618. 34.78 s gammaloop-nextest-vakint> stderr ---
  619. 34.78 s gammaloop-nextest-vakint>
  620. 34.78 s gammaloop-nextest-vakint> thread 'test_integrate_4l_clover_with_numerator' (434) panicked at crates/vakint/tests/test_utils.rs:554:30:
  621. 34.78 s gammaloop-nextest-vakint> Failed to evaluate integral: the following integral could not be identified using any of the supported topologies: topo(I4L_FG_pinch_4_6_7_8(muvsq,2,1,1,0,1,0,0,0))
  622. 34.78 s gammaloop-nextest-vakint> stack backtrace:
  623. 34.78 s gammaloop-nextest-vakint> 0: __rustc::rust_begin_unwind
  624. 34.78 s gammaloop-nextest-vakint> 1: core::panicking::panic_fmt
  625. 34.78 s gammaloop-nextest-vakint> 2: integral_evaluation_analytic_tests::test_utils::compare_vakint_evaluation_vs_reference::{closure#0}
  626. 34.78 s gammaloop-nextest-vakint> 3: integral_evaluation_analytic_tests::test_utils::compare_vakint_evaluation_vs_reference
  627. 34.78 s gammaloop-nextest-vakint> 4: <integral_evaluation_analytic_tests::test_integrate_4l_clover_with_numerator::{closure#0} as core::ops::function::FnOnce<()>>::call_once
  628. 34.78 s gammaloop-nextest-vakint> note: Some details are omitted, run with `RUST_BACKTRACE=full` for a verbose backtrace.
  629. 34.78 s gammaloop-nextest-vakint>
  630. 34.78 s gammaloop-nextest-vakint> FAIL [ 0.395s] (53/74) vakint::integral_evaluation_analytic_tests test_integrate_4l_dotted_clover
  631. 34.78 s gammaloop-nextest-vakint> stdout ---
  632. 34.78 s gammaloop-nextest-vakint>
  633. 34.78 s gammaloop-nextest-vakint> running 1 test
  634. 34.78 s gammaloop-nextest-vakint> test test_integrate_4l_dotted_clover ... FAILED
  635. 34.78 s gammaloop-nextest-vakint>
  636. 34.78 s gammaloop-nextest-vakint> failures:
  637. 34.78 s gammaloop-nextest-vakint>
  638. 34.78 s gammaloop-nextest-vakint> failures:
  639. 34.78 s gammaloop-nextest-vakint> test_integrate_4l_dotted_clover
  640. 34.78 s gammaloop-nextest-vakint>
  641. 34.78 s gammaloop-nextest-vakint> test result: FAILED. 0 passed; 1 failed; 0 ignored; 0 measured; 26 filtered out; finished in 0.39s
  642. 34.78 s gammaloop-nextest-vakint>
  643. 34.78 s gammaloop-nextest-vakint> stderr ---
  644. 34.78 s gammaloop-nextest-vakint>
  645. 34.78 s gammaloop-nextest-vakint> thread 'test_integrate_4l_dotted_clover' (439) panicked at crates/vakint/tests/test_utils.rs:554:30:
  646. 34.78 s gammaloop-nextest-vakint> Failed to evaluate integral: the following integral could not be identified using any of the supported topologies: topo(I4L_FG_pinch_4_6_7_8(muvsq,2,1,1,0,1,0,0,0))
  647. 34.78 s gammaloop-nextest-vakint> stack backtrace:
  648. 34.78 s gammaloop-nextest-vakint> 0: __rustc::rust_begin_unwind
  649. 34.78 s gammaloop-nextest-vakint> 1: core::panicking::panic_fmt
  650. 34.78 s gammaloop-nextest-vakint> 2: integral_evaluation_analytic_tests::test_utils::compare_vakint_evaluation_vs_reference::{closure#0}
  651. 34.78 s gammaloop-nextest-vakint> 3: integral_evaluation_analytic_tests::test_utils::compare_vakint_evaluation_vs_reference
  652. 34.78 s gammaloop-nextest-vakint> 4: <integral_evaluation_analytic_tests::test_integrate_4l_dotted_clover::{closure#0} as core::ops::function::FnOnce<()>>::call_once
  653. 34.78 s gammaloop-nextest-vakint> note: Some details are omitted, run with `RUST_BACKTRACE=full` for a verbose backtrace.
  654. 34.78 s gammaloop-nextest-vakint>
  655. 34.78 s gammaloop-nextest-vakint> FAIL [ 0.106s] (58/74) vakint::integral_evaluation_freeform_tests test_integrate_1l_decorated_indices_alphaloop
  656. 34.78 s gammaloop-nextest-vakint> stdout ---
  657. 34.78 s gammaloop-nextest-vakint>
  658. 34.78 s gammaloop-nextest-vakint> running 1 test
  659. 34.78 s gammaloop-nextest-vakint> test test_integrate_1l_decorated_indices_alphaloop ... FAILED
  660. 34.78 s gammaloop-nextest-vakint>
  661. 34.78 s gammaloop-nextest-vakint> failures:
  662. 34.78 s gammaloop-nextest-vakint>
  663. 34.78 s gammaloop-nextest-vakint> failures:
  664. 34.78 s gammaloop-nextest-vakint> test_integrate_1l_decorated_indices_alphaloop
  665. 34.78 s gammaloop-nextest-vakint>
  666. 34.78 s gammaloop-nextest-vakint> test result: FAILED. 0 passed; 1 failed; 0 ignored; 0 measured; 3 filtered out; finished in 0.10s
  667. 34.78 s gammaloop-nextest-vakint>
  668. 34.78 s gammaloop-nextest-vakint> stderr ---
  669. 34.78 s gammaloop-nextest-vakint>
  670. 34.78 s gammaloop-nextest-vakint> thread 'test_integrate_1l_decorated_indices_alphaloop' (468) panicked at crates/vakint/tests/test_utils.rs:563:6:
  671. 34.78 s gammaloop-nextest-vakint> called `Result::unwrap()` on an `Err` value: EvaluationError("Is some tensor structure left? | Expression: '(1/4*user_space::{real}::DDMUVsq^2*vakint::{symmetric}::g(user_space::{}::mink4(4,11),user_space::{}::mink4(4,22))+user_space::{real}::DDMUVsq*user_space::{scalar}::DDsigma2(user_space::{}::some_args)*vakint::{symmetric,linear}::dot(vakint::{}::p(1),vakint::{}::p(2))*vakint::{}::vec1(vakint::{}::p(1),13370002)*vakint::{}::vec1(vakint::{}::p(2),13370003)+user_space::{real}::DDMUVsq*user_space::{symmetric,real}::DDsigma3(user_space::{}::some_args)*vakint::{symmetric,linear}::dot(vakint::{}::p(1),vakint::{}::p(2))*vakint::{}::vec1(vakint::{}::p(1),13370002)*vakint::{}::vec1(vakint::{}::p(2),13370003)+user_space::{real}::DDMUVsq*user_space::{}::DDsigma(user_space::{}::some_args)*vakint::{symmetric,linear}::dot(vakint::{}::p(1),vakint::{}::p(2))*vakint::{}::vec1(vakint::{}::p(1),13370002)*vakint::{}::vec1(vakint::{}::p(2),13370003))*1/16*vakint::{}::𝑖*𝜋^(-2)' | Error: 'function vec1(p(1),13370002) is not in a parameter map and does not have an evaluator'")
  672. 34.78 s gammaloop-nextest-vakint> stack backtrace:
  673. 34.78 s gammaloop-nextest-vakint> 0: __rustc::rust_begin_unwind
  674. 34.78 s gammaloop-nextest-vakint> 1: core::panicking::panic_fmt
  675. 34.78 s gammaloop-nextest-vakint> 2: core::result::unwrap_failed
  676. 34.78 s gammaloop-nextest-vakint> 3: integral_evaluation_freeform_tests::test_utils::compare_vakint_evaluation_vs_reference
  677. 34.78 s gammaloop-nextest-vakint> 4: <integral_evaluation_freeform_tests::test_integrate_1l_decorated_indices_alphaloop::{closure#0} as core::ops::function::FnOnce<()>>::call_once
  678. 34.78 s gammaloop-nextest-vakint> note: Some details are omitted, run with `RUST_BACKTRACE=full` for a verbose backtrace.
  679. 34.78 s gammaloop-nextest-vakint>
  680. 34.78 s gammaloop-nextest-vakint> FAIL [ 0.186s] (59/74) vakint::integral_evaluation_freeform_tests test_integrate_1l_decorated_indices_fmft
  681. 34.78 s gammaloop-nextest-vakint> stdout ---
  682. 34.78 s gammaloop-nextest-vakint>
  683. 34.78 s gammaloop-nextest-vakint> running 1 test
  684. 34.78 s gammaloop-nextest-vakint> test test_integrate_1l_decorated_indices_fmft ... FAILED
  685. 34.78 s gammaloop-nextest-vakint>
  686. 34.78 s gammaloop-nextest-vakint> failures:
  687. 34.78 s gammaloop-nextest-vakint>
  688. 34.78 s gammaloop-nextest-vakint> failures:
  689. 34.78 s gammaloop-nextest-vakint> test_integrate_1l_decorated_indices_fmft
  690. 34.78 s gammaloop-nextest-vakint>
  691. 34.78 s gammaloop-nextest-vakint> test result: FAILED. 0 passed; 1 failed; 0 ignored; 0 measured; 3 filtered out; finished in 0.18s
  692. 34.78 s gammaloop-nextest-vakint>
  693. 34.78 s gammaloop-nextest-vakint> stderr ---
  694. 34.78 s gammaloop-nextest-vakint>
  695. 34.78 s gammaloop-nextest-vakint> thread 'test_integrate_1l_decorated_indices_fmft' (474) panicked at crates/vakint/tests/test_utils.rs:554:30:
  696. 34.78 s gammaloop-nextest-vakint> Failed to evaluate integral: the following integral could not be identified using any of the supported topologies: topo(I4L_FG_pinch_4_6_7_8(BBMUVsq,1,1,1,0,1,0,0,0))
  697. 34.78 s gammaloop-nextest-vakint> stack backtrace:
  698. 34.78 s gammaloop-nextest-vakint> 0: __rustc::rust_begin_unwind
  699. 34.78 s gammaloop-nextest-vakint> 1: core::panicking::panic_fmt
  700. 34.78 s gammaloop-nextest-vakint> 2: integral_evaluation_freeform_tests::test_utils::compare_vakint_evaluation_vs_reference::{closure#0}
  701. 34.78 s gammaloop-nextest-vakint> 3: integral_evaluation_freeform_tests::test_utils::compare_vakint_evaluation_vs_reference
  702. 34.78 s gammaloop-nextest-vakint> 4: <integral_evaluation_freeform_tests::test_integrate_1l_decorated_indices_fmft::{closure#0} as core::ops::function::FnOnce<()>>::call_once
  703. 34.78 s gammaloop-nextest-vakint> note: Some details are omitted, run with `RUST_BACKTRACE=full` for a verbose backtrace.
  704. 34.78 s gammaloop-nextest-vakint>
  705. 34.78 s gammaloop-nextest-vakint> FAIL [ 0.082s] (60/74) vakint::integral_evaluation_freeform_tests test_integrate_1l_decorated_indices_matad
  706. 34.78 s gammaloop-nextest-vakint> stdout ---
  707. 34.78 s gammaloop-nextest-vakint>
  708. 34.78 s gammaloop-nextest-vakint> running 1 test
  709. 34.78 s gammaloop-nextest-vakint> test test_integrate_1l_decorated_indices_matad ... FAILED
  710. 34.78 s gammaloop-nextest-vakint>
  711. 34.78 s gammaloop-nextest-vakint> failures:
  712. 34.78 s gammaloop-nextest-vakint>
  713. 34.78 s gammaloop-nextest-vakint> failures:
  714. 34.78 s gammaloop-nextest-vakint> test_integrate_1l_decorated_indices_matad
  715. 34.78 s gammaloop-nextest-vakint>
  716. 34.78 s gammaloop-nextest-vakint> test result: FAILED. 0 passed; 1 failed; 0 ignored; 0 measured; 3 filtered out; finished in 0.08s
  717. 34.78 s gammaloop-nextest-vakint>
  718. 34.78 s gammaloop-nextest-vakint> stderr ---
  719. 34.78 s gammaloop-nextest-vakint>
  720. 34.78 s gammaloop-nextest-vakint> thread 'test_integrate_1l_decorated_indices_matad' (479) panicked at crates/vakint/tests/test_utils.rs:554:30:
  721. 34.78 s gammaloop-nextest-vakint> Failed to evaluate integral: FORM run crashed with the following error:
  722. 34.78 s gammaloop-nextest-vakint> stderr:
  723. 34.78 s gammaloop-nextest-vakint> stdout: FORM 5.0.0 (Jan 1 1980) Run: Sat Sep 12 20:41:33 2026
  724. 34.78 s gammaloop-nextest-vakint> #-
  725. 34.78 s gammaloop-nextest-vakint> run_matad.frm Line 11 --> Undeclared variable vec1
  726. 34.78 s gammaloop-nextest-vakint> ~~~" "
  727. 34.78 s gammaloop-nextest-vakint> ~~~" "
  728. 34.78 s gammaloop-nextest-vakint> ~~~" _____ _____ _____ _____ ____ "
  729. 34.78 s gammaloop-nextest-vakint> ~~~" | | _ |_ _| _ | \ ___ ___ ___ "
  730. 34.78 s gammaloop-nextest-vakint> ~~~" | | | | | | | | | | |___| | . | "
  731. 34.78 s gammaloop-nextest-vakint> ~~~" |_|_|_|__|__| |_| |__|__|____/ |_|_|_ | "
  732. 34.78 s gammaloop-nextest-vakint> ~~~" |___| "
  733. 34.78 s gammaloop-nextest-vakint> ~~~" "
  734. 34.78 s gammaloop-nextest-vakint> ~~~" "
  735. 34.78 s gammaloop-nextest-vakint> ~~~" Originally written by M.Steinhauser "
  736. 34.78 s gammaloop-nextest-vakint> ~~~" About exact version contact to: "
  737. 34.78 s gammaloop-nextest-vakint> ~~~" pikelner[at]theor.jinr.ru, Andrey Pikelner "
  738. 34.78 s gammaloop-nextest-vakint> ~~~" "
  739. 34.78 s gammaloop-nextest-vakint> ~~~MATAD called for 1-loop integral
  740. 34.78 s gammaloop-nextest-vakint> Program terminating at -->
  741. 34.78 s gammaloop-nextest-vakint> Terminate called from pre.c:1086 (PreProcessor)
  742. 34.78 s gammaloop-nextest-vakint> 0.00 sec out of 0.00 sec
  743. 34.78 s gammaloop-nextest-vakint>
  744. 34.78 s gammaloop-nextest-vakint> You can rerun the script using:
  745. 34.78 s gammaloop-nextest-vakint> cd "/build/vakint_temp_pid478_1789245693849342430_1" && "form" "run_matad.frm"
  746. 34.78 s gammaloop-nextest-vakint> stack backtrace:
  747. 34.78 s gammaloop-nextest-vakint> 0: __rustc::rust_begin_unwind
  748. 34.78 s gammaloop-nextest-vakint> 1: core::panicking::panic_fmt
  749. 34.78 s gammaloop-nextest-vakint> 2: integral_evaluation_freeform_tests::test_utils::compare_vakint_evaluation_vs_reference::{closure#0}
  750. 34.78 s gammaloop-nextest-vakint> 3: integral_evaluation_freeform_tests::test_utils::compare_vakint_evaluation_vs_reference
  751. 34.78 s gammaloop-nextest-vakint> 4: <integral_evaluation_freeform_tests::test_integrate_1l_decorated_indices_matad::{closure#0} as core::ops::function::FnOnce<()>>::call_once
  752. 34.78 s gammaloop-nextest-vakint> note: Some details are omitted, run with `RUST_BACKTRACE=full` for a verbose backtrace.
  753. 34.78 s gammaloop-nextest-vakint>
  754. 34.89 s gammaloop-nextest-vakint> error: test run failed
  755. 34.92 s gammaloop-nextest-vakint>
  756. 34.92 s gammaloop-nextest-vakint> ========== nextest test summary ==========
  757. 34.92 s gammaloop-nextest-vakint> report: target/nextest/ci_gammaloop/junit.xml
  758. 34.92 s gammaloop-nextest-vakint> tests: 74, failures: 13, errors: 0
  759. 34.92 s gammaloop-nextest-vakint>
  760. 34.92 s gammaloop-nextest-vakint> 1. vakint::input_matching_tests::test_2l_matching_pinched
  761. 34.92 s gammaloop-nextest-vakint> failure: test failure with exit code 101
  762. 34.92 s gammaloop-nextest-vakint> thread 'test_2l_matching_pinched' (170) panicked at crates/vakint/tests/test_utils.rs:202:21:
  763. 34.92 s gammaloop-nextest-vakint> Error: the following integral could not be identified using any of the supported topologies: topo(I2L_pinch_3(mUVsq,2,1,0))
  764. 34.92 s gammaloop-nextest-vakint> stack backtrace:
  765. 34.92 s gammaloop-nextest-vakint> 0: __rustc::rust_begin_unwind
  766. 34.92 s gammaloop-nextest-vakint> 1: core::panicking::panic_fmt
  767. 34.92 s gammaloop-nextest-vakint> 2: input_matching_tests::test_utils::compare_output
  768. 34.92 s gammaloop-nextest-vakint> 3: <input_matching_tests::test_2l_matching_pinched::{closure#0} as core::ops::function::FnOnce<()>>::call_once
  769. 34.92 s gammaloop-nextest-vakint> note: Some details are omitted, run with `RUST_BACKTRACE=full` for a verbose backtrace.
  770. 34.92 s gammaloop-nextest-vakint> system-out
  771. 34.92 s gammaloop-nextest-vakint> running 1 test
  772. 34.92 s gammaloop-nextest-vakint> test test_2l_matching_pinched ... FAILED
  773. 34.92 s gammaloop-nextest-vakint>
  774. 34.92 s gammaloop-nextest-vakint> failures:
  775. 34.92 s gammaloop-nextest-vakint>
  776. 34.92 s gammaloop-nextest-vakint> failures:
  777. 34.92 s gammaloop-nextest-vakint> test_2l_matching_pinched
  778. 34.92 s gammaloop-nextest-vakint>
  779. 34.92 s gammaloop-nextest-vakint> test result: FAILED. 0 passed; 1 failed; 0 ignored; 0 measured; 5 filtered out; finished in 0.07s
  780. 34.92 s gammaloop-nextest-vakint> system-err
  781. 34.92 s gammaloop-nextest-vakint> thread 'test_2l_matching_pinched' (170) panicked at crates/vakint/tests/test_utils.rs:202:21:
  782. 34.92 s gammaloop-nextest-vakint> Error: the following integral could not be identified using any of the supported topologies: topo(I2L_pinch_3(mUVsq,2,1,0))
  783. 34.92 s gammaloop-nextest-vakint> stack backtrace:
  784. 34.92 s gammaloop-nextest-vakint> 0: __rustc::rust_begin_unwind
  785. 34.92 s gammaloop-nextest-vakint> 1: core::panicking::panic_fmt
  786. 34.92 s gammaloop-nextest-vakint> 2: input_matching_tests::test_utils::compare_output
  787. 34.92 s gammaloop-nextest-vakint> 3: <input_matching_tests::test_2l_matching_pinched::{closure#0} as core::ops::function::FnOnce<()>>::call_once
  788. 34.92 s gammaloop-nextest-vakint> note: Some details are omitted, run with `RUST_BACKTRACE=full` for a verbose backtrace.
  789. 34.92 s gammaloop-nextest-vakint>
  790. 34.92 s gammaloop-nextest-vakint> 2. vakint::integral_alphaloop_vs_matad_tests::test_integrate_1l_no_numerator_squared_mass
  791. 34.92 s gammaloop-nextest-vakint> failure: test failure with exit code 101
  792. 34.92 s gammaloop-nextest-vakint> thread 'test_integrate_1l_no_numerator_squared_mass' (231) panicked at crates/vakint/tests/test_utils.rs:416:13:
  793. 34.92 s gammaloop-nextest-vakint> Error during numerical evaluation of benchmark result with [MATAD (expand_masters=true, susbstitute_masters=true, substitute_hpls=true, direct_numerical_substition=true)] :: error:
  794. 34.92 s gammaloop-nextest-vakint> Numerical evaluation error: Is some tensor structure left? | Expression: '-1*user_space::{}::muv^2+2*vakint::{}::M' | Error: 'variable M is not in a parameter map and does not have an evaluator'
  795. 34.92 s gammaloop-nextest-vakint> stack backtrace:
  796. 34.92 s gammaloop-nextest-vakint> 0: __rustc::rust_begin_unwind
  797. 34.92 s gammaloop-nextest-vakint> 1: core::panicking::panic_fmt
  798. 34.92 s gammaloop-nextest-vakint> 2: integral_alphaloop_vs_matad_tests::test_utils::compare_two_evaluations
  799. 34.92 s gammaloop-nextest-vakint> 3: <integral_alphaloop_vs_matad_tests::test_integrate_1l_no_numerator_squared_mass::{closure#0} as core::ops::function::FnOnce<()>>::call_once
  800. 34.92 s gammaloop-nextest-vakint> note: Some details are omitted, run with `RUST_BACKTRACE=full` for a verbose backtrace.
  801. 34.92 s gammaloop-nextest-vakint> system-out
  802. 34.92 s gammaloop-nextest-vakint> running 1 test
  803. 34.92 s gammaloop-nextest-vakint>
  804. 34.92 s gammaloop-nextest-vakint> <><><><><>
  805. 34.92 s gammaloop-nextest-vakint>
  806. 34.92 s gammaloop-nextest-vakint>
  807. 34.92 s gammaloop-nextest-vakint> <><><><><>
  808. 34.92 s gammaloop-nextest-vakint>
  809. 34.92 s gammaloop-nextest-vakint> test test_integrate_1l_no_numerator_squared_mass ... FAILED
  810. 34.92 s gammaloop-nextest-vakint>
  811. 34.92 s gammaloop-nextest-vakint> failures:
  812. 34.92 s gammaloop-nextest-vakint>
  813. 34.92 s gammaloop-nextest-vakint> failures:
  814. 34.92 s gammaloop-nextest-vakint> test_integrate_1l_no_numerator_squared_mass
  815. 34.92 s gammaloop-nextest-vakint>
  816. 34.92 s gammaloop-nextest-vakint> test result: FAILED. 0 passed; 1 failed; 0 ignored; 0 measured; 9 filtered out; finished in 0.37s
  817. 34.92 s gammaloop-nextest-vakint> system-err
  818. 34.92 s gammaloop-nextest-vakint> [INFO integral_alphaloop_vs_matad_tests::test_utils] Benchmark [AlphaLoop (susbstitute_masters=true)] :: central :
  819. 34.92 s gammaloop-nextest-vakint> ε^-1 : (1.000000000000000000000000000000+0i)
  820. 34.92 s gammaloop-nextest-vakint> ε^ 0 : (4.227843350984671393934879099176e-1+0i)
  821. 34.92 s gammaloop-nextest-vakint> ε^+1 : (1.411840330426439694788883561418+0i)
  822. 34.92 s gammaloop-nextest-vakint> ε^+2 : (5.043612543455534057723233940620e-1+0i)
  823. 34.92 s gammaloop-nextest-vakint> [INFO integral_alphaloop_vs_matad_tests::test_utils] Tested [MATAD (expand_masters=true, susbstitute_masters=true, substitute_hpls=true, direct_numerical_substition=true)] :: central :
  824. 34.92 s gammaloop-nextest-vakint> ε^-1 : (1.000000000000000000000000000000+0i)
  825. 34.92 s gammaloop-nextest-vakint> ε^ 0 : (4.227843350984671393934879099176e-1+0i)
  826. 34.92 s gammaloop-nextest-vakint> ε^+1 : (1.411840330426439694788883561418+0i)
  827. 34.92 s gammaloop-nextest-vakint> ε^+2 : (5.043612543455534057723233940620e-1+0i)
  828. 34.92 s gammaloop-nextest-vakint> [INFO integral_alphaloop_vs_matad_tests::test_utils] matches!
  829. 34.92 s gammaloop-nextest-vakint>
  830. 34.92 s gammaloop-nextest-vakint> thread 'test_integrate_1l_no_numerator_squared_mass' (231) panicked at crates/vakint/tests/test_utils.rs:416:13:
  831. 34.92 s gammaloop-nextest-vakint> Error during numerical evaluation of benchmark result with [MATAD (expand_masters=true, susbstitute_masters=true, substitute_hpls=true, direct_numerical_substition=true)] :: error:
  832. 34.92 s gammaloop-nextest-vakint> Numerical evaluation error: Is some tensor structure left? | Expression: '-1*user_space::{}::muv^2+2*vakint::{}::M' | Error: 'variable M is not in a parameter map and does not have an evaluator'
  833. 34.92 s gammaloop-nextest-vakint> stack backtrace:
  834. 34.92 s gammaloop-nextest-vakint> 0: __rustc::rust_begin_unwind
  835. 34.92 s gammaloop-nextest-vakint> 1: core::panicking::panic_fmt
  836. 34.92 s gammaloop-nextest-vakint> 2: integral_alphaloop_vs_matad_tests::test_utils::compare_two_evaluations
  837. 34.92 s gammaloop-nextest-vakint> 3: <integral_alphaloop_vs_matad_tests::test_integrate_1l_no_numerator_squared_mass::{closure#0} as core::ops::function::FnOnce<()>>::call_once
  838. 34.92 s gammaloop-nextest-vakint> note: Some details are omitted, run with `RUST_BACKTRACE=full` for a verbose backtrace.
  839. 34.92 s gammaloop-nextest-vakint>
  840. 34.92 s gammaloop-nextest-vakint> 3. vakint::integral_alphaloop_vs_matad_tests::test_integrate_3l_basketball_a
  841. 34.92 s gammaloop-nextest-vakint> failure: test failure with exit code 101
  842. 34.92 s gammaloop-nextest-vakint> thread 'test_integrate_3l_basketball_a' (252) panicked at crates/vakint/tests/test_utils.rs:350:13:
  843. 34.92 s gammaloop-nextest-vakint> Error during benchmark integral evaluation with [AlphaLoop (susbstitute_masters=true)] :: error :
  844. 34.92 s gammaloop-nextest-vakint> the following integral could not be identified using any of the supported topologies: topo(I3L_pinch_1_6(muvsq,0,1,1,1,1,0))
  845. 34.92 s gammaloop-nextest-vakint> stack backtrace:
  846. 34.92 s gammaloop-nextest-vakint> 0: __rustc::rust_begin_unwind
  847. 34.92 s gammaloop-nextest-vakint> 1: core::panicking::panic_fmt
  848. 34.92 s gammaloop-nextest-vakint> 2: integral_alphaloop_vs_matad_tests::test_utils::compare_two_evaluations
  849. 34.92 s gammaloop-nextest-vakint> 3: <integral_alphaloop_vs_matad_tests::test_integrate_3l_basketball_a::{closure#0} as core::ops::function::FnOnce<()>>::call_once
  850. 34.92 s gammaloop-nextest-vakint> note: Some details are omitted, run with `RUST_BACKTRACE=full` for a verbose backtrace.
  851. 34.92 s gammaloop-nextest-vakint> system-out
  852. 34.92 s gammaloop-nextest-vakint> running 1 test
  853. 34.92 s gammaloop-nextest-vakint> test test_integrate_3l_basketball_a ... FAILED
  854. 34.92 s gammaloop-nextest-vakint>
  855. 34.92 s gammaloop-nextest-vakint> failures:
  856. 34.92 s gammaloop-nextest-vakint>
  857. 34.92 s gammaloop-nextest-vakint> failures:
  858. 34.92 s gammaloop-nextest-vakint> test_integrate_3l_basketball_a
  859. 34.92 s gammaloop-nextest-vakint>
  860. 34.92 s gammaloop-nextest-vakint> test result: FAILED. 0 passed; 1 failed; 0 ignored; 0 measured; 9 filtered out; finished in 0.08s
  861. 34.92 s gammaloop-nextest-vakint> system-err
  862. 34.92 s gammaloop-nextest-vakint> thread 'test_integrate_3l_basketball_a' (252) panicked at crates/vakint/tests/test_utils.rs:350:13:
  863. 34.92 s gammaloop-nextest-vakint> Error during benchmark integral evaluation with [AlphaLoop (susbstitute_masters=true)] :: error :
  864. 34.92 s gammaloop-nextest-vakint> the following integral could not be identified using any of the supported topologies: topo(I3L_pinch_1_6(muvsq,0,1,1,1,1,0))
  865. 34.92 s gammaloop-nextest-vakint> stack backtrace:
  866. 34.92 s gammaloop-nextest-vakint> 0: __rustc::rust_begin_unwind
  867. 34.92 s gammaloop-nextest-vakint> 1: core::panicking::panic_fmt
  868. 34.92 s gammaloop-nextest-vakint> 2: integral_alphaloop_vs_matad_tests::test_utils::compare_two_evaluations
  869. 34.92 s gammaloop-nextest-vakint> 3: <integral_alphaloop_vs_matad_tests::test_integrate_3l_basketball_a::{closure#0} as core::ops::function::FnOnce<()>>::call_once
  870. 34.92 s gammaloop-nextest-vakint> note: Some details are omitted, run with `RUST_BACKTRACE=full` for a verbose backtrace.
  871. 34.92 s gammaloop-nextest-vakint>
  872. 34.92 s gammaloop-nextest-vakint> 4. vakint::integral_alphaloop_vs_matad_tests::test_integrate_3l_basketball_b
  873. 34.92 s gammaloop-nextest-vakint> failure: test failure with exit code 101
  874. 34.92 s gammaloop-nextest-vakint> thread 'test_integrate_3l_basketball_b' (257) panicked at crates/vakint/tests/test_utils.rs:350:13:
  875. 34.92 s gammaloop-nextest-vakint> Error during benchmark integral evaluation with [AlphaLoop (susbstitute_masters=true)] :: error :
  876. 34.92 s gammaloop-nextest-vakint> the following integral could not be identified using any of the supported topologies: topo(I3L_pinch_1_6(muvsq,0,1,1,1,1,0))
  877. 34.92 s gammaloop-nextest-vakint> stack backtrace:
  878. 34.92 s gammaloop-nextest-vakint> 0: __rustc::rust_begin_unwind
  879. 34.92 s gammaloop-nextest-vakint> 1: core::panicking::panic_fmt
  880. 34.92 s gammaloop-nextest-vakint> 2: integral_alphaloop_vs_matad_tests::test_utils::compare_two_evaluations
  881. 34.92 s gammaloop-nextest-vakint> 3: <integral_alphaloop_vs_matad_tests::test_integrate_3l_basketball_b::{closure#0} as core::ops::function::FnOnce<()>>::call_once
  882. 34.92 s gammaloop-nextest-vakint> note: Some details are omitted, run with `RUST_BACKTRACE=full` for a verbose backtrace.
  883. 34.92 s gammaloop-nextest-vakint> system-out
  884. 34.92 s gammaloop-nextest-vakint> running 1 test
  885. 34.92 s gammaloop-nextest-vakint> test test_integrate_3l_basketball_b ... FAILED
  886. 34.92 s gammaloop-nextest-vakint>
  887. 34.92 s gammaloop-nextest-vakint> failures:
  888. 34.92 s gammaloop-nextest-vakint>
  889. 34.92 s gammaloop-nextest-vakint> failures:
  890. 34.92 s gammaloop-nextest-vakint> test_integrate_3l_basketball_b
  891. 34.92 s gammaloop-nextest-vakint>
  892. 34.92 s gammaloop-nextest-vakint> test result: FAILED. 0 passed; 1 failed; 0 ignored; 0 measured; 9 filtered out; finished in 0.08s
  893. 34.92 s gammaloop-nextest-vakint> system-err
  894. 34.92 s gammaloop-nextest-vakint> thread 'test_integrate_3l_basketball_b' (257) panicked at crates/vakint/tests/test_utils.rs:350:13:
  895. 34.92 s gammaloop-nextest-vakint> Error during benchmark integral evaluation with [AlphaLoop (susbstitute_masters=true)] :: error :
  896. 34.92 s gammaloop-nextest-vakint> the following integral could not be identified using any of the supported topologies: topo(I3L_pinch_1_6(muvsq,0,1,1,1,1,0))
  897. 34.92 s gammaloop-nextest-vakint> stack backtrace:
  898. 34.92 s gammaloop-nextest-vakint> 0: __rustc::rust_begin_unwind
  899. 34.92 s gammaloop-nextest-vakint> 1: core::panicking::panic_fmt
  900. 34.92 s gammaloop-nextest-vakint> 2: integral_alphaloop_vs_matad_tests::test_utils::compare_two_evaluations
  901. 34.92 s gammaloop-nextest-vakint> 3: <integral_alphaloop_vs_matad_tests::test_integrate_3l_basketball_b::{closure#0} as core::ops::function::FnOnce<()>>::call_once
  902. 34.92 s gammaloop-nextest-vakint> note: Some details are omitted, run with `RUST_BACKTRACE=full` for a verbose backtrace.
  903. 34.92 s gammaloop-nextest-vakint>
  904. 34.92 s gammaloop-nextest-vakint> 5. vakint::integral_evaluation_analytic_tests::test_integrate_4l_PR9d_from_FG_pinch
  905. 34.92 s gammaloop-nextest-vakint> failure: test failure with exit code 101
  906. 34.92 s gammaloop-nextest-vakint> thread 'test_integrate_4l_PR9d_from_FG_pinch' (402) panicked at crates/vakint/tests/test_utils.rs:554:30:
  907. 34.92 s gammaloop-nextest-vakint> Failed to evaluate integral: the following integral could not be identified using any of the supported topologies: topo(I4L_FG_pinch_4(muvsq,1,2,1,0,1,1,1,1))
  908. 34.92 s gammaloop-nextest-vakint> stack backtrace:
  909. 34.92 s gammaloop-nextest-vakint> 0: __rustc::rust_begin_unwind
  910. 34.92 s gammaloop-nextest-vakint> 1: core::panicking::panic_fmt
  911. 34.92 s gammaloop-nextest-vakint> 2: integral_evaluation_analytic_tests::test_utils::compare_vakint_evaluation_vs_reference::{closure#0}
  912. 34.92 s gammaloop-nextest-vakint> 3: integral_evaluation_analytic_tests::test_utils::compare_vakint_evaluation_vs_reference
  913. 34.92 s gammaloop-nextest-vakint> 4: <integral_evaluation_analytic_tests::test_integrate_4l_PR9d_from_FG_pinch::{closure#0} as core::ops::function::FnOnce<()>>::call_once
  914. 34.92 s gammaloop-nextest-vakint> note: Some details are omitted, run with `RUST_BACKTRACE=full` for a verbose backtrace.
  915. 34.92 s gammaloop-nextest-vakint> system-out
  916. 34.92 s gammaloop-nextest-vakint> running 1 test
  917. 34.92 s gammaloop-nextest-vakint> test test_integrate_4l_PR9d_from_FG_pinch ... FAILED
  918. 34.92 s gammaloop-nextest-vakint>
  919. 34.92 s gammaloop-nextest-vakint> failures:
  920. 34.92 s gammaloop-nextest-vakint>
  921. 34.92 s gammaloop-nextest-vakint> failures:
  922. 34.92 s gammaloop-nextest-vakint> test_integrate_4l_PR9d_from_FG_pinch
  923. 34.92 s gammaloop-nextest-vakint>
  924. 34.92 s gammaloop-nextest-vakint> test result: FAILED. 0 passed; 1 failed; 0 ignored; 0 measured; 26 filtered out; finished in 0.12s
  925. 34.92 s gammaloop-nextest-vakint> system-err
  926. 34.92 s gammaloop-nextest-vakint> thread 'test_integrate_4l_PR9d_from_FG_pinch' (402) panicked at crates/vakint/tests/test_utils.rs:554:30:
  927. 34.92 s gammaloop-nextest-vakint> Failed to evaluate integral: the following integral could not be identified using any of the supported topologies: topo(I4L_FG_pinch_4(muvsq,1,2,1,0,1,1,1,1))
  928. 34.92 s gammaloop-nextest-vakint> stack backtrace:
  929. 34.92 s gammaloop-nextest-vakint> 0: __rustc::rust_begin_unwind
  930. 34.92 s gammaloop-nextest-vakint> 1: core::panicking::panic_fmt
  931. 34.92 s gammaloop-nextest-vakint> 2: integral_evaluation_analytic_tests::test_utils::compare_vakint_evaluation_vs_reference::{closure#0}
  932. 34.92 s gammaloop-nextest-vakint> 3: integral_evaluation_analytic_tests::test_utils::compare_vakint_evaluation_vs_reference
  933. 34.92 s gammaloop-nextest-vakint> 4: <integral_evaluation_analytic_tests::test_integrate_4l_PR9d_from_FG_pinch::{closure#0} as core::ops::function::FnOnce<()>>::call_once
  934. 34.92 s gammaloop-nextest-vakint> note: Some details are omitted, run with `RUST_BACKTRACE=full` for a verbose backtrace.
  935. 34.92 s gammaloop-nextest-vakint>
  936. 34.92 s gammaloop-nextest-vakint> 6. vakint::integral_evaluation_analytic_tests::test_integrate_4l_PR9d_from_H_pinch
  937. 34.92 s gammaloop-nextest-vakint> failure: test failure with exit code 101
  938. 34.92 s gammaloop-nextest-vakint> thread 'test_integrate_4l_PR9d_from_H_pinch' (413) panicked at crates/vakint/tests/test_utils.rs:554:30:
  939. 34.92 s gammaloop-nextest-vakint> Failed to evaluate integral: the following integral could not be identified using any of the supported topologies: topo(I4L_FG_pinch_4(muvsq,1,2,1,0,1,1,1,1))
  940. 34.92 s gammaloop-nextest-vakint> stack backtrace:
  941. 34.92 s gammaloop-nextest-vakint> 0: __rustc::rust_begin_unwind
  942. 34.92 s gammaloop-nextest-vakint> 1: core::panicking::panic_fmt
  943. 34.92 s gammaloop-nextest-vakint> 2: integral_evaluation_analytic_tests::test_utils::compare_vakint_evaluation_vs_reference::{closure#0}
  944. 34.92 s gammaloop-nextest-vakint> 3: integral_evaluation_analytic_tests::test_utils::compare_vakint_evaluation_vs_reference
  945. 34.92 s gammaloop-nextest-vakint> 4: <integral_evaluation_analytic_tests::test_integrate_4l_PR9d_from_H_pinch::{closure#0} as core::ops::function::FnOnce<()>>::call_once
  946. 34.92 s gammaloop-nextest-vakint> note: Some details are omitted, run with `RUST_BACKTRACE=full` for a verbose backtrace.
  947. 34.92 s gammaloop-nextest-vakint> system-out
  948. 34.92 s gammaloop-nextest-vakint> running 1 test
  949. 34.92 s gammaloop-nextest-vakint> test test_integrate_4l_PR9d_from_H_pinch ... FAILED
  950. 34.92 s gammaloop-nextest-vakint>
  951. 34.92 s gammaloop-nextest-vakint> failures:
  952. 34.92 s gammaloop-nextest-vakint>
  953. 34.92 s gammaloop-nextest-vakint> failures:
  954. 34.92 s gammaloop-nextest-vakint> test_integrate_4l_PR9d_from_H_pinch
  955. 34.92 s gammaloop-nextest-vakint>
  956. 34.92 s gammaloop-nextest-vakint> test result: FAILED. 0 passed; 1 failed; 0 ignored; 0 measured; 26 filtered out; finished in 0.25s
  957. 34.92 s gammaloop-nextest-vakint> system-err
  958. 34.92 s gammaloop-nextest-vakint> thread 'test_integrate_4l_PR9d_from_H_pinch' (413) panicked at crates/vakint/tests/test_utils.rs:554:30:
  959. 34.92 s gammaloop-nextest-vakint> Failed to evaluate integral: the following integral could not be identified using any of the supported topologies: topo(I4L_FG_pinch_4(muvsq,1,2,1,0,1,1,1,1))
  960. 34.92 s gammaloop-nextest-vakint> stack backtrace:
  961. 34.92 s gammaloop-nextest-vakint> 0: __rustc::rust_begin_unwind
  962. 34.92 s gammaloop-nextest-vakint> 1: core::panicking::panic_fmt
  963. 34.92 s gammaloop-nextest-vakint> 2: integral_evaluation_analytic_tests::test_utils::compare_vakint_evaluation_vs_reference::{closure#0}
  964. 34.92 s gammaloop-nextest-vakint> 3: integral_evaluation_analytic_tests::test_utils::compare_vakint_evaluation_vs_reference
  965. 34.92 s gammaloop-nextest-vakint> 4: <integral_evaluation_analytic_tests::test_integrate_4l_PR9d_from_H_pinch::{closure#0} as core::ops::function::FnOnce<()>>::call_once
  966. 34.92 s gammaloop-nextest-vakint> note: Some details are omitted, run with `RUST_BACKTRACE=full` for a verbose backtrace.
  967. 34.92 s gammaloop-nextest-vakint>
  968. 34.92 s gammaloop-nextest-vakint> 7. vakint::integral_evaluation_analytic_tests::test_integrate_4l_clover
  969. 34.92 s gammaloop-nextest-vakint> failure: test failure with exit code 101
  970. 34.92 s gammaloop-nextest-vakint> thread 'test_integrate_4l_clover' (424) panicked at crates/vakint/tests/test_utils.rs:554:30:
  971. 34.92 s gammaloop-nextest-vakint> Failed to evaluate integral: the following integral could not be identified using any of the supported topologies: topo(I4L_FG_pinch_4_6_7_8(muvsq,1,1,1,0,1,0,0,0))
  972. 34.92 s gammaloop-nextest-vakint> stack backtrace:
  973. 34.92 s gammaloop-nextest-vakint> 0: __rustc::rust_begin_unwind
  974. 34.92 s gammaloop-nextest-vakint> 1: core::panicking::panic_fmt
  975. 34.92 s gammaloop-nextest-vakint> 2: integral_evaluation_analytic_tests::test_utils::compare_vakint_evaluation_vs_reference::{closure#0}
  976. 34.92 s gammaloop-nextest-vakint> 3: integral_evaluation_analytic_tests::test_utils::compare_vakint_evaluation_vs_reference
  977. 34.92 s gammaloop-nextest-vakint> 4: <integral_evaluation_analytic_tests::test_integrate_4l_clover::{closure#0} as core::ops::function::FnOnce<()>>::call_once
  978. 34.92 s gammaloop-nextest-vakint> note: Some details are omitted, run with `RUST_BACKTRACE=full` for a verbose backtrace.
  979. 34.92 s gammaloop-nextest-vakint> system-out
  980. 34.92 s gammaloop-nextest-vakint> running 1 test
  981. 34.92 s gammaloop-nextest-vakint> test test_integrate_4l_clover ... FAILED
  982. 34.92 s gammaloop-nextest-vakint>
  983. 34.92 s gammaloop-nextest-vakint> failures:
  984. 34.92 s gammaloop-nextest-vakint>
  985. 34.92 s gammaloop-nextest-vakint> failures:
  986. 34.92 s gammaloop-nextest-vakint> test_integrate_4l_clover
  987. 34.92 s gammaloop-nextest-vakint>
  988. 34.92 s gammaloop-nextest-vakint> test result: FAILED. 0 passed; 1 failed; 0 ignored; 0 measured; 26 filtered out; finished in 0.18s
  989. 34.92 s gammaloop-nextest-vakint> system-err
  990. 34.92 s gammaloop-nextest-vakint> thread 'test_integrate_4l_clover' (424) panicked at crates/vakint/tests/test_utils.rs:554:30:
  991. 34.92 s gammaloop-nextest-vakint> Failed to evaluate integral: the following integral could not be identified using any of the supported topologies: topo(I4L_FG_pinch_4_6_7_8(muvsq,1,1,1,0,1,0,0,0))
  992. 34.92 s gammaloop-nextest-vakint> stack backtrace:
  993. 34.92 s gammaloop-nextest-vakint> 0: __rustc::rust_begin_unwind
  994. 34.92 s gammaloop-nextest-vakint> 1: core::panicking::panic_fmt
  995. 34.92 s gammaloop-nextest-vakint> 2: integral_evaluation_analytic_tests::test_utils::compare_vakint_evaluation_vs_reference::{closure#0}
  996. 34.92 s gammaloop-nextest-vakint> 3: integral_evaluation_analytic_tests::test_utils::compare_vakint_evaluation_vs_reference
  997. 34.92 s gammaloop-nextest-vakint> 4: <integral_evaluation_analytic_tests::test_integrate_4l_clover::{closure#0} as core::ops::function::FnOnce<()>>::call_once
  998. 34.92 s gammaloop-nextest-vakint> note: Some details are omitted, run with `RUST_BACKTRACE=full` for a verbose backtrace.
  999. 34.92 s gammaloop-nextest-vakint>
  1000. 34.92 s gammaloop-nextest-vakint> 8. vakint::integral_evaluation_analytic_tests::test_integrate_4l_clover_with_non_unit_scales
  1001. 34.92 s gammaloop-nextest-vakint> failure: test failure with exit code 101
  1002. 34.92 s gammaloop-nextest-vakint> thread 'test_integrate_4l_clover_with_non_unit_scales' (429) panicked at crates/vakint/tests/test_utils.rs:554:30:
  1003. 34.92 s gammaloop-nextest-vakint> Failed to evaluate integral: the following integral could not be identified using any of the supported topologies: topo(I4L_FG_pinch_4_6_7_8(muvsq,1,1,1,0,1,0,0,0))
  1004. 34.92 s gammaloop-nextest-vakint> stack backtrace:
  1005. 34.92 s gammaloop-nextest-vakint> 0: __rustc::rust_begin_unwind
  1006. 34.92 s gammaloop-nextest-vakint> 1: core::panicking::panic_fmt
  1007. 34.92 s gammaloop-nextest-vakint> 2: integral_evaluation_analytic_tests::test_utils::compare_vakint_evaluation_vs_reference::{closure#0}
  1008. 34.92 s gammaloop-nextest-vakint> 3: integral_evaluation_analytic_tests::test_utils::compare_vakint_evaluation_vs_reference
  1009. 34.92 s gammaloop-nextest-vakint> 4: <integral_evaluation_analytic_tests::test_integrate_4l_clover_with_non_unit_scales::{closure#0} as core::ops::function::FnOnce<()>>::call_once
  1010. 34.92 s gammaloop-nextest-vakint> note: Some details are omitted, run with `RUST_BACKTRACE=full` for a verbose backtrace.
  1011. 34.92 s gammaloop-nextest-vakint> system-out
  1012. 34.92 s gammaloop-nextest-vakint> running 1 test
  1013. 34.92 s gammaloop-nextest-vakint> test test_integrate_4l_clover_with_non_unit_scales ... FAILED
  1014. 34.92 s gammaloop-nextest-vakint>
  1015. 34.92 s gammaloop-nextest-vakint> failures:
  1016. 34.92 s gammaloop-nextest-vakint>
  1017. 34.92 s gammaloop-nextest-vakint> failures:
  1018. 34.92 s gammaloop-nextest-vakint> test_integrate_4l_clover_with_non_unit_scales
  1019. 34.92 s gammaloop-nextest-vakint>
  1020. 34.92 s gammaloop-nextest-vakint> test result: FAILED. 0 passed; 1 failed; 0 ignored; 0 measured; 26 filtered out; finished in 0.22s
  1021. 34.92 s gammaloop-nextest-vakint> system-err
  1022. 34.92 s gammaloop-nextest-vakint> thread 'test_integrate_4l_clover_with_non_unit_scales' (429) panicked at crates/vakint/tests/test_utils.rs:554:30:
  1023. 34.92 s gammaloop-nextest-vakint> Failed to evaluate integral: the following integral could not be identified using any of the supported topologies: topo(I4L_FG_pinch_4_6_7_8(muvsq,1,1,1,0,1,0,0,0))
  1024. 34.92 s gammaloop-nextest-vakint> stack backtrace:
  1025. 34.92 s gammaloop-nextest-vakint> 0: __rustc::rust_begin_unwind
  1026. 34.92 s gammaloop-nextest-vakint> 1: core::panicking::panic_fmt
  1027. 34.92 s gammaloop-nextest-vakint> 2: integral_evaluation_analytic_tests::test_utils::compare_vakint_evaluation_vs_reference::{closure#0}
  1028. 34.92 s gammaloop-nextest-vakint> 3: integral_evaluation_analytic_tests::test_utils::compare_vakint_evaluation_vs_reference
  1029. 34.92 s gammaloop-nextest-vakint> 4: <integral_evaluation_analytic_tests::test_integrate_4l_clover_with_non_unit_scales::{closure#0} as core::ops::function::FnOnce<()>>::call_once
  1030. 34.92 s gammaloop-nextest-vakint> note: Some details are omitted, run with `RUST_BACKTRACE=full` for a verbose backtrace.
  1031. 34.92 s gammaloop-nextest-vakint>
  1032. 34.92 s gammaloop-nextest-vakint> 9. vakint::integral_evaluation_analytic_tests::test_integrate_4l_clover_with_numerator
  1033. 34.92 s gammaloop-nextest-vakint> failure: test failure with exit code 101
  1034. 34.92 s gammaloop-nextest-vakint> thread 'test_integrate_4l_clover_with_numerator' (434) panicked at crates/vakint/tests/test_utils.rs:554:30:
  1035. 34.92 s gammaloop-nextest-vakint> Failed to evaluate integral: the following integral could not be identified using any of the supported topologies: topo(I4L_FG_pinch_4_6_7_8(muvsq,2,1,1,0,1,0,0,0))
  1036. 34.92 s gammaloop-nextest-vakint> stack backtrace:
  1037. 34.92 s gammaloop-nextest-vakint> 0: __rustc::rust_begin_unwind
  1038. 34.92 s gammaloop-nextest-vakint> 1: core::panicking::panic_fmt
  1039. 34.92 s gammaloop-nextest-vakint> 2: integral_evaluation_analytic_tests::test_utils::compare_vakint_evaluation_vs_reference::{closure#0}
  1040. 34.92 s gammaloop-nextest-vakint> 3: integral_evaluation_analytic_tests::test_utils::compare_vakint_evaluation_vs_reference
  1041. 34.92 s gammaloop-nextest-vakint> 4: <integral_evaluation_analytic_tests::test_integrate_4l_clover_with_numerator::{closure#0} as core::ops::function::FnOnce<()>>::call_once
  1042. 34.92 s gammaloop-nextest-vakint> note: Some details are omitted, run with `RUST_BACKTRACE=full` for a verbose backtrace.
  1043. 34.92 s gammaloop-nextest-vakint> system-out
  1044. 34.92 s gammaloop-nextest-vakint> running 1 test
  1045. 34.92 s gammaloop-nextest-vakint> test test_integrate_4l_clover_with_numerator ... FAILED
  1046. 34.92 s gammaloop-nextest-vakint>
  1047. 34.92 s gammaloop-nextest-vakint> failures:
  1048. 34.92 s gammaloop-nextest-vakint>
  1049. 34.92 s gammaloop-nextest-vakint> failures:
  1050. 34.92 s gammaloop-nextest-vakint> test_integrate_4l_clover_with_numerator
  1051. 34.92 s gammaloop-nextest-vakint>
  1052. 34.92 s gammaloop-nextest-vakint> test result: FAILED. 0 passed; 1 failed; 0 ignored; 0 measured; 26 filtered out; finished in 0.22s
  1053. 34.92 s gammaloop-nextest-vakint> system-err
  1054. 34.92 s gammaloop-nextest-vakint> thread 'test_integrate_4l_clover_with_numerator' (434) panicked at crates/vakint/tests/test_utils.rs:554:30:
  1055. 34.92 s gammaloop-nextest-vakint> Failed to evaluate integral: the following integral could not be identified using any of the supported topologies: topo(I4L_FG_pinch_4_6_7_8(muvsq,2,1,1,0,1,0,0,0))
  1056. 34.92 s gammaloop-nextest-vakint> stack backtrace:
  1057. 34.92 s gammaloop-nextest-vakint> 0: __rustc::rust_begin_unwind
  1058. 34.92 s gammaloop-nextest-vakint> 1: core::panicking::panic_fmt
  1059. 34.92 s gammaloop-nextest-vakint> 2: integral_evaluation_analytic_tests::test_utils::compare_vakint_evaluation_vs_reference::{closure#0}
  1060. 34.92 s gammaloop-nextest-vakint> 3: integral_evaluation_analytic_tests::test_utils::compare_vakint_evaluation_vs_reference
  1061. 34.92 s gammaloop-nextest-vakint> 4: <integral_evaluation_analytic_tests::test_integrate_4l_clover_with_numerator::{closure#0} as core::ops::function::FnOnce<()>>::call_once
  1062. 34.92 s gammaloop-nextest-vakint> note: Some details are omitted, run with `RUST_BACKTRACE=full` for a verbose backtrace.
  1063. 34.92 s gammaloop-nextest-vakint>
  1064. 34.92 s gammaloop-nextest-vakint> 10. vakint::integral_evaluation_analytic_tests::test_integrate_4l_dotted_clover
  1065. 34.92 s gammaloop-nextest-vakint> failure: test failure with exit code 101
  1066. 34.92 s gammaloop-nextest-vakint> thread 'test_integrate_4l_dotted_clover' (439) panicked at crates/vakint/tests/test_utils.rs:554:30:
  1067. 34.92 s gammaloop-nextest-vakint> Failed to evaluate integral: the following integral could not be identified using any of the supported topologies: topo(I4L_FG_pinch_4_6_7_8(muvsq,2,1,1,0,1,0,0,0))
  1068. 34.92 s gammaloop-nextest-vakint> stack backtrace:
  1069. 34.92 s gammaloop-nextest-vakint> 0: __rustc::rust_begin_unwind
  1070. 34.92 s gammaloop-nextest-vakint> 1: core::panicking::panic_fmt
  1071. 34.92 s gammaloop-nextest-vakint> 2: integral_evaluation_analytic_tests::test_utils::compare_vakint_evaluation_vs_reference::{closure#0}
  1072. 34.92 s gammaloop-nextest-vakint> 3: integral_evaluation_analytic_tests::test_utils::compare_vakint_evaluation_vs_reference
  1073. 34.92 s gammaloop-nextest-vakint> 4: <integral_evaluation_analytic_tests::test_integrate_4l_dotted_clover::{closure#0} as core::ops::function::FnOnce<()>>::call_once
  1074. 34.92 s gammaloop-nextest-vakint> note: Some details are omitted, run with `RUST_BACKTRACE=full` for a verbose backtrace.
  1075. 34.92 s gammaloop-nextest-vakint> system-out
  1076. 34.92 s gammaloop-nextest-vakint> running 1 test
  1077. 34.92 s gammaloop-nextest-vakint> test test_integrate_4l_dotted_clover ... FAILED
  1078. 34.92 s gammaloop-nextest-vakint>
  1079. 34.92 s gammaloop-nextest-vakint> failures:
  1080. 34.92 s gammaloop-nextest-vakint>
  1081. 34.92 s gammaloop-nextest-vakint> failures:
  1082. 34.92 s gammaloop-nextest-vakint> test_integrate_4l_dotted_clover
  1083. 34.92 s gammaloop-nextest-vakint>
  1084. 34.92 s gammaloop-nextest-vakint> test result: FAILED. 0 passed; 1 failed; 0 ignored; 0 measured; 26 filtered out; finished in 0.39s
  1085. 34.92 s gammaloop-nextest-vakint> system-err
  1086. 34.92 s gammaloop-nextest-vakint> thread 'test_integrate_4l_dotted_clover' (439) panicked at crates/vakint/tests/test_utils.rs:554:30:
  1087. 34.92 s gammaloop-nextest-vakint> Failed to evaluate integral: the following integral could not be identified using any of the supported topologies: topo(I4L_FG_pinch_4_6_7_8(muvsq,2,1,1,0,1,0,0,0))
  1088. 34.92 s gammaloop-nextest-vakint> stack backtrace:
  1089. 34.92 s gammaloop-nextest-vakint> 0: __rustc::rust_begin_unwind
  1090. 34.92 s gammaloop-nextest-vakint> 1: core::panicking::panic_fmt
  1091. 34.92 s gammaloop-nextest-vakint> 2: integral_evaluation_analytic_tests::test_utils::compare_vakint_evaluation_vs_reference::{closure#0}
  1092. 34.92 s gammaloop-nextest-vakint> 3: integral_evaluation_analytic_tests::test_utils::compare_vakint_evaluation_vs_reference
  1093. 34.92 s gammaloop-nextest-vakint> 4: <integral_evaluation_analytic_tests::test_integrate_4l_dotted_clover::{closure#0} as core::ops::function::FnOnce<()>>::call_once
  1094. 34.92 s gammaloop-nextest-vakint> note: Some details are omitted, run with `RUST_BACKTRACE=full` for a verbose backtrace.
  1095. 34.92 s gammaloop-nextest-vakint>
  1096. 34.92 s gammaloop-nextest-vakint> 11. vakint::integral_evaluation_freeform_tests::test_integrate_1l_decorated_indices_alphaloop
  1097. 34.92 s gammaloop-nextest-vakint> failure: test failure with exit code 101
  1098. 34.92 s gammaloop-nextest-vakint> thread 'test_integrate_1l_decorated_indices_alphaloop' (468) panicked at crates/vakint/tests/test_utils.rs:563:6:
  1099. 34.92 s gammaloop-nextest-vakint> called `Result::unwrap()` on an `Err` value: EvaluationError("Is some tensor structure left? | Expression: '(1/4*user_space::{real}::DDMUVsq^2*vakint::{symmetric}::g(user_space::{}::mink4(4,11),user_space::{}::mink4(4,22))+user_space::{real}::DDMUVsq*user_space::{scalar}::DDsigma2(user_space::{}::some_args)*vakint::{symmetric,linear}::dot(vakint::{}::p(1),vakint::{}::p(2))*vakint::{}::vec1(vakint::{}::p(1),13370002)*vakint::{}::vec1(vakint::{}::p(2),13370003)+user_space::{real}::DDMUVsq*user_space::{symmetric,real}::DDsigma3(user_space::{}::some_args)*vakint::{symmetric,linear}::dot(vakint::{}::p(1),vakint::{}::p(2))*vakint::{}::vec1(vakint::{}::p(1),13370002)*vakint::{}::vec1(vakint::{}::p(2),13370003)+user_space::{real}::DDMUVsq*user_space::{}::DDsigma(user_space::{}::some_args)*vakint::{symmetric,linear}::dot(vakint::{}::p(1),vakint::{}::p(2))*vakint::{}::vec1(vakint::{}::p(1),13370002)*vakint::{}::vec1(vakint::{}::p(2),13370003))*1/16*vakint::{}::𝑖*𝜋^(-2)' | Error: 'function vec1(p(1),13370002) is not in a parameter map and does not have an evaluator'")
  1100. 34.92 s gammaloop-nextest-vakint> stack backtrace:
  1101. 34.92 s gammaloop-nextest-vakint> 0: __rustc::rust_begin_unwind
  1102. 34.92 s gammaloop-nextest-vakint> 1: core::panicking::panic_fmt
  1103. 34.92 s gammaloop-nextest-vakint> 2: core::result::unwrap_failed
  1104. 34.92 s gammaloop-nextest-vakint> 3: integral_evaluation_freeform_tests::test_utils::compare_vakint_evaluation_vs_reference
  1105. 34.92 s gammaloop-nextest-vakint> 4: <integral_evaluation_freeform_tests::test_integrate_1l_decorated_indices_alphaloop::{closure#0} as core::ops::function::FnOnce<()>>::call_once
  1106. 34.92 s gammaloop-nextest-vakint> note: Some details are omitted, run with `RUST_BACKTRACE=full` for a verbose backtrace.
  1107. 34.92 s gammaloop-nextest-vakint> system-out
  1108. 34.92 s gammaloop-nextest-vakint> running 1 test
  1109. 34.92 s gammaloop-nextest-vakint> test test_integrate_1l_decorated_indices_alphaloop ... FAILED
  1110. 34.92 s gammaloop-nextest-vakint>
  1111. 34.92 s gammaloop-nextest-vakint> failures:
  1112. 34.92 s gammaloop-nextest-vakint>
  1113. 34.92 s gammaloop-nextest-vakint> failures:
  1114. 34.92 s gammaloop-nextest-vakint> test_integrate_1l_decorated_indices_alphaloop
  1115. 34.92 s gammaloop-nextest-vakint>
  1116. 34.92 s gammaloop-nextest-vakint> test result: FAILED. 0 passed; 1 failed; 0 ignored; 0 measured; 3 filtered out; finished in 0.10s
  1117. 34.92 s gammaloop-nextest-vakint> system-err
  1118. 34.92 s gammaloop-nextest-vakint> thread 'test_integrate_1l_decorated_indices_alphaloop' (468) panicked at crates/vakint/tests/test_utils.rs:563:6:
  1119. 34.92 s gammaloop-nextest-vakint> called `Result::unwrap()` on an `Err` value: EvaluationError("Is some tensor structure left? | Expression: '(1/4*user_space::{real}::DDMUVsq^2*vakint::{symmetric}::g(user_space::{}::mink4(4,11),user_space::{}::mink4(4,22))+user_space::{real}::DDMUVsq*user_space::{scalar}::DDsigma2(user_space::{}::some_args)*vakint::{symmetric,linear}::dot(vakint::{}::p(1),vakint::{}::p(2))*vakint::{}::vec1(vakint::{}::p(1),13370002)*vakint::{}::vec1(vakint::{}::p(2),13370003)+user_space::{real}::DDMUVsq*user_space::{symmetric,real}::DDsigma3(user_space::{}::some_args)*vakint::{symmetric,linear}::dot(vakint::{}::p(1),vakint::{}::p(2))*vakint::{}::vec1(vakint::{}::p(1),13370002)*vakint::{}::vec1(vakint::{}::p(2),13370003)+user_space::{real}::DDMUVsq*user_space::{}::DDsigma(user_space::{}::some_args)*vakint::{symmetric,linear}::dot(vakint::{}::p(1),vakint::{}::p(2))*vakint::{}::vec1(vakint::{}::p(1),13370002)*vakint::{}::vec1(vakint::{}::p(2),13370003))*1/16*vakint::{}::𝑖*𝜋^(-2)' | Error: 'function vec1(p(1),13370002) is not in a parameter map and does not have an evaluator'")
  1120. 34.92 s gammaloop-nextest-vakint> stack backtrace:
  1121. 34.92 s gammaloop-nextest-vakint> 0: __rustc::rust_begin_unwind
  1122. 34.92 s gammaloop-nextest-vakint> 1: core::panicking::panic_fmt
  1123. 34.92 s gammaloop-nextest-vakint> 2: core::result::unwrap_failed
  1124. 34.92 s gammaloop-nextest-vakint> 3: integral_evaluation_freeform_tests::test_utils::compare_vakint_evaluation_vs_reference
  1125. 34.92 s gammaloop-nextest-vakint> 4: <integral_evaluation_freeform_tests::test_integrate_1l_decorated_indices_alphaloop::{closure#0} as core::ops::function::FnOnce<()>>::call_once
  1126. 34.92 s gammaloop-nextest-vakint> note: Some details are omitted, run with `RUST_BACKTRACE=full` for a verbose backtrace.
  1127. 34.92 s gammaloop-nextest-vakint>
  1128. 34.92 s gammaloop-nextest-vakint> 12. vakint::integral_evaluation_freeform_tests::test_integrate_1l_decorated_indices_fmft
  1129. 34.92 s gammaloop-nextest-vakint> failure: test failure with exit code 101
  1130. 34.93 s gammaloop-nextest-vakint> thread 'test_integrate_1l_decorated_indices_fmft' (474) panicked at crates/vakint/tests/test_utils.rs:554:30:
  1131. 34.93 s gammaloop-nextest-vakint> Failed to evaluate integral: the following integral could not be identified using any of the supported topologies: topo(I4L_FG_pinch_4_6_7_8(BBMUVsq,1,1,1,0,1,0,0,0))
  1132. 34.93 s gammaloop-nextest-vakint> stack backtrace:
  1133. 34.93 s gammaloop-nextest-vakint> 0: __rustc::rust_begin_unwind
  1134. 34.93 s gammaloop-nextest-vakint> 1: core::panicking::panic_fmt
  1135. 34.93 s gammaloop-nextest-vakint> 2: integral_evaluation_freeform_tests::test_utils::compare_vakint_evaluation_vs_reference::{closure#0}
  1136. 34.93 s gammaloop-nextest-vakint> 3: integral_evaluation_freeform_tests::test_utils::compare_vakint_evaluation_vs_reference
  1137. 34.93 s gammaloop-nextest-vakint> 4: <integral_evaluation_freeform_tests::test_integrate_1l_decorated_indices_fmft::{closure#0} as core::ops::function::FnOnce<()>>::call_once
  1138. 34.93 s gammaloop-nextest-vakint> note: Some details are omitted, run with `RUST_BACKTRACE=full` for a verbose backtrace.
  1139. 34.93 s gammaloop-nextest-vakint> system-out
  1140. 34.93 s gammaloop-nextest-vakint> running 1 test
  1141. 34.93 s gammaloop-nextest-vakint> test test_integrate_1l_decorated_indices_fmft ... FAILED
  1142. 34.93 s gammaloop-nextest-vakint>
  1143. 34.93 s gammaloop-nextest-vakint> failures:
  1144. 34.93 s gammaloop-nextest-vakint>
  1145. 34.93 s gammaloop-nextest-vakint> failures:
  1146. 34.93 s gammaloop-nextest-vakint> test_integrate_1l_decorated_indices_fmft
  1147. 34.93 s gammaloop-nextest-vakint>
  1148. 34.93 s gammaloop-nextest-vakint> test result: FAILED. 0 passed; 1 failed; 0 ignored; 0 measured; 3 filtered out; finished in 0.18s
  1149. 34.93 s gammaloop-nextest-vakint> system-err
  1150. 34.93 s gammaloop-nextest-vakint> thread 'test_integrate_1l_decorated_indices_fmft' (474) panicked at crates/vakint/tests/test_utils.rs:554:30:
  1151. 34.93 s gammaloop-nextest-vakint> Failed to evaluate integral: the following integral could not be identified using any of the supported topologies: topo(I4L_FG_pinch_4_6_7_8(BBMUVsq,1,1,1,0,1,0,0,0))
  1152. 34.93 s gammaloop-nextest-vakint> stack backtrace:
  1153. 34.93 s gammaloop-nextest-vakint> 0: __rustc::rust_begin_unwind
  1154. 34.93 s gammaloop-nextest-vakint> 1: core::panicking::panic_fmt
  1155. 34.93 s gammaloop-nextest-vakint> 2: integral_evaluation_freeform_tests::test_utils::compare_vakint_evaluation_vs_reference::{closure#0}
  1156. 34.93 s gammaloop-nextest-vakint> 3: integral_evaluation_freeform_tests::test_utils::compare_vakint_evaluation_vs_reference
  1157. 34.93 s gammaloop-nextest-vakint> 4: <integral_evaluation_freeform_tests::test_integrate_1l_decorated_indices_fmft::{closure#0} as core::ops::function::FnOnce<()>>::call_once
  1158. 34.93 s gammaloop-nextest-vakint> note: Some details are omitted, run with `RUST_BACKTRACE=full` for a verbose backtrace.
  1159. 34.93 s gammaloop-nextest-vakint>
  1160. 34.93 s gammaloop-nextest-vakint> 13. vakint::integral_evaluation_freeform_tests::test_integrate_1l_decorated_indices_matad
  1161. 34.93 s gammaloop-nextest-vakint> failure: test failure with exit code 101
  1162. 34.93 s gammaloop-nextest-vakint> thread 'test_integrate_1l_decorated_indices_matad' (479) panicked at crates/vakint/tests/test_utils.rs:554:30:
  1163. 34.93 s gammaloop-nextest-vakint> Failed to evaluate integral: FORM run crashed with the following error:
  1164. 34.93 s gammaloop-nextest-vakint> stderr:
  1165. 34.93 s gammaloop-nextest-vakint> stdout: FORM 5.0.0 (Jan 1 1980) Run: Sat Sep 12 20:41:33 2026
  1166. 34.93 s gammaloop-nextest-vakint> #-
  1167. 34.93 s gammaloop-nextest-vakint> run_matad.frm Line 11 --> Undeclared variable vec1
  1168. 34.93 s gammaloop-nextest-vakint> ~~~" "
  1169. 34.93 s gammaloop-nextest-vakint> ~~~" "
  1170. 34.93 s gammaloop-nextest-vakint> ~~~" _____ _____ _____ _____ ____ "
  1171. 34.93 s gammaloop-nextest-vakint> ~~~" | | _ |_ _| _ | \ ___ ___ ___ "
  1172. 34.93 s gammaloop-nextest-vakint> ~~~" | | | | | | | | | | |___| | . | "
  1173. 34.93 s gammaloop-nextest-vakint> ~~~" |_|_|_|__|__| |_| |__|__|____/ |_|_|_ | "
  1174. 34.93 s gammaloop-nextest-vakint> ~~~" |___| "
  1175. 34.93 s gammaloop-nextest-vakint> ~~~" "
  1176. 34.93 s gammaloop-nextest-vakint> ~~~" "
  1177. 34.93 s gammaloop-nextest-vakint> ~~~" Originally written by M.Steinhauser "
  1178. 34.93 s gammaloop-nextest-vakint> ~~~" About exact version contact to: "
  1179. 34.93 s gammaloop-nextest-vakint> ~~~" pikelner[at]theor.jinr.ru, Andrey Pikelner "
  1180. 34.93 s gammaloop-nextest-vakint> ~~~" "
  1181. 34.93 s gammaloop-nextest-vakint> ~~~MATAD called for 1-loop integral
  1182. 34.93 s gammaloop-nextest-vakint> Program terminating at -->
  1183. 34.93 s gammaloop-nextest-vakint> Terminate called from pre.c:1086 (PreProcessor)
  1184. 34.93 s gammaloop-nextest-vakint> 0.00 sec out of 0.00 sec
  1185. 34.93 s gammaloop-nextest-vakint>
  1186. 34.93 s gammaloop-nextest-vakint> You can rerun the script using:
  1187. 34.93 s gammaloop-nextest-vakint> cd "/build/vakint_temp_pid478_1789245693849342430_1" && "form" "run_matad.frm"
  1188. 34.93 s gammaloop-nextest-vakint> stack backtrace:
  1189. 34.93 s gammaloop-nextest-vakint> 0: __rustc::rust_begin_unwind
  1190. 34.93 s gammaloop-nextest-vakint> 1: core::panicking::panic_fmt
  1191. 34.93 s gammaloop-nextest-vakint> 2: integral_evaluation_freeform_tests::test_utils::compare_vakint_evaluation_vs_reference::{closure#0}
  1192. 34.93 s gammaloop-nextest-vakint> 3: integral_evaluation_freeform_tests::test_utils::compare_vakint_evaluation_vs_reference
  1193. 34.93 s gammaloop-nextest-vakint> 4: <integral_evaluation_freeform_tests::test_integrate_1l_decorated_indices_matad::{closure#0} as core::ops::function::FnOnce<()>>::call_once
  1194. 34.93 s gammaloop-nextest-vakint> note: Some details are omitted, run with `RUST_BACKTRACE=full` for a verbose backtrace.
  1195. 34.93 s gammaloop-nextest-vakint> system-out
  1196. 34.93 s gammaloop-nextest-vakint> running 1 test
  1197. 34.93 s gammaloop-nextest-vakint> test test_integrate_1l_decorated_indices_matad ... FAILED
  1198. 34.93 s gammaloop-nextest-vakint>
  1199. 34.93 s gammaloop-nextest-vakint> failures:
  1200. 34.93 s gammaloop-nextest-vakint>
  1201. 34.93 s gammaloop-nextest-vakint> failures:
  1202. 34.93 s gammaloop-nextest-vakint> test_integrate_1l_decorated_indices_matad
  1203. 34.93 s gammaloop-nextest-vakint>
  1204. 34.93 s gammaloop-nextest-vakint> test result: FAILED. 0 passed; 1 failed; 0 ignored; 0 measured; 3 filtered out; finished in 0.08s
  1205. 34.93 s gammaloop-nextest-vakint> system-err
  1206. 34.93 s gammaloop-nextest-vakint> thread 'test_integrate_1l_decorated_indices_matad' (479) panicked at crates/vakint/tests/test_utils.rs:554:30:
  1207. 34.93 s gammaloop-nextest-vakint> Failed to evaluate integral: FORM run crashed with the following error:
  1208. 34.93 s gammaloop-nextest-vakint> stderr:
  1209. 34.93 s gammaloop-nextest-vakint> stdout: FORM 5.0.0 (Jan 1 1980) Run: Sat Sep 12 20:41:33 2026
  1210. 34.93 s gammaloop-nextest-vakint> #-
  1211. 34.93 s gammaloop-nextest-vakint> run_matad.frm Line 11 --> Undeclared variable vec1
  1212. 34.93 s gammaloop-nextest-vakint> ~~~" "
  1213. 34.93 s gammaloop-nextest-vakint> ~~~" "
  1214. 34.93 s gammaloop-nextest-vakint> ~~~" _____ _____ _____ _____ ____ "
  1215. 34.93 s gammaloop-nextest-vakint> ~~~" | | _ |_ _| _ | \ ___ ___ ___ "
  1216. 34.93 s gammaloop-nextest-vakint> ~~~" | | | | | | | | | | |___| | . | "
  1217. 34.93 s gammaloop-nextest-vakint> ~~~" |_|_|_|__|__| |_| |__|__|____/ |_|_|_ | "
  1218. 34.93 s gammaloop-nextest-vakint> ~~~" |___| "
  1219. 34.93 s gammaloop-nextest-vakint> ~~~" "
  1220. 34.93 s gammaloop-nextest-vakint> ~~~" "
  1221. 34.93 s gammaloop-nextest-vakint> ~~~" Originally written by M.Steinhauser "
  1222. 34.93 s gammaloop-nextest-vakint> ~~~" About exact version contact to: "
  1223. 34.93 s gammaloop-nextest-vakint> ~~~" pikelner[at]theor.jinr.ru, Andrey Pikelner "
  1224. 34.93 s gammaloop-nextest-vakint> ~~~" "
  1225. 34.93 s gammaloop-nextest-vakint> ~~~MATAD called for 1-loop integral
  1226. 34.93 s gammaloop-nextest-vakint> Program terminating at -->
  1227. 34.93 s gammaloop-nextest-vakint> Terminate called from pre.c:1086 (PreProcessor)
  1228. 34.93 s gammaloop-nextest-vakint> 0.00 sec out of 0.00 sec
  1229. 34.93 s gammaloop-nextest-vakint>
  1230. 34.93 s gammaloop-nextest-vakint> You can rerun the script using:
  1231. 34.93 s gammaloop-nextest-vakint> cd "/build/vakint_temp_pid478_1789245693849342430_1" && "form" "run_matad.frm"
  1232. 34.93 s gammaloop-nextest-vakint> stack backtrace:
  1233. 34.93 s gammaloop-nextest-vakint> 0: __rustc::rust_begin_unwind
  1234. 34.93 s gammaloop-nextest-vakint> 1: core::panicking::panic_fmt
  1235. 34.93 s gammaloop-nextest-vakint> 2: integral_evaluation_freeform_tests::test_utils::compare_vakint_evaluation_vs_reference::{closure#0}
  1236. 34.93 s gammaloop-nextest-vakint> 3: integral_evaluation_freeform_tests::test_utils::compare_vakint_evaluation_vs_reference
  1237. 34.93 s gammaloop-nextest-vakint> 4: <integral_evaluation_freeform_tests::test_integrate_1l_decorated_indices_matad::{closure#0} as core::ops::function::FnOnce<()>>::call_once
  1238. 34.93 s gammaloop-nextest-vakint> note: Some details are omitted, run with `RUST_BACKTRACE=full` for a verbose backtrace.
  1239. 34.93 s gammaloop-nextest-vakint> =========================================
  1240. 34.96 s error: Cannot build '/nix/store/y7jldak46jgknws0nim0216sgb1hli86-gammaloop-nextest-vakint.drv'.
  1241. 34.96 s Reason: builder failed with exit code 100.
  1242. 34.96 s Output paths:
  1243. 34.96 s /nix/store/b8y76r6sr4fjrz3agqhd4b30bmdn4yxa-gammaloop-nextest-vakint
  1244. 34.96 s Last 1223 log lines:
  1245. 34.96 s > Extracting 9 binaries, 1 build script output directory, and 1 linked path to /build/nextest-archive-Yz5vPM
  1246. 34.96 s > Extracted 15 files to /build/nextest-archive-Yz5vPM in 0.92s
  1247. 34.96 s > ------------
  1248. 34.96 s > Nextest run ID b0b7e267-001c-4cee-a432-1b957573fd5c with nextest profile: ci_gammaloop
  1249. 34.96 s > Starting 74 tests across 9 binaries
  1250. 34.96 s > FAIL [ 0.077s] ( 5/74) vakint::input_matching_tests test_2l_matching_pinched
  1251. 34.96 s > stdout ---
  1252. 34.96 s >
  1253. 34.96 s > running 1 test
  1254. 34.96 s > test test_2l_matching_pinched ... FAILED
  1255. 34.96 s >
  1256. 34.96 s > failures:
  1257. 34.96 s >
  1258. 34.96 s > failures:
  1259. 34.96 s > test_2l_matching_pinched
  1260. 34.96 s >
  1261. 34.96 s > test result: FAILED. 0 passed; 1 failed; 0 ignored; 0 measured; 5 filtered out; finished in 0.07s
  1262. 34.96 s >
  1263. 34.96 s > stderr ---
  1264. 34.96 s >
  1265. 34.96 s > thread 'test_2l_matching_pinched' (170) panicked at crates/vakint/tests/test_utils.rs:202:21:
  1266. 34.96 s > Error: the following integral could not be identified using any of the supported topologies: topo(I2L_pinch_3(mUVsq,2,1,0))
  1267. 34.96 s > stack backtrace:
  1268. 34.96 s > 0: __rustc::rust_begin_unwind
  1269. 34.96 s > 1: core::panicking::panic_fmt
  1270. 34.96 s > 2: input_matching_tests::test_utils::compare_output
  1271. 34.96 s > 3: <input_matching_tests::test_2l_matching_pinched::{closure#0} as core::ops::function::FnOnce<()>>::call_once
  1272. 34.96 s > note: Some details are omitted, run with `RUST_BACKTRACE=full` for a verbose backtrace.
  1273. 34.96 s >
  1274. 34.96 s > FAIL [ 0.380s] (12/74) vakint::integral_alphaloop_vs_matad_tests test_integrate_1l_no_numerator_squared_mass
  1275. 34.96 s > stdout ---
  1276. 34.96 s >
  1277. 34.96 s > running 1 test
  1278. 34.96 s >
  1279. 34.96 s > <><><><><>
  1280. 34.96 s >
  1281. 34.96 s >
  1282. 34.96 s > <><><><><>
  1283. 34.96 s >
  1284. 34.96 s > test test_integrate_1l_no_numerator_squared_mass ... FAILED
  1285. 34.96 s >
  1286. 34.96 s > failures:
  1287. 34.96 s >
  1288. 34.96 s > failures:
  1289. 34.96 s > test_integrate_1l_no_numerator_squared_mass
  1290. 34.96 s >
  1291. 34.96 s > test result: FAILED. 0 passed; 1 failed; 0 ignored; 0 measured; 9 filtered out; finished in 0.37s
  1292. 34.96 s >
  1293. 34.96 s > stderr ---
  1294. 34.96 s > [INFO integral_alphaloop_vs_matad_tests::test_utils] Benchmark [AlphaLoop (susbstitute_masters=true)] :: central :
  1295. 34.96 s > ε^-1 : (1.000000000000000000000000000000+0i)
  1296. 34.96 s > ε^ 0 : (4.227843350984671393934879099176e-1+0i)
  1297. 34.96 s > ε^+1 : (1.411840330426439694788883561418+0i)
  1298. 34.96 s > ε^+2 : (5.043612543455534057723233940620e-1+0i)
  1299. 34.96 s > [INFO integral_alphaloop_vs_matad_tests::test_utils] Tested [MATAD (expand_masters=true, susbstitute_masters=true, substitute_hpls=true, direct_numerical_substition=true)] :: central :
  1300. 34.96 s > ε^-1 : (1.000000000000000000000000000000+0i)
  1301. 34.96 s > ε^ 0 : (4.227843350984671393934879099176e-1+0i)
  1302. 34.96 s > ε^+1 : (1.411840330426439694788883561418+0i)
  1303. 34.96 s > ε^+2 : (5.043612543455534057723233940620e-1+0i)
  1304. 34.96 s > [INFO integral_alphaloop_vs_matad_tests::test_utils] matches!
  1305. 34.96 s >
  1306. 34.96 s > thread 'test_integrate_1l_no_numerator_squared_mass' (231) panicked at crates/vakint/tests/test_utils.rs:416:13:
  1307. 34.96 s > Error during numerical evaluation of benchmark result with [MATAD (expand_masters=true, susbstitute_masters=true, substitute_hpls=true, direct_numerical_substition=true)] :: error:
  1308. 34.96 s > Numerical evaluation error: Is some tensor structure left? | Expression: '-1*user_space::{}::muv^2+2*vakint::{}::M' | Error: 'variable M is not in a parameter map and does not have an evaluator'
  1309. 34.96 s > stack backtrace:
  1310. 34.96 s > 0: __rustc::rust_begin_unwind
  1311. 34.96 s > 1: core::panicking::panic_fmt
  1312. 34.96 s > 2: integral_alphaloop_vs_matad_tests::test_utils::compare_two_evaluations
  1313. 34.96 s > 3: <integral_alphaloop_vs_matad_tests::test_integrate_1l_no_numerator_squared_mass::{closure#0} as core::ops::function::FnOnce<()>>::call_once
  1314. 34.96 s > note: Some details are omitted, run with `RUST_BACKTRACE=full` for a verbose backtrace.
  1315. 34.96 s >
  1316. 34.96 s > FAIL [ 0.088s] (14/74) vakint::integral_alphaloop_vs_matad_tests test_integrate_3l_basketball_a
  1317. 34.96 s > stdout ---
  1318. 34.96 s >
  1319. 34.96 s > running 1 test
  1320. 34.96 s > test test_integrate_3l_basketball_a ... FAILED
  1321. 34.96 s >
  1322. 34.96 s > failures:
  1323. 34.96 s >
  1324. 34.96 s > failures:
  1325. 34.96 s > test_integrate_3l_basketball_a
  1326. 34.96 s >
  1327. 34.96 s > test result: FAILED. 0 passed; 1 failed; 0 ignored; 0 measured; 9 filtered out; finished in 0.08s
  1328. 34.96 s >
  1329. 34.96 s > stderr ---
  1330. 34.96 s >
  1331. 34.96 s > thread 'test_integrate_3l_basketball_a' (252) panicked at crates/vakint/tests/test_utils.rs:350:13:
  1332. 34.96 s > Error during benchmark integral evaluation with [AlphaLoop (susbstitute_masters=true)] :: error :
  1333. 34.96 s > the following integral could not be identified using any of the supported topologies: topo(I3L_pinch_1_6(muvsq,0,1,1,1,1,0))
  1334. 34.96 s > stack backtrace:
  1335. 34.96 s > 0: __rustc::rust_begin_unwind
  1336. 34.96 s > 1: core::panicking::panic_fmt
  1337. 34.96 s > 2: integral_alphaloop_vs_matad_tests::test_utils::compare_two_evaluations
  1338. 34.96 s > 3: <integral_alphaloop_vs_matad_tests::test_integrate_3l_basketball_a::{closure#0} as core::ops::function::FnOnce<()>>::call_once
  1339. 34.96 s > note: Some details are omitted, run with `RUST_BACKTRACE=full` for a verbose backtrace.
  1340. 34.96 s >
  1341. 34.96 s > FAIL [ 0.083s] (15/74) vakint::integral_alphaloop_vs_matad_tests test_integrate_3l_basketball_b
  1342. 34.96 s > stdout ---
  1343. 34.96 s >
  1344. 34.96 s > running 1 test
  1345. 34.96 s > test test_integrate_3l_basketball_b ... FAILED
  1346. 34.96 s >
  1347. 34.96 s > failures:
  1348. 34.96 s >
  1349. 34.96 s > failures:
  1350. 34.96 s > test_integrate_3l_basketball_b
  1351. 34.96 s >
  1352. 34.96 s > test result: FAILED. 0 passed; 1 failed; 0 ignored; 0 measured; 9 filtered out; finished in 0.08s
  1353. 34.96 s >
  1354. 34.96 s > stderr ---
  1355. 34.96 s >
  1356. 34.96 s > thread 'test_integrate_3l_basketball_b' (257) panicked at crates/vakint/tests/test_utils.rs:350:13:
  1357. 34.96 s > Error during benchmark integral evaluation with [AlphaLoop (susbstitute_masters=true)] :: error :
  1358. 34.96 s > the following integral could not be identified using any of the supported topologies: topo(I3L_pinch_1_6(muvsq,0,1,1,1,1,0))
  1359. 34.96 s > stack backtrace:
  1360. 34.96 s > 0: __rustc::rust_begin_unwind
  1361. 34.96 s > 1: core::panicking::panic_fmt
  1362. 34.96 s > 2: integral_alphaloop_vs_matad_tests::test_utils::compare_two_evaluations
  1363. 34.96 s > 3: <integral_alphaloop_vs_matad_tests::test_integrate_3l_basketball_b::{closure#0} as core::ops::function::FnOnce<()>>::call_once
  1364. 34.96 s > note: Some details are omitted, run with `RUST_BACKTRACE=full` for a verbose backtrace.
  1365. 34.96 s >
  1366. 34.96 s > FAIL [ 0.124s] (46/74) vakint::integral_evaluation_analytic_tests test_integrate_4l_PR9d_from_FG_pinch
  1367. 34.96 s > stdout ---
  1368. 34.96 s >
  1369. 34.96 s > running 1 test
  1370. 34.96 s > test test_integrate_4l_PR9d_from_FG_pinch ... FAILED
  1371. 34.96 s >
  1372. 34.96 s > failures:
  1373. 34.96 s >
  1374. 34.96 s > failures:
  1375. 34.96 s > test_integrate_4l_PR9d_from_FG_pinch
  1376. 34.96 s >
  1377. 34.96 s > test result: FAILED. 0 passed; 1 failed; 0 ignored; 0 measured; 26 filtered out; finished in 0.12s
  1378. 34.96 s >
  1379. 34.96 s > stderr ---
  1380. 34.96 s >
  1381. 34.96 s > thread 'test_integrate_4l_PR9d_from_FG_pinch' (402) panicked at crates/vakint/tests/test_utils.rs:554:30:
  1382. 34.96 s > Failed to evaluate integral: the following integral could not be identified using any of the supported topologies: topo(I4L_FG_pinch_4(muvsq,1,2,1,0,1,1,1,1))
  1383. 34.96 s > stack backtrace:
  1384. 34.96 s > 0: __rustc::rust_begin_unwind
  1385. 34.96 s > 1: core::panicking::panic_fmt
  1386. 34.96 s > 2: integral_evaluation_analytic_tests::test_utils::compare_vakint_evaluation_vs_reference::{closure#0}
  1387. 34.96 s > 3: integral_evaluation_analytic_tests::test_utils::compare_vakint_evaluation_vs_reference
  1388. 34.96 s > 4: <integral_evaluation_analytic_tests::test_integrate_4l_PR9d_from_FG_pinch::{closure#0} as core::ops::function::FnOnce<()>>::call_once
  1389. 34.96 s > note: Some details are omitted, run with `RUST_BACKTRACE=full` for a verbose backtrace.
  1390. 34.96 s >
  1391. 34.96 s > FAIL [ 0.255s] (48/74) vakint::integral_evaluation_analytic_tests test_integrate_4l_PR9d_from_H_pinch
  1392. 34.96 s > stdout ---
  1393. 34.96 s >
  1394. 34.96 s > running 1 test
  1395. 34.96 s > test test_integrate_4l_PR9d_from_H_pinch ... FAILED
  1396. 34.96 s >
  1397. 34.96 s > failures:
  1398. 34.96 s >
  1399. 34.96 s > failures:
  1400. 34.96 s > test_integrate_4l_PR9d_from_H_pinch
  1401. 34.96 s >
  1402. 34.96 s > test result: FAILED. 0 passed; 1 failed; 0 ignored; 0 measured; 26 filtered out; finished in 0.25s
  1403. 34.96 s >
  1404. 34.96 s > stderr ---
  1405. 34.96 s >
  1406. 34.96 s > thread 'test_integrate_4l_PR9d_from_H_pinch' (413) panicked at crates/vakint/tests/test_utils.rs:554:30:
  1407. 34.96 s > Failed to evaluate integral: the following integral could not be identified using any of the supported topologies: topo(I4L_FG_pinch_4(muvsq,1,2,1,0,1,1,1,1))
  1408. 34.96 s > stack backtrace:
  1409. 34.96 s > 0: __rustc::rust_begin_unwind
  1410. 34.96 s > 1: core::panicking::panic_fmt
  1411. 34.96 s > 2: integral_evaluation_analytic_tests::test_utils::compare_vakint_evaluation_vs_reference::{closure#0}
  1412. 34.96 s > 3: integral_evaluation_analytic_tests::test_utils::compare_vakint_evaluation_vs_reference
  1413. 34.96 s > 4: <integral_evaluation_analytic_tests::test_integrate_4l_PR9d_from_H_pinch::{closure#0} as core::ops::function::FnOnce<()>>::call_once
  1414. 34.96 s > note: Some details are omitted, run with `RUST_BACKTRACE=full` for a verbose backtrace.
  1415. 34.96 s >
  1416. 34.96 s > FAIL [ 0.189s] (50/74) vakint::integral_evaluation_analytic_tests test_integrate_4l_clover
  1417. 34.96 s > stdout ---
  1418. 34.96 s >
  1419. 34.96 s > running 1 test
  1420. 34.96 s > test test_integrate_4l_clover ... FAILED
  1421. 34.96 s >
  1422. 34.96 s > failures:
  1423. 34.96 s >
  1424. 34.96 s > failures:
  1425. 34.96 s > test_integrate_4l_clover
  1426. 34.96 s >
  1427. 34.96 s > test result: FAILED. 0 passed; 1 failed; 0 ignored; 0 measured; 26 filtered out; finished in 0.18s
  1428. 34.96 s >
  1429. 34.96 s > stderr ---
  1430. 34.96 s >
  1431. 34.96 s > thread 'test_integrate_4l_clover' (424) panicked at crates/vakint/tests/test_utils.rs:554:30:
  1432. 34.96 s > Failed to evaluate integral: the following integral could not be identified using any of the supported topologies: topo(I4L_FG_pinch_4_6_7_8(muvsq,1,1,1,0,1,0,0,0))
  1433. 34.96 s > stack backtrace:
  1434. 34.96 s > 0: __rustc::rust_begin_unwind
  1435. 34.96 s > 1: core::panicking::panic_fmt
  1436. 34.96 s > 2: integral_evaluation_analytic_tests::test_utils::compare_vakint_evaluation_vs_reference::{closure#0}
  1437. 34.96 s > 3: integral_evaluation_analytic_tests::test_utils::compare_vakint_evaluation_vs_reference
  1438. 34.96 s > 4: <integral_evaluation_analytic_tests::test_integrate_4l_clover::{closure#0} as core::ops::function::FnOnce<()>>::call_once
  1439. 34.96 s > note: Some details are omitted, run with `RUST_BACKTRACE=full` for a verbose backtrace.
  1440. 34.96 s >
  1441. 34.96 s > FAIL [ 0.226s] (51/74) vakint::integral_evaluation_analytic_tests test_integrate_4l_clover_with_non_unit_scales
  1442. 34.96 s > stdout ---
  1443. 34.96 s >
  1444. 34.96 s > running 1 test
  1445. 34.96 s > test test_integrate_4l_clover_with_non_unit_scales ... FAILED
  1446. 34.96 s >
  1447. 34.96 s > failures:
  1448. 34.96 s >
  1449. 34.96 s > failures:
  1450. 34.96 s > test_integrate_4l_clover_with_non_unit_scales
  1451. 34.96 s >
  1452. 34.96 s > test result: FAILED. 0 passed; 1 failed; 0 ignored; 0 measured; 26 filtered out; finished in 0.22s
  1453. 34.96 s >
  1454. 34.96 s > stderr ---
  1455. 34.96 s >
  1456. 34.96 s > thread 'test_integrate_4l_clover_with_non_unit_scales' (429) panicked at crates/vakint/tests/test_utils.rs:554:30:
  1457. 34.96 s > Failed to evaluate integral: the following integral could not be identified using any of the supported topologies: topo(I4L_FG_pinch_4_6_7_8(muvsq,1,1,1,0,1,0,0,0))
  1458. 34.96 s > stack backtrace:
  1459. 34.96 s > 0: __rustc::rust_begin_unwind
  1460. 34.96 s > 1: core::panicking::panic_fmt
  1461. 34.96 s > 2: integral_evaluation_analytic_tests::test_utils::compare_vakint_evaluation_vs_reference::{closure#0}
  1462. 34.96 s > 3: integral_evaluation_analytic_tests::test_utils::compare_vakint_evaluation_vs_reference
  1463. 34.96 s > 4: <integral_evaluation_analytic_tests::test_integrate_4l_clover_with_non_unit_scales::{closure#0} as core::ops::function::FnOnce<()>>::call_once
  1464. 34.96 s > note: Some details are omitted, run with `RUST_BACKTRACE=full` for a verbose backtrace.
  1465. 34.96 s >
  1466. 34.96 s > FAIL [ 0.225s] (52/74) vakint::integral_evaluation_analytic_tests test_integrate_4l_clover_with_numerator
  1467. 34.96 s > stdout ---
  1468. 34.96 s >
  1469. 34.96 s > running 1 test
  1470. 34.96 s > test test_integrate_4l_clover_with_numerator ... FAILED
  1471. 34.96 s >
  1472. 34.96 s > failures:
  1473. 34.96 s >
  1474. 34.96 s > failures:
  1475. 34.96 s > test_integrate_4l_clover_with_numerator
  1476. 34.96 s >
  1477. 34.96 s > test result: FAILED. 0 passed; 1 failed; 0 ignored; 0 measured; 26 filtered out; finished in 0.22s
  1478. 34.96 s >
  1479. 34.96 s > stderr ---
  1480. 34.96 s >
  1481. 34.96 s > thread 'test_integrate_4l_clover_with_numerator' (434) panicked at crates/vakint/tests/test_utils.rs:554:30:
  1482. 34.96 s > Failed to evaluate integral: the following integral could not be identified using any of the supported topologies: topo(I4L_FG_pinch_4_6_7_8(muvsq,2,1,1,0,1,0,0,0))
  1483. 34.96 s > stack backtrace:
  1484. 34.96 s > 0: __rustc::rust_begin_unwind
  1485. 34.96 s > 1: core::panicking::panic_fmt
  1486. 34.96 s > 2: integral_evaluation_analytic_tests::test_utils::compare_vakint_evaluation_vs_reference::{closure#0}
  1487. 34.96 s > 3: integral_evaluation_analytic_tests::test_utils::compare_vakint_evaluation_vs_reference
  1488. 34.96 s > 4: <integral_evaluation_analytic_tests::test_integrate_4l_clover_with_numerator::{closure#0} as core::ops::function::FnOnce<()>>::call_once
  1489. 34.96 s > note: Some details are omitted, run with `RUST_BACKTRACE=full` for a verbose backtrace.
  1490. 34.96 s >
  1491. 34.96 s > FAIL [ 0.395s] (53/74) vakint::integral_evaluation_analytic_tests test_integrate_4l_dotted_clover
  1492. 34.96 s > stdout ---
  1493. 34.96 s >
  1494. 34.96 s > running 1 test
  1495. 34.96 s > test test_integrate_4l_dotted_clover ... FAILED
  1496. 34.96 s >
  1497. 34.96 s > failures:
  1498. 34.96 s >
  1499. 34.96 s > failures:
  1500. 34.96 s > test_integrate_4l_dotted_clover
  1501. 34.96 s >
  1502. 34.96 s > test result: FAILED. 0 passed; 1 failed; 0 ignored; 0 measured; 26 filtered out; finished in 0.39s
  1503. 34.96 s >
  1504. 34.96 s > stderr ---
  1505. 34.96 s >
  1506. 34.96 s > thread 'test_integrate_4l_dotted_clover' (439) panicked at crates/vakint/tests/test_utils.rs:554:30:
  1507. 34.96 s > Failed to evaluate integral: the following integral could not be identified using any of the supported topologies: topo(I4L_FG_pinch_4_6_7_8(muvsq,2,1,1,0,1,0,0,0))
  1508. 34.96 s > stack backtrace:
  1509. 34.96 s > 0: __rustc::rust_begin_unwind
  1510. 34.96 s > 1: core::panicking::panic_fmt
  1511. 34.96 s > 2: integral_evaluation_analytic_tests::test_utils::compare_vakint_evaluation_vs_reference::{closure#0}
  1512. 34.96 s > 3: integral_evaluation_analytic_tests::test_utils::compare_vakint_evaluation_vs_reference
  1513. 34.96 s > 4: <integral_evaluation_analytic_tests::test_integrate_4l_dotted_clover::{closure#0} as core::ops::function::FnOnce<()>>::call_once
  1514. 34.96 s > note: Some details are omitted, run with `RUST_BACKTRACE=full` for a verbose backtrace.
  1515. 34.96 s >
  1516. 34.96 s > FAIL [ 0.106s] (58/74) vakint::integral_evaluation_freeform_tests test_integrate_1l_decorated_indices_alphaloop
  1517. 34.96 s > stdout ---
  1518. 34.96 s >
  1519. 34.96 s > running 1 test
  1520. 34.96 s > test test_integrate_1l_decorated_indices_alphaloop ... FAILED
  1521. 34.96 s >
  1522. 34.96 s > failures:
  1523. 34.96 s >
  1524. 34.96 s > failures:
  1525. 34.96 s > test_integrate_1l_decorated_indices_alphaloop
  1526. 34.96 s >
  1527. 34.96 s > test result: FAILED. 0 passed; 1 failed; 0 ignored; 0 measured; 3 filtered out; finished in 0.10s
  1528. 34.96 s >
  1529. 34.96 s > stderr ---
  1530. 34.96 s >
  1531. 34.96 s > thread 'test_integrate_1l_decorated_indices_alphaloop' (468) panicked at crates/vakint/tests/test_utils.rs:563:6:
  1532. 34.96 s > called `Result::unwrap()` on an `Err` value: EvaluationError("Is some tensor structure left? | Expression: '(1/4*user_space::{real}::DDMUVsq^2*vakint::{symmetric}::g(user_space::{}::mink4(4,11),user_space::{}::mink4(4,22))+user_space::{real}::DDMUVsq*user_space::{scalar}::DDsigma2(user_space::{}::some_args)*vakint::{symmetric,linear}::dot(vakint::{}::p(1),vakint::{}::p(2))*vakint::{}::vec1(vakint::{}::p(1),13370002)*vakint::{}::vec1(vakint::{}::p(2),13370003)+user_space::{real}::DDMUVsq*user_space::{symmetric,real}::DDsigma3(user_space::{}::some_args)*vakint::{symmetric,linear}::dot(vakint::{}::p(1),vakint::{}::p(2))*vakint::{}::vec1(vakint::{}::p(1),13370002)*vakint::{}::vec1(vakint::{}::p(2),13370003)+user_space::{real}::DDMUVsq*user_space::{}::DDsigma(user_space::{}::some_args)*vakint::{symmetric,linear}::dot(vakint::{}::p(1),vakint::{}::p(2))*vakint::{}::vec1(vakint::{}::p(1),13370002)*vakint::{}::vec1(vakint::{}::p(2),13370003))*1/16*vakint::{}::𝑖*𝜋^(-2)' | Error: 'function vec1(p(1),13370002) is not in a parameter map and does not have an evaluator'")
  1533. 34.96 s > stack backtrace:
  1534. 34.96 s > 0: __rustc::rust_begin_unwind
  1535. 34.96 s > 1: core::panicking::panic_fmt
  1536. 34.96 s > 2: core::result::unwrap_failed
  1537. 34.96 s > 3: integral_evaluation_freeform_tests::test_utils::compare_vakint_evaluation_vs_reference
  1538. 34.96 s > 4: <integral_evaluation_freeform_tests::test_integrate_1l_decorated_indices_alphaloop::{closure#0} as core::ops::function::FnOnce<()>>::call_once
  1539. 34.96 s > note: Some details are omitted, run with `RUST_BACKTRACE=full` for a verbose backtrace.
  1540. 34.96 s >
  1541. 34.96 s > FAIL [ 0.186s] (59/74) vakint::integral_evaluation_freeform_tests test_integrate_1l_decorated_indices_fmft
  1542. 34.96 s > stdout ---
  1543. 34.96 s >
  1544. 34.96 s > running 1 test
  1545. 34.96 s > test test_integrate_1l_decorated_indices_fmft ... FAILED
  1546. 34.96 s >
  1547. 34.96 s > failures:
  1548. 34.96 s >
  1549. 34.96 s > failures:
  1550. 34.96 s > test_integrate_1l_decorated_indices_fmft
  1551. 34.96 s >
  1552. 34.96 s > test result: FAILED. 0 passed; 1 failed; 0 ignored; 0 measured; 3 filtered out; finished in 0.18s
  1553. 34.96 s >
  1554. 34.96 s > stderr ---
  1555. 34.96 s >
  1556. 34.96 s > thread 'test_integrate_1l_decorated_indices_fmft' (474) panicked at crates/vakint/tests/test_utils.rs:554:30:
  1557. 34.96 s > Failed to evaluate integral: the following integral could not be identified using any of the supported topologies: topo(I4L_FG_pinch_4_6_7_8(BBMUVsq,1,1,1,0,1,0,0,0))
  1558. 34.96 s > stack backtrace:
  1559. 34.96 s > 0: __rustc::rust_begin_unwind
  1560. 34.96 s > 1: core::panicking::panic_fmt
  1561. 34.96 s > 2: integral_evaluation_freeform_tests::test_utils::compare_vakint_evaluation_vs_reference::{closure#0}
  1562. 34.96 s > 3: integral_evaluation_freeform_tests::test_utils::compare_vakint_evaluation_vs_reference
  1563. 34.96 s > 4: <integral_evaluation_freeform_tests::test_integrate_1l_decorated_indices_fmft::{closure#0} as core::ops::function::FnOnce<()>>::call_once
  1564. 34.96 s > note: Some details are omitted, run with `RUST_BACKTRACE=full` for a verbose backtrace.
  1565. 34.96 s >
  1566. 34.96 s > FAIL [ 0.082s] (60/74) vakint::integral_evaluation_freeform_tests test_integrate_1l_decorated_indices_matad
  1567. 34.96 s > stdout ---
  1568. 34.96 s >
  1569. 34.96 s > running 1 test
  1570. 34.96 s > test test_integrate_1l_decorated_indices_matad ... FAILED
  1571. 34.96 s >
  1572. 34.96 s > failures:
  1573. 34.96 s >
  1574. 34.96 s > failures:
  1575. 34.96 s > test_integrate_1l_decorated_indices_matad
  1576. 34.96 s >
  1577. 34.96 s > test result: FAILED. 0 passed; 1 failed; 0 ignored; 0 measured; 3 filtered out; finished in 0.08s
  1578. 34.96 s >
  1579. 34.96 s > stderr ---
  1580. 34.96 s >
  1581. 34.96 s > thread 'test_integrate_1l_decorated_indices_matad' (479) panicked at crates/vakint/tests/test_utils.rs:554:30:
  1582. 34.96 s > Failed to evaluate integral: FORM run crashed with the following error:
  1583. 34.96 s > stderr:
  1584. 34.96 s > stdout: FORM 5.0.0 (Jan 1 1980) Run: Sat Sep 12 20:41:33 2026
  1585. 34.96 s > #-
  1586. 34.96 s > run_matad.frm Line 11 --> Undeclared variable vec1
  1587. 34.96 s > ~~~" "
  1588. 34.96 s > ~~~" "
  1589. 34.96 s > ~~~" _____ _____ _____ _____ ____ "
  1590. 34.96 s > ~~~" | | _ |_ _| _ | \ ___ ___ ___ "
  1591. 34.96 s > ~~~" | | | | | | | | | | |___| | . | "
  1592. 34.96 s > ~~~" |_|_|_|__|__| |_| |__|__|____/ |_|_|_ | "
  1593. 34.96 s > ~~~" |___| "
  1594. 34.96 s > ~~~" "
  1595. 34.96 s > ~~~" "
  1596. 34.96 s > ~~~" Originally written by M.Steinhauser "
  1597. 34.96 s > ~~~" About exact version contact to: "
  1598. 34.96 s > ~~~" pikelner[at]theor.jinr.ru, Andrey Pikelner "
  1599. 34.96 s > ~~~" "
  1600. 34.96 s > ~~~MATAD called for 1-loop integral
  1601. 34.96 s > Program terminating at -->
  1602. 34.96 s > Terminate called from pre.c:1086 (PreProcessor)
  1603. 34.96 s > 0.00 sec out of 0.00 sec
  1604. 34.96 s >
  1605. 34.96 s > You can rerun the script using:
  1606. 34.96 s > cd "/build/vakint_temp_pid478_1789245693849342430_1" && "form" "run_matad.frm"
  1607. 34.96 s > stack backtrace:
  1608. 34.96 s > 0: __rustc::rust_begin_unwind
  1609. 34.96 s > 1: core::panicking::panic_fmt
  1610. 34.96 s > 2: integral_evaluation_freeform_tests::test_utils::compare_vakint_evaluation_vs_reference::{closure#0}
  1611. 34.96 s > 3: integral_evaluation_freeform_tests::test_utils::compare_vakint_evaluation_vs_reference
  1612. 34.96 s > 4: <integral_evaluation_freeform_tests::test_integrate_1l_decorated_indices_matad::{closure#0} as core::ops::function::FnOnce<()>>::call_once
  1613. 34.96 s > note: Some details are omitted, run with `RUST_BACKTRACE=full` for a verbose backtrace.
  1614. 34.96 s >
  1615. 34.96 s > ------------
  1616. 34.96 s > Summary [ 14.143s] 74 tests run: 61 passed, 13 failed, 0 skipped
  1617. 34.96 s > FAIL [ 0.077s] ( 5/74) vakint::input_matching_tests test_2l_matching_pinched
  1618. 34.96 s > stdout ---
  1619. 34.96 s >
  1620. 34.96 s > running 1 test
  1621. 34.96 s > test test_2l_matching_pinched ... FAILED
  1622. 34.96 s >
  1623. 34.96 s > failures:
  1624. 34.96 s >
  1625. 34.96 s > failures:
  1626. 34.96 s > test_2l_matching_pinched
  1627. 34.96 s >
  1628. 34.96 s > test result: FAILED. 0 passed; 1 failed; 0 ignored; 0 measured; 5 filtered out; finished in 0.07s
  1629. 34.96 s >
  1630. 34.96 s > stderr ---
  1631. 34.96 s >
  1632. 34.96 s > thread 'test_2l_matching_pinched' (170) panicked at crates/vakint/tests/test_utils.rs:202:21:
  1633. 34.96 s > Error: the following integral could not be identified using any of the supported topologies: topo(I2L_pinch_3(mUVsq,2,1,0))
  1634. 34.96 s > stack backtrace:
  1635. 34.96 s > 0: __rustc::rust_begin_unwind
  1636. 34.96 s > 1: core::panicking::panic_fmt
  1637. 34.96 s > 2: input_matching_tests::test_utils::compare_output
  1638. 34.96 s > 3: <input_matching_tests::test_2l_matching_pinched::{closure#0} as core::ops::function::FnOnce<()>>::call_once
  1639. 34.96 s > note: Some details are omitted, run with `RUST_BACKTRACE=full` for a verbose backtrace.
  1640. 34.96 s >
  1641. 34.96 s > FAIL [ 0.380s] (12/74) vakint::integral_alphaloop_vs_matad_tests test_integrate_1l_no_numerator_squared_mass
  1642. 34.96 s > stdout ---
  1643. 34.96 s >
  1644. 34.96 s > running 1 test
  1645. 34.96 s >
  1646. 34.96 s > <><><><><>
  1647. 34.96 s >
  1648. 34.96 s >
  1649. 34.96 s > <><><><><>
  1650. 34.96 s >
  1651. 34.96 s > test test_integrate_1l_no_numerator_squared_mass ... FAILED
  1652. 34.96 s >
  1653. 34.96 s > failures:
  1654. 34.96 s >
  1655. 34.96 s > failures:
  1656. 34.96 s > test_integrate_1l_no_numerator_squared_mass
  1657. 34.96 s >
  1658. 34.96 s > test result: FAILED. 0 passed; 1 failed; 0 ignored; 0 measured; 9 filtered out; finished in 0.37s
  1659. 34.96 s >
  1660. 34.96 s > stderr ---
  1661. 34.96 s > [INFO integral_alphaloop_vs_matad_tests::test_utils] Benchmark [AlphaLoop (susbstitute_masters=true)] :: central :
  1662. 34.96 s > ε^-1 : (1.000000000000000000000000000000+0i)
  1663. 34.96 s > ε^ 0 : (4.227843350984671393934879099176e-1+0i)
  1664. 34.96 s > ε^+1 : (1.411840330426439694788883561418+0i)
  1665. 34.96 s > ε^+2 : (5.043612543455534057723233940620e-1+0i)
  1666. 34.96 s > [INFO integral_alphaloop_vs_matad_tests::test_utils] Tested [MATAD (expand_masters=true, susbstitute_masters=true, substitute_hpls=true, direct_numerical_substition=true)] :: central :
  1667. 34.96 s > ε^-1 : (1.000000000000000000000000000000+0i)
  1668. 34.96 s > ε^ 0 : (4.227843350984671393934879099176e-1+0i)
  1669. 34.96 s > ε^+1 : (1.411840330426439694788883561418+0i)
  1670. 34.96 s > ε^+2 : (5.043612543455534057723233940620e-1+0i)
  1671. 34.96 s > [INFO integral_alphaloop_vs_matad_tests::test_utils] matches!
  1672. 34.96 s >
  1673. 34.96 s > thread 'test_integrate_1l_no_numerator_squared_mass' (231) panicked at crates/vakint/tests/test_utils.rs:416:13:
  1674. 34.96 s > Error during numerical evaluation of benchmark result with [MATAD (expand_masters=true, susbstitute_masters=true, substitute_hpls=true, direct_numerical_substition=true)] :: error:
  1675. 34.96 s > Numerical evaluation error: Is some tensor structure left? | Expression: '-1*user_space::{}::muv^2+2*vakint::{}::M' | Error: 'variable M is not in a parameter map and does not have an evaluator'
  1676. 34.96 s > stack backtrace:
  1677. 34.96 s > 0: __rustc::rust_begin_unwind
  1678. 34.96 s > 1: core::panicking::panic_fmt
  1679. 34.96 s > 2: integral_alphaloop_vs_matad_tests::test_utils::compare_two_evaluations
  1680. 34.96 s > 3: <integral_alphaloop_vs_matad_tests::test_integrate_1l_no_numerator_squared_mass::{closure#0} as core::ops::function::FnOnce<()>>::call_once
  1681. 34.96 s > note: Some details are omitted, run with `RUST_BACKTRACE=full` for a verbose backtrace.
  1682. 34.96 s >
  1683. 34.96 s > FAIL [ 0.088s] (14/74) vakint::integral_alphaloop_vs_matad_tests test_integrate_3l_basketball_a
  1684. 34.96 s > stdout ---
  1685. 34.96 s >
  1686. 34.96 s > running 1 test
  1687. 34.96 s > test test_integrate_3l_basketball_a ... FAILED
  1688. 34.96 s >
  1689. 34.96 s > failures:
  1690. 34.96 s >
  1691. 34.96 s > failures:
  1692. 34.96 s > test_integrate_3l_basketball_a
  1693. 34.96 s >
  1694. 34.96 s > test result: FAILED. 0 passed; 1 failed; 0 ignored; 0 measured; 9 filtered out; finished in 0.08s
  1695. 34.96 s >
  1696. 34.96 s > stderr ---
  1697. 34.96 s >
  1698. 34.96 s > thread 'test_integrate_3l_basketball_a' (252) panicked at crates/vakint/tests/test_utils.rs:350:13:
  1699. 34.96 s > Error during benchmark integral evaluation with [AlphaLoop (susbstitute_masters=true)] :: error :
  1700. 34.96 s > the following integral could not be identified using any of the supported topologies: topo(I3L_pinch_1_6(muvsq,0,1,1,1,1,0))
  1701. 34.96 s > stack backtrace:
  1702. 34.96 s > 0: __rustc::rust_begin_unwind
  1703. 34.96 s > 1: core::panicking::panic_fmt
  1704. 34.96 s > 2: integral_alphaloop_vs_matad_tests::test_utils::compare_two_evaluations
  1705. 34.96 s > 3: <integral_alphaloop_vs_matad_tests::test_integrate_3l_basketball_a::{closure#0} as core::ops::function::FnOnce<()>>::call_once
  1706. 34.96 s > note: Some details are omitted, run with `RUST_BACKTRACE=full` for a verbose backtrace.
  1707. 34.96 s >
  1708. 34.96 s > FAIL [ 0.083s] (15/74) vakint::integral_alphaloop_vs_matad_tests test_integrate_3l_basketball_b
  1709. 34.96 s > stdout ---
  1710. 34.96 s >
  1711. 34.96 s > running 1 test
  1712. 34.96 s > test test_integrate_3l_basketball_b ... FAILED
  1713. 34.96 s >
  1714. 34.96 s > failures:
  1715. 34.96 s >
  1716. 34.96 s > failures:
  1717. 34.96 s > test_integrate_3l_basketball_b
  1718. 34.96 s >
  1719. 34.96 s > test result: FAILED. 0 passed; 1 failed; 0 ignored; 0 measured; 9 filtered out; finished in 0.08s
  1720. 34.96 s >
  1721. 34.96 s > stderr ---
  1722. 34.96 s >
  1723. 34.96 s > thread 'test_integrate_3l_basketball_b' (257) panicked at crates/vakint/tests/test_utils.rs:350:13:
  1724. 34.96 s > Error during benchmark integral evaluation with [AlphaLoop (susbstitute_masters=true)] :: error :
  1725. 34.96 s > the following integral could not be identified using any of the supported topologies: topo(I3L_pinch_1_6(muvsq,0,1,1,1,1,0))
  1726. 34.96 s > stack backtrace:
  1727. 34.96 s > 0: __rustc::rust_begin_unwind
  1728. 34.96 s > 1: core::panicking::panic_fmt
  1729. 34.96 s > 2: integral_alphaloop_vs_matad_tests::test_utils::compare_two_evaluations
  1730. 34.96 s > 3: <integral_alphaloop_vs_matad_tests::test_integrate_3l_basketball_b::{closure#0} as core::ops::function::FnOnce<()>>::call_once
  1731. 34.96 s > note: Some details are omitted, run with `RUST_BACKTRACE=full` for a verbose backtrace.
  1732. 34.96 s >
  1733. 34.96 s > FAIL [ 0.124s] (46/74) vakint::integral_evaluation_analytic_tests test_integrate_4l_PR9d_from_FG_pinch
  1734. 34.96 s > stdout ---
  1735. 34.96 s >
  1736. 34.96 s > running 1 test
  1737. 34.96 s > test test_integrate_4l_PR9d_from_FG_pinch ... FAILED
  1738. 34.96 s >
  1739. 34.96 s > failures:
  1740. 34.96 s >
  1741. 34.96 s > failures:
  1742. 34.96 s > test_integrate_4l_PR9d_from_FG_pinch
  1743. 34.96 s >
  1744. 34.96 s > test result: FAILED. 0 passed; 1 failed; 0 ignored; 0 measured; 26 filtered out; finished in 0.12s
  1745. 34.96 s >
  1746. 34.96 s > stderr ---
  1747. 34.96 s >
  1748. 34.96 s > thread 'test_integrate_4l_PR9d_from_FG_pinch' (402) panicked at crates/vakint/tests/test_utils.rs:554:30:
  1749. 34.96 s > Failed to evaluate integral: the following integral could not be identified using any of the supported topologies: topo(I4L_FG_pinch_4(muvsq,1,2,1,0,1,1,1,1))
  1750. 34.96 s > stack backtrace:
  1751. 34.96 s > 0: __rustc::rust_begin_unwind
  1752. 34.96 s > 1: core::panicking::panic_fmt
  1753. 34.96 s > 2: integral_evaluation_analytic_tests::test_utils::compare_vakint_evaluation_vs_reference::{closure#0}
  1754. 34.96 s > 3: integral_evaluation_analytic_tests::test_utils::compare_vakint_evaluation_vs_reference
  1755. 34.96 s > 4: <integral_evaluation_analytic_tests::test_integrate_4l_PR9d_from_FG_pinch::{closure#0} as core::ops::function::FnOnce<()>>::call_once
  1756. 34.96 s > note: Some details are omitted, run with `RUST_BACKTRACE=full` for a verbose backtrace.
  1757. 34.96 s >
  1758. 34.96 s > FAIL [ 0.255s] (48/74) vakint::integral_evaluation_analytic_tests test_integrate_4l_PR9d_from_H_pinch
  1759. 34.96 s > stdout ---
  1760. 34.96 s >
  1761. 34.96 s > running 1 test
  1762. 34.96 s > test test_integrate_4l_PR9d_from_H_pinch ... FAILED
  1763. 34.96 s >
  1764. 34.96 s > failures:
  1765. 34.96 s >
  1766. 34.96 s > failures:
  1767. 34.96 s > test_integrate_4l_PR9d_from_H_pinch
  1768. 34.96 s >
  1769. 34.96 s > test result: FAILED. 0 passed; 1 failed; 0 ignored; 0 measured; 26 filtered out; finished in 0.25s
  1770. 34.96 s >
  1771. 34.96 s > stderr ---
  1772. 34.96 s >
  1773. 34.96 s > thread 'test_integrate_4l_PR9d_from_H_pinch' (413) panicked at crates/vakint/tests/test_utils.rs:554:30:
  1774. 34.96 s > Failed to evaluate integral: the following integral could not be identified using any of the supported topologies: topo(I4L_FG_pinch_4(muvsq,1,2,1,0,1,1,1,1))
  1775. 34.96 s > stack backtrace:
  1776. 34.96 s > 0: __rustc::rust_begin_unwind
  1777. 34.96 s > 1: core::panicking::panic_fmt
  1778. 34.96 s > 2: integral_evaluation_analytic_tests::test_utils::compare_vakint_evaluation_vs_reference::{closure#0}
  1779. 34.96 s > 3: integral_evaluation_analytic_tests::test_utils::compare_vakint_evaluation_vs_reference
  1780. 34.96 s > 4: <integral_evaluation_analytic_tests::test_integrate_4l_PR9d_from_H_pinch::{closure#0} as core::ops::function::FnOnce<()>>::call_once
  1781. 34.96 s > note: Some details are omitted, run with `RUST_BACKTRACE=full` for a verbose backtrace.
  1782. 34.96 s >
  1783. 34.96 s > FAIL [ 0.189s] (50/74) vakint::integral_evaluation_analytic_tests test_integrate_4l_clover
  1784. 34.96 s > stdout ---
  1785. 34.96 s >
  1786. 34.96 s > running 1 test
  1787. 34.96 s > test test_integrate_4l_clover ... FAILED
  1788. 34.96 s >
  1789. 34.96 s > failures:
  1790. 34.96 s >
  1791. 34.96 s > failures:
  1792. 34.96 s > test_integrate_4l_clover
  1793. 34.96 s >
  1794. 34.96 s > test result: FAILED. 0 passed; 1 failed; 0 ignored; 0 measured; 26 filtered out; finished in 0.18s
  1795. 34.96 s >
  1796. 34.96 s > stderr ---
  1797. 34.96 s >
  1798. 34.96 s > thread 'test_integrate_4l_clover' (424) panicked at crates/vakint/tests/test_utils.rs:554:30:
  1799. 34.96 s > Failed to evaluate integral: the following integral could not be identified using any of the supported topologies: topo(I4L_FG_pinch_4_6_7_8(muvsq,1,1,1,0,1,0,0,0))
  1800. 34.96 s > stack backtrace:
  1801. 34.96 s > 0: __rustc::rust_begin_unwind
  1802. 34.96 s > 1: core::panicking::panic_fmt
  1803. 34.96 s > 2: integral_evaluation_analytic_tests::test_utils::compare_vakint_evaluation_vs_reference::{closure#0}
  1804. 34.96 s > 3: integral_evaluation_analytic_tests::test_utils::compare_vakint_evaluation_vs_reference
  1805. 34.96 s > 4: <integral_evaluation_analytic_tests::test_integrate_4l_clover::{closure#0} as core::ops::function::FnOnce<()>>::call_once
  1806. 34.96 s > note: Some details are omitted, run with `RUST_BACKTRACE=full` for a verbose backtrace.
  1807. 34.96 s >
  1808. 34.96 s > FAIL [ 0.226s] (51/74) vakint::integral_evaluation_analytic_tests test_integrate_4l_clover_with_non_unit_scales
  1809. 34.96 s > stdout ---
  1810. 34.96 s >
  1811. 34.96 s > running 1 test
  1812. 34.96 s > test test_integrate_4l_clover_with_non_unit_scales ... FAILED
  1813. 34.96 s >
  1814. 34.96 s > failures:
  1815. 34.96 s >
  1816. 34.96 s > failures:
  1817. 34.96 s > test_integrate_4l_clover_with_non_unit_scales
  1818. 34.96 s >
  1819. 34.96 s > test result: FAILED. 0 passed; 1 failed; 0 ignored; 0 measured; 26 filtered out; finished in 0.22s
  1820. 34.96 s >
  1821. 34.96 s > stderr ---
  1822. 34.96 s >
  1823. 34.96 s > thread 'test_integrate_4l_clover_with_non_unit_scales' (429) panicked at crates/vakint/tests/test_utils.rs:554:30:
  1824. 34.96 s > Failed to evaluate integral: the following integral could not be identified using any of the supported topologies: topo(I4L_FG_pinch_4_6_7_8(muvsq,1,1,1,0,1,0,0,0))
  1825. 34.96 s > stack backtrace:
  1826. 34.96 s > 0: __rustc::rust_begin_unwind
  1827. 34.96 s > 1: core::panicking::panic_fmt
  1828. 34.96 s > 2: integral_evaluation_analytic_tests::test_utils::compare_vakint_evaluation_vs_reference::{closure#0}
  1829. 34.96 s > 3: integral_evaluation_analytic_tests::test_utils::compare_vakint_evaluation_vs_reference
  1830. 34.96 s > 4: <integral_evaluation_analytic_tests::test_integrate_4l_clover_with_non_unit_scales::{closure#0} as core::ops::function::FnOnce<()>>::call_once
  1831. 34.96 s > note: Some details are omitted, run with `RUST_BACKTRACE=full` for a verbose backtrace.
  1832. 34.96 s >
  1833. 34.96 s > FAIL [ 0.225s] (52/74) vakint::integral_evaluation_analytic_tests test_integrate_4l_clover_with_numerator
  1834. 34.96 s > stdout ---
  1835. 34.96 s >
  1836. 34.96 s > running 1 test
  1837. 34.96 s > test test_integrate_4l_clover_with_numerator ... FAILED
  1838. 34.96 s >
  1839. 34.96 s > failures:
  1840. 34.96 s >
  1841. 34.96 s > failures:
  1842. 34.96 s > test_integrate_4l_clover_with_numerator
  1843. 34.96 s >
  1844. 34.96 s > test result: FAILED. 0 passed; 1 failed; 0 ignored; 0 measured; 26 filtered out; finished in 0.22s
  1845. 34.96 s >
  1846. 34.96 s > stderr ---
  1847. 34.96 s >
  1848. 34.96 s > thread 'test_integrate_4l_clover_with_numerator' (434) panicked at crates/vakint/tests/test_utils.rs:554:30:
  1849. 34.96 s > Failed to evaluate integral: the following integral could not be identified using any of the supported topologies: topo(I4L_FG_pinch_4_6_7_8(muvsq,2,1,1,0,1,0,0,0))
  1850. 34.96 s > stack backtrace:
  1851. 34.96 s > 0: __rustc::rust_begin_unwind
  1852. 34.96 s > 1: core::panicking::panic_fmt
  1853. 34.96 s > 2: integral_evaluation_analytic_tests::test_utils::compare_vakint_evaluation_vs_reference::{closure#0}
  1854. 34.96 s > 3: integral_evaluation_analytic_tests::test_utils::compare_vakint_evaluation_vs_reference
  1855. 34.96 s > 4: <integral_evaluation_analytic_tests::test_integrate_4l_clover_with_numerator::{closure#0} as core::ops::function::FnOnce<()>>::call_once
  1856. 34.96 s > note: Some details are omitted, run with `RUST_BACKTRACE=full` for a verbose backtrace.
  1857. 34.96 s >
  1858. 34.96 s > FAIL [ 0.395s] (53/74) vakint::integral_evaluation_analytic_tests test_integrate_4l_dotted_clover
  1859. 34.96 s > stdout ---
  1860. 34.96 s >
  1861. 34.96 s > running 1 test
  1862. 34.96 s > test test_integrate_4l_dotted_clover ... FAILED
  1863. 34.96 s >
  1864. 34.96 s > failures:
  1865. 34.96 s >
  1866. 34.96 s > failures:
  1867. 34.96 s > test_integrate_4l_dotted_clover
  1868. 34.96 s >
  1869. 34.96 s > test result: FAILED. 0 passed; 1 failed; 0 ignored; 0 measured; 26 filtered out; finished in 0.39s
  1870. 34.96 s >
  1871. 34.96 s > stderr ---
  1872. 34.96 s >
  1873. 34.96 s > thread 'test_integrate_4l_dotted_clover' (439) panicked at crates/vakint/tests/test_utils.rs:554:30:
  1874. 34.96 s > Failed to evaluate integral: the following integral could not be identified using any of the supported topologies: topo(I4L_FG_pinch_4_6_7_8(muvsq,2,1,1,0,1,0,0,0))
  1875. 34.96 s > stack backtrace:
  1876. 34.96 s > 0: __rustc::rust_begin_unwind
  1877. 34.96 s > 1: core::panicking::panic_fmt
  1878. 34.96 s > 2: integral_evaluation_analytic_tests::test_utils::compare_vakint_evaluation_vs_reference::{closure#0}
  1879. 34.96 s > 3: integral_evaluation_analytic_tests::test_utils::compare_vakint_evaluation_vs_reference
  1880. 34.96 s > 4: <integral_evaluation_analytic_tests::test_integrate_4l_dotted_clover::{closure#0} as core::ops::function::FnOnce<()>>::call_once
  1881. 34.96 s > note: Some details are omitted, run with `RUST_BACKTRACE=full` for a verbose backtrace.
  1882. 34.96 s >
  1883. 34.96 s > FAIL [ 0.106s] (58/74) vakint::integral_evaluation_freeform_tests test_integrate_1l_decorated_indices_alphaloop
  1884. 34.96 s > stdout ---
  1885. 34.96 s >
  1886. 34.96 s > running 1 test
  1887. 34.96 s > test test_integrate_1l_decorated_indices_alphaloop ... FAILED
  1888. 34.96 s >
  1889. 34.96 s > failures:
  1890. 34.96 s >
  1891. 34.96 s > failures:
  1892. 34.96 s > test_integrate_1l_decorated_indices_alphaloop
  1893. 34.96 s >
  1894. 34.96 s > test result: FAILED. 0 passed; 1 failed; 0 ignored; 0 measured; 3 filtered out; finished in 0.10s
  1895. 34.96 s >
  1896. 34.96 s > stderr ---
  1897. 34.96 s >
  1898. 34.96 s > thread 'test_integrate_1l_decorated_indices_alphaloop' (468) panicked at crates/vakint/tests/test_utils.rs:563:6:
  1899. 34.96 s > called `Result::unwrap()` on an `Err` value: EvaluationError("Is some tensor structure left? | Expression: '(1/4*user_space::{real}::DDMUVsq^2*vakint::{symmetric}::g(user_space::{}::mink4(4,11),user_space::{}::mink4(4,22))+user_space::{real}::DDMUVsq*user_space::{scalar}::DDsigma2(user_space::{}::some_args)*vakint::{symmetric,linear}::dot(vakint::{}::p(1),vakint::{}::p(2))*vakint::{}::vec1(vakint::{}::p(1),13370002)*vakint::{}::vec1(vakint::{}::p(2),13370003)+user_space::{real}::DDMUVsq*user_space::{symmetric,real}::DDsigma3(user_space::{}::some_args)*vakint::{symmetric,linear}::dot(vakint::{}::p(1),vakint::{}::p(2))*vakint::{}::vec1(vakint::{}::p(1),13370002)*vakint::{}::vec1(vakint::{}::p(2),13370003)+user_space::{real}::DDMUVsq*user_space::{}::DDsigma(user_space::{}::some_args)*vakint::{symmetric,linear}::dot(vakint::{}::p(1),vakint::{}::p(2))*vakint::{}::vec1(vakint::{}::p(1),13370002)*vakint::{}::vec1(vakint::{}::p(2),13370003))*1/16*vakint::{}::𝑖*𝜋^(-2)' | Error: 'function vec1(p(1),13370002) is not in a parameter map and does not have an evaluator'")
  1900. 34.96 s > stack backtrace:
  1901. 34.96 s > 0: __rustc::rust_begin_unwind
  1902. 34.96 s > 1: core::panicking::panic_fmt
  1903. 34.96 s > 2: core::result::unwrap_failed
  1904. 34.96 s > 3: integral_evaluation_freeform_tests::test_utils::compare_vakint_evaluation_vs_reference
  1905. 34.96 s > 4: <integral_evaluation_freeform_tests::test_integrate_1l_decorated_indices_alphaloop::{closure#0} as core::ops::function::FnOnce<()>>::call_once
  1906. 34.96 s > note: Some details are omitted, run with `RUST_BACKTRACE=full` for a verbose backtrace.
  1907. 34.96 s >
  1908. 34.96 s > FAIL [ 0.186s] (59/74) vakint::integral_evaluation_freeform_tests test_integrate_1l_decorated_indices_fmft
  1909. 34.96 s > stdout ---
  1910. 34.96 s >
  1911. 34.96 s > running 1 test
  1912. 34.96 s > test test_integrate_1l_decorated_indices_fmft ... FAILED
  1913. 34.96 s >
  1914. 34.96 s > failures:
  1915. 34.96 s >
  1916. 34.96 s > failures:
  1917. 34.96 s > test_integrate_1l_decorated_indices_fmft
  1918. 34.96 s >
  1919. 34.96 s > test result: FAILED. 0 passed; 1 failed; 0 ignored; 0 measured; 3 filtered out; finished in 0.18s
  1920. 34.96 s >
  1921. 34.96 s > stderr ---
  1922. 34.96 s >
  1923. 34.96 s > thread 'test_integrate_1l_decorated_indices_fmft' (474) panicked at crates/vakint/tests/test_utils.rs:554:30:
  1924. 34.96 s > Failed to evaluate integral: the following integral could not be identified using any of the supported topologies: topo(I4L_FG_pinch_4_6_7_8(BBMUVsq,1,1,1,0,1,0,0,0))
  1925. 34.96 s > stack backtrace:
  1926. 34.96 s > 0: __rustc::rust_begin_unwind
  1927. 34.96 s > 1: core::panicking::panic_fmt
  1928. 34.96 s > 2: integral_evaluation_freeform_tests::test_utils::compare_vakint_evaluation_vs_reference::{closure#0}
  1929. 34.96 s > 3: integral_evaluation_freeform_tests::test_utils::compare_vakint_evaluation_vs_reference
  1930. 34.96 s > 4: <integral_evaluation_freeform_tests::test_integrate_1l_decorated_indices_fmft::{closure#0} as core::ops::function::FnOnce<()>>::call_once
  1931. 34.96 s > note: Some details are omitted, run with `RUST_BACKTRACE=full` for a verbose backtrace.
  1932. 34.96 s >
  1933. 34.96 s > FAIL [ 0.082s] (60/74) vakint::integral_evaluation_freeform_tests test_integrate_1l_decorated_indices_matad
  1934. 34.96 s > stdout ---
  1935. 34.96 s >
  1936. 34.96 s > running 1 test
  1937. 34.96 s > test test_integrate_1l_decorated_indices_matad ... FAILED
  1938. 34.96 s >
  1939. 34.96 s > failures:
  1940. 34.96 s >
  1941. 34.96 s > failures:
  1942. 34.96 s > test_integrate_1l_decorated_indices_matad
  1943. 34.96 s >
  1944. 34.96 s > test result: FAILED. 0 passed; 1 failed; 0 ignored; 0 measured; 3 filtered out; finished in 0.08s
  1945. 34.96 s >
  1946. 34.96 s > stderr ---
  1947. 34.96 s >
  1948. 34.96 s > thread 'test_integrate_1l_decorated_indices_matad' (479) panicked at crates/vakint/tests/test_utils.rs:554:30:
  1949. 34.96 s > Failed to evaluate integral: FORM run crashed with the following error:
  1950. 34.96 s > stderr:
  1951. 34.96 s > stdout: FORM 5.0.0 (Jan 1 1980) Run: Sat Sep 12 20:41:33 2026
  1952. 34.96 s > #-
  1953. 34.96 s > run_matad.frm Line 11 --> Undeclared variable vec1
  1954. 34.96 s > ~~~" "
  1955. 34.96 s > ~~~" "
  1956. 34.96 s > ~~~" _____ _____ _____ _____ ____ "
  1957. 34.96 s > ~~~" | | _ |_ _| _ | \ ___ ___ ___ "
  1958. 34.96 s > ~~~" | | | | | | | | | | |___| | . | "
  1959. 34.96 s > ~~~" |_|_|_|__|__| |_| |__|__|____/ |_|_|_ | "
  1960. 34.96 s > ~~~" |___| "
  1961. 34.96 s > ~~~" "
  1962. 34.96 s > ~~~" "
  1963. 34.96 s > ~~~" Originally written by M.Steinhauser "
  1964. 34.96 s > ~~~" About exact version contact to: "
  1965. 34.96 s > ~~~" pikelner[at]theor.jinr.ru, Andrey Pikelner "
  1966. 34.96 s > ~~~" "
  1967. 34.96 s > ~~~MATAD called for 1-loop integral
  1968. 34.96 s > Program terminating at -->
  1969. 34.96 s > Terminate called from pre.c:1086 (PreProcessor)
  1970. 34.96 s > 0.00 sec out of 0.00 sec
  1971. 34.96 s >
  1972. 34.96 s > You can rerun the script using:
  1973. 34.96 s > cd "/build/vakint_temp_pid478_1789245693849342430_1" && "form" "run_matad.frm"
  1974. 34.96 s > stack backtrace:
  1975. 34.96 s > 0: __rustc::rust_begin_unwind
  1976. 34.96 s > 1: core::panicking::panic_fmt
  1977. 34.96 s > 2: integral_evaluation_freeform_tests::test_utils::compare_vakint_evaluation_vs_reference::{closure#0}
  1978. 34.96 s > 3: integral_evaluation_freeform_tests::test_utils::compare_vakint_evaluation_vs_reference
  1979. 34.96 s > 4: <integral_evaluation_freeform_tests::test_integrate_1l_decorated_indices_matad::{closure#0} as core::ops::function::FnOnce<()>>::call_once
  1980. 34.96 s > note: Some details are omitted, run with `RUST_BACKTRACE=full` for a verbose backtrace.
  1981. 34.96 s >
  1982. 34.96 s > error: test run failed
  1983. 34.96 s >
  1984. 34.96 s > ========== nextest test summary ==========
  1985. 34.96 s > report: target/nextest/ci_gammaloop/junit.xml
  1986. 34.96 s > tests: 74, failures: 13, errors: 0
  1987. 34.96 s >
  1988. 34.96 s > 1. vakint::input_matching_tests::test_2l_matching_pinched
  1989. 34.96 s > failure: test failure with exit code 101
  1990. 34.96 s > thread 'test_2l_matching_pinched' (170) panicked at crates/vakint/tests/test_utils.rs:202:21:
  1991. 34.96 s > Error: the following integral could not be identified using any of the supported topologies: topo(I2L_pinch_3(mUVsq,2,1,0))
  1992. 34.96 s > stack backtrace:
  1993. 34.96 s > 0: __rustc::rust_begin_unwind
  1994. 34.96 s > 1: core::panicking::panic_fmt
  1995. 34.96 s > 2: input_matching_tests::test_utils::compare_output
  1996. 34.96 s > 3: <input_matching_tests::test_2l_matching_pinched::{closure#0} as core::ops::function::FnOnce<()>>::call_once
  1997. 34.96 s > note: Some details are omitted, run with `RUST_BACKTRACE=full` for a verbose backtrace.
  1998. 34.96 s > system-out
  1999. 34.96 s > running 1 test
  2000. 34.96 s > test test_2l_matching_pinched ... FAILED
  2001. 34.96 s >
  2002. 34.96 s > failures:
  2003. 34.96 s >
  2004. 34.96 s > failures:
  2005. 34.96 s > test_2l_matching_pinched
  2006. 34.96 s >
  2007. 34.96 s > test result: FAILED. 0 passed; 1 failed; 0 ignored; 0 measured; 5 filtered out; finished in 0.07s
  2008. 34.96 s > system-err
  2009. 34.96 s > thread 'test_2l_matching_pinched' (170) panicked at crates/vakint/tests/test_utils.rs:202:21:
  2010. 34.96 s > Error: the following integral could not be identified using any of the supported topologies: topo(I2L_pinch_3(mUVsq,2,1,0))
  2011. 34.96 s > stack backtrace:
  2012. 34.96 s > 0: __rustc::rust_begin_unwind
  2013. 34.96 s > 1: core::panicking::panic_fmt
  2014. 34.96 s > 2: input_matching_tests::test_utils::compare_output
  2015. 34.96 s > 3: <input_matching_tests::test_2l_matching_pinched::{closure#0} as core::ops::function::FnOnce<()>>::call_once
  2016. 34.96 s > note: Some details are omitted, run with `RUST_BACKTRACE=full` for a verbose backtrace.
  2017. 34.96 s >
  2018. 34.96 s > 2. vakint::integral_alphaloop_vs_matad_tests::test_integrate_1l_no_numerator_squared_mass
  2019. 34.96 s > failure: test failure with exit code 101
  2020. 34.96 s > thread 'test_integrate_1l_no_numerator_squared_mass' (231) panicked at crates/vakint/tests/test_utils.rs:416:13:
  2021. 34.96 s > Error during numerical evaluation of benchmark result with [MATAD (expand_masters=true, susbstitute_masters=true, substitute_hpls=true, direct_numerical_substition=true)] :: error:
  2022. 34.96 s > Numerical evaluation error: Is some tensor structure left? | Expression: '-1*user_space::{}::muv^2+2*vakint::{}::M' | Error: 'variable M is not in a parameter map and does not have an evaluator'
  2023. 34.96 s > stack backtrace:
  2024. 34.96 s > 0: __rustc::rust_begin_unwind
  2025. 34.96 s > 1: core::panicking::panic_fmt
  2026. 34.96 s > 2: integral_alphaloop_vs_matad_tests::test_utils::compare_two_evaluations
  2027. 34.96 s > 3: <integral_alphaloop_vs_matad_tests::test_integrate_1l_no_numerator_squared_mass::{closure#0} as core::ops::function::FnOnce<()>>::call_once
  2028. 34.96 s > note: Some details are omitted, run with `RUST_BACKTRACE=full` for a verbose backtrace.
  2029. 34.96 s > system-out
  2030. 34.96 s > running 1 test
  2031. 34.96 s >
  2032. 34.96 s > <><><><><>
  2033. 34.96 s >
  2034. 34.96 s >
  2035. 34.96 s > <><><><><>
  2036. 34.96 s >
  2037. 34.96 s > test test_integrate_1l_no_numerator_squared_mass ... FAILED
  2038. 34.96 s >
  2039. 34.96 s > failures:
  2040. 34.96 s >
  2041. 34.96 s > failures:
  2042. 34.96 s > test_integrate_1l_no_numerator_squared_mass
  2043. 34.96 s >
  2044. 34.96 s > test result: FAILED. 0 passed; 1 failed; 0 ignored; 0 measured; 9 filtered out; finished in 0.37s
  2045. 34.96 s > system-err
  2046. 34.96 s > [INFO integral_alphaloop_vs_matad_tests::test_utils] Benchmark [AlphaLoop (susbstitute_masters=true)] :: central :
  2047. 34.96 s > ε^-1 : (1.000000000000000000000000000000+0i)
  2048. 34.96 s > ε^ 0 : (4.227843350984671393934879099176e-1+0i)
  2049. 34.96 s > ε^+1 : (1.411840330426439694788883561418+0i)
  2050. 34.96 s > ε^+2 : (5.043612543455534057723233940620e-1+0i)
  2051. 34.96 s > [INFO integral_alphaloop_vs_matad_tests::test_utils] Tested [MATAD (expand_masters=true, susbstitute_masters=true, substitute_hpls=true, direct_numerical_substition=true)] :: central :
  2052. 34.96 s > ε^-1 : (1.000000000000000000000000000000+0i)
  2053. 34.96 s > ε^ 0 : (4.227843350984671393934879099176e-1+0i)
  2054. 34.96 s > ε^+1 : (1.411840330426439694788883561418+0i)
  2055. 34.96 s > ε^+2 : (5.043612543455534057723233940620e-1+0i)
  2056. 34.96 s > [INFO integral_alphaloop_vs_matad_tests::test_utils] matches!
  2057. 34.96 s >
  2058. 34.96 s > thread 'test_integrate_1l_no_numerator_squared_mass' (231) panicked at crates/vakint/tests/test_utils.rs:416:13:
  2059. 34.96 s > Error during numerical evaluation of benchmark result with [MATAD (expand_masters=true, susbstitute_masters=true, substitute_hpls=true, direct_numerical_substition=true)] :: error:
  2060. 34.96 s > Numerical evaluation error: Is some tensor structure left? | Expression: '-1*user_space::{}::muv^2+2*vakint::{}::M' | Error: 'variable M is not in a parameter map and does not have an evaluator'
  2061. 34.96 s > stack backtrace:
  2062. 34.96 s > 0: __rustc::rust_begin_unwind
  2063. 34.96 s > 1: core::panicking::panic_fmt
  2064. 34.96 s > 2: integral_alphaloop_vs_matad_tests::test_utils::compare_two_evaluations
  2065. 34.96 s > 3: <integral_alphaloop_vs_matad_tests::test_integrate_1l_no_numerator_squared_mass::{closure#0} as core::ops::function::FnOnce<()>>::call_once
  2066. 34.96 s > note: Some details are omitted, run with `RUST_BACKTRACE=full` for a verbose backtrace.
  2067. 34.96 s >
  2068. 34.96 s > 3. vakint::integral_alphaloop_vs_matad_tests::test_integrate_3l_basketball_a
  2069. 34.96 s > failure: test failure with exit code 101
  2070. 34.96 s > thread 'test_integrate_3l_basketball_a' (252) panicked at crates/vakint/tests/test_utils.rs:350:13:
  2071. 34.96 s > Error during benchmark integral evaluation with [AlphaLoop (susbstitute_masters=true)] :: error :
  2072. 34.96 s > the following integral could not be identified using any of the supported topologies: topo(I3L_pinch_1_6(muvsq,0,1,1,1,1,0))
  2073. 34.96 s > stack backtrace:
  2074. 34.96 s > 0: __rustc::rust_begin_unwind
  2075. 34.96 s > 1: core::panicking::panic_fmt
  2076. 34.96 s > 2: integral_alphaloop_vs_matad_tests::test_utils::compare_two_evaluations
  2077. 34.96 s > 3: <integral_alphaloop_vs_matad_tests::test_integrate_3l_basketball_a::{closure#0} as core::ops::function::FnOnce<()>>::call_once
  2078. 34.96 s > note: Some details are omitted, run with `RUST_BACKTRACE=full` for a verbose backtrace.
  2079. 34.96 s > system-out
  2080. 34.96 s > running 1 test
  2081. 34.96 s > test test_integrate_3l_basketball_a ... FAILED
  2082. 34.96 s >
  2083. 34.96 s > failures:
  2084. 34.96 s >
  2085. 34.96 s > failures:
  2086. 34.96 s > test_integrate_3l_basketball_a
  2087. 34.96 s >
  2088. 34.96 s > test result: FAILED. 0 passed; 1 failed; 0 ignored; 0 measured; 9 filtered out; finished in 0.08s
  2089. 34.96 s > system-err
  2090. 34.96 s > thread 'test_integrate_3l_basketball_a' (252) panicked at crates/vakint/tests/test_utils.rs:350:13:
  2091. 34.96 s > Error during benchmark integral evaluation with [AlphaLoop (susbstitute_masters=true)] :: error :
  2092. 34.96 s > the following integral could not be identified using any of the supported topologies: topo(I3L_pinch_1_6(muvsq,0,1,1,1,1,0))
  2093. 34.96 s > stack backtrace:
  2094. 34.96 s > 0: __rustc::rust_begin_unwind
  2095. 34.96 s > 1: core::panicking::panic_fmt
  2096. 34.96 s > 2: integral_alphaloop_vs_matad_tests::test_utils::compare_two_evaluations
  2097. 34.96 s > 3: <integral_alphaloop_vs_matad_tests::test_integrate_3l_basketball_a::{closure#0} as core::ops::function::FnOnce<()>>::call_once
  2098. 34.96 s > note: Some details are omitted, run with `RUST_BACKTRACE=full` for a verbose backtrace.
  2099. 34.96 s >
  2100. 34.96 s > 4. vakint::integral_alphaloop_vs_matad_tests::test_integrate_3l_basketball_b
  2101. 34.96 s > failure: test failure with exit code 101
  2102. 34.96 s > thread 'test_integrate_3l_basketball_b' (257) panicked at crates/vakint/tests/test_utils.rs:350:13:
  2103. 34.96 s > Error during benchmark integral evaluation with [AlphaLoop (susbstitute_masters=true)] :: error :
  2104. 34.96 s > the following integral could not be identified using any of the supported topologies: topo(I3L_pinch_1_6(muvsq,0,1,1,1,1,0))
  2105. 34.96 s > stack backtrace:
  2106. 34.96 s > 0: __rustc::rust_begin_unwind
  2107. 34.96 s > 1: core::panicking::panic_fmt
  2108. 34.96 s > 2: integral_alphaloop_vs_matad_tests::test_utils::compare_two_evaluations
  2109. 34.96 s > 3: <integral_alphaloop_vs_matad_tests::test_integrate_3l_basketball_b::{closure#0} as core::ops::function::FnOnce<()>>::call_once
  2110. 34.96 s > note: Some details are omitted, run with `RUST_BACKTRACE=full` for a verbose backtrace.
  2111. 34.96 s > system-out
  2112. 34.96 s > running 1 test
  2113. 34.96 s > test test_integrate_3l_basketball_b ... FAILED
  2114. 34.96 s >
  2115. 34.96 s > failures:
  2116. 34.96 s >
  2117. 34.96 s > failures:
  2118. 34.96 s > test_integrate_3l_basketball_b
  2119. 34.96 s >
  2120. 34.96 s > test result: FAILED. 0 passed; 1 failed; 0 ignored; 0 measured; 9 filtered out; finished in 0.08s
  2121. 34.96 s > system-err
  2122. 34.96 s > thread 'test_integrate_3l_basketball_b' (257) panicked at crates/vakint/tests/test_utils.rs:350:13:
  2123. 34.96 s > Error during benchmark integral evaluation with [AlphaLoop (susbstitute_masters=true)] :: error :
  2124. 34.96 s > the following integral could not be identified using any of the supported topologies: topo(I3L_pinch_1_6(muvsq,0,1,1,1,1,0))
  2125. 34.96 s > stack backtrace:
  2126. 34.96 s > 0: __rustc::rust_begin_unwind
  2127. 34.96 s > 1: core::panicking::panic_fmt
  2128. 34.96 s > 2: integral_alphaloop_vs_matad_tests::test_utils::compare_two_evaluations
  2129. 34.96 s > 3: <integral_alphaloop_vs_matad_tests::test_integrate_3l_basketball_b::{closure#0} as core::ops::function::FnOnce<()>>::call_once
  2130. 34.96 s > note: Some details are omitted, run with `RUST_BACKTRACE=full` for a verbose backtrace.
  2131. 34.96 s >
  2132. 34.96 s > 5. vakint::integral_evaluation_analytic_tests::test_integrate_4l_PR9d_from_FG_pinch
  2133. 34.96 s > failure: test failure with exit code 101
  2134. 34.96 s > thread 'test_integrate_4l_PR9d_from_FG_pinch' (402) panicked at crates/vakint/tests/test_utils.rs:554:30:
  2135. 34.96 s > Failed to evaluate integral: the following integral could not be identified using any of the supported topologies: topo(I4L_FG_pinch_4(muvsq,1,2,1,0,1,1,1,1))
  2136. 34.96 s > stack backtrace:
  2137. 34.96 s > 0: __rustc::rust_begin_unwind
  2138. 34.96 s > 1: core::panicking::panic_fmt
  2139. 34.96 s > 2: integral_evaluation_analytic_tests::test_utils::compare_vakint_evaluation_vs_reference::{closure#0}
  2140. 34.96 s > 3: integral_evaluation_analytic_tests::test_utils::compare_vakint_evaluation_vs_reference
  2141. 34.96 s > 4: <integral_evaluation_analytic_tests::test_integrate_4l_PR9d_from_FG_pinch::{closure#0} as core::ops::function::FnOnce<()>>::call_once
  2142. 34.96 s > note: Some details are omitted, run with `RUST_BACKTRACE=full` for a verbose backtrace.
  2143. 34.96 s > system-out
  2144. 34.96 s > running 1 test
  2145. 34.96 s > test test_integrate_4l_PR9d_from_FG_pinch ... FAILED
  2146. 34.96 s >
  2147. 34.96 s > failures:
  2148. 34.96 s >
  2149. 34.96 s > failures:
  2150. 34.96 s > test_integrate_4l_PR9d_from_FG_pinch
  2151. 34.96 s >
  2152. 34.96 s > test result: FAILED. 0 passed; 1 failed; 0 ignored; 0 measured; 26 filtered out; finished in 0.12s
  2153. 34.96 s > system-err
  2154. 34.96 s > thread 'test_integrate_4l_PR9d_from_FG_pinch' (402) panicked at crates/vakint/tests/test_utils.rs:554:30:
  2155. 34.96 s > Failed to evaluate integral: the following integral could not be identified using any of the supported topologies: topo(I4L_FG_pinch_4(muvsq,1,2,1,0,1,1,1,1))
  2156. 34.96 s > stack backtrace:
  2157. 34.96 s > 0: __rustc::rust_begin_unwind
  2158. 34.96 s > 1: core::panicking::panic_fmt
  2159. 34.96 s > 2: integral_evaluation_analytic_tests::test_utils::compare_vakint_evaluation_vs_reference::{closure#0}
  2160. 34.96 s > 3: integral_evaluation_analytic_tests::test_utils::compare_vakint_evaluation_vs_reference
  2161. 34.96 s > 4: <integral_evaluation_analytic_tests::test_integrate_4l_PR9d_from_FG_pinch::{closure#0} as core::ops::function::FnOnce<()>>::call_once
  2162. 34.96 s > note: Some details are omitted, run with `RUST_BACKTRACE=full` for a verbose backtrace.
  2163. 34.96 s >
  2164. 34.96 s > 6. vakint::integral_evaluation_analytic_tests::test_integrate_4l_PR9d_from_H_pinch
  2165. 34.96 s > failure: test failure with exit code 101
  2166. 34.96 s > thread 'test_integrate_4l_PR9d_from_H_pinch' (413) panicked at crates/vakint/tests/test_utils.rs:554:30:
  2167. 34.96 s > Failed to evaluate integral: the following integral could not be identified using any of the supported topologies: topo(I4L_FG_pinch_4(muvsq,1,2,1,0,1,1,1,1))
  2168. 34.96 s > stack backtrace:
  2169. 34.96 s > 0: __rustc::rust_begin_unwind
  2170. 34.96 s > 1: core::panicking::panic_fmt
  2171. 34.96 s > 2: integral_evaluation_analytic_tests::test_utils::compare_vakint_evaluation_vs_reference::{closure#0}
  2172. 34.96 s > 3: integral_evaluation_analytic_tests::test_utils::compare_vakint_evaluation_vs_reference
  2173. 34.96 s > 4: <integral_evaluation_analytic_tests::test_integrate_4l_PR9d_from_H_pinch::{closure#0} as core::ops::function::FnOnce<()>>::call_once
  2174. 34.96 s > note: Some details are omitted, run with `RUST_BACKTRACE=full` for a verbose backtrace.
  2175. 34.96 s > system-out
  2176. 34.96 s > running 1 test
  2177. 34.96 s > test test_integrate_4l_PR9d_from_H_pinch ... FAILED
  2178. 34.96 s >
  2179. 34.96 s > failures:
  2180. 34.96 s >
  2181. 34.96 s > failures:
  2182. 34.96 s > test_integrate_4l_PR9d_from_H_pinch
  2183. 34.96 s >
  2184. 34.96 s > test result: FAILED. 0 passed; 1 failed; 0 ignored; 0 measured; 26 filtered out; finished in 0.25s
  2185. 34.96 s > system-err
  2186. 34.96 s > thread 'test_integrate_4l_PR9d_from_H_pinch' (413) panicked at crates/vakint/tests/test_utils.rs:554:30:
  2187. 34.96 s > Failed to evaluate integral: the following integral could not be identified using any of the supported topologies: topo(I4L_FG_pinch_4(muvsq,1,2,1,0,1,1,1,1))
  2188. 34.96 s > stack backtrace:
  2189. 34.96 s > 0: __rustc::rust_begin_unwind
  2190. 34.96 s > 1: core::panicking::panic_fmt
  2191. 34.96 s > 2: integral_evaluation_analytic_tests::test_utils::compare_vakint_evaluation_vs_reference::{closure#0}
  2192. 34.96 s > 3: integral_evaluation_analytic_tests::test_utils::compare_vakint_evaluation_vs_reference
  2193. 34.96 s > 4: <integral_evaluation_analytic_tests::test_integrate_4l_PR9d_from_H_pinch::{closure#0} as core::ops::function::FnOnce<()>>::call_once
  2194. 34.96 s > note: Some details are omitted, run with `RUST_BACKTRACE=full` for a verbose backtrace.
  2195. 34.96 s >
  2196. 34.96 s > 7. vakint::integral_evaluation_analytic_tests::test_integrate_4l_clover
  2197. 34.96 s > failure: test failure with exit code 101
  2198. 34.96 s > thread 'test_integrate_4l_clover' (424) panicked at crates/vakint/tests/test_utils.rs:554:30:
  2199. 34.96 s > Failed to evaluate integral: the following integral could not be identified using any of the supported topologies: topo(I4L_FG_pinch_4_6_7_8(muvsq,1,1,1,0,1,0,0,0))
  2200. 34.96 s > stack backtrace:
  2201. 34.96 s > 0: __rustc::rust_begin_unwind
  2202. 34.96 s > 1: core::panicking::panic_fmt
  2203. 34.96 s > 2: integral_evaluation_analytic_tests::test_utils::compare_vakint_evaluation_vs_reference::{closure#0}
  2204. 34.96 s > 3: integral_evaluation_analytic_tests::test_utils::compare_vakint_evaluation_vs_reference
  2205. 34.96 s > 4: <integral_evaluation_analytic_tests::test_integrate_4l_clover::{closure#0} as core::ops::function::FnOnce<()>>::call_once
  2206. 34.96 s > note: Some details are omitted, run with `RUST_BACKTRACE=full` for a verbose backtrace.
  2207. 34.96 s > system-out
  2208. 34.96 s > running 1 test
  2209. 34.96 s > test test_integrate_4l_clover ... FAILED
  2210. 34.96 s >
  2211. 34.96 s > failures:
  2212. 34.96 s >
  2213. 34.96 s > failures:
  2214. 34.96 s > test_integrate_4l_clover
  2215. 34.96 s >
  2216. 34.96 s > test result: FAILED. 0 passed; 1 failed; 0 ignored; 0 measured; 26 filtered out; finished in 0.18s
  2217. 34.96 s > system-err
  2218. 34.96 s > thread 'test_integrate_4l_clover' (424) panicked at crates/vakint/tests/test_utils.rs:554:30:
  2219. 34.96 s > Failed to evaluate integral: the following integral could not be identified using any of the supported topologies: topo(I4L_FG_pinch_4_6_7_8(muvsq,1,1,1,0,1,0,0,0))
  2220. 34.96 s > stack backtrace:
  2221. 34.96 s > 0: __rustc::rust_begin_unwind
  2222. 34.96 s > 1: core::panicking::panic_fmt
  2223. 34.96 s > 2: integral_evaluation_analytic_tests::test_utils::compare_vakint_evaluation_vs_reference::{closure#0}
  2224. 34.96 s > 3: integral_evaluation_analytic_tests::test_utils::compare_vakint_evaluation_vs_reference
  2225. 34.96 s > 4: <integral_evaluation_analytic_tests::test_integrate_4l_clover::{closure#0} as core::ops::function::FnOnce<()>>::call_once
  2226. 34.96 s > note: Some details are omitted, run with `RUST_BACKTRACE=full` for a verbose backtrace.
  2227. 34.96 s >
  2228. 34.96 s > 8. vakint::integral_evaluation_analytic_tests::test_integrate_4l_clover_with_non_unit_scales
  2229. 34.96 s > failure: test failure with exit code 101
  2230. 34.96 s > thread 'test_integrate_4l_clover_with_non_unit_scales' (429) panicked at crates/vakint/tests/test_utils.rs:554:30:
  2231. 34.96 s > Failed to evaluate integral: the following integral could not be identified using any of the supported topologies: topo(I4L_FG_pinch_4_6_7_8(muvsq,1,1,1,0,1,0,0,0))
  2232. 34.96 s > stack backtrace:
  2233. 34.96 s > 0: __rustc::rust_begin_unwind
  2234. 34.96 s > 1: core::panicking::panic_fmt
  2235. 34.96 s > 2: integral_evaluation_analytic_tests::test_utils::compare_vakint_evaluation_vs_reference::{closure#0}
  2236. 34.96 s > 3: integral_evaluation_analytic_tests::test_utils::compare_vakint_evaluation_vs_reference
  2237. 34.96 s > 4: <integral_evaluation_analytic_tests::test_integrate_4l_clover_with_non_unit_scales::{closure#0} as core::ops::function::FnOnce<()>>::call_once
  2238. 34.96 s > note: Some details are omitted, run with `RUST_BACKTRACE=full` for a verbose backtrace.
  2239. 34.96 s > system-out
  2240. 34.96 s > running 1 test
  2241. 34.96 s > test test_integrate_4l_clover_with_non_unit_scales ... FAILED
  2242. 34.96 s >
  2243. 34.96 s > failures:
  2244. 34.96 s >
  2245. 34.96 s > failures:
  2246. 34.96 s > test_integrate_4l_clover_with_non_unit_scales
  2247. 34.96 s >
  2248. 34.96 s > test result: FAILED. 0 passed; 1 failed; 0 ignored; 0 measured; 26 filtered out; finished in 0.22s
  2249. 34.96 s > system-err
  2250. 34.96 s > thread 'test_integrate_4l_clover_with_non_unit_scales' (429) panicked at crates/vakint/tests/test_utils.rs:554:30:
  2251. 34.96 s > Failed to evaluate integral: the following integral could not be identified using any of the supported topologies: topo(I4L_FG_pinch_4_6_7_8(muvsq,1,1,1,0,1,0,0,0))
  2252. 34.96 s > stack backtrace:
  2253. 34.96 s > 0: __rustc::rust_begin_unwind
  2254. 34.96 s > 1: core::panicking::panic_fmt
  2255. 34.96 s > 2: integral_evaluation_analytic_tests::test_utils::compare_vakint_evaluation_vs_reference::{closure#0}
  2256. 34.96 s > 3: integral_evaluation_analytic_tests::test_utils::compare_vakint_evaluation_vs_reference
  2257. 34.96 s > 4: <integral_evaluation_analytic_tests::test_integrate_4l_clover_with_non_unit_scales::{closure#0} as core::ops::function::FnOnce<()>>::call_once
  2258. 34.96 s > note: Some details are omitted, run with `RUST_BACKTRACE=full` for a verbose backtrace.
  2259. 34.96 s >
  2260. 34.96 s > 9. vakint::integral_evaluation_analytic_tests::test_integrate_4l_clover_with_numerator
  2261. 34.96 s > failure: test failure with exit code 101
  2262. 34.96 s > thread 'test_integrate_4l_clover_with_numerator' (434) panicked at crates/vakint/tests/test_utils.rs:554:30:
  2263. 34.96 s > Failed to evaluate integral: the following integral could not be identified using any of the supported topologies: topo(I4L_FG_pinch_4_6_7_8(muvsq,2,1,1,0,1,0,0,0))
  2264. 34.96 s > stack backtrace:
  2265. 34.96 s > 0: __rustc::rust_begin_unwind
  2266. 34.96 s > 1: core::panicking::panic_fmt
  2267. 34.96 s > 2: integral_evaluation_analytic_tests::test_utils::compare_vakint_evaluation_vs_reference::{closure#0}
  2268. 34.96 s > 3: integral_evaluation_analytic_tests::test_utils::compare_vakint_evaluation_vs_reference
  2269. 34.96 s > 4: <integral_evaluation_analytic_tests::test_integrate_4l_clover_with_numerator::{closure#0} as core::ops::function::FnOnce<()>>::call_once
  2270. 34.96 s > note: Some details are omitted, run with `RUST_BACKTRACE=full` for a verbose backtrace.
  2271. 34.96 s > system-out
  2272. 34.96 s > running 1 test
  2273. 34.96 s > test test_integrate_4l_clover_with_numerator ... FAILED
  2274. 34.96 s >
  2275. 34.96 s > failures:
  2276. 34.96 s >
  2277. 34.96 s > failures:
  2278. 34.96 s > test_integrate_4l_clover_with_numerator
  2279. 34.96 s >
  2280. 34.96 s > test result: FAILED. 0 passed; 1 failed; 0 ignored; 0 measured; 26 filtered out; finished in 0.22s
  2281. 34.96 s > system-err
  2282. 34.96 s > thread 'test_integrate_4l_clover_with_numerator' (434) panicked at crates/vakint/tests/test_utils.rs:554:30:
  2283. 34.96 s > Failed to evaluate integral: the following integral could not be identified using any of the supported topologies: topo(I4L_FG_pinch_4_6_7_8(muvsq,2,1,1,0,1,0,0,0))
  2284. 34.96 s > stack backtrace:
  2285. 34.96 s > 0: __rustc::rust_begin_unwind
  2286. 34.96 s > 1: core::panicking::panic_fmt
  2287. 34.96 s > 2: integral_evaluation_analytic_tests::test_utils::compare_vakint_evaluation_vs_reference::{closure#0}
  2288. 34.96 s > 3: integral_evaluation_analytic_tests::test_utils::compare_vakint_evaluation_vs_reference
  2289. 34.96 s > 4: <integral_evaluation_analytic_tests::test_integrate_4l_clover_with_numerator::{closure#0} as core::ops::function::FnOnce<()>>::call_once
  2290. 34.96 s > note: Some details are omitted, run with `RUST_BACKTRACE=full` for a verbose backtrace.
  2291. 34.96 s >
  2292. 34.96 s > 10. vakint::integral_evaluation_analytic_tests::test_integrate_4l_dotted_clover
  2293. 34.96 s > failure: test failure with exit code 101
  2294. 34.96 s > thread 'test_integrate_4l_dotted_clover' (439) panicked at crates/vakint/tests/test_utils.rs:554:30:
  2295. 34.96 s > Failed to evaluate integral: the following integral could not be identified using any of the supported topologies: topo(I4L_FG_pinch_4_6_7_8(muvsq,2,1,1,0,1,0,0,0))
  2296. 34.96 s > stack backtrace:
  2297. 34.96 s > 0: __rustc::rust_begin_unwind
  2298. 34.96 s > 1: core::panicking::panic_fmt
  2299. 34.96 s > 2: integral_evaluation_analytic_tests::test_utils::compare_vakint_evaluation_vs_reference::{closure#0}
  2300. 34.96 s > 3: integral_evaluation_analytic_tests::test_utils::compare_vakint_evaluation_vs_reference
  2301. 34.96 s > 4: <integral_evaluation_analytic_tests::test_integrate_4l_dotted_clover::{closure#0} as core::ops::function::FnOnce<()>>::call_once
  2302. 34.96 s > note: Some details are omitted, run with `RUST_BACKTRACE=full` for a verbose backtrace.
  2303. 34.96 s > system-out
  2304. 34.96 s > running 1 test
  2305. 34.96 s > test test_integrate_4l_dotted_clover ... FAILED
  2306. 34.96 s >
  2307. 34.96 s > failures:
  2308. 34.96 s >
  2309. 34.96 s > failures:
  2310. 34.96 s > test_integrate_4l_dotted_clover
  2311. 34.96 s >
  2312. 34.96 s > test result: FAILED. 0 passed; 1 failed; 0 ignored; 0 measured; 26 filtered out; finished in 0.39s
  2313. 34.96 s > system-err
  2314. 34.96 s > thread 'test_integrate_4l_dotted_clover' (439) panicked at crates/vakint/tests/test_utils.rs:554:30:
  2315. 34.96 s > Failed to evaluate integral: the following integral could not be identified using any of the supported topologies: topo(I4L_FG_pinch_4_6_7_8(muvsq,2,1,1,0,1,0,0,0))
  2316. 34.96 s > stack backtrace:
  2317. 34.96 s > 0: __rustc::rust_begin_unwind
  2318. 34.96 s > 1: core::panicking::panic_fmt
  2319. 34.96 s > 2: integral_evaluation_analytic_tests::test_utils::compare_vakint_evaluation_vs_reference::{closure#0}
  2320. 34.96 s > 3: integral_evaluation_analytic_tests::test_utils::compare_vakint_evaluation_vs_reference
  2321. 34.96 s > 4: <integral_evaluation_analytic_tests::test_integrate_4l_dotted_clover::{closure#0} as core::ops::function::FnOnce<()>>::call_once
  2322. 34.96 s > note: Some details are omitted, run with `RUST_BACKTRACE=full` for a verbose backtrace.
  2323. 34.96 s >
  2324. 34.96 s > 11. vakint::integral_evaluation_freeform_tests::test_integrate_1l_decorated_indices_alphaloop
  2325. 34.96 s > failure: test failure with exit code 101
  2326. 34.96 s > thread 'test_integrate_1l_decorated_indices_alphaloop' (468) panicked at crates/vakint/tests/test_utils.rs:563:6:
  2327. 34.96 s > called `Result::unwrap()` on an `Err` value: EvaluationError("Is some tensor structure left? | Expression: '(1/4*user_space::{real}::DDMUVsq^2*vakint::{symmetric}::g(user_space::{}::mink4(4,11),user_space::{}::mink4(4,22))+user_space::{real}::DDMUVsq*user_space::{scalar}::DDsigma2(user_space::{}::some_args)*vakint::{symmetric,linear}::dot(vakint::{}::p(1),vakint::{}::p(2))*vakint::{}::vec1(vakint::{}::p(1),13370002)*vakint::{}::vec1(vakint::{}::p(2),13370003)+user_space::{real}::DDMUVsq*user_space::{symmetric,real}::DDsigma3(user_space::{}::some_args)*vakint::{symmetric,linear}::dot(vakint::{}::p(1),vakint::{}::p(2))*vakint::{}::vec1(vakint::{}::p(1),13370002)*vakint::{}::vec1(vakint::{}::p(2),13370003)+user_space::{real}::DDMUVsq*user_space::{}::DDsigma(user_space::{}::some_args)*vakint::{symmetric,linear}::dot(vakint::{}::p(1),vakint::{}::p(2))*vakint::{}::vec1(vakint::{}::p(1),13370002)*vakint::{}::vec1(vakint::{}::p(2),13370003))*1/16*vakint::{}::𝑖*𝜋^(-2)' | Error: 'function vec1(p(1),13370002) is not in a parameter map and does not have an evaluator'")
  2328. 34.96 s > stack backtrace:
  2329. 34.96 s > 0: __rustc::rust_begin_unwind
  2330. 34.96 s > 1: core::panicking::panic_fmt
  2331. 34.96 s > 2: core::result::unwrap_failed
  2332. 34.96 s > 3: integral_evaluation_freeform_tests::test_utils::compare_vakint_evaluation_vs_reference
  2333. 34.96 s > 4: <integral_evaluation_freeform_tests::test_integrate_1l_decorated_indices_alphaloop::{closure#0} as core::ops::function::FnOnce<()>>::call_once
  2334. 34.96 s > note: Some details are omitted, run with `RUST_BACKTRACE=full` for a verbose backtrace.
  2335. 34.96 s > system-out
  2336. 34.96 s > running 1 test
  2337. 34.96 s > test test_integrate_1l_decorated_indices_alphaloop ... FAILED
  2338. 34.96 s >
  2339. 34.96 s > failures:
  2340. 34.96 s >
  2341. 34.96 s > failures:
  2342. 34.96 s > test_integrate_1l_decorated_indices_alphaloop
  2343. 34.96 s >
  2344. 34.96 s > test result: FAILED. 0 passed; 1 failed; 0 ignored; 0 measured; 3 filtered out; finished in 0.10s
  2345. 34.96 s > system-err
  2346. 34.96 s > thread 'test_integrate_1l_decorated_indices_alphaloop' (468) panicked at crates/vakint/tests/test_utils.rs:563:6:
  2347. 34.96 s > called `Result::unwrap()` on an `Err` value: EvaluationError("Is some tensor structure left? | Expression: '(1/4*user_space::{real}::DDMUVsq^2*vakint::{symmetric}::g(user_space::{}::mink4(4,11),user_space::{}::mink4(4,22))+user_space::{real}::DDMUVsq*user_space::{scalar}::DDsigma2(user_space::{}::some_args)*vakint::{symmetric,linear}::dot(vakint::{}::p(1),vakint::{}::p(2))*vakint::{}::vec1(vakint::{}::p(1),13370002)*vakint::{}::vec1(vakint::{}::p(2),13370003)+user_space::{real}::DDMUVsq*user_space::{symmetric,real}::DDsigma3(user_space::{}::some_args)*vakint::{symmetric,linear}::dot(vakint::{}::p(1),vakint::{}::p(2))*vakint::{}::vec1(vakint::{}::p(1),13370002)*vakint::{}::vec1(vakint::{}::p(2),13370003)+user_space::{real}::DDMUVsq*user_space::{}::DDsigma(user_space::{}::some_args)*vakint::{symmetric,linear}::dot(vakint::{}::p(1),vakint::{}::p(2))*vakint::{}::vec1(vakint::{}::p(1),13370002)*vakint::{}::vec1(vakint::{}::p(2),13370003))*1/16*vakint::{}::𝑖*𝜋^(-2)' | Error: 'function vec1(p(1),13370002) is not in a parameter map and does not have an evaluator'")
  2348. 34.96 s > stack backtrace:
  2349. 34.96 s > 0: __rustc::rust_begin_unwind
  2350. 34.96 s > 1: core::panicking::panic_fmt
  2351. 34.96 s > 2: core::result::unwrap_failed
  2352. 34.96 s > 3: integral_evaluation_freeform_tests::test_utils::compare_vakint_evaluation_vs_reference
  2353. 34.96 s > 4: <integral_evaluation_freeform_tests::test_integrate_1l_decorated_indices_alphaloop::{closure#0} as core::ops::function::FnOnce<()>>::call_once
  2354. 34.96 s > note: Some details are omitted, run with `RUST_BACKTRACE=full` for a verbose backtrace.
  2355. 34.96 s >
  2356. 34.96 s > 12. vakint::integral_evaluation_freeform_tests::test_integrate_1l_decorated_indices_fmft
  2357. 34.96 s > failure: test failure with exit code 101
  2358. 34.96 s > thread 'test_integrate_1l_decorated_indices_fmft' (474) panicked at crates/vakint/tests/test_utils.rs:554:30:
  2359. 34.96 s > Failed to evaluate integral: the following integral could not be identified using any of the supported topologies: topo(I4L_FG_pinch_4_6_7_8(BBMUVsq,1,1,1,0,1,0,0,0))
  2360. 34.96 s > stack backtrace:
  2361. 34.96 s > 0: __rustc::rust_begin_unwind
  2362. 34.96 s > 1: core::panicking::panic_fmt
  2363. 34.96 s > 2: integral_evaluation_freeform_tests::test_utils::compare_vakint_evaluation_vs_reference::{closure#0}
  2364. 34.96 s > 3: integral_evaluation_freeform_tests::test_utils::compare_vakint_evaluation_vs_reference
  2365. 34.96 s > 4: <integral_evaluation_freeform_tests::test_integrate_1l_decorated_indices_fmft::{closure#0} as core::ops::function::FnOnce<()>>::call_once
  2366. 34.96 s > note: Some details are omitted, run with `RUST_BACKTRACE=full` for a verbose backtrace.
  2367. 34.96 s > system-out
  2368. 34.96 s > running 1 test
  2369. 34.96 s > test test_integrate_1l_decorated_indices_fmft ... FAILED
  2370. 34.96 s >
  2371. 34.96 s > failures:
  2372. 34.96 s >
  2373. 34.96 s > failures:
  2374. 34.96 s > test_integrate_1l_decorated_indices_fmft
  2375. 34.96 s >
  2376. 34.96 s > test result: FAILED. 0 passed; 1 failed; 0 ignored; 0 measured; 3 filtered out; finished in 0.18s
  2377. 34.96 s > system-err
  2378. 34.96 s > thread 'test_integrate_1l_decorated_indices_fmft' (474) panicked at crates/vakint/tests/test_utils.rs:554:30:
  2379. 34.96 s > Failed to evaluate integral: the following integral could not be identified using any of the supported topologies: topo(I4L_FG_pinch_4_6_7_8(BBMUVsq,1,1,1,0,1,0,0,0))
  2380. 34.96 s > stack backtrace:
  2381. 34.96 s > 0: __rustc::rust_begin_unwind
  2382. 34.96 s > 1: core::panicking::panic_fmt
  2383. 34.96 s > 2: integral_evaluation_freeform_tests::test_utils::compare_vakint_evaluation_vs_reference::{closure#0}
  2384. 34.96 s > 3: integral_evaluation_freeform_tests::test_utils::compare_vakint_evaluation_vs_reference
  2385. 34.96 s > 4: <integral_evaluation_freeform_tests::test_integrate_1l_decorated_indices_fmft::{closure#0} as core::ops::function::FnOnce<()>>::call_once
  2386. 34.96 s > note: Some details are omitted, run with `RUST_BACKTRACE=full` for a verbose backtrace.
  2387. 34.96 s >
  2388. 34.96 s > 13. vakint::integral_evaluation_freeform_tests::test_integrate_1l_decorated_indices_matad
  2389. 34.96 s > failure: test failure with exit code 101
  2390. 34.96 s > thread 'test_integrate_1l_decorated_indices_matad' (479) panicked at crates/vakint/tests/test_utils.rs:554:30:
  2391. 34.96 s > Failed to evaluate integral: FORM run crashed with the following error:
  2392. 34.96 s > stderr:
  2393. 34.96 s > stdout: FORM 5.0.0 (Jan 1 1980) Run: Sat Sep 12 20:41:33 2026
  2394. 34.96 s > #-
  2395. 34.96 s > run_matad.frm Line 11 --> Undeclared variable vec1
  2396. 34.96 s > ~~~" "
  2397. 34.96 s > ~~~" "
  2398. 34.96 s > ~~~" _____ _____ _____ _____ ____ "
  2399. 34.96 s > ~~~" | | _ |_ _| _ | \ ___ ___ ___ "
  2400. 34.96 s > ~~~" | | | | | | | | | | |___| | . | "
  2401. 34.96 s > ~~~" |_|_|_|__|__| |_| |__|__|____/ |_|_|_ | "
  2402. 34.96 s > ~~~" |___| "
  2403. 34.96 s > ~~~" "
  2404. 34.96 s > ~~~" "
  2405. 34.96 s > ~~~" Originally written by M.Steinhauser "
  2406. 34.96 s > ~~~" About exact version contact to: "
  2407. 34.96 s > ~~~" pikelner[at]theor.jinr.ru, Andrey Pikelner "
  2408. 34.96 s > ~~~" "
  2409. 34.96 s > ~~~MATAD called for 1-loop integral
  2410. 34.96 s > Program terminating at -->
  2411. 34.96 s > Terminate called from pre.c:1086 (PreProcessor)
  2412. 34.96 s > 0.00 sec out of 0.00 sec
  2413. 34.96 s >
  2414. 34.96 s > You can rerun the script using:
  2415. 34.96 s > cd "/build/vakint_temp_pid478_1789245693849342430_1" && "form" "run_matad.frm"
  2416. 34.96 s > stack backtrace:
  2417. 34.96 s > 0: __rustc::rust_begin_unwind
  2418. 34.96 s > 1: core::panicking::panic_fmt
  2419. 34.96 s > 2: integral_evaluation_freeform_tests::test_utils::compare_vakint_evaluation_vs_reference::{closure#0}
  2420. 34.96 s > 3: integral_evaluation_freeform_tests::test_utils::compare_vakint_evaluation_vs_reference
  2421. 34.96 s > 4: <integral_evaluation_freeform_tests::test_integrate_1l_decorated_indices_matad::{closure#0} as core::ops::function::FnOnce<()>>::call_once
  2422. 34.96 s > note: Some details are omitted, run with `RUST_BACKTRACE=full` for a verbose backtrace.
  2423. 34.96 s > system-out
  2424. 34.96 s > running 1 test
  2425. 34.96 s > test test_integrate_1l_decorated_indices_matad ... FAILED
  2426. 34.96 s >
  2427. 34.96 s > failures:
  2428. 34.96 s >
  2429. 34.96 s > failures:
  2430. 34.96 s > test_integrate_1l_decorated_indices_matad
  2431. 34.96 s >
  2432. 34.96 s > test result: FAILED. 0 passed; 1 failed; 0 ignored; 0 measured; 3 filtered out; finished in 0.08s
  2433. 34.96 s > system-err
  2434. 34.96 s > thread 'test_integrate_1l_decorated_indices_matad' (479) panicked at crates/vakint/tests/test_utils.rs:554:30:
  2435. 34.96 s > Failed to evaluate integral: FORM run crashed with the following error:
  2436. 34.96 s > stderr:
  2437. 34.96 s > stdout: FORM 5.0.0 (Jan 1 1980) Run: Sat Sep 12 20:41:33 2026
  2438. 34.96 s > #-
  2439. 34.96 s > run_matad.frm Line 11 --> Undeclared variable vec1
  2440. 34.96 s > ~~~" "
  2441. 34.96 s > ~~~" "
  2442. 34.96 s > ~~~" _____ _____ _____ _____ ____ "
  2443. 34.96 s > ~~~" | | _ |_ _| _ | \ ___ ___ ___ "
  2444. 34.96 s > ~~~" | | | | | | | | | | |___| | . | "
  2445. 34.96 s > ~~~" |_|_|_|__|__| |_| |__|__|____/ |_|_|_ | "
  2446. 34.96 s > ~~~" |___| "
  2447. 34.96 s > ~~~" "
  2448. 34.96 s > ~~~" "
  2449. 34.96 s > ~~~" Originally written by M.Steinhauser "
  2450. 34.96 s > ~~~" About exact version contact to: "
  2451. 34.96 s > ~~~" pikelner[at]theor.jinr.ru, Andrey Pikelner "
  2452. 34.96 s > ~~~" "
  2453. 34.96 s > ~~~MATAD called for 1-loop integral
  2454. 34.96 s > Program terminating at -->
  2455. 34.96 s > Terminate called from pre.c:1086 (PreProcessor)
  2456. 34.96 s > 0.00 sec out of 0.00 sec
  2457. 34.96 s >
  2458. 34.96 s > You can rerun the script using:
  2459. 34.96 s > cd "/build/vakint_temp_pid478_1789245693849342430_1" && "form" "run_matad.frm"
  2460. 34.96 s > stack backtrace:
  2461. 34.96 s > 0: __rustc::rust_begin_unwind
  2462. 34.96 s > 1: core::panicking::panic_fmt
  2463. 34.96 s > 2: integral_evaluation_freeform_tests::test_utils::compare_vakint_evaluation_vs_reference::{closure#0}
  2464. 34.96 s > 3: integral_evaluation_freeform_tests::test_utils::compare_vakint_evaluation_vs_reference
  2465. 34.96 s > 4: <integral_evaluation_freeform_tests::test_integrate_1l_decorated_indices_matad::{closure#0} as core::ops::function::FnOnce<()>>::call_once
  2466. 34.96 s > note: Some details are omitted, run with `RUST_BACKTRACE=full` for a verbose backtrace.
  2467. 34.96 s > =========================================
  2468. 34.96 s For full logs, run:
  2469. 34.96 s nix log /nix/store/y7jldak46jgknws0nim0216sgb1hli86-gammaloop-nextest-vakint.drv
  2470. 35.09 s [0 built (1 failed)]Run failed.