1. 0.95 s $ /nix/store/9ypz3flqsrl5xl495mm8h645gadjsxi1-coreutils-9.11/bin/timeout --kill-after=15s 7200s /nix/store/23zk8sgzamrbmj1fday15szf7f2279s8-nix-2.34.7/bin/nix --extra-experimental-features nix-command --extra-experimental-features flakes flake clone git+https://github.com/alphal00p/gammaloop --dest /tmp/nix-ci-worker/stable-pwd/repo/
  2. 1.70 s Cloning into '/tmp/nix-ci-worker/stable-pwd/repo'...
  3. 1.70 s remote: Enumerating objects: 65014, done.
  4. 1.70 s remote: Counting objects: 0% (1/7686) remote: Counting objects: 1% (77/7686) remote: Counting objects: 2% (154/7686) remote: Counting objects: 3% (231/7686) remote: Counting objects: 4% (308/7686) remote: Counting objects: 5% (385/7686) remote: Counting objects: 6% (462/7686) remote: Counting objects: 7% (539/7686) remote: Counting objects: 8% (615/7686) remote: Counting objects: 9% (692/7686) remote: Counting objects: 10% (769/7686) remote: Counting objects: 11% (846/7686) remote: Counting objects: 12% (923/7686) remote: Counting objects: 13% (1000/7686) remote: Counting objects: 14% (1077/7686) remote: Counting objects: 15% (1153/7686) remote: Counting objects: 16% (1230/7686) remote: Counting objects: 17% (1307/7686) remote: Counting objects: 18% (1384/7686) remote: Counting objects: 19% (1461/7686) remote: Counting objects: 20% (1538/7686) remote: Counting objects: 21% (1615/7686) remote: Counting objects: 22% (1691/7686) remote: Counting objects: 23% (1768/7686) remote: Counting objects: 24% (1845/7686) remote: Counting objects: 25% (1922/7686) remote: Counting objects: 26% (1999/7686) remote: Counting objects: 27% (2076/7686) remote: Counting objects: 28% (2153/7686) remote: Counting objects: 29% (2229/7686) remote: Counting objects: 30% (2306/7686) remote: Counting objects: 31% (2383/7686) remote: Counting objects: 32% (2460/7686) remote: Counting objects: 33% (2537/7686) remote: Counting objects: 34% (2614/7686) remote: Counting objects: 35% (2691/7686) remote: Counting objects: 36% (2767/7686) remote: Counting objects: 37% (2844/7686) remote: Counting objects: 38% (2921/7686) remote: Counting objects: 39% (2998/7686) remote: Counting objects: 40% (3075/7686) remote: Counting objects: 41% (3152/7686) remote: Counting objects: 42% (3229/7686) remote: Counting objects: 43% (3305/7686) remote: Counting objects: 44% (3382/7686) remote: Counting objects: 45% (3459/7686) remote: Counting objects: 46% (3536/7686) remote: Counting objects: 47% (3613/7686) remote: Counting objects: 48% (3690/7686) remote: Counting objects: 49% (3767/7686) remote: Counting objects: 50% (3843/7686) remote: Counting objects: 51% (3920/7686) remote: Counting objects: 52% (3997/7686) remote: Counting objects: 53% (4074/7686) remote: Counting objects: 54% (4151/7686) remote: Counting objects: 55% (4228/7686) remote: Counting objects: 56% (4305/7686) remote: Counting objects: 57% (4382/7686) remote: Counting objects: 58% (4458/7686) remote: Counting objects: 59% (4535/7686) remote: Counting objects: 60% (4612/7686) remote: Counting objects: 61% (4689/7686) remote: Counting objects: 62% (4766/7686) remote: Counting objects: 63% (4843/7686) remote: Counting objects: 64% (4920/7686) remote: Counting objects: 65% (4996/7686) remote: Counting objects: 66% (5073/7686) remote: Counting objects: 67% (5150/7686) remote: Counting objects: 68% (5227/7686) remote: Counting objects: 69% (5304/7686) remote: Counting objects: 70% (5381/7686) remote: Counting objects: 71% (5458/7686) remote: Counting objects: 72% (5534/7686) remote: Counting objects: 73% (5611/7686) remote: Counting objects: 74% (5688/7686) remote: Counting objects: 75% (5765/7686) remote: Counting objects: 76% (5842/7686) remote: Counting objects: 77% (5919/7686) remote: Counting objects: 78% (5996/7686) remote: Counting objects: 79% (6072/7686) remote: Counting objects: 80% (6149/7686) remote: Counting objects: 81% (6226/7686) remote: Counting objects: 82% (6303/7686) remote: Counting objects: 83% (6380/7686) remote: Counting objects: 84% (6457/7686) remote: Counting objects: 85% (6534/7686) remote: Counting objects: 86% (6610/7686) remote: Counting objects: 87% (6687/7686) remote: Counting objects: 88% (6764/7686) remote: Counting objects: 89% (6841/7686) remote: Counting objects: 90% (6918/7686) remote: Counting objects: 91% (6995/7686) remote: Counting objects: 92% (7072/7686) remote: Counting objects: 93% (7148/7686) remote: Counting objects: 94% (7225/7686) remote: Counting objects: 95% (7302/7686) remote: Counting objects: 96% (7379/7686) remote: Counting objects: 97% (7456/7686) remote: Counting objects: 98% (7533/7686) remote: Counting objects: 99% (7610/7686) remote: Counting objects: 100% (7686/7686) remote: Counting objects: 100% (7686/7686), done.
  5. 2.36 s remote: Compressing objects: 0% (1/1402) remote: Compressing objects: 1% (15/1402) remote: Compressing objects: 2% (29/1402) remote: Compressing objects: 3% (43/1402) remote: Compressing objects: 4% (57/1402) remote: Compressing objects: 5% (71/1402) remote: Compressing objects: 6% (85/1402) remote: Compressing objects: 7% (99/1402) remote: Compressing objects: 8% (113/1402) remote: Compressing objects: 9% (127/1402) remote: Compressing objects: 10% (141/1402) remote: Compressing objects: 11% (155/1402) remote: Compressing objects: 12% (169/1402) remote: Compressing objects: 12% (172/1402) remote: Compressing objects: 13% (183/1402) remote: Compressing objects: 14% (197/1402) remote: Compressing objects: 15% (211/1402) remote: Compressing objects: 16% (225/1402) remote: Compressing objects: 17% (239/1402) remote: Compressing objects: 18% (253/1402) remote: Compressing objects: 19% (267/1402) remote: Compressing objects: 20% (281/1402) remote: Compressing objects: 21% (295/1402) remote: Compressing objects: 22% (309/1402) remote: Compressing objects: 23% (323/1402) remote: Compressing objects: 24% (337/1402) remote: Compressing objects: 25% (351/1402) remote: Compressing objects: 26% (365/1402) remote: Compressing objects: 27% (379/1402) remote: Compressing objects: 28% (393/1402) remote: Compressing objects: 29% (407/1402) remote: Compressing objects: 30% (421/1402) remote: Compressing objects: 31% (435/1402) remote: Compressing objects: 32% (449/1402) remote: Compressing objects: 33% (463/1402) remote: Compressing objects: 34% (477/1402) remote: Compressing objects: 35% (491/1402) remote: Compressing objects: 36% (505/1402) remote: Compressing objects: 37% (519/1402) remote: Compressing objects: 38% (533/1402) remote: Compressing objects: 39% (547/1402) remote: Compressing objects: 40% (561/1402) remote: Compressing objects: 41% (575/1402) remote: Compressing objects: 42% (589/1402) remote: Compressing objects: 43% (603/1402) remote: Compressing objects: 44% (617/1402) remote: Compressing objects: 45% (631/1402) remote: Compressing objects: 46% (645/1402) remote: Compressing objects: 47% (659/1402) remote: Compressing objects: 48% (673/1402) remote: Compressing objects: 49% (687/1402) remote: Compressing objects: 50% (701/1402) remote: Compressing objects: 51% (716/1402) remote: Compressing objects: 52% (730/1402) remote: Compressing objects: 53% (744/1402) remote: Compressing objects: 54% (758/1402) remote: Compressing objects: 55% (772/1402) remote: Compressing objects: 56% (786/1402) remote: Compressing objects: 57% (800/1402) remote: Compressing objects: 58% (814/1402) remote: Compressing objects: 59% (828/1402) remote: Compressing objects: 60% (842/1402) remote: Compressing objects: 61% (856/1402) remote: Compressing objects: 62% (870/1402) remote: Compressing objects: 63% (884/1402) remote: Compressing objects: 64% (898/1402) remote: Compressing objects: 65% (912/1402) remote: Compressing objects: 66% (926/1402) remote: Compressing objects: 67% (940/1402) remote: Compressing objects: 68% (954/1402) remote: Compressing objects: 69% (968/1402) remote: Compressing objects: 70% (982/1402) remote: Compressing objects: 71% (996/1402) remote: Compressing objects: 72% (1010/1402) remote: Compressing objects: 73% (1024/1402) remote: Compressing objects: 74% (1038/1402) remote: Compressing objects: 75% (1052/1402) remote: Compressing objects: 76% (1066/1402) remote: Compressing objects: 77% (1080/1402) remote: Compressing objects: 78% (1094/1402) remote: Compressing objects: 79% (1108/1402) remote: Compressing objects: 80% (1122/1402) remote: Compressing objects: 81% (1136/1402) remote: Compressing objects: 82% (1150/1402) remote: Compressing objects: 83% (1164/1402) remote: Compressing objects: 84% (1178/1402) remote: Compressing objects: 85% (1192/1402) remote: Compressing objects: 86% (1206/1402) remote: Compressing objects: 87% (1220/1402) remote: Compressing objects: 88% (1234/1402) remote: Compressing objects: 89% (1248/1402) remote: Compressing objects: 90% (1262/1402) remote: Compressing objects: 91% (1276/1402) remote: Compressing objects: 92% (1290/1402) remote: Compressing objects: 93% (1304/1402) remote: Compressing objects: 94% (1318/1402) remote: Compressing objects: 95% (1332/1402) remote: Compressing objects: 96% (1346/1402) remote: Compressing objects: 97% (1360/1402) remote: Compressing objects: 98% (1374/1402) remote: Compressing objects: 99% (1388/1402) remote: Compressing objects: 100% (1402/1402) remote: Compressing objects: 100% (1402/1402), done.
  6. 5.05 s Receiving objects: 0% (1/65014) Receiving objects: 1% (651/65014) Receiving objects: 2% (1301/65014) Receiving objects: 3% (1951/65014) Receiving objects: 4% (2601/65014) Receiving objects: 5% (3251/65014) Receiving objects: 6% (3901/65014) Receiving objects: 7% (4551/65014) Receiving objects: 8% (5202/65014) Receiving objects: 9% (5852/65014) Receiving objects: 10% (6502/65014) Receiving objects: 11% (7152/65014) Receiving objects: 12% (7802/65014), 13.76 MiB | 27.51 MiB/s Receiving objects: 13% (8452/65014), 13.76 MiB | 27.51 MiB/s Receiving objects: 14% (9102/65014), 13.76 MiB | 27.51 MiB/s Receiving objects: 15% (9753/65014), 13.76 MiB | 27.51 MiB/s Receiving objects: 16% (10403/65014), 13.76 MiB | 27.51 MiB/s Receiving objects: 17% (11053/65014), 13.76 MiB | 27.51 MiB/s Receiving objects: 18% (11703/65014), 13.76 MiB | 27.51 MiB/s Receiving objects: 19% (12353/65014), 13.76 MiB | 27.51 MiB/s Receiving objects: 20% (13003/65014), 13.76 MiB | 27.51 MiB/s Receiving objects: 21% (13653/65014), 13.76 MiB | 27.51 MiB/s Receiving objects: 22% (14304/65014), 13.76 MiB | 27.51 MiB/s Receiving objects: 23% (14954/65014), 13.76 MiB | 27.51 MiB/s Receiving objects: 24% (15604/65014), 13.76 MiB | 27.51 MiB/s Receiving objects: 25% (16254/65014), 13.76 MiB | 27.51 MiB/s Receiving objects: 26% (16904/65014), 13.76 MiB | 27.51 MiB/s Receiving objects: 27% (17554/65014), 13.76 MiB | 27.51 MiB/s Receiving objects: 28% (18204/65014), 13.76 MiB | 27.51 MiB/s Receiving objects: 29% (18855/65014), 13.76 MiB | 27.51 MiB/s Receiving objects: 30% (19505/65014), 13.76 MiB | 27.51 MiB/s Receiving objects: 31% (20155/65014), 13.76 MiB | 27.51 MiB/s Receiving objects: 32% (20805/65014), 13.76 MiB | 27.51 MiB/s Receiving objects: 33% (21455/65014), 13.76 MiB | 27.51 MiB/s Receiving objects: 34% (22105/65014), 13.76 MiB | 27.51 MiB/s Receiving objects: 35% (22755/65014), 13.76 MiB | 27.51 MiB/s Receiving objects: 36% (23406/65014), 13.76 MiB | 27.51 MiB/s Receiving objects: 37% (24056/65014), 13.76 MiB | 27.51 MiB/s Receiving objects: 38% (24706/65014), 13.76 MiB | 27.51 MiB/s Receiving objects: 39% (25356/65014), 13.76 MiB | 27.51 MiB/s Receiving objects: 40% (26006/65014), 13.76 MiB | 27.51 MiB/s Receiving objects: 41% (26656/65014), 13.76 MiB | 27.51 MiB/s Receiving objects: 42% (27306/65014), 13.76 MiB | 27.51 MiB/s Receiving objects: 43% (27957/65014), 13.76 MiB | 27.51 MiB/s Receiving objects: 44% (28607/65014), 13.76 MiB | 27.51 MiB/s Receiving objects: 45% (29257/65014), 13.76 MiB | 27.51 MiB/s Receiving objects: 46% (29907/65014), 13.76 MiB | 27.51 MiB/s Receiving objects: 47% (30557/65014), 13.76 MiB | 27.51 MiB/s Receiving objects: 48% (31207/65014), 13.76 MiB | 27.51 MiB/s Receiving objects: 49% (31857/65014), 13.76 MiB | 27.51 MiB/s Receiving objects: 50% (32507/65014), 13.76 MiB | 27.51 MiB/s Receiving objects: 50% (32753/65014), 30.14 MiB | 29.98 MiB/s Receiving objects: 51% (33158/65014), 30.14 MiB | 29.98 MiB/s Receiving objects: 52% (33808/65014), 30.14 MiB | 29.98 MiB/s Receiving objects: 53% (34458/65014), 30.14 MiB | 29.98 MiB/s Receiving objects: 54% (35108/65014), 30.14 MiB | 29.98 MiB/s Receiving objects: 55% (35758/65014), 30.14 MiB | 29.98 MiB/s Receiving objects: 56% (36408/65014), 30.14 MiB | 29.98 MiB/s Receiving objects: 57% (37058/65014), 30.14 MiB | 29.98 MiB/s Receiving objects: 58% (37709/65014), 30.14 MiB | 29.98 MiB/s Receiving objects: 59% (38359/65014), 30.14 MiB | 29.98 MiB/s Receiving objects: 60% (39009/65014), 30.14 MiB | 29.98 MiB/s Receiving objects: 61% (39659/65014), 30.14 MiB | 29.98 MiB/s Receiving objects: 62% (40309/65014), 47.44 MiB | 31.48 MiB/s Receiving objects: 63% (40959/65014), 47.44 MiB | 31.48 MiB/s Receiving objects: 64% (41609/65014), 47.44 MiB | 31.48 MiB/s Receiving objects: 65% (42260/65014), 47.44 MiB | 31.48 MiB/s Receiving objects: 66% (42910/65014), 47.44 MiB | 31.48 MiB/s Receiving objects: 67% (43560/65014), 47.44 MiB | 31.48 MiB/s Receiving objects: 68% (44210/65014), 47.44 MiB | 31.48 MiB/s Receiving objects: 69% (44860/65014), 47.44 MiB | 31.48 MiB/s Receiving objects: 70% (45510/65014), 47.44 MiB | 31.48 MiB/s Receiving objects: 71% (46160/65014), 47.44 MiB | 31.48 MiB/s Receiving objects: 72% (46811/65014), 47.44 MiB | 31.48 MiB/s Receiving objects: 73% (47461/65014), 47.44 MiB | 31.48 MiB/s Receiving objects: 74% (48111/65014), 47.44 MiB | 31.48 MiB/s Receiving objects: 75% (48761/65014), 47.44 MiB | 31.48 MiB/s Receiving objects: 75% (48902/65014), 64.32 MiB | 32.05 MiB/s Receiving objects: 76% (49411/65014), 64.32 MiB | 32.05 MiB/s Receiving objects: 77% (50061/65014), 64.32 MiB | 32.05 MiB/s Receiving objects: 78% (50711/65014), 64.32 MiB | 32.05 MiB/s Receiving objects: 79% (51362/65014), 64.32 MiB | 32.05 MiB/s Receiving objects: 80% (52012/65014), 64.32 MiB | 32.05 MiB/s Receiving objects: 81% (52662/65014), 64.32 MiB | 32.05 MiB/s Receiving objects: 82% (53312/65014), 64.32 MiB | 32.05 MiB/s Receiving objects: 83% (53962/65014), 64.32 MiB | 32.05 MiB/s Receiving objects: 84% (54612/65014), 64.32 MiB | 32.05 MiB/s Receiving objects: 85% (55262/65014), 64.32 MiB | 32.05 MiB/s Receiving objects: 86% (55913/65014), 64.32 MiB | 32.05 MiB/s Receiving objects: 87% (56563/65014), 64.32 MiB | 32.05 MiB/s Receiving objects: 88% (57213/65014), 81.92 MiB | 32.55 MiB/s Receiving objects: 89% (57863/65014), 81.92 MiB | 32.55 MiB/s Receiving objects: 90% (58513/65014), 81.92 MiB | 32.55 MiB/s Receiving objects: 91% (59163/65014), 81.92 MiB | 32.55 MiB/s Receiving objects: 92% (59813/65014), 81.92 MiB | 32.55 MiB/s Receiving objects: 93% (60464/65014), 81.92 MiB | 32.55 MiB/s Receiving objects: 94% (61114/65014), 81.92 MiB | 32.55 MiB/s Receiving objects: 95% (61764/65014), 81.92 MiB | 32.55 MiB/s Receiving objects: 96% (62414/65014), 81.92 MiB | 32.55 MiB/s Receiving objects: 97% (63064/65014), 81.92 MiB | 32.55 MiB/s Receiving objects: 98% (63714/65014), 81.92 MiB | 32.55 MiB/s Receiving objects: 99% (64364/65014), 81.92 MiB | 32.55 MiB/s remote: Total 65014 (delta 6802), reused 6284 (delta 6284), pack-reused 57328 (from 1)
  7. 5.05 s Receiving objects: 100% (65014/65014), 81.92 MiB | 32.55 MiB/s Receiving objects: 100% (65014/65014), 86.90 MiB | 32.53 MiB/s, done.
  8. 5.70 s Resolving deltas: 0% (0/45899) Resolving deltas: 1% (459/45899) Resolving deltas: 2% (918/45899) Resolving deltas: 3% (1377/45899) Resolving deltas: 4% (1836/45899) Resolving deltas: 5% (2295/45899) Resolving deltas: 6% (2754/45899) Resolving deltas: 7% (3213/45899) Resolving deltas: 8% (3672/45899) Resolving deltas: 9% (4131/45899) Resolving deltas: 10% (4594/45899) Resolving deltas: 11% (5049/45899) Resolving deltas: 12% (5508/45899) Resolving deltas: 13% (5967/45899) Resolving deltas: 14% (6426/45899) Resolving deltas: 15% (6885/45899) Resolving deltas: 16% (7344/45899) Resolving deltas: 17% (7803/45899) Resolving deltas: 18% (8262/45899) Resolving deltas: 19% (8721/45899) Resolving deltas: 20% (9180/45899) Resolving deltas: 21% (9639/45899) Resolving deltas: 22% (10098/45899) Resolving deltas: 23% (10557/45899) Resolving deltas: 24% (11017/45899) Resolving deltas: 25% (11475/45899) Resolving deltas: 26% (11935/45899) Resolving deltas: 27% (12393/45899) Resolving deltas: 28% (12852/45899) Resolving deltas: 29% (13311/45899) Resolving deltas: 30% (13770/45899) Resolving deltas: 31% (14229/45899) Resolving deltas: 32% (14689/45899) Resolving deltas: 33% (15147/45899) Resolving deltas: 34% (15607/45899) Resolving deltas: 35% (16067/45899) Resolving deltas: 36% (16524/45899) Resolving deltas: 37% (16983/45899) Resolving deltas: 38% (17442/45899) Resolving deltas: 39% (17901/45899) Resolving deltas: 40% (18361/45899) Resolving deltas: 41% (18819/45899) Resolving deltas: 42% (19279/45899) Resolving deltas: 43% (19737/45899) Resolving deltas: 44% (20196/45899) Resolving deltas: 45% (20655/45899) Resolving deltas: 46% (21114/45899) Resolving deltas: 47% (21573/45899) Resolving deltas: 48% (22033/45899) Resolving deltas: 49% (22491/45899) Resolving deltas: 50% (22950/45899) Resolving deltas: 51% (23410/45899) Resolving deltas: 52% (23868/45899) Resolving deltas: 53% (24327/45899) Resolving deltas: 54% (24786/45899) Resolving deltas: 55% (25250/45899) Resolving deltas: 56% (25704/45899) Resolving deltas: 57% (26163/45899) Resolving deltas: 58% (26622/45899) Resolving deltas: 59% (27081/45899) Resolving deltas: 60% (27540/45899) Resolving deltas: 61% (27999/45899) Resolving deltas: 62% (28458/45899) Resolving deltas: 63% (28917/45899) Resolving deltas: 64% (29377/45899) Resolving deltas: 65% (29835/45899) Resolving deltas: 66% (30294/45899) Resolving deltas: 67% (30753/45899) Resolving deltas: 68% (31212/45899) Resolving deltas: 69% (31671/45899) Resolving deltas: 70% (32130/45899) Resolving deltas: 71% (32589/45899) Resolving deltas: 72% (33048/45899) Resolving deltas: 73% (33507/45899) Resolving deltas: 74% (33966/45899) Resolving deltas: 75% (34425/45899) Resolving deltas: 76% (34884/45899) Resolving deltas: 77% (35343/45899) Resolving deltas: 78% (35802/45899) Resolving deltas: 79% (36261/45899) Resolving deltas: 80% (36720/45899) Resolving deltas: 81% (37179/45899) Resolving deltas: 82% (37638/45899) Resolving deltas: 83% (38097/45899) Resolving deltas: 84% (38556/45899) Resolving deltas: 85% (39015/45899) Resolving deltas: 86% (39475/45899) Resolving deltas: 87% (39933/45899) Resolving deltas: 88% (40392/45899) Resolving deltas: 89% (40851/45899) Resolving deltas: 90% (41310/45899) Resolving deltas: 91% (41769/45899) Resolving deltas: 92% (42228/45899) Resolving deltas: 93% (42687/45899) Resolving deltas: 94% (43146/45899) Resolving deltas: 95% (43605/45899) Resolving deltas: 96% (44064/45899) Resolving deltas: 97% (44523/45899) Resolving deltas: 98% (44982/45899) Resolving deltas: 99% (45441/45899) Resolving deltas: 100% (45899/45899) Resolving deltas: 100% (45899/45899), done.
  9. 5.97 s Fetching commit 185337f01e5e562fa8f23f8e846b12c2a0cd39cc for vakint_rustred ...
  10. 6.04 s $ /nix/store/bcnisk3ydfgv26v2gw3zlky24g00yww2-git-2.54.0/bin/git fetch origin 185337f01e5e562fa8f23f8e846b12c2a0cd39cc
  11. 6.46 s From https://github.com/alphal00p/gammaloop
  12. 6.46 s * branch 185337f01e5e562fa8f23f8e846b12c2a0cd39cc -> FETCH_HEAD
  13. 6.47 s $ /nix/store/9ypz3flqsrl5xl495mm8h645gadjsxi1-coreutils-9.11/bin/timeout --kill-after=15s 7200s /nix/store/bcnisk3ydfgv26v2gw3zlky24g00yww2-git-2.54.0/bin/git -c advice.detachedHead=false checkout 185337f01e5e562fa8f23f8e846b12c2a0cd39cc
  14. 6.58 s HEAD is now at 185337f0 Add RustRed tensor reduction mode boundary
  15. 6.58 s $ /nix/store/9ypz3flqsrl5xl495mm8h645gadjsxi1-coreutils-9.11/bin/timeout --kill-after=15s 7200s /nix/store/23zk8sgzamrbmj1fday15szf7f2279s8-nix-2.34.7/bin/nix --extra-experimental-features nix-command --extra-experimental-features flakes --log-format internal-json run .#packages.x86_64-linux.nix-ci-check-gammaloop-nextest-core --print-build-logs
  16. 10.36 s
  17. 10.48 s Downloading cached gammaloop-nextest-binaries-core-gammaloop-api from https://cache.nix-ci.com
  18. 10.48 s Downloading cached gammaloop-nextest-binaries-core-gammaloop-tracing-filter from https://cache.nix-ci.com
  19. 10.48 s Downloading cached gammaloop-nextest-binaries-core-gammaloop-tracing-filter-macros from https://cache.nix-ci.com
  20. 10.48 s Downloading cached gammaloop-nextest-binaries-core-gammalooprs from https://cache.nix-ci.com
  21. 10.70 s Downloaded cached gammaloop-nextest-binaries-core-gammaloop-tracing-filter-macros (1.7 MiB) in 218ms
  22. 10.70 s Progress: 0 of 1 built, 1 of 6 downloaded from cache (3 downloading)
  23. 10.78 s Downloaded cached gammaloop-nextest-binaries-core-gammaloop-tracing-filter (6.6 MiB) in 298ms
  24. 10.78 s Progress: 0 of 1 built, 2 of 6 downloaded from cache (2 downloading)
  25. 12.03 s Downloaded cached gammaloop-nextest-binaries-core-gammalooprs (76.7 MiB) in 1.5s
  26. 12.07 s Progress: 0 of 1 built, 3 of 6 downloaded from cache (1 downloading)
  27. 12.13 s Downloaded cached gammaloop-nextest-binaries-core-gammaloop-api (66.7 MiB) in 1.6s
  28. 12.13 s Progress: 0 of 1 built, 4 of 6 downloaded from cache
  29. 12.13 s Downloading cached gammaloop-nextest-binaries-core from https://cache.nix-ci.com
  30. 12.17 s Downloaded cached gammaloop-nextest-binaries-core (1640 B) in 39ms
  31. 12.17 s Progress: 0 of 1 built, 5 of 6 downloaded from cache
  32. 12.17 s Downloading cached nix-ci-check-gammaloop-nextest-core from https://cache.nix-ci.com
  33. 12.20 s Downloaded cached nix-ci-check-gammaloop-nextest-core (1016 B) in 29ms
  34. 12.20 s Progress: 0 of 1 built, 6 of 6 downloaded from cache
  35. 16.37 s evaluating derivation 'g copying '/nix/store/9ycf evaluating derivation 'g copying '/nix/store/9ycf evaluating derivation 'g copying '/nix/store/9ycf evaluating derivation 'g copying '/nix/store/9ycf evaluating derivation 'g copying '/nix/store/9ycf evaluating derivation 'g querying gammaloop-nexte [0/1 built, 0.0 KiB DL] [1/0/1 built, 0.0 KiB DLgammaloop-nextest-core> Extracting 3 binaries (including 1 non-test binary), 1 build script output directory, and 2 linked paths to /build/nextest-archive-kSkRZh
  36. 16.75 s gammaloop-nextest-core> Extracted 18 files to /build/nextest-archive-kSkRZh in 0.38s
  37. 16.76 s gammaloop-nextest-core> ------------
  38. 16.76 s gammaloop-nextest-core> Nextest run ID 2ab7916d-55ea-4df9-99f0-ead93cfcb454 with nextest profile: ci_gammaloop
  39. 16.76 s gammaloop-nextest-core> Starting 339 tests across 2 binaries
  40. 17.18 s gammaloop-nextest-core> ------------
  41. 17.18 s gammaloop-nextest-core> Summary [ 0.420s] 339 tests run: 339 passed, 0 skipped
  42. 17.26 s gammaloop-nextest-core>
  43. 17.26 s gammaloop-nextest-core> ========== nextest test summary ==========
  44. 17.26 s gammaloop-nextest-core> report: target/nextest/ci_gammaloop/junit.xml
  45. 17.26 s gammaloop-nextest-core> tests: 339, failures: 0, errors: 0
  46. 17.26 s gammaloop-nextest-core> No failing testcases found.
  47. 17.26 s gammaloop-nextest-core> =========================================
  48. 17.28 s gammaloop-nextest-core> Extracting 1 binary and 1 linked path to /build/nextest-archive-BTt73G
  49. 17.33 s gammaloop-nextest-core> Extracted 7 files to /build/nextest-archive-BTt73G in 0.06s
  50. 17.34 s gammaloop-nextest-core> ------------
  51. 17.34 s gammaloop-nextest-core> Nextest run ID ee0cf6ff-16d9-446b-8ffc-b23bf21c8bda with nextest profile: ci_gammaloop
  52. 17.34 s gammaloop-nextest-core> Starting 19 tests across 1 binary
  53. 17.35 s gammaloop-nextest-core> ------------
  54. 17.35 s gammaloop-nextest-core> Summary [ 0.010s] 19 tests run: 19 passed, 0 skipped
  55. 17.38 s gammaloop-nextest-core>
  56. 17.38 s gammaloop-nextest-core> ========== nextest test summary ==========
  57. 17.38 s gammaloop-nextest-core> report: target/nextest/ci_gammaloop/junit.xml
  58. 17.38 s gammaloop-nextest-core> tests: 19, failures: 0, errors: 0
  59. 17.38 s gammaloop-nextest-core> No failing testcases found.
  60. 17.38 s gammaloop-nextest-core> =========================================
  61. 17.40 s gammaloop-nextest-core> Extracting 1 binary to /build/nextest-archive-Es5BTu
  62. 17.42 s gammaloop-nextest-core> Extracted 4 files to /build/nextest-archive-Es5BTu in 0.03s
  63. 17.43 s gammaloop-nextest-core> ------------
  64. 17.43 s gammaloop-nextest-core> Nextest run ID 3a5c9982-d2d3-4f0e-8c1e-bb882f923643 with nextest profile: ci_gammaloop
  65. 17.43 s gammaloop-nextest-core> Starting 0 tests across 1 binary
  66. 17.43 s gammaloop-nextest-core> ------------
  67. 17.43 s gammaloop-nextest-core> Summary [ 0.000s] 0 tests run: 0 passed, 0 skipped
  68. 17.46 s gammaloop-nextest-core>
  69. 17.46 s gammaloop-nextest-core> ========== nextest test summary ==========
  70. 17.46 s gammaloop-nextest-core> report: target/nextest/ci_gammaloop/junit.xml
  71. 17.46 s gammaloop-nextest-core> tests: 0, failures: 0, errors: 0
  72. 17.46 s gammaloop-nextest-core> No failing testcases found.
  73. 17.46 s gammaloop-nextest-core> =========================================
  74. 17.47 s gammaloop-nextest-core> Extracting 4 binaries, 1 build script output directory, and 2 linked paths to /build/nextest-archive-jTNJ8E
  75. 17.85 s gammaloop-nextest-core> Extracted 18 files to /build/nextest-archive-jTNJ8E in 0.38s
  76. 17.86 s gammaloop-nextest-core> ------------
  77. 17.86 s gammaloop-nextest-core> Nextest run ID 0ff8b2ff-aa06-4e09-8f63-d9f1b3255586 with nextest profile: ci_gammaloop
  78. 17.86 s gammaloop-nextest-core> Starting 456 tests across 4 binaries (61 tests skipped, including 60 tests via profile.ci_gammaloop.default-filter)
  79. 18.84 s gammaloop-nextest-core> FAIL [ 0.248s] (444/456) gammalooprs::test_renormalization finit_part_ghlo
  80. 18.84 s gammaloop-nextest-core> stdout ---
  81. 18.84 s gammaloop-nextest-core>
  82. 18.84 s gammaloop-nextest-core> running 1 test
  83. 18.84 s gammaloop-nextest-core> ren part: 1/2*GC_10^2*dot(P(0,mink(dim)),P(0,mink(dim)))*cas(2,coad(8))/ε
  84. 18.84 s gammaloop-nextest-core> ━━━━━━━━━━━━━━━━━━━━━━━━━━━━━━━ Snapshot Summary ━━━━━━━━━━━━━━━━━━━━━━━━━━━━━━━
  85. 18.84 s gammaloop-nextest-core> Snapshot: finit_part_ghlo
  86. 18.84 s gammaloop-nextest-core> Source: crates/gammalooprs/tests/test_renormalization.rs:557
  87. 18.84 s gammaloop-nextest-core> ────────────────────────────────────────────────────────────────────────────────
  88. 18.84 s gammaloop-nextest-core> Expression: align_to_rqft(&a, &model).to_bare_ordered_string()
  89. 18.84 s gammaloop-nextest-core> ────────────────────────────────────────────────────────────────────────────────
  90. 18.84 s gammaloop-nextest-core> -old snapshot
  91. 18.84 s gammaloop-nextest-core> +new results
  92. 18.84 s gammaloop-nextest-core> ────────────┬───────────────────────────────────────────────────────────────────
  93. 18.84 s gammaloop-nextest-core> 1 │--1/2*cas(2,coad(8))*dot(P(0,mink(4)),P(0,mink(4)))*gs^2*ε^(-1)
  94. 18.84 s gammaloop-nextest-core> 1 │+1/2*cas(2,coad(8))*dot(P(0,mink(4)),P(0,mink(4)))*gs^2*ε^(-1)
  95. 18.84 s gammaloop-nextest-core> ────────────┴───────────────────────────────────────────────────────────────────
  96. 18.84 s gammaloop-nextest-core> To update snapshots run `cargo insta review`
  97. 18.84 s gammaloop-nextest-core> Stopped on the first failure. Run `cargo insta test` to run all snapshots.
  98. 18.84 s gammaloop-nextest-core> test finit_part_ghlo ... FAILED
  99. 18.84 s gammaloop-nextest-core>
  100. 18.84 s gammaloop-nextest-core> failures:
  101. 18.84 s gammaloop-nextest-core>
  102. 18.84 s gammaloop-nextest-core> failures:
  103. 18.84 s gammaloop-nextest-core> finit_part_ghlo
  104. 18.84 s gammaloop-nextest-core>
  105. 18.84 s gammaloop-nextest-core> test result: FAILED. 0 passed; 1 failed; 0 ignored; 0 measured; 5 filtered out; finished in 0.24s
  106. 18.84 s gammaloop-nextest-core>
  107. 18.84 s gammaloop-nextest-core> stderr ---
  108. 18.84 s gammaloop-nextest-core> The application panicked (crashed).
  109. 18.84 s gammaloop-nextest-core> Message: snapshot assertion for 'finit_part_ghlo' failed in line 557
  110. 18.84 s gammaloop-nextest-core> Location: /nix/store/5nq6hmff26w9jbhbmba4wsvgnvglj2xd-vendor-cargo-deps/c19b7c6f923b580ac259164a89f2577984ad5ab09ee9d583b888f934adbbe8d0/insta-1.47.2/src/runtime.rs:719
  111. 18.84 s gammaloop-nextest-core>
  112. 18.84 s gammaloop-nextest-core> ━━━━━━━━━━━━━━━━━━━━━━━━━━━━━━━━━━ BACKTRACE ━━━━━━━━━━━━━━━━━━━━━━━━━━━━━━━━━━━
  113. 18.84 s gammaloop-nextest-core> 1: <color_eyre[51793ea62743adbd]::config::PanicHook>::panic_report<unknown>
  114. 18.84 s gammaloop-nextest-core> at <unknown source file>:<unknown line>
  115. 18.84 s gammaloop-nextest-core> 2: <color_eyre[51793ea62743adbd]::config::PanicHook>::into_panic_hook::{closure#0}<unknown>
  116. 18.84 s gammaloop-nextest-core> at <unknown source file>:<unknown line>
  117. 18.84 s gammaloop-nextest-core> 3: std[bcb96dfbba0ab899]::panicking::panic_with_hook<unknown>
  118. 18.84 s gammaloop-nextest-core> at <unknown source file>:<unknown line>
  119. 18.84 s gammaloop-nextest-core> 4: std[bcb96dfbba0ab899]::panicking::panic_handler::{closure#0}<unknown>
  120. 18.84 s gammaloop-nextest-core> at <unknown source file>:<unknown line>
  121. 18.84 s gammaloop-nextest-core> 5: std[bcb96dfbba0ab899]::sys::backtrace::__rust_end_short_backtrace::<std[bcb96dfbba0ab899]::panicking::panic_handler::{closure#0}, !><unknown>
  122. 18.84 s gammaloop-nextest-core> at <unknown source file>:<unknown line>
  123. 18.84 s gammaloop-nextest-core> 6: __rustc[6c289b9f9c454d21]::rust_begin_unwind<unknown>
  124. 18.84 s gammaloop-nextest-core> at <unknown source file>:<unknown line>
  125. 18.84 s gammaloop-nextest-core> 7: core[940e698046960fd5]::panicking::panic_fmt<unknown>
  126. 18.84 s gammaloop-nextest-core> at <unknown source file>:<unknown line>
  127. 18.84 s gammaloop-nextest-core> 8: insta[307a548ac79ef4d9]::runtime::assert_snapshot<unknown>
  128. 18.84 s gammaloop-nextest-core> at <unknown source file>:<unknown line>
  129. 18.84 s gammaloop-nextest-core> 9: <test_renormalization[a909d96d00a50d41]::finit_part_ghlo::{closure#0} as core[940e698046960fd5]::ops::function::FnOnce<()>>::call_once<unknown>
  130. 18.84 s gammaloop-nextest-core> at <unknown source file>:<unknown line>
  131. 18.84 s gammaloop-nextest-core> 10: test[75d6903177b1d7e9]::__rust_begin_short_backtrace::<core[940e698046960fd5]::result::Result<(), alloc[2ea6bcb46fca0c42]::string::String>, fn() -> core[940e698046960fd5]::result::Result<(), alloc[2ea6bcb46fca0c42]::string::String>><unknown>
  132. 18.84 s gammaloop-nextest-core> at <unknown source file>:<unknown line>
  133. 18.84 s gammaloop-nextest-core> 11: test[75d6903177b1d7e9]::run_test::{closure#0}<unknown>
  134. 18.84 s gammaloop-nextest-core> at <unknown source file>:<unknown line>
  135. 18.84 s gammaloop-nextest-core> 12: std[bcb96dfbba0ab899]::sys::backtrace::__rust_begin_short_backtrace::<test[75d6903177b1d7e9]::run_test::{closure#1}, ()><unknown>
  136. 18.84 s gammaloop-nextest-core> at <unknown source file>:<unknown line>
  137. 18.84 s gammaloop-nextest-core> 13: <std[bcb96dfbba0ab899]::thread::lifecycle::spawn_unchecked<test[75d6903177b1d7e9]::run_test::{closure#1}, ()>::{closure#1} as core[940e698046960fd5]::ops::function::FnOnce<()>>::call_once::{shim:vtable#0}<unknown>
  138. 18.84 s gammaloop-nextest-core> at <unknown source file>:<unknown line>
  139. 18.84 s gammaloop-nextest-core> 14: <std[bcb96dfbba0ab899]::sys::thread::unix::Thread>::new::thread_start<unknown>
  140. 18.84 s gammaloop-nextest-core> at <unknown source file>:<unknown line>
  141. 18.84 s gammaloop-nextest-core> 15: start_thread<unknown>
  142. 18.84 s gammaloop-nextest-core> at <unknown source file>:<unknown line>
  143. 18.84 s gammaloop-nextest-core> 16: __clone3<unknown>
  144. 18.84 s gammaloop-nextest-core> at <unknown source file>:<unknown line>
  145. 18.84 s gammaloop-nextest-core>
  146. 18.84 s gammaloop-nextest-core> Run with COLORBT_SHOW_HIDDEN=1 environment variable to disable frame filtering.
  147. 18.84 s gammaloop-nextest-core> Run with RUST_BACKTRACE=full to include source snippets.
  148. 18.84 s gammaloop-nextest-core>
  149. 20.55 s gammaloop-nextest-core> FAIL [ 1.956s] (451/456) gammalooprs::test_renormalization finite_part_ghost_2loop
  150. 20.55 s gammaloop-nextest-core> stdout ---
  151. 20.55 s gammaloop-nextest-core>
  152. 20.55 s gammaloop-nextest-core> running 1 test
  153. 20.55 s gammaloop-nextest-core> ━━━━━━━━━━━━━━━━━━━━━━━━━━━━━━━ Snapshot Summary ━━━━━━━━━━━━━━━━━━━━━━━━━━━━━━━
  154. 20.55 s gammaloop-nextest-core> Snapshot: finite_part_ghost_2loop-3
  155. 20.55 s gammaloop-nextest-core> Source: crates/gammalooprs/tests/test_renormalization.rs:464
  156. 20.55 s gammaloop-nextest-core> ────────────────────────────────────────────────────────────────────────────────
  157. 20.55 s gammaloop-nextest-core> Expression: align_to_rqft(&a, &model).to_bare_ordered_string()
  158. 20.55 s gammaloop-nextest-core> ────────────────────────────────────────────────────────────────────────────────
  159. 20.55 s gammaloop-nextest-core> -old snapshot
  160. 20.55 s gammaloop-nextest-core> +new results
  161. 20.55 s gammaloop-nextest-core> ────────────┬───────────────────────────────────────────────────────────────────
  162. 20.55 s gammaloop-nextest-core> 1 │-(-1𝑖/32*ε+1𝑖/16)*(cas(2,coad(8)))^2*dot(P(0,mink(4)),P(0,mink(4)))*gs^4*ε^(-2)
  163. 20.55 s gammaloop-nextest-core> 1 │+(-1𝑖/16+1𝑖/32*ε)*(cas(2,coad(8)))^2*dot(P(0,mink(4)),P(0,mink(4)))*gs^4*ε^(-2)
  164. 20.55 s gammaloop-nextest-core> ────────────┴───────────────────────────────────────────────────────────────────
  165. 20.55 s gammaloop-nextest-core> To update snapshots run `cargo insta review`
  166. 20.55 s gammaloop-nextest-core> Stopped on the first failure. Run `cargo insta test` to run all snapshots.
  167. 20.55 s gammaloop-nextest-core> test finite_part_ghost_2loop ... FAILED
  168. 20.55 s gammaloop-nextest-core>
  169. 20.55 s gammaloop-nextest-core> failures:
  170. 20.55 s gammaloop-nextest-core>
  171. 20.55 s gammaloop-nextest-core> failures:
  172. 20.55 s gammaloop-nextest-core> finite_part_ghost_2loop
  173. 20.55 s gammaloop-nextest-core>
  174. 20.55 s gammaloop-nextest-core> test result: FAILED. 0 passed; 1 failed; 0 ignored; 0 measured; 5 filtered out; finished in 1.95s
  175. 20.55 s gammaloop-nextest-core>
  176. 20.55 s gammaloop-nextest-core> stderr ---
  177. 20.55 s gammaloop-nextest-core> The application panicked (crashed).
  178. 20.55 s gammaloop-nextest-core> Message: snapshot assertion for 'finite_part_ghost_2loop-3' failed in line 464
  179. 20.55 s gammaloop-nextest-core> Location: /nix/store/5nq6hmff26w9jbhbmba4wsvgnvglj2xd-vendor-cargo-deps/c19b7c6f923b580ac259164a89f2577984ad5ab09ee9d583b888f934adbbe8d0/insta-1.47.2/src/runtime.rs:719
  180. 20.55 s gammaloop-nextest-core>
  181. 20.55 s gammaloop-nextest-core> ━━━━━━━━━━━━━━━━━━━━━━━━━━━━━━━━━━ BACKTRACE ━━━━━━━━━━━━━━━━━━━━━━━━━━━━━━━━━━━
  182. 20.55 s gammaloop-nextest-core> 1: <color_eyre[51793ea62743adbd]::config::PanicHook>::panic_report<unknown>
  183. 20.55 s gammaloop-nextest-core> at <unknown source file>:<unknown line>
  184. 20.55 s gammaloop-nextest-core> 2: <color_eyre[51793ea62743adbd]::config::PanicHook>::into_panic_hook::{closure#0}<unknown>
  185. 20.55 s gammaloop-nextest-core> at <unknown source file>:<unknown line>
  186. 20.55 s gammaloop-nextest-core> 3: std[bcb96dfbba0ab899]::panicking::panic_with_hook<unknown>
  187. 20.55 s gammaloop-nextest-core> at <unknown source file>:<unknown line>
  188. 20.55 s gammaloop-nextest-core> 4: std[bcb96dfbba0ab899]::panicking::panic_handler::{closure#0}<unknown>
  189. 20.55 s gammaloop-nextest-core> at <unknown source file>:<unknown line>
  190. 20.55 s gammaloop-nextest-core> 5: std[bcb96dfbba0ab899]::sys::backtrace::__rust_end_short_backtrace::<std[bcb96dfbba0ab899]::panicking::panic_handler::{closure#0}, !><unknown>
  191. 20.55 s gammaloop-nextest-core> at <unknown source file>:<unknown line>
  192. 20.55 s gammaloop-nextest-core> 6: __rustc[6c289b9f9c454d21]::rust_begin_unwind<unknown>
  193. 20.55 s gammaloop-nextest-core> at <unknown source file>:<unknown line>
  194. 20.55 s gammaloop-nextest-core> 7: core[940e698046960fd5]::panicking::panic_fmt<unknown>
  195. 20.55 s gammaloop-nextest-core> at <unknown source file>:<unknown line>
  196. 20.55 s gammaloop-nextest-core> 8: insta[307a548ac79ef4d9]::runtime::assert_snapshot<unknown>
  197. 20.55 s gammaloop-nextest-core> at <unknown source file>:<unknown line>
  198. 20.55 s gammaloop-nextest-core> 9: test_renormalization[a909d96d00a50d41]::finite_part_ghost_2loop<unknown>
  199. 20.55 s gammaloop-nextest-core> at <unknown source file>:<unknown line>
  200. 20.55 s gammaloop-nextest-core> 10: <test_renormalization[a909d96d00a50d41]::finite_part_ghost_2loop::{closure#0} as core[940e698046960fd5]::ops::function::FnOnce<()>>::call_once<unknown>
  201. 20.55 s gammaloop-nextest-core> at <unknown source file>:<unknown line>
  202. 20.55 s gammaloop-nextest-core> 11: test[75d6903177b1d7e9]::__rust_begin_short_backtrace::<core[940e698046960fd5]::result::Result<(), alloc[2ea6bcb46fca0c42]::string::String>, fn() -> core[940e698046960fd5]::result::Result<(), alloc[2ea6bcb46fca0c42]::string::String>><unknown>
  203. 20.55 s gammaloop-nextest-core> at <unknown source file>:<unknown line>
  204. 20.55 s gammaloop-nextest-core> 12: test[75d6903177b1d7e9]::run_test::{closure#0}<unknown>
  205. 20.55 s gammaloop-nextest-core> at <unknown source file>:<unknown line>
  206. 20.55 s gammaloop-nextest-core> 13: std[bcb96dfbba0ab899]::sys::backtrace::__rust_begin_short_backtrace::<test[75d6903177b1d7e9]::run_test::{closure#1}, ()><unknown>
  207. 20.55 s gammaloop-nextest-core> at <unknown source file>:<unknown line>
  208. 20.55 s gammaloop-nextest-core> 14: <std[bcb96dfbba0ab899]::thread::lifecycle::spawn_unchecked<test[75d6903177b1d7e9]::run_test::{closure#1}, ()>::{closure#1} as core[940e698046960fd5]::ops::function::FnOnce<()>>::call_once::{shim:vtable#0}<unknown>
  209. 20.55 s gammaloop-nextest-core> at <unknown source file>:<unknown line>
  210. 20.55 s gammaloop-nextest-core> 15: <std[bcb96dfbba0ab899]::sys::thread::unix::Thread>::new::thread_start<unknown>
  211. 20.55 s gammaloop-nextest-core> at <unknown source file>:<unknown line>
  212. 20.55 s gammaloop-nextest-core> 16: start_thread<unknown>
  213. 20.55 s gammaloop-nextest-core> at <unknown source file>:<unknown line>
  214. 20.55 s gammaloop-nextest-core> 17: __clone3<unknown>
  215. 20.55 s gammaloop-nextest-core> at <unknown source file>:<unknown line>
  216. 20.55 s gammaloop-nextest-core>
  217. 20.55 s gammaloop-nextest-core> Run with COLORBT_SHOW_HIDDEN=1 environment variable to disable frame filtering.
  218. 20.55 s gammaloop-nextest-core> Run with RUST_BACKTRACE=full to include source snippets.
  219. 20.55 s gammaloop-nextest-core>
  220. 25.54 s gammaloop-nextest-core> ------------
  221. 25.62 s gammaloop-nextest-core> Summary [ 7.681s] 456 tests run: 454 passed, 2 failed, 61 skipped
  222. 25.62 s gammaloop-nextest-core> FAIL [ 0.248s] (444/456) gammalooprs::test_renormalization finit_part_ghlo
  223. 25.62 s gammaloop-nextest-core> stdout ---
  224. 25.62 s gammaloop-nextest-core>
  225. 25.62 s gammaloop-nextest-core> running 1 test
  226. 25.62 s gammaloop-nextest-core> ren part: 1/2*GC_10^2*dot(P(0,mink(dim)),P(0,mink(dim)))*cas(2,coad(8))/ε
  227. 25.62 s gammaloop-nextest-core> ━━━━━━━━━━━━━━━━━━━━━━━━━━━━━━━ Snapshot Summary ━━━━━━━━━━━━━━━━━━━━━━━━━━━━━━━
  228. 25.62 s gammaloop-nextest-core> Snapshot: finit_part_ghlo
  229. 25.62 s gammaloop-nextest-core> Source: crates/gammalooprs/tests/test_renormalization.rs:557
  230. 25.62 s gammaloop-nextest-core> ────────────────────────────────────────────────────────────────────────────────
  231. 25.62 s gammaloop-nextest-core> Expression: align_to_rqft(&a, &model).to_bare_ordered_string()
  232. 25.62 s gammaloop-nextest-core> ────────────────────────────────────────────────────────────────────────────────
  233. 25.62 s gammaloop-nextest-core> -old snapshot
  234. 25.62 s gammaloop-nextest-core> +new results
  235. 25.62 s gammaloop-nextest-core> ────────────┬───────────────────────────────────────────────────────────────────
  236. 25.62 s gammaloop-nextest-core> 1 │--1/2*cas(2,coad(8))*dot(P(0,mink(4)),P(0,mink(4)))*gs^2*ε^(-1)
  237. 25.62 s gammaloop-nextest-core> 1 │+1/2*cas(2,coad(8))*dot(P(0,mink(4)),P(0,mink(4)))*gs^2*ε^(-1)
  238. 25.62 s gammaloop-nextest-core> ────────────┴───────────────────────────────────────────────────────────────────
  239. 25.62 s gammaloop-nextest-core> To update snapshots run `cargo insta review`
  240. 25.62 s gammaloop-nextest-core> Stopped on the first failure. Run `cargo insta test` to run all snapshots.
  241. 25.62 s gammaloop-nextest-core> test finit_part_ghlo ... FAILED
  242. 25.62 s gammaloop-nextest-core>
  243. 25.62 s gammaloop-nextest-core> failures:
  244. 25.62 s gammaloop-nextest-core>
  245. 25.62 s gammaloop-nextest-core> failures:
  246. 25.62 s gammaloop-nextest-core> finit_part_ghlo
  247. 25.62 s gammaloop-nextest-core>
  248. 25.62 s gammaloop-nextest-core> test result: FAILED. 0 passed; 1 failed; 0 ignored; 0 measured; 5 filtered out; finished in 0.24s
  249. 25.62 s gammaloop-nextest-core>
  250. 25.62 s gammaloop-nextest-core> stderr ---
  251. 25.62 s gammaloop-nextest-core> The application panicked (crashed).
  252. 25.62 s gammaloop-nextest-core> Message: snapshot assertion for 'finit_part_ghlo' failed in line 557
  253. 25.62 s gammaloop-nextest-core> Location: /nix/store/5nq6hmff26w9jbhbmba4wsvgnvglj2xd-vendor-cargo-deps/c19b7c6f923b580ac259164a89f2577984ad5ab09ee9d583b888f934adbbe8d0/insta-1.47.2/src/runtime.rs:719
  254. 25.62 s gammaloop-nextest-core>
  255. 25.62 s gammaloop-nextest-core> ━━━━━━━━━━━━━━━━━━━━━━━━━━━━━━━━━━ BACKTRACE ━━━━━━━━━━━━━━━━━━━━━━━━━━━━━━━━━━━
  256. 25.62 s gammaloop-nextest-core> 1: <color_eyre[51793ea62743adbd]::config::PanicHook>::panic_report<unknown>
  257. 25.62 s gammaloop-nextest-core> at <unknown source file>:<unknown line>
  258. 25.62 s gammaloop-nextest-core> 2: <color_eyre[51793ea62743adbd]::config::PanicHook>::into_panic_hook::{closure#0}<unknown>
  259. 25.62 s gammaloop-nextest-core> at <unknown source file>:<unknown line>
  260. 25.62 s gammaloop-nextest-core> 3: std[bcb96dfbba0ab899]::panicking::panic_with_hook<unknown>
  261. 25.62 s gammaloop-nextest-core> at <unknown source file>:<unknown line>
  262. 25.62 s gammaloop-nextest-core> 4: std[bcb96dfbba0ab899]::panicking::panic_handler::{closure#0}<unknown>
  263. 25.62 s gammaloop-nextest-core> at <unknown source file>:<unknown line>
  264. 25.62 s gammaloop-nextest-core> 5: std[bcb96dfbba0ab899]::sys::backtrace::__rust_end_short_backtrace::<std[bcb96dfbba0ab899]::panicking::panic_handler::{closure#0}, !><unknown>
  265. 25.62 s gammaloop-nextest-core> at <unknown source file>:<unknown line>
  266. 25.62 s gammaloop-nextest-core> 6: __rustc[6c289b9f9c454d21]::rust_begin_unwind<unknown>
  267. 25.62 s gammaloop-nextest-core> at <unknown source file>:<unknown line>
  268. 25.62 s gammaloop-nextest-core> 7: core[940e698046960fd5]::panicking::panic_fmt<unknown>
  269. 25.62 s gammaloop-nextest-core> at <unknown source file>:<unknown line>
  270. 25.62 s gammaloop-nextest-core> 8: insta[307a548ac79ef4d9]::runtime::assert_snapshot<unknown>
  271. 25.62 s gammaloop-nextest-core> at <unknown source file>:<unknown line>
  272. 25.62 s gammaloop-nextest-core> 9: <test_renormalization[a909d96d00a50d41]::finit_part_ghlo::{closure#0} as core[940e698046960fd5]::ops::function::FnOnce<()>>::call_once<unknown>
  273. 25.62 s gammaloop-nextest-core> at <unknown source file>:<unknown line>
  274. 25.62 s gammaloop-nextest-core> 10: test[75d6903177b1d7e9]::__rust_begin_short_backtrace::<core[940e698046960fd5]::result::Result<(), alloc[2ea6bcb46fca0c42]::string::String>, fn() -> core[940e698046960fd5]::result::Result<(), alloc[2ea6bcb46fca0c42]::string::String>><unknown>
  275. 25.62 s gammaloop-nextest-core> at <unknown source file>:<unknown line>
  276. 25.62 s gammaloop-nextest-core> 11: test[75d6903177b1d7e9]::run_test::{closure#0}<unknown>
  277. 25.62 s gammaloop-nextest-core> at <unknown source file>:<unknown line>
  278. 25.62 s gammaloop-nextest-core> 12: std[bcb96dfbba0ab899]::sys::backtrace::__rust_begin_short_backtrace::<test[75d6903177b1d7e9]::run_test::{closure#1}, ()><unknown>
  279. 25.62 s gammaloop-nextest-core> at <unknown source file>:<unknown line>
  280. 25.62 s gammaloop-nextest-core> 13: <std[bcb96dfbba0ab899]::thread::lifecycle::spawn_unchecked<test[75d6903177b1d7e9]::run_test::{closure#1}, ()>::{closure#1} as core[940e698046960fd5]::ops::function::FnOnce<()>>::call_once::{shim:vtable#0}<unknown>
  281. 25.62 s gammaloop-nextest-core> at <unknown source file>:<unknown line>
  282. 25.62 s gammaloop-nextest-core> 14: <std[bcb96dfbba0ab899]::sys::thread::unix::Thread>::new::thread_start<unknown>
  283. 25.62 s gammaloop-nextest-core> at <unknown source file>:<unknown line>
  284. 25.62 s gammaloop-nextest-core> 15: start_thread<unknown>
  285. 25.62 s gammaloop-nextest-core> at <unknown source file>:<unknown line>
  286. 25.62 s gammaloop-nextest-core> 16: __clone3<unknown>
  287. 25.62 s gammaloop-nextest-core> at <unknown source file>:<unknown line>
  288. 25.62 s gammaloop-nextest-core>
  289. 25.62 s gammaloop-nextest-core> Run with COLORBT_SHOW_HIDDEN=1 environment variable to disable frame filtering.
  290. 25.62 s gammaloop-nextest-core> Run with RUST_BACKTRACE=full to include source snippets.
  291. 25.62 s gammaloop-nextest-core>
  292. 25.62 s gammaloop-nextest-core> FAIL [ 1.956s] (451/456) gammalooprs::test_renormalization finite_part_ghost_2loop
  293. 25.62 s gammaloop-nextest-core> stdout ---
  294. 25.62 s gammaloop-nextest-core>
  295. 25.62 s gammaloop-nextest-core> running 1 test
  296. 25.62 s gammaloop-nextest-core> ━━━━━━━━━━━━━━━━━━━━━━━━━━━━━━━ Snapshot Summary ━━━━━━━━━━━━━━━━━━━━━━━━━━━━━━━
  297. 25.62 s gammaloop-nextest-core> Snapshot: finite_part_ghost_2loop-3
  298. 25.62 s gammaloop-nextest-core> Source: crates/gammalooprs/tests/test_renormalization.rs:464
  299. 25.62 s gammaloop-nextest-core> ────────────────────────────────────────────────────────────────────────────────
  300. 25.62 s gammaloop-nextest-core> Expression: align_to_rqft(&a, &model).to_bare_ordered_string()
  301. 25.62 s gammaloop-nextest-core> ────────────────────────────────────────────────────────────────────────────────
  302. 25.62 s gammaloop-nextest-core> -old snapshot
  303. 25.62 s gammaloop-nextest-core> +new results
  304. 25.62 s gammaloop-nextest-core> ────────────┬───────────────────────────────────────────────────────────────────
  305. 25.62 s gammaloop-nextest-core> 1 │-(-1𝑖/32*ε+1𝑖/16)*(cas(2,coad(8)))^2*dot(P(0,mink(4)),P(0,mink(4)))*gs^4*ε^(-2)
  306. 25.62 s gammaloop-nextest-core> 1 │+(-1𝑖/16+1𝑖/32*ε)*(cas(2,coad(8)))^2*dot(P(0,mink(4)),P(0,mink(4)))*gs^4*ε^(-2)
  307. 25.62 s gammaloop-nextest-core> ────────────┴───────────────────────────────────────────────────────────────────
  308. 25.62 s gammaloop-nextest-core> To update snapshots run `cargo insta review`
  309. 25.62 s gammaloop-nextest-core> Stopped on the first failure. Run `cargo insta test` to run all snapshots.
  310. 25.62 s gammaloop-nextest-core> test finite_part_ghost_2loop ... FAILED
  311. 25.62 s gammaloop-nextest-core>
  312. 25.62 s gammaloop-nextest-core> failures:
  313. 25.62 s gammaloop-nextest-core>
  314. 25.62 s gammaloop-nextest-core> failures:
  315. 25.62 s gammaloop-nextest-core> finite_part_ghost_2loop
  316. 25.62 s gammaloop-nextest-core>
  317. 25.62 s gammaloop-nextest-core> test result: FAILED. 0 passed; 1 failed; 0 ignored; 0 measured; 5 filtered out; finished in 1.95s
  318. 25.62 s gammaloop-nextest-core>
  319. 25.62 s gammaloop-nextest-core> stderr ---
  320. 25.62 s gammaloop-nextest-core> The application panicked (crashed).
  321. 25.62 s gammaloop-nextest-core> Message: snapshot assertion for 'finite_part_ghost_2loop-3' failed in line 464
  322. 25.62 s gammaloop-nextest-core> Location: /nix/store/5nq6hmff26w9jbhbmba4wsvgnvglj2xd-vendor-cargo-deps/c19b7c6f923b580ac259164a89f2577984ad5ab09ee9d583b888f934adbbe8d0/insta-1.47.2/src/runtime.rs:719
  323. 25.62 s gammaloop-nextest-core>
  324. 25.62 s gammaloop-nextest-core> ━━━━━━━━━━━━━━━━━━━━━━━━━━━━━━━━━━ BACKTRACE ━━━━━━━━━━━━━━━━━━━━━━━━━━━━━━━━━━━
  325. 25.62 s gammaloop-nextest-core> 1: <color_eyre[51793ea62743adbd]::config::PanicHook>::panic_report<unknown>
  326. 25.62 s gammaloop-nextest-core> at <unknown source file>:<unknown line>
  327. 25.62 s gammaloop-nextest-core> 2: <color_eyre[51793ea62743adbd]::config::PanicHook>::into_panic_hook::{closure#0}<unknown>
  328. 25.62 s gammaloop-nextest-core> at <unknown source file>:<unknown line>
  329. 25.62 s gammaloop-nextest-core> 3: std[bcb96dfbba0ab899]::panicking::panic_with_hook<unknown>
  330. 25.62 s gammaloop-nextest-core> at <unknown source file>:<unknown line>
  331. 25.62 s gammaloop-nextest-core> 4: std[bcb96dfbba0ab899]::panicking::panic_handler::{closure#0}<unknown>
  332. 25.62 s gammaloop-nextest-core> at <unknown source file>:<unknown line>
  333. 25.62 s gammaloop-nextest-core> 5: std[bcb96dfbba0ab899]::sys::backtrace::__rust_end_short_backtrace::<std[bcb96dfbba0ab899]::panicking::panic_handler::{closure#0}, !><unknown>
  334. 25.62 s gammaloop-nextest-core> at <unknown source file>:<unknown line>
  335. 25.62 s gammaloop-nextest-core> 6: __rustc[6c289b9f9c454d21]::rust_begin_unwind<unknown>
  336. 25.62 s gammaloop-nextest-core> at <unknown source file>:<unknown line>
  337. 25.62 s gammaloop-nextest-core> 7: core[940e698046960fd5]::panicking::panic_fmt<unknown>
  338. 25.62 s gammaloop-nextest-core> at <unknown source file>:<unknown line>
  339. 25.62 s gammaloop-nextest-core> 8: insta[307a548ac79ef4d9]::runtime::assert_snapshot<unknown>
  340. 25.62 s gammaloop-nextest-core> at <unknown source file>:<unknown line>
  341. 25.62 s gammaloop-nextest-core> 9: test_renormalization[a909d96d00a50d41]::finite_part_ghost_2loop<unknown>
  342. 25.62 s gammaloop-nextest-core> at <unknown source file>:<unknown line>
  343. 25.62 s gammaloop-nextest-core> 10: <test_renormalization[a909d96d00a50d41]::finite_part_ghost_2loop::{closure#0} as core[940e698046960fd5]::ops::function::FnOnce<()>>::call_once<unknown>
  344. 25.62 s gammaloop-nextest-core> at <unknown source file>:<unknown line>
  345. 25.62 s gammaloop-nextest-core> 11: test[75d6903177b1d7e9]::__rust_begin_short_backtrace::<core[940e698046960fd5]::result::Result<(), alloc[2ea6bcb46fca0c42]::string::String>, fn() -> core[940e698046960fd5]::result::Result<(), alloc[2ea6bcb46fca0c42]::string::String>><unknown>
  346. 25.62 s gammaloop-nextest-core> at <unknown source file>:<unknown line>
  347. 25.62 s gammaloop-nextest-core> 12: test[75d6903177b1d7e9]::run_test::{closure#0}<unknown>
  348. 25.62 s gammaloop-nextest-core> at <unknown source file>:<unknown line>
  349. 25.62 s gammaloop-nextest-core> 13: std[bcb96dfbba0ab899]::sys::backtrace::__rust_begin_short_backtrace::<test[75d6903177b1d7e9]::run_test::{closure#1}, ()><unknown>
  350. 25.62 s gammaloop-nextest-core> at <unknown source file>:<unknown line>
  351. 25.62 s gammaloop-nextest-core> 14: <std[bcb96dfbba0ab899]::thread::lifecycle::spawn_unchecked<test[75d6903177b1d7e9]::run_test::{closure#1}, ()>::{closure#1} as core[940e698046960fd5]::ops::function::FnOnce<()>>::call_once::{shim:vtable#0}<unknown>
  352. 25.62 s gammaloop-nextest-core> at <unknown source file>:<unknown line>
  353. 25.62 s gammaloop-nextest-core> 15: <std[bcb96dfbba0ab899]::sys::thread::unix::Thread>::new::thread_start<unknown>
  354. 25.62 s gammaloop-nextest-core> at <unknown source file>:<unknown line>
  355. 25.62 s gammaloop-nextest-core> 16: start_thread<unknown>
  356. 25.62 s gammaloop-nextest-core> at <unknown source file>:<unknown line>
  357. 25.62 s gammaloop-nextest-core> 17: __clone3<unknown>
  358. 25.62 s gammaloop-nextest-core> at <unknown source file>:<unknown line>
  359. 25.62 s gammaloop-nextest-core>
  360. 25.62 s gammaloop-nextest-core> Run with COLORBT_SHOW_HIDDEN=1 environment variable to disable frame filtering.
  361. 25.62 s gammaloop-nextest-core> Run with RUST_BACKTRACE=full to include source snippets.
  362. 25.62 s gammaloop-nextest-core>
  363. 25.62 s gammaloop-nextest-core> error: test run failed
  364. 25.63 s gammaloop-nextest-core>
  365. 25.63 s gammaloop-nextest-core> ========== nextest test summary ==========
  366. 25.63 s gammaloop-nextest-core> report: target/nextest/ci_gammaloop/junit.xml
  367. 25.63 s gammaloop-nextest-core> tests: 456, failures: 2, errors: 0
  368. 25.63 s gammaloop-nextest-core>
  369. 25.63 s gammaloop-nextest-core> 1. gammalooprs::test_renormalization::finit_part_ghlo
  370. 25.63 s gammaloop-nextest-core> failure: test failure with exit code 101
  371. 25.63 s gammaloop-nextest-core> system-out
  372. 25.63 s gammaloop-nextest-core> running 1 test
  373. 25.63 s gammaloop-nextest-core> ren part: 1/2*GC_10^2*dot(P(0,mink(dim)),P(0,mink(dim)))*cas(2,coad(8))/ε
  374. 25.63 s gammaloop-nextest-core> ━━━━━━━━━━━━━━━━━━━━━━━━━━━━━━━ Snapshot Summary ━━━━━━━━━━━━━━━━━━━━━━━━━━━━━━━
  375. 25.63 s gammaloop-nextest-core> Snapshot: finit_part_ghlo
  376. 25.63 s gammaloop-nextest-core> Source: crates/gammalooprs/tests/test_renormalization.rs:557
  377. 25.63 s gammaloop-nextest-core> ────────────────────────────────────────────────────────────────────────────────
  378. 25.63 s gammaloop-nextest-core> Expression: align_to_rqft(&a, &model).to_bare_ordered_string()
  379. 25.63 s gammaloop-nextest-core> ────────────────────────────────────────────────────────────────────────────────
  380. 25.63 s gammaloop-nextest-core> -old snapshot
  381. 25.63 s gammaloop-nextest-core> +new results
  382. 25.63 s gammaloop-nextest-core> ────────────┬───────────────────────────────────────────────────────────────────
  383. 25.63 s gammaloop-nextest-core> 1 │--1/2*cas(2,coad(8))*dot(P(0,mink(4)),P(0,mink(4)))*gs^2*ε^(-1)
  384. 25.63 s gammaloop-nextest-core> 1 │+1/2*cas(2,coad(8))*dot(P(0,mink(4)),P(0,mink(4)))*gs^2*ε^(-1)
  385. 25.63 s gammaloop-nextest-core> ────────────┴───────────────────────────────────────────────────────────────────
  386. 25.63 s gammaloop-nextest-core> To update snapshots run `cargo insta review`
  387. 25.63 s gammaloop-nextest-core> Stopped on the first failure. Run `cargo insta test` to run all snapshots.
  388. 25.63 s gammaloop-nextest-core> test finit_part_ghlo ... FAILED
  389. 25.63 s gammaloop-nextest-core>
  390. 25.63 s gammaloop-nextest-core> failures:
  391. 25.63 s gammaloop-nextest-core>
  392. 25.63 s gammaloop-nextest-core> failures:
  393. 25.63 s gammaloop-nextest-core> finit_part_ghlo
  394. 25.63 s gammaloop-nextest-core>
  395. 25.63 s gammaloop-nextest-core> test result: FAILED. 0 passed; 1 failed; 0 ignored; 0 measured; 5 filtered out; finished in 0.24s
  396. 25.63 s gammaloop-nextest-core> system-err
  397. 25.63 s gammaloop-nextest-core> The application panicked (crashed).
  398. 25.63 s gammaloop-nextest-core> Message: snapshot assertion for 'finit_part_ghlo' failed in line 557
  399. 25.63 s gammaloop-nextest-core> Location: /nix/store/5nq6hmff26w9jbhbmba4wsvgnvglj2xd-vendor-cargo-deps/c19b7c6f923b580ac259164a89f2577984ad5ab09ee9d583b888f934adbbe8d0/insta-1.47.2/src/runtime.rs:719
  400. 25.63 s gammaloop-nextest-core>
  401. 25.63 s gammaloop-nextest-core> ━━━━━━━━━━━━━━━━━━━━━━━━━━━━━━━━━━ BACKTRACE ━━━━━━━━━━━━━━━━━━━━━━━━━━━━━━━━━━━
  402. 25.63 s gammaloop-nextest-core> 1: <color_eyre[51793ea62743adbd]::config::PanicHook>::panic_report<unknown>
  403. 25.63 s gammaloop-nextest-core> at <unknown source file>:<unknown line>
  404. 25.63 s gammaloop-nextest-core> 2: <color_eyre[51793ea62743adbd]::config::PanicHook>::into_panic_hook::{closure#0}<unknown>
  405. 25.63 s gammaloop-nextest-core> at <unknown source file>:<unknown line>
  406. 25.63 s gammaloop-nextest-core> 3: std[bcb96dfbba0ab899]::panicking::panic_with_hook<unknown>
  407. 25.63 s gammaloop-nextest-core> at <unknown source file>:<unknown line>
  408. 25.63 s gammaloop-nextest-core> 4: std[bcb96dfbba0ab899]::panicking::panic_handler::{closure#0}<unknown>
  409. 25.63 s gammaloop-nextest-core> at <unknown source file>:<unknown line>
  410. 25.63 s gammaloop-nextest-core> 5: std[bcb96dfbba0ab899]::sys::backtrace::__rust_end_short_backtrace::<std[bcb96dfbba0ab899]::panicking::panic_handler::{closure#0}, !><unknown>
  411. 25.63 s gammaloop-nextest-core> at <unknown source file>:<unknown line>
  412. 25.63 s gammaloop-nextest-core> 6: __rustc[6c289b9f9c454d21]::rust_begin_unwind<unknown>
  413. 25.63 s gammaloop-nextest-core> at <unknown source file>:<unknown line>
  414. 25.63 s gammaloop-nextest-core> 7: core[940e698046960fd5]::panicking::panic_fmt<unknown>
  415. 25.63 s gammaloop-nextest-core> at <unknown source file>:<unknown line>
  416. 25.63 s gammaloop-nextest-core> 8: insta[307a548ac79ef4d9]::runtime::assert_snapshot<unknown>
  417. 25.63 s gammaloop-nextest-core> at <unknown source file>:<unknown line>
  418. 25.63 s gammaloop-nextest-core> 9: <test_renormalization[a909d96d00a50d41]::finit_part_ghlo::{closure#0} as core[940e698046960fd5]::ops::function::FnOnce<()>>::call_once<unknown>
  419. 25.63 s gammaloop-nextest-core> at <unknown source file>:<unknown line>
  420. 25.63 s gammaloop-nextest-core> 10: test[75d6903177b1d7e9]::__rust_begin_short_backtrace::<core[940e698046960fd5]::result::Result<(), alloc[2ea6bcb46fca0c42]::string::String>, fn() -> core[940e698046960fd5]::result::Result<(), alloc[2ea6bcb46fca0c42]::string::String>><unknown>
  421. 25.63 s gammaloop-nextest-core> at <unknown source file>:<unknown line>
  422. 25.63 s gammaloop-nextest-core> 11: test[75d6903177b1d7e9]::run_test::{closure#0}<unknown>
  423. 25.63 s gammaloop-nextest-core> at <unknown source file>:<unknown line>
  424. 25.63 s gammaloop-nextest-core> 12: std[bcb96dfbba0ab899]::sys::backtrace::__rust_begin_short_backtrace::<test[75d6903177b1d7e9]::run_test::{closure#1}, ()><unknown>
  425. 25.63 s gammaloop-nextest-core> at <unknown source file>:<unknown line>
  426. 25.63 s gammaloop-nextest-core> 13: <std[bcb96dfbba0ab899]::thread::lifecycle::spawn_unchecked<test[75d6903177b1d7e9]::run_test::{closure#1}, ()>::{closure#1} as core[940e698046960fd5]::ops::function::FnOnce<()>>::call_once::{shim:vtable#0}<unknown>
  427. 25.63 s gammaloop-nextest-core> at <unknown source file>:<unknown line>
  428. 25.63 s gammaloop-nextest-core> 14: <std[bcb96dfbba0ab899]::sys::thread::unix::Thread>::new::thread_start<unknown>
  429. 25.63 s gammaloop-nextest-core> at <unknown source file>:<unknown line>
  430. 25.63 s gammaloop-nextest-core> 15: start_thread<unknown>
  431. 25.63 s gammaloop-nextest-core> at <unknown source file>:<unknown line>
  432. 25.63 s gammaloop-nextest-core> 16: __clone3<unknown>
  433. 25.63 s gammaloop-nextest-core> at <unknown source file>:<unknown line>
  434. 25.63 s gammaloop-nextest-core>
  435. 25.63 s gammaloop-nextest-core> Run with COLORBT_SHOW_HIDDEN=1 environment variable to disable frame filtering.
  436. 25.63 s gammaloop-nextest-core> Run with RUST_BACKTRACE=full to include source snippets.
  437. 25.63 s gammaloop-nextest-core>
  438. 25.63 s gammaloop-nextest-core> 2. gammalooprs::test_renormalization::finite_part_ghost_2loop
  439. 25.63 s gammaloop-nextest-core> failure: test failure with exit code 101
  440. 25.63 s gammaloop-nextest-core> system-out
  441. 25.63 s gammaloop-nextest-core> running 1 test
  442. 25.63 s gammaloop-nextest-core> ━━━━━━━━━━━━━━━━━━━━━━━━━━━━━━━ Snapshot Summary ━━━━━━━━━━━━━━━━━━━━━━━━━━━━━━━
  443. 25.63 s gammaloop-nextest-core> Snapshot: finite_part_ghost_2loop-3
  444. 25.63 s gammaloop-nextest-core> Source: crates/gammalooprs/tests/test_renormalization.rs:464
  445. 25.63 s gammaloop-nextest-core> ────────────────────────────────────────────────────────────────────────────────
  446. 25.63 s gammaloop-nextest-core> Expression: align_to_rqft(&a, &model).to_bare_ordered_string()
  447. 25.63 s gammaloop-nextest-core> ────────────────────────────────────────────────────────────────────────────────
  448. 25.63 s gammaloop-nextest-core> -old snapshot
  449. 25.63 s gammaloop-nextest-core> +new results
  450. 25.63 s gammaloop-nextest-core> ────────────┬───────────────────────────────────────────────────────────────────
  451. 25.63 s gammaloop-nextest-core> 1 │-(-1𝑖/32*ε+1𝑖/16)*(cas(2,coad(8)))^2*dot(P(0,mink(4)),P(0,mink(4)))*gs^4*ε^(-2)
  452. 25.63 s gammaloop-nextest-core> 1 │+(-1𝑖/16+1𝑖/32*ε)*(cas(2,coad(8)))^2*dot(P(0,mink(4)),P(0,mink(4)))*gs^4*ε^(-2)
  453. 25.63 s gammaloop-nextest-core> ────────────┴───────────────────────────────────────────────────────────────────
  454. 25.63 s gammaloop-nextest-core> To update snapshots run `cargo insta review`
  455. 25.63 s gammaloop-nextest-core> Stopped on the first failure. Run `cargo insta test` to run all snapshots.
  456. 25.63 s gammaloop-nextest-core> test finite_part_ghost_2loop ... FAILED
  457. 25.63 s gammaloop-nextest-core>
  458. 25.63 s gammaloop-nextest-core> failures:
  459. 25.63 s gammaloop-nextest-core>
  460. 25.63 s gammaloop-nextest-core> failures:
  461. 25.63 s gammaloop-nextest-core> finite_part_ghost_2loop
  462. 25.63 s gammaloop-nextest-core>
  463. 25.63 s gammaloop-nextest-core> test result: FAILED. 0 passed; 1 failed; 0 ignored; 0 measured; 5 filtered out; finished in 1.95s
  464. 25.63 s gammaloop-nextest-core> system-err
  465. 25.63 s gammaloop-nextest-core> The application panicked (crashed).
  466. 25.63 s gammaloop-nextest-core> Message: snapshot assertion for 'finite_part_ghost_2loop-3' failed in line 464
  467. 25.63 s gammaloop-nextest-core> Location: /nix/store/5nq6hmff26w9jbhbmba4wsvgnvglj2xd-vendor-cargo-deps/c19b7c6f923b580ac259164a89f2577984ad5ab09ee9d583b888f934adbbe8d0/insta-1.47.2/src/runtime.rs:719
  468. 25.63 s gammaloop-nextest-core>
  469. 25.63 s gammaloop-nextest-core> ━━━━━━━━━━━━━━━━━━━━━━━━━━━━━━━━━━ BACKTRACE ━━━━━━━━━━━━━━━━━━━━━━━━━━━━━━━━━━━
  470. 25.63 s gammaloop-nextest-core> 1: <color_eyre[51793ea62743adbd]::config::PanicHook>::panic_report<unknown>
  471. 25.63 s gammaloop-nextest-core> at <unknown source file>:<unknown line>
  472. 25.63 s gammaloop-nextest-core> 2: <color_eyre[51793ea62743adbd]::config::PanicHook>::into_panic_hook::{closure#0}<unknown>
  473. 25.63 s gammaloop-nextest-core> at <unknown source file>:<unknown line>
  474. 25.63 s gammaloop-nextest-core> 3: std[bcb96dfbba0ab899]::panicking::panic_with_hook<unknown>
  475. 25.63 s gammaloop-nextest-core> at <unknown source file>:<unknown line>
  476. 25.63 s gammaloop-nextest-core> 4: std[bcb96dfbba0ab899]::panicking::panic_handler::{closure#0}<unknown>
  477. 25.63 s gammaloop-nextest-core> at <unknown source file>:<unknown line>
  478. 25.63 s gammaloop-nextest-core> 5: std[bcb96dfbba0ab899]::sys::backtrace::__rust_end_short_backtrace::<std[bcb96dfbba0ab899]::panicking::panic_handler::{closure#0}, !><unknown>
  479. 25.63 s gammaloop-nextest-core> at <unknown source file>:<unknown line>
  480. 25.63 s gammaloop-nextest-core> 6: __rustc[6c289b9f9c454d21]::rust_begin_unwind<unknown>
  481. 25.63 s gammaloop-nextest-core> at <unknown source file>:<unknown line>
  482. 25.63 s gammaloop-nextest-core> 7: core[940e698046960fd5]::panicking::panic_fmt<unknown>
  483. 25.63 s gammaloop-nextest-core> at <unknown source file>:<unknown line>
  484. 25.63 s gammaloop-nextest-core> 8: insta[307a548ac79ef4d9]::runtime::assert_snapshot<unknown>
  485. 25.63 s gammaloop-nextest-core> at <unknown source file>:<unknown line>
  486. 25.63 s gammaloop-nextest-core> 9: test_renormalization[a909d96d00a50d41]::finite_part_ghost_2loop<unknown>
  487. 25.63 s gammaloop-nextest-core> at <unknown source file>:<unknown line>
  488. 25.63 s gammaloop-nextest-core> 10: <test_renormalization[a909d96d00a50d41]::finite_part_ghost_2loop::{closure#0} as core[940e698046960fd5]::ops::function::FnOnce<()>>::call_once<unknown>
  489. 25.63 s gammaloop-nextest-core> at <unknown source file>:<unknown line>
  490. 25.63 s gammaloop-nextest-core> 11: test[75d6903177b1d7e9]::__rust_begin_short_backtrace::<core[940e698046960fd5]::result::Result<(), alloc[2ea6bcb46fca0c42]::string::String>, fn() -> core[940e698046960fd5]::result::Result<(), alloc[2ea6bcb46fca0c42]::string::String>><unknown>
  491. 25.63 s gammaloop-nextest-core> at <unknown source file>:<unknown line>
  492. 25.63 s gammaloop-nextest-core> 12: test[75d6903177b1d7e9]::run_test::{closure#0}<unknown>
  493. 25.63 s gammaloop-nextest-core> at <unknown source file>:<unknown line>
  494. 25.63 s gammaloop-nextest-core> 13: std[bcb96dfbba0ab899]::sys::backtrace::__rust_begin_short_backtrace::<test[75d6903177b1d7e9]::run_test::{closure#1}, ()><unknown>
  495. 25.63 s gammaloop-nextest-core> at <unknown source file>:<unknown line>
  496. 25.63 s gammaloop-nextest-core> 14: <std[bcb96dfbba0ab899]::thread::lifecycle::spawn_unchecked<test[75d6903177b1d7e9]::run_test::{closure#1}, ()>::{closure#1} as core[940e698046960fd5]::ops::function::FnOnce<()>>::call_once::{shim:vtable#0}<unknown>
  497. 25.63 s gammaloop-nextest-core> at <unknown source file>:<unknown line>
  498. 25.63 s gammaloop-nextest-core> 15: <std[bcb96dfbba0ab899]::sys::thread::unix::Thread>::new::thread_start<unknown>
  499. 25.63 s gammaloop-nextest-core> at <unknown source file>:<unknown line>
  500. 25.63 s gammaloop-nextest-core> 16: start_thread<unknown>
  501. 25.63 s gammaloop-nextest-core> at <unknown source file>:<unknown line>
  502. 25.63 s gammaloop-nextest-core> 17: __clone3<unknown>
  503. 25.63 s gammaloop-nextest-core> at <unknown source file>:<unknown line>
  504. 25.63 s gammaloop-nextest-core>
  505. 25.63 s gammaloop-nextest-core> Run with COLORBT_SHOW_HIDDEN=1 environment variable to disable frame filtering.
  506. 25.63 s gammaloop-nextest-core> Run with RUST_BACKTRACE=full to include source snippets.
  507. 25.63 s gammaloop-nextest-core> =========================================
  508. 25.67 s [0 built (1 failed), 0.0error: Cannot build '/nix/store/bdjz1sm6jpf4ngrik4ql09axygsysbqj-gammaloop-nextest-core.drv'.
  509. 25.67 s Reason: builder failed with exit code 100.
  510. 25.67 s Output paths:
  511. 25.67 s /nix/store/m6wbas79fxijf98k47qgcx8am2457ykb-gammaloop-nextest-core
  512. 25.67 s Last 473 log lines:
  513. 25.67 s > Extracting 3 binaries (including 1 non-test binary), 1 build script output directory, and 2 linked paths to /build/nextest-archive-kSkRZh
  514. 25.67 s > Extracted 18 files to /build/nextest-archive-kSkRZh in 0.38s
  515. 25.67 s > ------------
  516. 25.67 s > Nextest run ID 2ab7916d-55ea-4df9-99f0-ead93cfcb454 with nextest profile: ci_gammaloop
  517. 25.67 s > Starting 339 tests across 2 binaries
  518. 25.67 s > ------------
  519. 25.67 s > Summary [ 0.420s] 339 tests run: 339 passed, 0 skipped
  520. 25.67 s >
  521. 25.67 s > ========== nextest test summary ==========
  522. 25.67 s > report: target/nextest/ci_gammaloop/junit.xml
  523. 25.67 s > tests: 339, failures: 0, errors: 0
  524. 25.67 s > No failing testcases found.
  525. 25.67 s > =========================================
  526. 25.67 s > Extracting 1 binary and 1 linked path to /build/nextest-archive-BTt73G
  527. 25.67 s > Extracted 7 files to /build/nextest-archive-BTt73G in 0.06s
  528. 25.67 s > ------------
  529. 25.67 s > Nextest run ID ee0cf6ff-16d9-446b-8ffc-b23bf21c8bda with nextest profile: ci_gammaloop
  530. 25.67 s > Starting 19 tests across 1 binary
  531. 25.67 s > ------------
  532. 25.67 s > Summary [ 0.010s] 19 tests run: 19 passed, 0 skipped
  533. 25.67 s >
  534. 25.67 s > ========== nextest test summary ==========
  535. 25.67 s > report: target/nextest/ci_gammaloop/junit.xml
  536. 25.67 s > tests: 19, failures: 0, errors: 0
  537. 25.67 s > No failing testcases found.
  538. 25.67 s > =========================================
  539. 25.67 s > Extracting 1 binary to /build/nextest-archive-Es5BTu
  540. 25.67 s > Extracted 4 files to /build/nextest-archive-Es5BTu in 0.03s
  541. 25.67 s > ------------
  542. 25.67 s > Nextest run ID 3a5c9982-d2d3-4f0e-8c1e-bb882f923643 with nextest profile: ci_gammaloop
  543. 25.67 s > Starting 0 tests across 1 binary
  544. 25.67 s > ------------
  545. 25.67 s > Summary [ 0.000s] 0 tests run: 0 passed, 0 skipped
  546. 25.67 s >
  547. 25.67 s > ========== nextest test summary ==========
  548. 25.67 s > report: target/nextest/ci_gammaloop/junit.xml
  549. 25.67 s > tests: 0, failures: 0, errors: 0
  550. 25.67 s > No failing testcases found.
  551. 25.67 s > =========================================
  552. 25.67 s > Extracting 4 binaries, 1 build script output directory, and 2 linked paths to /build/nextest-archive-jTNJ8E
  553. 25.67 s > Extracted 18 files to /build/nextest-archive-jTNJ8E in 0.38s
  554. 25.67 s > ------------
  555. 25.67 s > Nextest run ID 0ff8b2ff-aa06-4e09-8f63-d9f1b3255586 with nextest profile: ci_gammaloop
  556. 25.67 s > Starting 456 tests across 4 binaries (61 tests skipped, including 60 tests via profile.ci_gammaloop.default-filter)
  557. 25.67 s > FAIL [ 0.248s] (444/456) gammalooprs::test_renormalization finit_part_ghlo
  558. 25.67 s > stdout ---
  559. 25.67 s >
  560. 25.67 s > running 1 test
  561. 25.67 s > ren part: 1/2*GC_10^2*dot(P(0,mink(dim)),P(0,mink(dim)))*cas(2,coad(8))/ε
  562. 25.67 s > ━━━━━━━━━━━━━━━━━━━━━━━━━━━━━━━ Snapshot Summary ━━━━━━━━━━━━━━━━━━━━━━━━━━━━━━━
  563. 25.67 s > Snapshot: finit_part_ghlo
  564. 25.67 s > Source: crates/gammalooprs/tests/test_renormalization.rs:557
  565. 25.67 s > ────────────────────────────────────────────────────────────────────────────────
  566. 25.67 s > Expression: align_to_rqft(&a, &model).to_bare_ordered_string()
  567. 25.67 s > ────────────────────────────────────────────────────────────────────────────────
  568. 25.67 s > -old snapshot
  569. 25.67 s > +new results
  570. 25.67 s > ────────────┬───────────────────────────────────────────────────────────────────
  571. 25.67 s > 1 │--1/2*cas(2,coad(8))*dot(P(0,mink(4)),P(0,mink(4)))*gs^2*ε^(-1)
  572. 25.67 s > 1 │+1/2*cas(2,coad(8))*dot(P(0,mink(4)),P(0,mink(4)))*gs^2*ε^(-1)
  573. 25.67 s > ────────────┴───────────────────────────────────────────────────────────────────
  574. 25.67 s > To update snapshots run `cargo insta review`
  575. 25.67 s > Stopped on the first failure. Run `cargo insta test` to run all snapshots.
  576. 25.67 s > test finit_part_ghlo ... FAILED
  577. 25.67 s >
  578. 25.67 s > failures:
  579. 25.67 s >
  580. 25.67 s > failures:
  581. 25.67 s > finit_part_ghlo
  582. 25.67 s >
  583. 25.67 s > test result: FAILED. 0 passed; 1 failed; 0 ignored; 0 measured; 5 filtered out; finished in 0.24s
  584. 25.67 s >
  585. 25.67 s > stderr ---
  586. 25.67 s > The application panicked (crashed).
  587. 25.67 s > Message: snapshot assertion for 'finit_part_ghlo' failed in line 557
  588. 25.67 s > Location: /nix/store/5nq6hmff26w9jbhbmba4wsvgnvglj2xd-vendor-cargo-deps/c19b7c6f923b580ac259164a89f2577984ad5ab09ee9d583b888f934adbbe8d0/insta-1.47.2/src/runtime.rs:719
  589. 25.67 s >
  590. 25.67 s > ━━━━━━━━━━━━━━━━━━━━━━━━━━━━━━━━━━ BACKTRACE ━━━━━━━━━━━━━━━━━━━━━━━━━━━━━━━━━━━
  591. 25.67 s > 1: <color_eyre[51793ea62743adbd]::config::PanicHook>::panic_report<unknown>
  592. 25.67 s > at <unknown source file>:<unknown line>
  593. 25.67 s > 2: <color_eyre[51793ea62743adbd]::config::PanicHook>::into_panic_hook::{closure#0}<unknown>
  594. 25.67 s > at <unknown source file>:<unknown line>
  595. 25.67 s > 3: std[bcb96dfbba0ab899]::panicking::panic_with_hook<unknown>
  596. 25.67 s > at <unknown source file>:<unknown line>
  597. 25.67 s > 4: std[bcb96dfbba0ab899]::panicking::panic_handler::{closure#0}<unknown>
  598. 25.67 s > at <unknown source file>:<unknown line>
  599. 25.67 s > 5: std[bcb96dfbba0ab899]::sys::backtrace::__rust_end_short_backtrace::<std[bcb96dfbba0ab899]::panicking::panic_handler::{closure#0}, !><unknown>
  600. 25.67 s > at <unknown source file>:<unknown line>
  601. 25.67 s > 6: __rustc[6c289b9f9c454d21]::rust_begin_unwind<unknown>
  602. 25.67 s > at <unknown source file>:<unknown line>
  603. 25.67 s > 7: core[940e698046960fd5]::panicking::panic_fmt<unknown>
  604. 25.67 s > at <unknown source file>:<unknown line>
  605. 25.67 s > 8: insta[307a548ac79ef4d9]::runtime::assert_snapshot<unknown>
  606. 25.67 s > at <unknown source file>:<unknown line>
  607. 25.67 s > 9: <test_renormalization[a909d96d00a50d41]::finit_part_ghlo::{closure#0} as core[940e698046960fd5]::ops::function::FnOnce<()>>::call_once<unknown>
  608. 25.67 s > at <unknown source file>:<unknown line>
  609. 25.67 s > 10: test[75d6903177b1d7e9]::__rust_begin_short_backtrace::<core[940e698046960fd5]::result::Result<(), alloc[2ea6bcb46fca0c42]::string::String>, fn() -> core[940e698046960fd5]::result::Result<(), alloc[2ea6bcb46fca0c42]::string::String>><unknown>
  610. 25.67 s > at <unknown source file>:<unknown line>
  611. 25.67 s > 11: test[75d6903177b1d7e9]::run_test::{closure#0}<unknown>
  612. 25.67 s > at <unknown source file>:<unknown line>
  613. 25.67 s > 12: std[bcb96dfbba0ab899]::sys::backtrace::__rust_begin_short_backtrace::<test[75d6903177b1d7e9]::run_test::{closure#1}, ()><unknown>
  614. 25.67 s > at <unknown source file>:<unknown line>
  615. 25.67 s > 13: <std[bcb96dfbba0ab899]::thread::lifecycle::spawn_unchecked<test[75d6903177b1d7e9]::run_test::{closure#1}, ()>::{closure#1} as core[940e698046960fd5]::ops::function::FnOnce<()>>::call_once::{shim:vtable#0}<unknown>
  616. 25.67 s > at <unknown source file>:<unknown line>
  617. 25.67 s > 14: <std[bcb96dfbba0ab899]::sys::thread::unix::Thread>::new::thread_start<unknown>
  618. 25.67 s > at <unknown source file>:<unknown line>
  619. 25.67 s > 15: start_thread<unknown>
  620. 25.67 s > at <unknown source file>:<unknown line>
  621. 25.67 s > 16: __clone3<unknown>
  622. 25.67 s > at <unknown source file>:<unknown line>
  623. 25.67 s >
  624. 25.67 s > Run with COLORBT_SHOW_HIDDEN=1 environment variable to disable frame filtering.
  625. 25.67 s > Run with RUST_BACKTRACE=full to include source snippets.
  626. 25.67 s >
  627. 25.67 s > FAIL [ 1.956s] (451/456) gammalooprs::test_renormalization finite_part_ghost_2loop
  628. 25.67 s > stdout ---
  629. 25.67 s >
  630. 25.67 s > running 1 test
  631. 25.67 s > ━━━━━━━━━━━━━━━━━━━━━━━━━━━━━━━ Snapshot Summary ━━━━━━━━━━━━━━━━━━━━━━━━━━━━━━━
  632. 25.67 s > Snapshot: finite_part_ghost_2loop-3
  633. 25.67 s > Source: crates/gammalooprs/tests/test_renormalization.rs:464
  634. 25.67 s > ────────────────────────────────────────────────────────────────────────────────
  635. 25.67 s > Expression: align_to_rqft(&a, &model).to_bare_ordered_string()
  636. 25.67 s > ────────────────────────────────────────────────────────────────────────────────
  637. 25.67 s > -old snapshot
  638. 25.67 s > +new results
  639. 25.67 s > ────────────┬───────────────────────────────────────────────────────────────────
  640. 25.67 s > 1 │-(-1𝑖/32*ε+1𝑖/16)*(cas(2,coad(8)))^2*dot(P(0,mink(4)),P(0,mink(4)))*gs^4*ε^(-2)
  641. 25.67 s > 1 │+(-1𝑖/16+1𝑖/32*ε)*(cas(2,coad(8)))^2*dot(P(0,mink(4)),P(0,mink(4)))*gs^4*ε^(-2)
  642. 25.67 s > ────────────┴───────────────────────────────────────────────────────────────────
  643. 25.67 s > To update snapshots run `cargo insta review`
  644. 25.67 s > Stopped on the first failure. Run `cargo insta test` to run all snapshots.
  645. 25.67 s > test finite_part_ghost_2loop ... FAILED
  646. 25.67 s >
  647. 25.67 s > failures:
  648. 25.67 s >
  649. 25.67 s > failures:
  650. 25.67 s > finite_part_ghost_2loop
  651. 25.67 s >
  652. 25.67 s > test result: FAILED. 0 passed; 1 failed; 0 ignored; 0 measured; 5 filtered out; finished in 1.95s
  653. 25.67 s >
  654. 25.67 s > stderr ---
  655. 25.67 s > The application panicked (crashed).
  656. 25.67 s > Message: snapshot assertion for 'finite_part_ghost_2loop-3' failed in line 464
  657. 25.67 s > Location: /nix/store/5nq6hmff26w9jbhbmba4wsvgnvglj2xd-vendor-cargo-deps/c19b7c6f923b580ac259164a89f2577984ad5ab09ee9d583b888f934adbbe8d0/insta-1.47.2/src/runtime.rs:719
  658. 25.67 s >
  659. 25.67 s > ━━━━━━━━━━━━━━━━━━━━━━━━━━━━━━━━━━ BACKTRACE ━━━━━━━━━━━━━━━━━━━━━━━━━━━━━━━━━━━
  660. 25.67 s > 1: <color_eyre[51793ea62743adbd]::config::PanicHook>::panic_report<unknown>
  661. 25.67 s > at <unknown source file>:<unknown line>
  662. 25.67 s > 2: <color_eyre[51793ea62743adbd]::config::PanicHook>::into_panic_hook::{closure#0}<unknown>
  663. 25.67 s > at <unknown source file>:<unknown line>
  664. 25.67 s > 3: std[bcb96dfbba0ab899]::panicking::panic_with_hook<unknown>
  665. 25.67 s > at <unknown source file>:<unknown line>
  666. 25.67 s > 4: std[bcb96dfbba0ab899]::panicking::panic_handler::{closure#0}<unknown>
  667. 25.67 s > at <unknown source file>:<unknown line>
  668. 25.67 s > 5: std[bcb96dfbba0ab899]::sys::backtrace::__rust_end_short_backtrace::<std[bcb96dfbba0ab899]::panicking::panic_handler::{closure#0}, !><unknown>
  669. 25.67 s > at <unknown source file>:<unknown line>
  670. 25.67 s > 6: __rustc[6c289b9f9c454d21]::rust_begin_unwind<unknown>
  671. 25.67 s > at <unknown source file>:<unknown line>
  672. 25.67 s > 7: core[940e698046960fd5]::panicking::panic_fmt<unknown>
  673. 25.67 s > at <unknown source file>:<unknown line>
  674. 25.67 s > 8: insta[307a548ac79ef4d9]::runtime::assert_snapshot<unknown>
  675. 25.67 s > at <unknown source file>:<unknown line>
  676. 25.67 s > 9: test_renormalization[a909d96d00a50d41]::finite_part_ghost_2loop<unknown>
  677. 25.67 s > at <unknown source file>:<unknown line>
  678. 25.67 s > 10: <test_renormalization[a909d96d00a50d41]::finite_part_ghost_2loop::{closure#0} as core[940e698046960fd5]::ops::function::FnOnce<()>>::call_once<unknown>
  679. 25.67 s > at <unknown source file>:<unknown line>
  680. 25.67 s > 11: test[75d6903177b1d7e9]::__rust_begin_short_backtrace::<core[940e698046960fd5]::result::Result<(), alloc[2ea6bcb46fca0c42]::string::String>, fn() -> core[940e698046960fd5]::result::Result<(), alloc[2ea6bcb46fca0c42]::string::String>><unknown>
  681. 25.67 s > at <unknown source file>:<unknown line>
  682. 25.67 s > 12: test[75d6903177b1d7e9]::run_test::{closure#0}<unknown>
  683. 25.67 s > at <unknown source file>:<unknown line>
  684. 25.67 s > 13: std[bcb96dfbba0ab899]::sys::backtrace::__rust_begin_short_backtrace::<test[75d6903177b1d7e9]::run_test::{closure#1}, ()><unknown>
  685. 25.67 s > at <unknown source file>:<unknown line>
  686. 25.67 s > 14: <std[bcb96dfbba0ab899]::thread::lifecycle::spawn_unchecked<test[75d6903177b1d7e9]::run_test::{closure#1}, ()>::{closure#1} as core[940e698046960fd5]::ops::function::FnOnce<()>>::call_once::{shim:vtable#0}<unknown>
  687. 25.67 s > at <unknown source file>:<unknown line>
  688. 25.67 s > 15: <std[bcb96dfbba0ab899]::sys::thread::unix::Thread>::new::thread_start<unknown>
  689. 25.67 s > at <unknown source file>:<unknown line>
  690. 25.67 s > 16: start_thread<unknown>
  691. 25.67 s > at <unknown source file>:<unknown line>
  692. 25.67 s > 17: __clone3<unknown>
  693. 25.67 s > at <unknown source file>:<unknown line>
  694. 25.67 s >
  695. 25.67 s > Run with COLORBT_SHOW_HIDDEN=1 environment variable to disable frame filtering.
  696. 25.67 s > Run with RUST_BACKTRACE=full to include source snippets.
  697. 25.67 s >
  698. 25.67 s > ------------
  699. 25.67 s > Summary [ 7.681s] 456 tests run: 454 passed, 2 failed, 61 skipped
  700. 25.67 s > FAIL [ 0.248s] (444/456) gammalooprs::test_renormalization finit_part_ghlo
  701. 25.67 s > stdout ---
  702. 25.67 s >
  703. 25.67 s > running 1 test
  704. 25.67 s > ren part: 1/2*GC_10^2*dot(P(0,mink(dim)),P(0,mink(dim)))*cas(2,coad(8))/ε
  705. 25.67 s > ━━━━━━━━━━━━━━━━━━━━━━━━━━━━━━━ Snapshot Summary ━━━━━━━━━━━━━━━━━━━━━━━━━━━━━━━
  706. 25.67 s > Snapshot: finit_part_ghlo
  707. 25.67 s > Source: crates/gammalooprs/tests/test_renormalization.rs:557
  708. 25.67 s > ────────────────────────────────────────────────────────────────────────────────
  709. 25.67 s > Expression: align_to_rqft(&a, &model).to_bare_ordered_string()
  710. 25.67 s > ────────────────────────────────────────────────────────────────────────────────
  711. 25.67 s > -old snapshot
  712. 25.67 s > +new results
  713. 25.67 s > ────────────┬───────────────────────────────────────────────────────────────────
  714. 25.67 s > 1 │--1/2*cas(2,coad(8))*dot(P(0,mink(4)),P(0,mink(4)))*gs^2*ε^(-1)
  715. 25.67 s > 1 │+1/2*cas(2,coad(8))*dot(P(0,mink(4)),P(0,mink(4)))*gs^2*ε^(-1)
  716. 25.67 s > ────────────┴───────────────────────────────────────────────────────────────────
  717. 25.67 s > To update snapshots run `cargo insta review`
  718. 25.67 s > Stopped on the first failure. Run `cargo insta test` to run all snapshots.
  719. 25.67 s > test finit_part_ghlo ... FAILED
  720. 25.67 s >
  721. 25.67 s > failures:
  722. 25.67 s >
  723. 25.67 s > failures:
  724. 25.67 s > finit_part_ghlo
  725. 25.67 s >
  726. 25.67 s > test result: FAILED. 0 passed; 1 failed; 0 ignored; 0 measured; 5 filtered out; finished in 0.24s
  727. 25.67 s >
  728. 25.67 s > stderr ---
  729. 25.67 s > The application panicked (crashed).
  730. 25.67 s > Message: snapshot assertion for 'finit_part_ghlo' failed in line 557
  731. 25.67 s > Location: /nix/store/5nq6hmff26w9jbhbmba4wsvgnvglj2xd-vendor-cargo-deps/c19b7c6f923b580ac259164a89f2577984ad5ab09ee9d583b888f934adbbe8d0/insta-1.47.2/src/runtime.rs:719
  732. 25.67 s >
  733. 25.67 s > ━━━━━━━━━━━━━━━━━━━━━━━━━━━━━━━━━━ BACKTRACE ━━━━━━━━━━━━━━━━━━━━━━━━━━━━━━━━━━━
  734. 25.67 s > 1: <color_eyre[51793ea62743adbd]::config::PanicHook>::panic_report<unknown>
  735. 25.67 s > at <unknown source file>:<unknown line>
  736. 25.67 s > 2: <color_eyre[51793ea62743adbd]::config::PanicHook>::into_panic_hook::{closure#0}<unknown>
  737. 25.67 s > at <unknown source file>:<unknown line>
  738. 25.67 s > 3: std[bcb96dfbba0ab899]::panicking::panic_with_hook<unknown>
  739. 25.67 s > at <unknown source file>:<unknown line>
  740. 25.67 s > 4: std[bcb96dfbba0ab899]::panicking::panic_handler::{closure#0}<unknown>
  741. 25.67 s > at <unknown source file>:<unknown line>
  742. 25.67 s > 5: std[bcb96dfbba0ab899]::sys::backtrace::__rust_end_short_backtrace::<std[bcb96dfbba0ab899]::panicking::panic_handler::{closure#0}, !><unknown>
  743. 25.67 s > at <unknown source file>:<unknown line>
  744. 25.67 s > 6: __rustc[6c289b9f9c454d21]::rust_begin_unwind<unknown>
  745. 25.67 s > at <unknown source file>:<unknown line>
  746. 25.67 s > 7: core[940e698046960fd5]::panicking::panic_fmt<unknown>
  747. 25.67 s > at <unknown source file>:<unknown line>
  748. 25.67 s > 8: insta[307a548ac79ef4d9]::runtime::assert_snapshot<unknown>
  749. 25.67 s > at <unknown source file>:<unknown line>
  750. 25.67 s > 9: <test_renormalization[a909d96d00a50d41]::finit_part_ghlo::{closure#0} as core[940e698046960fd5]::ops::function::FnOnce<()>>::call_once<unknown>
  751. 25.67 s > at <unknown source file>:<unknown line>
  752. 25.67 s > 10: test[75d6903177b1d7e9]::__rust_begin_short_backtrace::<core[940e698046960fd5]::result::Result<(), alloc[2ea6bcb46fca0c42]::string::String>, fn() -> core[940e698046960fd5]::result::Result<(), alloc[2ea6bcb46fca0c42]::string::String>><unknown>
  753. 25.67 s > at <unknown source file>:<unknown line>
  754. 25.67 s > 11: test[75d6903177b1d7e9]::run_test::{closure#0}<unknown>
  755. 25.67 s > at <unknown source file>:<unknown line>
  756. 25.67 s > 12: std[bcb96dfbba0ab899]::sys::backtrace::__rust_begin_short_backtrace::<test[75d6903177b1d7e9]::run_test::{closure#1}, ()><unknown>
  757. 25.67 s > at <unknown source file>:<unknown line>
  758. 25.67 s > 13: <std[bcb96dfbba0ab899]::thread::lifecycle::spawn_unchecked<test[75d6903177b1d7e9]::run_test::{closure#1}, ()>::{closure#1} as core[940e698046960fd5]::ops::function::FnOnce<()>>::call_once::{shim:vtable#0}<unknown>
  759. 25.67 s > at <unknown source file>:<unknown line>
  760. 25.67 s > 14: <std[bcb96dfbba0ab899]::sys::thread::unix::Thread>::new::thread_start<unknown>
  761. 25.67 s > at <unknown source file>:<unknown line>
  762. 25.67 s > 15: start_thread<unknown>
  763. 25.67 s > at <unknown source file>:<unknown line>
  764. 25.67 s > 16: __clone3<unknown>
  765. 25.67 s > at <unknown source file>:<unknown line>
  766. 25.67 s >
  767. 25.67 s > Run with COLORBT_SHOW_HIDDEN=1 environment variable to disable frame filtering.
  768. 25.67 s > Run with RUST_BACKTRACE=full to include source snippets.
  769. 25.67 s >
  770. 25.67 s > FAIL [ 1.956s] (451/456) gammalooprs::test_renormalization finite_part_ghost_2loop
  771. 25.67 s > stdout ---
  772. 25.67 s >
  773. 25.67 s > running 1 test
  774. 25.67 s > ━━━━━━━━━━━━━━━━━━━━━━━━━━━━━━━ Snapshot Summary ━━━━━━━━━━━━━━━━━━━━━━━━━━━━━━━
  775. 25.67 s > Snapshot: finite_part_ghost_2loop-3
  776. 25.67 s > Source: crates/gammalooprs/tests/test_renormalization.rs:464
  777. 25.67 s > ────────────────────────────────────────────────────────────────────────────────
  778. 25.67 s > Expression: align_to_rqft(&a, &model).to_bare_ordered_string()
  779. 25.67 s > ────────────────────────────────────────────────────────────────────────────────
  780. 25.67 s > -old snapshot
  781. 25.67 s > +new results
  782. 25.67 s > ────────────┬───────────────────────────────────────────────────────────────────
  783. 25.67 s > 1 │-(-1𝑖/32*ε+1𝑖/16)*(cas(2,coad(8)))^2*dot(P(0,mink(4)),P(0,mink(4)))*gs^4*ε^(-2)
  784. 25.67 s > 1 │+(-1𝑖/16+1𝑖/32*ε)*(cas(2,coad(8)))^2*dot(P(0,mink(4)),P(0,mink(4)))*gs^4*ε^(-2)
  785. 25.67 s > ────────────┴───────────────────────────────────────────────────────────────────
  786. 25.67 s > To update snapshots run `cargo insta review`
  787. 25.67 s > Stopped on the first failure. Run `cargo insta test` to run all snapshots.
  788. 25.67 s > test finite_part_ghost_2loop ... FAILED
  789. 25.67 s >
  790. 25.67 s > failures:
  791. 25.67 s >
  792. 25.67 s > failures:
  793. 25.67 s > finite_part_ghost_2loop
  794. 25.67 s >
  795. 25.67 s > test result: FAILED. 0 passed; 1 failed; 0 ignored; 0 measured; 5 filtered out; finished in 1.95s
  796. 25.67 s >
  797. 25.67 s > stderr ---
  798. 25.67 s > The application panicked (crashed).
  799. 25.67 s > Message: snapshot assertion for 'finite_part_ghost_2loop-3' failed in line 464
  800. 25.67 s > Location: /nix/store/5nq6hmff26w9jbhbmba4wsvgnvglj2xd-vendor-cargo-deps/c19b7c6f923b580ac259164a89f2577984ad5ab09ee9d583b888f934adbbe8d0/insta-1.47.2/src/runtime.rs:719
  801. 25.67 s >
  802. 25.67 s > ━━━━━━━━━━━━━━━━━━━━━━━━━━━━━━━━━━ BACKTRACE ━━━━━━━━━━━━━━━━━━━━━━━━━━━━━━━━━━━
  803. 25.67 s > 1: <color_eyre[51793ea62743adbd]::config::PanicHook>::panic_report<unknown>
  804. 25.67 s > at <unknown source file>:<unknown line>
  805. 25.67 s > 2: <color_eyre[51793ea62743adbd]::config::PanicHook>::into_panic_hook::{closure#0}<unknown>
  806. 25.67 s > at <unknown source file>:<unknown line>
  807. 25.67 s > 3: std[bcb96dfbba0ab899]::panicking::panic_with_hook<unknown>
  808. 25.67 s > at <unknown source file>:<unknown line>
  809. 25.67 s > 4: std[bcb96dfbba0ab899]::panicking::panic_handler::{closure#0}<unknown>
  810. 25.67 s > at <unknown source file>:<unknown line>
  811. 25.67 s > 5: std[bcb96dfbba0ab899]::sys::backtrace::__rust_end_short_backtrace::<std[bcb96dfbba0ab899]::panicking::panic_handler::{closure#0}, !><unknown>
  812. 25.67 s > at <unknown source file>:<unknown line>
  813. 25.67 s > 6: __rustc[6c289b9f9c454d21]::rust_begin_unwind<unknown>
  814. 25.67 s > at <unknown source file>:<unknown line>
  815. 25.67 s > 7: core[940e698046960fd5]::panicking::panic_fmt<unknown>
  816. 25.67 s > at <unknown source file>:<unknown line>
  817. 25.67 s > 8: insta[307a548ac79ef4d9]::runtime::assert_snapshot<unknown>
  818. 25.67 s > at <unknown source file>:<unknown line>
  819. 25.67 s > 9: test_renormalization[a909d96d00a50d41]::finite_part_ghost_2loop<unknown>
  820. 25.67 s > at <unknown source file>:<unknown line>
  821. 25.67 s > 10: <test_renormalization[a909d96d00a50d41]::finite_part_ghost_2loop::{closure#0} as core[940e698046960fd5]::ops::function::FnOnce<()>>::call_once<unknown>
  822. 25.67 s > at <unknown source file>:<unknown line>
  823. 25.67 s > 11: test[75d6903177b1d7e9]::__rust_begin_short_backtrace::<core[940e698046960fd5]::result::Result<(), alloc[2ea6bcb46fca0c42]::string::String>, fn() -> core[940e698046960fd5]::result::Result<(), alloc[2ea6bcb46fca0c42]::string::String>><unknown>
  824. 25.67 s > at <unknown source file>:<unknown line>
  825. 25.67 s > 12: test[75d6903177b1d7e9]::run_test::{closure#0}<unknown>
  826. 25.67 s > at <unknown source file>:<unknown line>
  827. 25.67 s > 13: std[bcb96dfbba0ab899]::sys::backtrace::__rust_begin_short_backtrace::<test[75d6903177b1d7e9]::run_test::{closure#1}, ()><unknown>
  828. 25.67 s > at <unknown source file>:<unknown line>
  829. 25.67 s > 14: <std[bcb96dfbba0ab899]::thread::lifecycle::spawn_unchecked<test[75d6903177b1d7e9]::run_test::{closure#1}, ()>::{closure#1} as core[940e698046960fd5]::ops::function::FnOnce<()>>::call_once::{shim:vtable#0}<unknown>
  830. 25.67 s > at <unknown source file>:<unknown line>
  831. 25.67 s > 15: <std[bcb96dfbba0ab899]::sys::thread::unix::Thread>::new::thread_start<unknown>
  832. 25.67 s > at <unknown source file>:<unknown line>
  833. 25.67 s > 16: start_thread<unknown>
  834. 25.67 s > at <unknown source file>:<unknown line>
  835. 25.67 s > 17: __clone3<unknown>
  836. 25.67 s > at <unknown source file>:<unknown line>
  837. 25.67 s >
  838. 25.67 s > Run with COLORBT_SHOW_HIDDEN=1 environment variable to disable frame filtering.
  839. 25.67 s > Run with RUST_BACKTRACE=full to include source snippets.
  840. 25.67 s >
  841. 25.67 s > error: test run failed
  842. 25.67 s >
  843. 25.67 s > ========== nextest test summary ==========
  844. 25.67 s > report: target/nextest/ci_gammaloop/junit.xml
  845. 25.67 s > tests: 456, failures: 2, errors: 0
  846. 25.67 s >
  847. 25.67 s > 1. gammalooprs::test_renormalization::finit_part_ghlo
  848. 25.67 s > failure: test failure with exit code 101
  849. 25.67 s > system-out
  850. 25.67 s > running 1 test
  851. 25.67 s > ren part: 1/2*GC_10^2*dot(P(0,mink(dim)),P(0,mink(dim)))*cas(2,coad(8))/ε
  852. 25.67 s > ━━━━━━━━━━━━━━━━━━━━━━━━━━━━━━━ Snapshot Summary ━━━━━━━━━━━━━━━━━━━━━━━━━━━━━━━
  853. 25.67 s > Snapshot: finit_part_ghlo
  854. 25.67 s > Source: crates/gammalooprs/tests/test_renormalization.rs:557
  855. 25.67 s > ────────────────────────────────────────────────────────────────────────────────
  856. 25.67 s > Expression: align_to_rqft(&a, &model).to_bare_ordered_string()
  857. 25.67 s > ────────────────────────────────────────────────────────────────────────────────
  858. 25.67 s > -old snapshot
  859. 25.67 s > +new results
  860. 25.67 s > ────────────┬───────────────────────────────────────────────────────────────────
  861. 25.67 s > 1 │--1/2*cas(2,coad(8))*dot(P(0,mink(4)),P(0,mink(4)))*gs^2*ε^(-1)
  862. 25.67 s > 1 │+1/2*cas(2,coad(8))*dot(P(0,mink(4)),P(0,mink(4)))*gs^2*ε^(-1)
  863. 25.67 s > ────────────┴───────────────────────────────────────────────────────────────────
  864. 25.67 s > To update snapshots run `cargo insta review`
  865. 25.67 s > Stopped on the first failure. Run `cargo insta test` to run all snapshots.
  866. 25.67 s > test finit_part_ghlo ... FAILED
  867. 25.67 s >
  868. 25.67 s > failures:
  869. 25.67 s >
  870. 25.67 s > failures:
  871. 25.67 s > finit_part_ghlo
  872. 25.67 s >
  873. 25.67 s > test result: FAILED. 0 passed; 1 failed; 0 ignored; 0 measured; 5 filtered out; finished in 0.24s
  874. 25.67 s > system-err
  875. 25.67 s > The application panicked (crashed).
  876. 25.67 s > Message: snapshot assertion for 'finit_part_ghlo' failed in line 557
  877. 25.67 s > Location: /nix/store/5nq6hmff26w9jbhbmba4wsvgnvglj2xd-vendor-cargo-deps/c19b7c6f923b580ac259164a89f2577984ad5ab09ee9d583b888f934adbbe8d0/insta-1.47.2/src/runtime.rs:719
  878. 25.67 s >
  879. 25.67 s > ━━━━━━━━━━━━━━━━━━━━━━━━━━━━━━━━━━ BACKTRACE ━━━━━━━━━━━━━━━━━━━━━━━━━━━━━━━━━━━
  880. 25.67 s > 1: <color_eyre[51793ea62743adbd]::config::PanicHook>::panic_report<unknown>
  881. 25.67 s > at <unknown source file>:<unknown line>
  882. 25.67 s > 2: <color_eyre[51793ea62743adbd]::config::PanicHook>::into_panic_hook::{closure#0}<unknown>
  883. 25.67 s > at <unknown source file>:<unknown line>
  884. 25.67 s > 3: std[bcb96dfbba0ab899]::panicking::panic_with_hook<unknown>
  885. 25.67 s > at <unknown source file>:<unknown line>
  886. 25.67 s > 4: std[bcb96dfbba0ab899]::panicking::panic_handler::{closure#0}<unknown>
  887. 25.67 s > at <unknown source file>:<unknown line>
  888. 25.67 s > 5: std[bcb96dfbba0ab899]::sys::backtrace::__rust_end_short_backtrace::<std[bcb96dfbba0ab899]::panicking::panic_handler::{closure#0}, !><unknown>
  889. 25.67 s > at <unknown source file>:<unknown line>
  890. 25.67 s > 6: __rustc[6c289b9f9c454d21]::rust_begin_unwind<unknown>
  891. 25.67 s > at <unknown source file>:<unknown line>
  892. 25.67 s > 7: core[940e698046960fd5]::panicking::panic_fmt<unknown>
  893. 25.67 s > at <unknown source file>:<unknown line>
  894. 25.67 s > 8: insta[307a548ac79ef4d9]::runtime::assert_snapshot<unknown>
  895. 25.67 s > at <unknown source file>:<unknown line>
  896. 25.67 s > 9: <test_renormalization[a909d96d00a50d41]::finit_part_ghlo::{closure#0} as core[940e698046960fd5]::ops::function::FnOnce<()>>::call_once<unknown>
  897. 25.67 s > at <unknown source file>:<unknown line>
  898. 25.67 s > 10: test[75d6903177b1d7e9]::__rust_begin_short_backtrace::<core[940e698046960fd5]::result::Result<(), alloc[2ea6bcb46fca0c42]::string::String>, fn() -> core[940e698046960fd5]::result::Result<(), alloc[2ea6bcb46fca0c42]::string::String>><unknown>
  899. 25.67 s > at <unknown source file>:<unknown line>
  900. 25.67 s > 11: test[75d6903177b1d7e9]::run_test::{closure#0}<unknown>
  901. 25.67 s > at <unknown source file>:<unknown line>
  902. 25.67 s > 12: std[bcb96dfbba0ab899]::sys::backtrace::__rust_begin_short_backtrace::<test[75d6903177b1d7e9]::run_test::{closure#1}, ()><unknown>
  903. 25.67 s > at <unknown source file>:<unknown line>
  904. 25.67 s > 13: <std[bcb96dfbba0ab899]::thread::lifecycle::spawn_unchecked<test[75d6903177b1d7e9]::run_test::{closure#1}, ()>::{closure#1} as core[940e698046960fd5]::ops::function::FnOnce<()>>::call_once::{shim:vtable#0}<unknown>
  905. 25.67 s > at <unknown source file>:<unknown line>
  906. 25.67 s > 14: <std[bcb96dfbba0ab899]::sys::thread::unix::Thread>::new::thread_start<unknown>
  907. 25.67 s > at <unknown source file>:<unknown line>
  908. 25.67 s > 15: start_thread<unknown>
  909. 25.67 s > at <unknown source file>:<unknown line>
  910. 25.67 s > 16: __clone3<unknown>
  911. 25.67 s > at <unknown source file>:<unknown line>
  912. 25.67 s >
  913. 25.67 s > Run with COLORBT_SHOW_HIDDEN=1 environment variable to disable frame filtering.
  914. 25.67 s > Run with RUST_BACKTRACE=full to include source snippets.
  915. 25.67 s >
  916. 25.67 s > 2. gammalooprs::test_renormalization::finite_part_ghost_2loop
  917. 25.67 s > failure: test failure with exit code 101
  918. 25.67 s > system-out
  919. 25.67 s > running 1 test
  920. 25.67 s > ━━━━━━━━━━━━━━━━━━━━━━━━━━━━━━━ Snapshot Summary ━━━━━━━━━━━━━━━━━━━━━━━━━━━━━━━
  921. 25.67 s > Snapshot: finite_part_ghost_2loop-3
  922. 25.67 s > Source: crates/gammalooprs/tests/test_renormalization.rs:464
  923. 25.67 s > ────────────────────────────────────────────────────────────────────────────────
  924. 25.67 s > Expression: align_to_rqft(&a, &model).to_bare_ordered_string()
  925. 25.67 s > ────────────────────────────────────────────────────────────────────────────────
  926. 25.67 s > -old snapshot
  927. 25.67 s > +new results
  928. 25.67 s > ────────────┬───────────────────────────────────────────────────────────────────
  929. 25.67 s > 1 │-(-1𝑖/32*ε+1𝑖/16)*(cas(2,coad(8)))^2*dot(P(0,mink(4)),P(0,mink(4)))*gs^4*ε^(-2)
  930. 25.67 s > 1 │+(-1𝑖/16+1𝑖/32*ε)*(cas(2,coad(8)))^2*dot(P(0,mink(4)),P(0,mink(4)))*gs^4*ε^(-2)
  931. 25.67 s > ────────────┴───────────────────────────────────────────────────────────────────
  932. 25.67 s > To update snapshots run `cargo insta review`
  933. 25.67 s > Stopped on the first failure. Run `cargo insta test` to run all snapshots.
  934. 25.67 s > test finite_part_ghost_2loop ... FAILED
  935. 25.67 s >
  936. 25.67 s > failures:
  937. 25.67 s >
  938. 25.67 s > failures:
  939. 25.67 s > finite_part_ghost_2loop
  940. 25.67 s >
  941. 25.67 s > test result: FAILED. 0 passed; 1 failed; 0 ignored; 0 measured; 5 filtered out; finished in 1.95s
  942. 25.67 s > system-err
  943. 25.67 s > The application panicked (crashed).
  944. 25.67 s > Message: snapshot assertion for 'finite_part_ghost_2loop-3' failed in line 464
  945. 25.67 s > Location: /nix/store/5nq6hmff26w9jbhbmba4wsvgnvglj2xd-vendor-cargo-deps/c19b7c6f923b580ac259164a89f2577984ad5ab09ee9d583b888f934adbbe8d0/insta-1.47.2/src/runtime.rs:719
  946. 25.67 s >
  947. 25.67 s > ━━━━━━━━━━━━━━━━━━━━━━━━━━━━━━━━━━ BACKTRACE ━━━━━━━━━━━━━━━━━━━━━━━━━━━━━━━━━━━
  948. 25.67 s > 1: <color_eyre[51793ea62743adbd]::config::PanicHook>::panic_report<unknown>
  949. 25.67 s > at <unknown source file>:<unknown line>
  950. 25.67 s > 2: <color_eyre[51793ea62743adbd]::config::PanicHook>::into_panic_hook::{closure#0}<unknown>
  951. 25.67 s > at <unknown source file>:<unknown line>
  952. 25.67 s > 3: std[bcb96dfbba0ab899]::panicking::panic_with_hook<unknown>
  953. 25.67 s > at <unknown source file>:<unknown line>
  954. 25.67 s > 4: std[bcb96dfbba0ab899]::panicking::panic_handler::{closure#0}<unknown>
  955. 25.67 s > at <unknown source file>:<unknown line>
  956. 25.67 s > 5: std[bcb96dfbba0ab899]::sys::backtrace::__rust_end_short_backtrace::<std[bcb96dfbba0ab899]::panicking::panic_handler::{closure#0}, !><unknown>
  957. 25.67 s > at <unknown source file>:<unknown line>
  958. 25.67 s > 6: __rustc[6c289b9f9c454d21]::rust_begin_unwind<unknown>
  959. 25.67 s > at <unknown source file>:<unknown line>
  960. 25.67 s > 7: core[940e698046960fd5]::panicking::panic_fmt<unknown>
  961. 25.67 s > at <unknown source file>:<unknown line>
  962. 25.67 s > 8: insta[307a548ac79ef4d9]::runtime::assert_snapshot<unknown>
  963. 25.67 s > at <unknown source file>:<unknown line>
  964. 25.67 s > 9: test_renormalization[a909d96d00a50d41]::finite_part_ghost_2loop<unknown>
  965. 25.67 s > at <unknown source file>:<unknown line>
  966. 25.67 s > 10: <test_renormalization[a909d96d00a50d41]::finite_part_ghost_2loop::{closure#0} as core[940e698046960fd5]::ops::function::FnOnce<()>>::call_once<unknown>
  967. 25.67 s > at <unknown source file>:<unknown line>
  968. 25.67 s > 11: test[75d6903177b1d7e9]::__rust_begin_short_backtrace::<core[940e698046960fd5]::result::Result<(), alloc[2ea6bcb46fca0c42]::string::String>, fn() -> core[940e698046960fd5]::result::Result<(), alloc[2ea6bcb46fca0c42]::string::String>><unknown>
  969. 25.67 s > at <unknown source file>:<unknown line>
  970. 25.67 s > 12: test[75d6903177b1d7e9]::run_test::{closure#0}<unknown>
  971. 25.67 s > at <unknown source file>:<unknown line>
  972. 25.67 s > 13: std[bcb96dfbba0ab899]::sys::backtrace::__rust_begin_short_backtrace::<test[75d6903177b1d7e9]::run_test::{closure#1}, ()><unknown>
  973. 25.67 s > at <unknown source file>:<unknown line>
  974. 25.67 s > 14: <std[bcb96dfbba0ab899]::thread::lifecycle::spawn_unchecked<test[75d6903177b1d7e9]::run_test::{closure#1}, ()>::{closure#1} as core[940e698046960fd5]::ops::function::FnOnce<()>>::call_once::{shim:vtable#0}<unknown>
  975. 25.67 s > at <unknown source file>:<unknown line>
  976. 25.67 s > 15: <std[bcb96dfbba0ab899]::sys::thread::unix::Thread>::new::thread_start<unknown>
  977. 25.67 s > at <unknown source file>:<unknown line>
  978. 25.67 s > 16: start_thread<unknown>
  979. 25.67 s > at <unknown source file>:<unknown line>
  980. 25.67 s > 17: __clone3<unknown>
  981. 25.67 s > at <unknown source file>:<unknown line>
  982. 25.67 s >
  983. 25.67 s > Run with COLORBT_SHOW_HIDDEN=1 environment variable to disable frame filtering.
  984. 25.67 s > Run with RUST_BACKTRACE=full to include source snippets.
  985. 25.67 s > =========================================
  986. 25.67 s For full logs, run:
  987. 25.67 s nix log /nix/store/bdjz1sm6jpf4ngrik4ql09axygsysbqj-gammaloop-nextest-core.drv
  988. 25.77 s Run failed.