1. 0.62 s $ /nix/store/9ypz3flqsrl5xl495mm8h645gadjsxi1-coreutils-9.11/bin/timeout --kill-after=15s 7200s /nix/store/23zk8sgzamrbmj1fday15szf7f2279s8-nix-2.34.7/bin/nix --extra-experimental-features nix-command --extra-experimental-features flakes flake clone git+https://github.com/alphal00p/gammaloop --dest /tmp/nix-ci-worker/stable-pwd/repo/
  2. 0.67 s Cloning into '/tmp/nix-ci-worker/stable-pwd/repo'...
  3. 0.81 s remote: Enumerating objects: 65276, done.
  4. 0.92 s remote: Counting objects: 0% (1/7948) remote: Counting objects: 1% (80/7948) remote: Counting objects: 2% (159/7948) remote: Counting objects: 3% (239/7948) remote: Counting objects: 4% (318/7948) remote: Counting objects: 5% (398/7948) remote: Counting objects: 6% (477/7948) remote: Counting objects: 7% (557/7948) remote: Counting objects: 8% (636/7948) remote: Counting objects: 9% (716/7948) remote: Counting objects: 10% (795/7948) remote: Counting objects: 11% (875/7948) remote: Counting objects: 12% (954/7948) remote: Counting objects: 13% (1034/7948) remote: Counting objects: 14% (1113/7948) remote: Counting objects: 15% (1193/7948) remote: Counting objects: 16% (1272/7948) remote: Counting objects: 17% (1352/7948) remote: Counting objects: 18% (1431/7948) remote: Counting objects: 19% (1511/7948) remote: Counting objects: 20% (1590/7948) remote: Counting objects: 21% (1670/7948) remote: Counting objects: 22% (1749/7948) remote: Counting objects: 23% (1829/7948) remote: Counting objects: 24% (1908/7948) remote: Counting objects: 25% (1987/7948) remote: Counting objects: 26% (2067/7948) remote: Counting objects: 27% (2146/7948) remote: Counting objects: 28% (2226/7948) remote: Counting objects: 29% (2305/7948) remote: Counting objects: 30% (2385/7948) remote: Counting objects: 31% (2464/7948) remote: Counting objects: 32% (2544/7948) remote: Counting objects: 33% (2623/7948) remote: Counting objects: 34% (2703/7948) remote: Counting objects: 35% (2782/7948) remote: Counting objects: 36% (2862/7948) remote: Counting objects: 37% (2941/7948) remote: Counting objects: 38% (3021/7948) remote: Counting objects: 39% (3100/7948) remote: Counting objects: 40% (3180/7948) remote: Counting objects: 41% (3259/7948) remote: Counting objects: 42% (3339/7948) remote: Counting objects: 43% (3418/7948) remote: Counting objects: 44% (3498/7948) remote: Counting objects: 45% (3577/7948) remote: Counting objects: 46% (3657/7948) remote: Counting objects: 47% (3736/7948) remote: Counting objects: 48% (3816/7948) remote: Counting objects: 49% (3895/7948) remote: Counting objects: 50% (3974/7948) remote: Counting objects: 51% (4054/7948) remote: Counting objects: 52% (4133/7948) remote: Counting objects: 53% (4213/7948) remote: Counting objects: 54% (4292/7948) remote: Counting objects: 55% (4372/7948) remote: Counting objects: 56% (4451/7948) remote: Counting objects: 57% (4531/7948) remote: Counting objects: 58% (4610/7948) remote: Counting objects: 59% (4690/7948) remote: Counting objects: 60% (4769/7948) remote: Counting objects: 61% (4849/7948) remote: Counting objects: 62% (4928/7948) remote: Counting objects: 63% (5008/7948) remote: Counting objects: 64% (5087/7948) remote: Counting objects: 65% (5167/7948) remote: Counting objects: 66% (5246/7948) remote: Counting objects: 67% (5326/7948) remote: Counting objects: 68% (5405/7948) remote: Counting objects: 69% (5485/7948) remote: Counting objects: 70% (5564/7948) remote: Counting objects: 71% (5644/7948) remote: Counting objects: 72% (5723/7948) remote: Counting objects: 73% (5803/7948) remote: Counting objects: 74% (5882/7948) remote: Counting objects: 75% (5961/7948) remote: Counting objects: 76% (6041/7948) remote: Counting objects: 77% (6120/7948) remote: Counting objects: 78% (6200/7948) remote: Counting objects: 79% (6279/7948) remote: Counting objects: 80% (6359/7948) remote: Counting objects: 81% (6438/7948) remote: Counting objects: 82% (6518/7948) remote: Counting objects: 83% (6597/7948) remote: Counting objects: 84% (6677/7948) remote: Counting objects: 85% (6756/7948) remote: Counting objects: 86% (6836/7948) remote: Counting objects: 87% (6915/7948) remote: Counting objects: 88% (6995/7948) remote: Counting objects: 89% (7074/7948) remote: Counting objects: 90% (7154/7948) remote: Counting objects: 91% (7233/7948) remote: Counting objects: 92% (7313/7948) remote: Counting objects: 93% (7392/7948) remote: Counting objects: 94% (7472/7948) remote: Counting objects: 95% (7551/7948) remote: Counting objects: 96% (7631/7948) remote: Counting objects: 97% (7710/7948) remote: Counting objects: 98% (7790/7948) remote: Counting objects: 99% (7869/7948) remote: Counting objects: 100% (7948/7948) remote: Counting objects: 100% (7948/7948), done.
  5. 2.40 s remote: Compressing objects: 0% (1/1591) remote: Compressing objects: 1% (16/1591) remote: Compressing objects: 2% (32/1591) remote: Compressing objects: 3% (48/1591) remote: Compressing objects: 4% (64/1591) remote: Compressing objects: 5% (80/1591) remote: Compressing objects: 6% (96/1591) remote: Compressing objects: 7% (112/1591) remote: Compressing objects: 8% (128/1591) remote: Compressing objects: 9% (144/1591) remote: Compressing objects: 10% (160/1591) remote: Compressing objects: 11% (176/1591) remote: Compressing objects: 12% (191/1591) remote: Compressing objects: 13% (207/1591) remote: Compressing objects: 14% (223/1591) remote: Compressing objects: 15% (239/1591) remote: Compressing objects: 15% (254/1591) remote: Compressing objects: 16% (255/1591) remote: Compressing objects: 17% (271/1591) remote: Compressing objects: 18% (287/1591) remote: Compressing objects: 19% (303/1591) remote: Compressing objects: 20% (319/1591) remote: Compressing objects: 21% (335/1591) remote: Compressing objects: 22% (351/1591) remote: Compressing objects: 23% (366/1591) remote: Compressing objects: 24% (382/1591) remote: Compressing objects: 25% (398/1591) remote: Compressing objects: 26% (414/1591) remote: Compressing objects: 27% (430/1591) remote: Compressing objects: 28% (446/1591) remote: Compressing objects: 29% (462/1591) remote: Compressing objects: 30% (478/1591) remote: Compressing objects: 31% (494/1591) remote: Compressing objects: 32% (510/1591) remote: Compressing objects: 33% (526/1591) remote: Compressing objects: 34% (541/1591) remote: Compressing objects: 35% (557/1591) remote: Compressing objects: 36% (573/1591) remote: Compressing objects: 37% (589/1591) remote: Compressing objects: 38% (605/1591) remote: Compressing objects: 39% (621/1591) remote: Compressing objects: 40% (637/1591) remote: Compressing objects: 41% (653/1591) remote: Compressing objects: 42% (669/1591) remote: Compressing objects: 43% (685/1591) remote: Compressing objects: 44% (701/1591) remote: Compressing objects: 45% (716/1591) remote: Compressing objects: 46% (732/1591) remote: Compressing objects: 47% (748/1591) remote: Compressing objects: 48% (764/1591) remote: Compressing objects: 49% (780/1591) remote: Compressing objects: 50% (796/1591) remote: Compressing objects: 51% (812/1591) remote: Compressing objects: 52% (828/1591) remote: Compressing objects: 53% (844/1591) remote: Compressing objects: 54% (860/1591) remote: Compressing objects: 55% (876/1591) remote: Compressing objects: 56% (891/1591) remote: Compressing objects: 57% (907/1591) remote: Compressing objects: 58% (923/1591) remote: Compressing objects: 59% (939/1591) remote: Compressing objects: 60% (955/1591) remote: Compressing objects: 61% (971/1591) remote: Compressing objects: 62% (987/1591) remote: Compressing objects: 63% (1003/1591) remote: Compressing objects: 64% (1019/1591) remote: Compressing objects: 65% (1035/1591) remote: Compressing objects: 66% (1051/1591) remote: Compressing objects: 67% (1066/1591) remote: Compressing objects: 68% (1082/1591) remote: Compressing objects: 69% (1098/1591) remote: Compressing objects: 70% (1114/1591) remote: Compressing objects: 71% (1130/1591) remote: Compressing objects: 72% (1146/1591) remote: Compressing objects: 73% (1162/1591) remote: Compressing objects: 74% (1178/1591) remote: Compressing objects: 75% (1194/1591) remote: Compressing objects: 76% (1210/1591) remote: Compressing objects: 77% (1226/1591) remote: Compressing objects: 78% (1241/1591) remote: Compressing objects: 79% (1257/1591) remote: Compressing objects: 80% (1273/1591) remote: Compressing objects: 81% (1289/1591) remote: Compressing objects: 82% (1305/1591) remote: Compressing objects: 83% (1321/1591) remote: Compressing objects: 84% (1337/1591) remote: Compressing objects: 85% (1353/1591) remote: Compressing objects: 86% (1369/1591) remote: Compressing objects: 87% (1385/1591) remote: Compressing objects: 88% (1401/1591) remote: Compressing objects: 89% (1416/1591) remote: Compressing objects: 90% (1432/1591) remote: Compressing objects: 91% (1448/1591) remote: Compressing objects: 92% (1464/1591) remote: Compressing objects: 93% (1480/1591) remote: Compressing objects: 94% (1496/1591) remote: Compressing objects: 95% (1512/1591) remote: Compressing objects: 96% (1528/1591) remote: Compressing objects: 97% (1544/1591) remote: Compressing objects: 98% (1560/1591) remote: Compressing objects: 99% (1576/1591) remote: Compressing objects: 100% (1591/1591) remote: Compressing objects: 100% (1591/1591), done.
  6. 5.18 s Receiving objects: 0% (1/65276) Receiving objects: 1% (653/65276) Receiving objects: 2% (1306/65276) Receiving objects: 3% (1959/65276) Receiving objects: 4% (2612/65276) Receiving objects: 5% (3264/65276) Receiving objects: 6% (3917/65276) Receiving objects: 7% (4570/65276) Receiving objects: 8% (5223/65276) Receiving objects: 9% (5875/65276) Receiving objects: 10% (6528/65276) Receiving objects: 11% (7181/65276) Receiving objects: 12% (7834/65276), 11.63 MiB | 23.24 MiB/s Receiving objects: 13% (8486/65276), 11.63 MiB | 23.24 MiB/s Receiving objects: 14% (9139/65276), 11.63 MiB | 23.24 MiB/s Receiving objects: 15% (9792/65276), 11.63 MiB | 23.24 MiB/s Receiving objects: 16% (10445/65276), 11.63 MiB | 23.24 MiB/s Receiving objects: 17% (11097/65276), 11.63 MiB | 23.24 MiB/s Receiving objects: 18% (11750/65276), 11.63 MiB | 23.24 MiB/s Receiving objects: 19% (12403/65276), 11.63 MiB | 23.24 MiB/s Receiving objects: 20% (13056/65276), 11.63 MiB | 23.24 MiB/s Receiving objects: 21% (13708/65276), 11.63 MiB | 23.24 MiB/s Receiving objects: 22% (14361/65276), 11.63 MiB | 23.24 MiB/s Receiving objects: 23% (15014/65276), 11.63 MiB | 23.24 MiB/s Receiving objects: 24% (15667/65276), 11.63 MiB | 23.24 MiB/s Receiving objects: 25% (16319/65276), 11.63 MiB | 23.24 MiB/s Receiving objects: 26% (16972/65276), 11.63 MiB | 23.24 MiB/s Receiving objects: 27% (17625/65276), 11.63 MiB | 23.24 MiB/s Receiving objects: 28% (18278/65276), 11.63 MiB | 23.24 MiB/s Receiving objects: 29% (18931/65276), 11.63 MiB | 23.24 MiB/s Receiving objects: 30% (19583/65276), 11.63 MiB | 23.24 MiB/s Receiving objects: 31% (20236/65276), 11.63 MiB | 23.24 MiB/s Receiving objects: 32% (20889/65276), 11.63 MiB | 23.24 MiB/s Receiving objects: 33% (21542/65276), 11.63 MiB | 23.24 MiB/s Receiving objects: 34% (22194/65276), 11.63 MiB | 23.24 MiB/s Receiving objects: 35% (22847/65276), 11.63 MiB | 23.24 MiB/s Receiving objects: 36% (23500/65276), 11.63 MiB | 23.24 MiB/s Receiving objects: 37% (24153/65276), 11.63 MiB | 23.24 MiB/s Receiving objects: 38% (24805/65276), 11.63 MiB | 23.24 MiB/s Receiving objects: 39% (25458/65276), 11.63 MiB | 23.24 MiB/s Receiving objects: 40% (26111/65276), 11.63 MiB | 23.24 MiB/s Receiving objects: 41% (26764/65276), 11.63 MiB | 23.24 MiB/s Receiving objects: 42% (27416/65276), 11.63 MiB | 23.24 MiB/s Receiving objects: 43% (28069/65276), 11.63 MiB | 23.24 MiB/s Receiving objects: 44% (28722/65276), 11.63 MiB | 23.24 MiB/s Receiving objects: 45% (29375/65276), 11.63 MiB | 23.24 MiB/s Receiving objects: 46% (30027/65276), 11.63 MiB | 23.24 MiB/s Receiving objects: 47% (30680/65276), 11.63 MiB | 23.24 MiB/s Receiving objects: 48% (31333/65276), 11.63 MiB | 23.24 MiB/s Receiving objects: 48% (31903/65276), 11.63 MiB | 23.24 MiB/s Receiving objects: 49% (31986/65276), 29.70 MiB | 29.69 MiB/s Receiving objects: 50% (32638/65276), 29.70 MiB | 29.69 MiB/s Receiving objects: 51% (33291/65276), 29.70 MiB | 29.69 MiB/s Receiving objects: 52% (33944/65276), 29.70 MiB | 29.69 MiB/s Receiving objects: 53% (34597/65276), 29.70 MiB | 29.69 MiB/s Receiving objects: 54% (35250/65276), 29.70 MiB | 29.69 MiB/s Receiving objects: 55% (35902/65276), 29.70 MiB | 29.69 MiB/s Receiving objects: 56% (36555/65276), 29.70 MiB | 29.69 MiB/s Receiving objects: 57% (37208/65276), 29.70 MiB | 29.69 MiB/s Receiving objects: 58% (37861/65276), 29.70 MiB | 29.69 MiB/s Receiving objects: 59% (38513/65276), 29.70 MiB | 29.69 MiB/s Receiving objects: 60% (39166/65276), 29.70 MiB | 29.69 MiB/s Receiving objects: 61% (39819/65276), 46.14 MiB | 30.75 MiB/s Receiving objects: 62% (40472/65276), 46.14 MiB | 30.75 MiB/s Receiving objects: 63% (41124/65276), 46.14 MiB | 30.75 MiB/s Receiving objects: 64% (41777/65276), 46.14 MiB | 30.75 MiB/s Receiving objects: 65% (42430/65276), 46.14 MiB | 30.75 MiB/s Receiving objects: 66% (43083/65276), 46.14 MiB | 30.75 MiB/s Receiving objects: 67% (43735/65276), 46.14 MiB | 30.75 MiB/s Receiving objects: 68% (44388/65276), 46.14 MiB | 30.75 MiB/s Receiving objects: 69% (45041/65276), 46.14 MiB | 30.75 MiB/s Receiving objects: 70% (45694/65276), 46.14 MiB | 30.75 MiB/s Receiving objects: 71% (46346/65276), 46.14 MiB | 30.75 MiB/s Receiving objects: 72% (46999/65276), 46.14 MiB | 30.75 MiB/s Receiving objects: 73% (47652/65276), 46.14 MiB | 30.75 MiB/s Receiving objects: 74% (48305/65276), 46.14 MiB | 30.75 MiB/s Receiving objects: 74% (48902/65276), 62.93 MiB | 31.46 MiB/s Receiving objects: 75% (48957/65276), 62.93 MiB | 31.46 MiB/s Receiving objects: 76% (49610/65276), 62.93 MiB | 31.46 MiB/s Receiving objects: 77% (50263/65276), 62.93 MiB | 31.46 MiB/s Receiving objects: 78% (50916/65276), 62.93 MiB | 31.46 MiB/s Receiving objects: 79% (51569/65276), 62.93 MiB | 31.46 MiB/s Receiving objects: 80% (52221/65276), 62.93 MiB | 31.46 MiB/s Receiving objects: 81% (52874/65276), 62.93 MiB | 31.46 MiB/s Receiving objects: 82% (53527/65276), 62.93 MiB | 31.46 MiB/s Receiving objects: 83% (54180/65276), 62.93 MiB | 31.46 MiB/s Receiving objects: 84% (54832/65276), 79.25 MiB | 31.53 MiB/s Receiving objects: 85% (55485/65276), 79.25 MiB | 31.53 MiB/s Receiving objects: 86% (56138/65276), 79.25 MiB | 31.53 MiB/s Receiving objects: 87% (56791/65276), 79.25 MiB | 31.53 MiB/s Receiving objects: 88% (57443/65276), 79.25 MiB | 31.53 MiB/s Receiving objects: 89% (58096/65276), 79.25 MiB | 31.53 MiB/s Receiving objects: 90% (58749/65276), 79.25 MiB | 31.53 MiB/s Receiving objects: 91% (59402/65276), 79.25 MiB | 31.53 MiB/s Receiving objects: 92% (60054/65276), 79.25 MiB | 31.53 MiB/s Receiving objects: 93% (60707/65276), 79.25 MiB | 31.53 MiB/s Receiving objects: 94% (61360/65276), 79.25 MiB | 31.53 MiB/s Receiving objects: 95% (62013/65276), 79.25 MiB | 31.53 MiB/s Receiving objects: 96% (62665/65276), 79.25 MiB | 31.53 MiB/s Receiving objects: 97% (63318/65276), 79.25 MiB | 31.53 MiB/s Receiving objects: 98% (63971/65276), 79.25 MiB | 31.53 MiB/s Receiving objects: 99% (64624/65276), 79.25 MiB | 31.53 MiB/s remote: Total 65276 (delta 6893), reused 6440 (delta 6347), pack-reused 57328 (from 1)
  7. 5.18 s Receiving objects: 100% (65276/65276), 79.25 MiB | 31.53 MiB/s Receiving objects: 100% (65276/65276), 87.61 MiB | 31.73 MiB/s, done.
  8. 5.81 s Resolving deltas: 0% (0/45990) Resolving deltas: 1% (460/45990) Resolving deltas: 2% (920/45990) Resolving deltas: 3% (1380/45990) Resolving deltas: 4% (1840/45990) Resolving deltas: 5% (2300/45990) Resolving deltas: 6% (2761/45990) Resolving deltas: 7% (3222/45990) Resolving deltas: 8% (3680/45990) Resolving deltas: 9% (4140/45990) Resolving deltas: 10% (4599/45990) Resolving deltas: 11% (5059/45990) Resolving deltas: 12% (5521/45990) Resolving deltas: 13% (5979/45990) Resolving deltas: 14% (6439/45990) Resolving deltas: 15% (6905/45990) Resolving deltas: 16% (7360/45990) Resolving deltas: 17% (7819/45990) Resolving deltas: 18% (8279/45990) Resolving deltas: 19% (8739/45990) Resolving deltas: 20% (9198/45990) Resolving deltas: 21% (9659/45990) Resolving deltas: 22% (10118/45990) Resolving deltas: 23% (10578/45990) Resolving deltas: 24% (11038/45990) Resolving deltas: 25% (11498/45990) Resolving deltas: 26% (11958/45990) Resolving deltas: 27% (12418/45990) Resolving deltas: 28% (12878/45990) Resolving deltas: 29% (13338/45990) Resolving deltas: 30% (13797/45990) Resolving deltas: 31% (14259/45990) Resolving deltas: 32% (14717/45990) Resolving deltas: 33% (15177/45990) Resolving deltas: 34% (15637/45990) Resolving deltas: 35% (16097/45990) Resolving deltas: 36% (16559/45990) Resolving deltas: 37% (17018/45990) Resolving deltas: 38% (17477/45990) Resolving deltas: 39% (17937/45990) Resolving deltas: 40% (18396/45990) Resolving deltas: 41% (18856/45990) Resolving deltas: 42% (19316/45990) Resolving deltas: 43% (19777/45990) Resolving deltas: 44% (20236/45990) Resolving deltas: 45% (20696/45990) Resolving deltas: 46% (21156/45990) Resolving deltas: 47% (21616/45990) Resolving deltas: 48% (22078/45990) Resolving deltas: 49% (22537/45990) Resolving deltas: 50% (22995/45990) Resolving deltas: 51% (23455/45990) Resolving deltas: 52% (23915/45990) Resolving deltas: 53% (24375/45990) Resolving deltas: 54% (24835/45990) Resolving deltas: 55% (25300/45990) Resolving deltas: 56% (25755/45990) Resolving deltas: 57% (26215/45990) Resolving deltas: 58% (26675/45990) Resolving deltas: 59% (27135/45990) Resolving deltas: 60% (27594/45990) Resolving deltas: 61% (28054/45990) Resolving deltas: 62% (28515/45990) Resolving deltas: 63% (28974/45990) Resolving deltas: 64% (29434/45990) Resolving deltas: 65% (29894/45990) Resolving deltas: 66% (30354/45990) Resolving deltas: 67% (30814/45990) Resolving deltas: 68% (31274/45990) Resolving deltas: 69% (31734/45990) Resolving deltas: 70% (32193/45990) Resolving deltas: 71% (32653/45990) Resolving deltas: 72% (33113/45990) Resolving deltas: 73% (33574/45990) Resolving deltas: 74% (34036/45990) Resolving deltas: 75% (34494/45990) Resolving deltas: 76% (34953/45990) Resolving deltas: 77% (35413/45990) Resolving deltas: 78% (35873/45990) Resolving deltas: 79% (36333/45990) Resolving deltas: 80% (36793/45990) Resolving deltas: 81% (37252/45990) Resolving deltas: 82% (37712/45990) Resolving deltas: 83% (38172/45990) Resolving deltas: 84% (38632/45990) Resolving deltas: 85% (39092/45990) Resolving deltas: 86% (39552/45990) Resolving deltas: 87% (40012/45990) Resolving deltas: 88% (40472/45990) Resolving deltas: 89% (40932/45990) Resolving deltas: 90% (41393/45990) Resolving deltas: 91% (41852/45990) Resolving deltas: 92% (42311/45990) Resolving deltas: 93% (42771/45990) Resolving deltas: 94% (43231/45990) Resolving deltas: 95% (43692/45990) Resolving deltas: 96% (44152/45990) Resolving deltas: 97% (44611/45990) Resolving deltas: 98% (45071/45990) Resolving deltas: 99% (45531/45990) Resolving deltas: 100% (45990/45990) Resolving deltas: 100% (45990/45990), done.
  9. 6.07 s Fetching commit 19107fed4b8ff70444a6725c1fcebd873f2872d7 for vakint_rustred ...
  10. 6.08 s $ /nix/store/bcnisk3ydfgv26v2gw3zlky24g00yww2-git-2.54.0/bin/git fetch origin 19107fed4b8ff70444a6725c1fcebd873f2872d7
  11. 6.55 s From https://github.com/alphal00p/gammaloop
  12. 6.55 s * branch 19107fed4b8ff70444a6725c1fcebd873f2872d7 -> FETCH_HEAD
  13. 6.56 s $ /nix/store/9ypz3flqsrl5xl495mm8h645gadjsxi1-coreutils-9.11/bin/timeout --kill-after=15s 7200s /nix/store/bcnisk3ydfgv26v2gw3zlky24g00yww2-git-2.54.0/bin/git -c advice.detachedHead=false checkout 19107fed4b8ff70444a6725c1fcebd873f2872d7
  14. 6.71 s HEAD is now at 19107fed migrate shipped RustRed artifacts to schema V3
  15. 6.71 s $ /nix/store/9ypz3flqsrl5xl495mm8h645gadjsxi1-coreutils-9.11/bin/timeout --kill-after=15s 7200s /nix/store/23zk8sgzamrbmj1fday15szf7f2279s8-nix-2.34.7/bin/nix --extra-experimental-features nix-command --extra-experimental-features flakes --log-format internal-json run .#packages.x86_64-linux.nix-ci-check-gammaloop-nextest-spenso --print-build-logs
  16. 11.01 s
  17. 11.12 s Downloading cached gammaloop-nextest-binaries-spenso-idenso from https://cache.nix-ci.com
  18. 11.16 s Downloading cached gammaloop-nextest-binaries-spenso-spenso from https://cache.nix-ci.com
  19. 11.16 s Downloading cached gammaloop-nextest-binaries-spenso-spenso-hep-lib from https://cache.nix-ci.com
  20. 11.16 s Downloading cached gammaloop-nextest-binaries-spenso-spenso-macros from https://cache.nix-ci.com
  21. 11.16 s Downloading cached gammaloop-nextest-binaries-spenso-symbolica-utils from https://cache.nix-ci.com
  22. 11.69 s Downloaded cached gammaloop-nextest-binaries-spenso-idenso (29.3 MiB) in 566ms
  23. 11.69 s Progress: 0 of 1 built, 1 of 7 downloaded from cache (4 downloading)
  24. 11.73 s Downloaded cached gammaloop-nextest-binaries-spenso-symbolica-utils (6.3 MiB) in 572ms
  25. 11.73 s Progress: 0 of 1 built, 2 of 7 downloaded from cache (3 downloading)
  26. 11.77 s Downloaded cached gammaloop-nextest-binaries-spenso-spenso-macros (6.5 MiB) in 613ms
  27. 11.77 s Progress: 0 of 1 built, 3 of 7 downloaded from cache (2 downloading)
  28. 12.09 s Downloaded cached gammaloop-nextest-binaries-spenso-spenso-hep-lib (34 MiB) in 929ms
  29. 12.09 s Progress: 0 of 1 built, 4 of 7 downloaded from cache (1 downloading)
  30. 12.15 s Downloaded cached gammaloop-nextest-binaries-spenso-spenso (10.2 MiB) in 991ms
  31. 12.15 s Progress: 0 of 1 built, 5 of 7 downloaded from cache
  32. 12.15 s Downloading cached gammaloop-nextest-binaries-spenso from https://cache.nix-ci.com
  33. 12.18 s Downloaded cached gammaloop-nextest-binaries-spenso (1920 B) in 28ms
  34. 12.18 s Progress: 0 of 1 built, 6 of 7 downloaded from cache
  35. 12.18 s Downloading cached nix-ci-check-gammaloop-nextest-spenso from https://cache.nix-ci.com
  36. 12.20 s Downloaded cached nix-ci-check-gammaloop-nextest-spenso (1016 B) in 28ms
  37. 12.20 s Progress: 0 of 1 built, 7 of 7 downloaded from cache
  38. 16.75 s evaluating derivation 'g copying '/nix/store/bbqb evaluating derivation 'g querying gammaloop-nexte [0/1 built, 0.0 KiB DL] [1/0/1 built, 0.0 KiB DLgammaloop-nextest-spenso> Extracting 5 binaries and 2 linked paths to /build/nextest-archive-pPYx73
  39. 17.40 s gammaloop-nextest-spenso> Extracted 19 files to /build/nextest-archive-pPYx73 in 0.16s
  40. 17.40 s gammaloop-nextest-spenso> ------------
  41. 17.40 s gammaloop-nextest-spenso> Nextest run ID b716e426-055b-44e6-bd22-7e2ee0adb6d6 with nextest profile: ci_gammaloop
  42. 17.40 s gammaloop-nextest-spenso> Starting 224 tests across 5 binaries (26 tests skipped, including 2 tests via profile.ci_gammaloop.default-filter)
  43. 17.40 s gammaloop-nextest-spenso> FAIL [ 0.012s] ( 44/224) idenso color::test::form_reference::metric_contraction_respects_antisymmetric_normalization
  44. 17.40 s gammaloop-nextest-spenso> stdout ---
  45. 17.40 s gammaloop-nextest-spenso>
  46. 17.40 s gammaloop-nextest-spenso> running 1 test
  47. 17.40 s gammaloop-nextest-spenso> test color::test::form_reference::metric_contraction_respects_antisymmetric_normalization ... FAILED
  48. 17.40 s gammaloop-nextest-spenso>
  49. 17.40 s gammaloop-nextest-spenso> failures:
  50. 17.40 s gammaloop-nextest-spenso>
  51. 17.40 s gammaloop-nextest-spenso> failures:
  52. 17.40 s gammaloop-nextest-spenso> color::test::form_reference::metric_contraction_respects_antisymmetric_normalization
  53. 17.40 s gammaloop-nextest-spenso>
  54. 17.40 s gammaloop-nextest-spenso> test result: FAILED. 0 passed; 1 failed; 0 ignored; 0 measured; 240 filtered out; finished in 0.00s
  55. 17.40 s gammaloop-nextest-spenso>
  56. 17.40 s gammaloop-nextest-spenso> stderr ---
  57. 17.40 s gammaloop-nextest-spenso>
  58. 17.40 s gammaloop-nextest-spenso> thread 'color::test::form_reference::metric_contraction_respects_antisymmetric_normalization' (332) panicked at crates/idenso/src/color/test/form_reference.rs:171:5:
  59. 17.40 s gammaloop-nextest-spenso> assertion `left == right` failed
  60. 17.40 s gammaloop-nextest-spenso> left: "-1*f(coad(8,standalone_metric_j),coad(8,standalone_metric_s),coad(8,standalone_metric_u))"
  61. 17.40 s gammaloop-nextest-spenso> right: "f(coad(8,standalone_metric_j),coad(8,standalone_metric_s),coad(8,standalone_metric_u))"
  62. 17.40 s gammaloop-nextest-spenso> stack backtrace:
  63. 17.40 s gammaloop-nextest-spenso> 0: __rustc::rust_begin_unwind
  64. 17.40 s gammaloop-nextest-spenso> 1: core::panicking::panic_fmt
  65. 17.40 s gammaloop-nextest-spenso> 2: core::panicking::assert_failed_inner
  66. 17.40 s gammaloop-nextest-spenso> 3: core::panicking::assert_failed::<alloc::string::String, alloc::string::String>
  67. 17.40 s gammaloop-nextest-spenso> 4: idenso::color::test::form_reference::metric_contraction_respects_antisymmetric_normalization
  68. 17.40 s gammaloop-nextest-spenso> 5: <idenso::color::test::form_reference::metric_contraction_respects_antisymmetric_normalization::{closure#0} as core::ops::function::FnOnce<()>>::call_once
  69. 17.40 s gammaloop-nextest-spenso> note: Some details are omitted, run with `RUST_BACKTRACE=full` for a verbose backtrace.
  70. 17.40 s gammaloop-nextest-spenso>
  71. 17.40 s gammaloop-nextest-spenso> FAIL [ 0.038s] (220/224) idenso tensor::tests::parsing::infinite_execution
  72. 17.40 s gammaloop-nextest-spenso> stdout ---
  73. 17.40 s gammaloop-nextest-spenso>
  74. 17.40 s gammaloop-nextest-spenso> running 1 test
  75. 17.40 s gammaloop-nextest-spenso> ━━━━━━━━━━━━━━━━━━━━━━━━━━━━━━━ Snapshot Summary ━━━━━━━━━━━━━━━━━━━━━━━━━━━━━━━
  76. 17.40 s gammaloop-nextest-spenso> Snapshot: infinite_execution
  77. 17.40 s gammaloop-nextest-spenso> Source: crates/idenso/src/tensor/tests/parsing.rs:910
  78. 17.40 s gammaloop-nextest-spenso> ────────────────────────────────────────────────────────────────────────────────
  79. 17.40 s gammaloop-nextest-spenso> Expression: net_iter.snapshot_dot()
  80. 17.40 s gammaloop-nextest-spenso> ────────────────────────────────────────────────────────────────────────────────
  81. 17.40 s gammaloop-nextest-spenso> -old snapshot
  82. 17.40 s gammaloop-nextest-spenso> +new results
  83. 17.40 s gammaloop-nextest-spenso> ────────────┬───────────────────────────────────────────────────────────────────
  84. 17.40 s gammaloop-nextest-spenso> 8 8 │ 0:0:s -> ext0 [id=0 color="red"];
  85. 17.40 s gammaloop-nextest-spenso> 9 9 │ ext1 [style=invis];
  86. 17.40 s gammaloop-nextest-spenso> 10 10 │ 0:5:s -> ext1 [id=1 dir=none color="red" label="mink4|l_0"];
  87. 17.40 s gammaloop-nextest-spenso> 11 11 │ ext2 [style=invis];
  88. 17.40 s gammaloop-nextest-spenso> 12 │- 0:4:s -> ext2 [id=2 dir=none color="red" label="bis4|l_2"];
  89. 17.40 s gammaloop-nextest-spenso> 12 │+ 0:3:s -> ext2 [id=2 dir=none color="red" label="mink4|l_1"];
  90. 17.40 s gammaloop-nextest-spenso> 13 13 │ ext3 [style=invis];
  91. 17.40 s gammaloop-nextest-spenso> 14 │- 0:3:s -> ext3 [id=3 dir=none color="red" label="bis4|l_3"];
  92. 17.40 s gammaloop-nextest-spenso> 14 │+ 0:1:s -> ext3 [id=3 dir=none color="red" label="bis4|l_2"];
  93. 17.40 s gammaloop-nextest-spenso> 15 15 │ ext4 [style=invis];
  94. 17.40 s gammaloop-nextest-spenso> 16 │- 0:1:s -> ext4 [id=4 dir=none color="red" label="mink4|l_1"];
  95. 17.40 s gammaloop-nextest-spenso> 16 │+ 0:2:s -> ext4 [id=4 dir=none color="red" label="mink4|l_4"];
  96. 17.40 s gammaloop-nextest-spenso> 17 17 │ ext5 [style=invis];
  97. 17.40 s gammaloop-nextest-spenso> 18 │- 0:2:s -> ext5 [id=5 dir=none color="red" label="mink4|l_4"];
  98. 17.40 s gammaloop-nextest-spenso> 18 │+ 0:4:s -> ext5 [id=5 dir=none color="red" label="bis4|l_3"];
  99. 17.40 s gammaloop-nextest-spenso> 19 19 │ }
  100. 17.40 s gammaloop-nextest-spenso> ────────────┴───────────────────────────────────────────────────────────────────
  101. 17.40 s gammaloop-nextest-spenso> To update snapshots run `cargo insta review`
  102. 17.40 s gammaloop-nextest-spenso> Stopped on the first failure. Run `cargo insta test` to run all snapshots.
  103. 17.40 s gammaloop-nextest-spenso> test tensor::tests::parsing::infinite_execution ... FAILED
  104. 17.40 s gammaloop-nextest-spenso>
  105. 17.40 s gammaloop-nextest-spenso> failures:
  106. 17.40 s gammaloop-nextest-spenso>
  107. 17.40 s gammaloop-nextest-spenso> failures:
  108. 17.40 s gammaloop-nextest-spenso> tensor::tests::parsing::infinite_execution
  109. 17.40 s gammaloop-nextest-spenso>
  110. 17.40 s gammaloop-nextest-spenso> test result: FAILED. 0 passed; 1 failed; 0 ignored; 0 measured; 240 filtered out; finished in 0.03s
  111. 17.40 s gammaloop-nextest-spenso>
  112. 17.40 s gammaloop-nextest-spenso> stderr ---
  113. 17.40 s gammaloop-nextest-spenso>
  114. 17.40 s gammaloop-nextest-spenso> thread 'tensor::tests::parsing::infinite_execution' (844) panicked at /nix/store/hvwd4qqiaadc4s871lfyylxrciqrvlgs-vendor-cargo-deps/c19b7c6f923b580ac259164a89f2577984ad5ab09ee9d583b888f934adbbe8d0/insta-1.47.2/src/runtime.rs:719:13:
  115. 17.40 s gammaloop-nextest-spenso> snapshot assertion for 'infinite_execution' failed in line 910
  116. 17.40 s gammaloop-nextest-spenso> stack backtrace:
  117. 17.40 s gammaloop-nextest-spenso> 0: __rustc::rust_begin_unwind
  118. 17.40 s gammaloop-nextest-spenso> 1: core::panicking::panic_fmt
  119. 17.40 s gammaloop-nextest-spenso> 2: insta::runtime::assert_snapshot
  120. 17.40 s gammaloop-nextest-spenso> 3: idenso::tensor::tests::parsing::infinite_execution
  121. 17.40 s gammaloop-nextest-spenso> 4: <idenso::tensor::tests::parsing::infinite_execution::{closure#0} as core::ops::function::FnOnce<()>>::call_once
  122. 17.40 s gammaloop-nextest-spenso> note: Some details are omitted, run with `RUST_BACKTRACE=full` for a verbose backtrace.
  123. 17.40 s gammaloop-nextest-spenso>
  124. 18.46 s gammaloop-nextest-spenso> ------------
  125. 18.46 s gammaloop-nextest-spenso> Summary [ 1.532s] 224 tests run: 222 passed, 2 failed, 26 skipped
  126. 18.46 s gammaloop-nextest-spenso> FAIL [ 0.012s] ( 44/224) idenso color::test::form_reference::metric_contraction_respects_antisymmetric_normalization
  127. 18.46 s gammaloop-nextest-spenso> stdout ---
  128. 18.46 s gammaloop-nextest-spenso>
  129. 18.46 s gammaloop-nextest-spenso> running 1 test
  130. 18.46 s gammaloop-nextest-spenso> test color::test::form_reference::metric_contraction_respects_antisymmetric_normalization ... FAILED
  131. 18.46 s gammaloop-nextest-spenso>
  132. 18.46 s gammaloop-nextest-spenso> failures:
  133. 18.46 s gammaloop-nextest-spenso>
  134. 18.46 s gammaloop-nextest-spenso> failures:
  135. 18.46 s gammaloop-nextest-spenso> color::test::form_reference::metric_contraction_respects_antisymmetric_normalization
  136. 18.46 s gammaloop-nextest-spenso>
  137. 18.46 s gammaloop-nextest-spenso> test result: FAILED. 0 passed; 1 failed; 0 ignored; 0 measured; 240 filtered out; finished in 0.00s
  138. 18.46 s gammaloop-nextest-spenso>
  139. 18.46 s gammaloop-nextest-spenso> stderr ---
  140. 18.46 s gammaloop-nextest-spenso>
  141. 18.46 s gammaloop-nextest-spenso> thread 'color::test::form_reference::metric_contraction_respects_antisymmetric_normalization' (332) panicked at crates/idenso/src/color/test/form_reference.rs:171:5:
  142. 18.46 s gammaloop-nextest-spenso> assertion `left == right` failed
  143. 18.46 s gammaloop-nextest-spenso> left: "-1*f(coad(8,standalone_metric_j),coad(8,standalone_metric_s),coad(8,standalone_metric_u))"
  144. 18.46 s gammaloop-nextest-spenso> right: "f(coad(8,standalone_metric_j),coad(8,standalone_metric_s),coad(8,standalone_metric_u))"
  145. 18.46 s gammaloop-nextest-spenso> stack backtrace:
  146. 18.46 s gammaloop-nextest-spenso> 0: __rustc::rust_begin_unwind
  147. 18.46 s gammaloop-nextest-spenso> 1: core::panicking::panic_fmt
  148. 18.46 s gammaloop-nextest-spenso> 2: core::panicking::assert_failed_inner
  149. 18.46 s gammaloop-nextest-spenso> 3: core::panicking::assert_failed::<alloc::string::String, alloc::string::String>
  150. 18.46 s gammaloop-nextest-spenso> 4: idenso::color::test::form_reference::metric_contraction_respects_antisymmetric_normalization
  151. 18.46 s gammaloop-nextest-spenso> 5: <idenso::color::test::form_reference::metric_contraction_respects_antisymmetric_normalization::{closure#0} as core::ops::function::FnOnce<()>>::call_once
  152. 18.46 s gammaloop-nextest-spenso> note: Some details are omitted, run with `RUST_BACKTRACE=full` for a verbose backtrace.
  153. 18.46 s gammaloop-nextest-spenso>
  154. 18.46 s gammaloop-nextest-spenso> FAIL [ 0.038s] (220/224) idenso tensor::tests::parsing::infinite_execution
  155. 18.46 s gammaloop-nextest-spenso> stdout ---
  156. 18.46 s gammaloop-nextest-spenso>
  157. 18.46 s gammaloop-nextest-spenso> running 1 test
  158. 18.46 s gammaloop-nextest-spenso> ━━━━━━━━━━━━━━━━━━━━━━━━━━━━━━━ Snapshot Summary ━━━━━━━━━━━━━━━━━━━━━━━━━━━━━━━
  159. 18.46 s gammaloop-nextest-spenso> Snapshot: infinite_execution
  160. 18.46 s gammaloop-nextest-spenso> Source: crates/idenso/src/tensor/tests/parsing.rs:910
  161. 18.46 s gammaloop-nextest-spenso> ────────────────────────────────────────────────────────────────────────────────
  162. 18.46 s gammaloop-nextest-spenso> Expression: net_iter.snapshot_dot()
  163. 18.46 s gammaloop-nextest-spenso> ────────────────────────────────────────────────────────────────────────────────
  164. 18.46 s gammaloop-nextest-spenso> -old snapshot
  165. 18.46 s gammaloop-nextest-spenso> +new results
  166. 18.46 s gammaloop-nextest-spenso> ────────────┬───────────────────────────────────────────────────────────────────
  167. 18.46 s gammaloop-nextest-spenso> 8 8 │ 0:0:s -> ext0 [id=0 color="red"];
  168. 18.46 s gammaloop-nextest-spenso> 9 9 │ ext1 [style=invis];
  169. 18.46 s gammaloop-nextest-spenso> 10 10 │ 0:5:s -> ext1 [id=1 dir=none color="red" label="mink4|l_0"];
  170. 18.46 s gammaloop-nextest-spenso> 11 11 │ ext2 [style=invis];
  171. 18.46 s gammaloop-nextest-spenso> 12 │- 0:4:s -> ext2 [id=2 dir=none color="red" label="bis4|l_2"];
  172. 18.46 s gammaloop-nextest-spenso> 12 │+ 0:3:s -> ext2 [id=2 dir=none color="red" label="mink4|l_1"];
  173. 18.46 s gammaloop-nextest-spenso> 13 13 │ ext3 [style=invis];
  174. 18.46 s gammaloop-nextest-spenso> 14 │- 0:3:s -> ext3 [id=3 dir=none color="red" label="bis4|l_3"];
  175. 18.46 s gammaloop-nextest-spenso> 14 │+ 0:1:s -> ext3 [id=3 dir=none color="red" label="bis4|l_2"];
  176. 18.46 s gammaloop-nextest-spenso> 15 15 │ ext4 [style=invis];
  177. 18.46 s gammaloop-nextest-spenso> 16 │- 0:1:s -> ext4 [id=4 dir=none color="red" label="mink4|l_1"];
  178. 18.46 s gammaloop-nextest-spenso> 16 │+ 0:2:s -> ext4 [id=4 dir=none color="red" label="mink4|l_4"];
  179. 18.46 s gammaloop-nextest-spenso> 17 17 │ ext5 [style=invis];
  180. 18.46 s gammaloop-nextest-spenso> 18 │- 0:2:s -> ext5 [id=5 dir=none color="red" label="mink4|l_4"];
  181. 18.46 s gammaloop-nextest-spenso> 18 │+ 0:4:s -> ext5 [id=5 dir=none color="red" label="bis4|l_3"];
  182. 18.46 s gammaloop-nextest-spenso> 19 19 │ }
  183. 18.46 s gammaloop-nextest-spenso> ────────────┴───────────────────────────────────────────────────────────────────
  184. 18.46 s gammaloop-nextest-spenso> To update snapshots run `cargo insta review`
  185. 18.46 s gammaloop-nextest-spenso> Stopped on the first failure. Run `cargo insta test` to run all snapshots.
  186. 18.46 s gammaloop-nextest-spenso> test tensor::tests::parsing::infinite_execution ... FAILED
  187. 18.46 s gammaloop-nextest-spenso>
  188. 18.46 s gammaloop-nextest-spenso> failures:
  189. 18.46 s gammaloop-nextest-spenso>
  190. 18.46 s gammaloop-nextest-spenso> failures:
  191. 18.46 s gammaloop-nextest-spenso> tensor::tests::parsing::infinite_execution
  192. 18.46 s gammaloop-nextest-spenso>
  193. 18.46 s gammaloop-nextest-spenso> test result: FAILED. 0 passed; 1 failed; 0 ignored; 0 measured; 240 filtered out; finished in 0.03s
  194. 18.46 s gammaloop-nextest-spenso>
  195. 18.46 s gammaloop-nextest-spenso> stderr ---
  196. 18.46 s gammaloop-nextest-spenso>
  197. 18.46 s gammaloop-nextest-spenso> thread 'tensor::tests::parsing::infinite_execution' (844) panicked at /nix/store/hvwd4qqiaadc4s871lfyylxrciqrvlgs-vendor-cargo-deps/c19b7c6f923b580ac259164a89f2577984ad5ab09ee9d583b888f934adbbe8d0/insta-1.47.2/src/runtime.rs:719:13:
  198. 18.46 s gammaloop-nextest-spenso> snapshot assertion for 'infinite_execution' failed in line 910
  199. 18.46 s gammaloop-nextest-spenso> stack backtrace:
  200. 18.46 s gammaloop-nextest-spenso> 0: __rustc::rust_begin_unwind
  201. 18.46 s gammaloop-nextest-spenso> 1: core::panicking::panic_fmt
  202. 18.46 s gammaloop-nextest-spenso> 2: insta::runtime::assert_snapshot
  203. 18.46 s gammaloop-nextest-spenso> 3: idenso::tensor::tests::parsing::infinite_execution
  204. 18.46 s gammaloop-nextest-spenso> 4: <idenso::tensor::tests::parsing::infinite_execution::{closure#0} as core::ops::function::FnOnce<()>>::call_once
  205. 18.46 s gammaloop-nextest-spenso> note: Some details are omitted, run with `RUST_BACKTRACE=full` for a verbose backtrace.
  206. 18.46 s gammaloop-nextest-spenso>
  207. 18.49 s gammaloop-nextest-spenso> error: test run failed
  208. 18.51 s gammaloop-nextest-spenso>
  209. 18.51 s gammaloop-nextest-spenso> ========== nextest test summary ==========
  210. 18.51 s gammaloop-nextest-spenso> report: target/nextest/ci_gammaloop/junit.xml
  211. 18.51 s gammaloop-nextest-spenso> tests: 224, failures: 2, errors: 0
  212. 18.51 s gammaloop-nextest-spenso>
  213. 18.51 s gammaloop-nextest-spenso> 1. idenso::color::test::form_reference::metric_contraction_respects_antisymmetric_normalization
  214. 18.51 s gammaloop-nextest-spenso> failure: test failure with exit code 101
  215. 18.51 s gammaloop-nextest-spenso> thread 'color::test::form_reference::metric_contraction_respects_antisymmetric_normalization' (332) panicked at crates/idenso/src/color/test/form_reference.rs:171:5:
  216. 18.51 s gammaloop-nextest-spenso> assertion `left == right` failed
  217. 18.51 s gammaloop-nextest-spenso> left: "-1*f(coad(8,standalone_metric_j),coad(8,standalone_metric_s),coad(8,standalone_metric_u))"
  218. 18.51 s gammaloop-nextest-spenso> right: "f(coad(8,standalone_metric_j),coad(8,standalone_metric_s),coad(8,standalone_metric_u))"
  219. 18.51 s gammaloop-nextest-spenso> stack backtrace:
  220. 18.51 s gammaloop-nextest-spenso> 0: __rustc::rust_begin_unwind
  221. 18.51 s gammaloop-nextest-spenso> 1: core::panicking::panic_fmt
  222. 18.51 s gammaloop-nextest-spenso> 2: core::panicking::assert_failed_inner
  223. 18.51 s gammaloop-nextest-spenso> 3: core::panicking::assert_failed::<alloc::string::String, alloc::string::String>
  224. 18.51 s gammaloop-nextest-spenso> 4: idenso::color::test::form_reference::metric_contraction_respects_antisymmetric_normalization
  225. 18.51 s gammaloop-nextest-spenso> 5: <idenso::color::test::form_reference::metric_contraction_respects_antisymmetric_normalization::{closure#0} as core::ops::function::FnOnce<()>>::call_once
  226. 18.51 s gammaloop-nextest-spenso> note: Some details are omitted, run with `RUST_BACKTRACE=full` for a verbose backtrace.
  227. 18.51 s gammaloop-nextest-spenso> system-out
  228. 18.51 s gammaloop-nextest-spenso> running 1 test
  229. 18.51 s gammaloop-nextest-spenso> test color::test::form_reference::metric_contraction_respects_antisymmetric_normalization ... FAILED
  230. 18.51 s gammaloop-nextest-spenso>
  231. 18.51 s gammaloop-nextest-spenso> failures:
  232. 18.51 s gammaloop-nextest-spenso>
  233. 18.51 s gammaloop-nextest-spenso> failures:
  234. 18.51 s gammaloop-nextest-spenso> color::test::form_reference::metric_contraction_respects_antisymmetric_normalization
  235. 18.51 s gammaloop-nextest-spenso>
  236. 18.51 s gammaloop-nextest-spenso> test result: FAILED. 0 passed; 1 failed; 0 ignored; 0 measured; 240 filtered out; finished in 0.00s
  237. 18.51 s gammaloop-nextest-spenso> system-err
  238. 18.51 s gammaloop-nextest-spenso> thread 'color::test::form_reference::metric_contraction_respects_antisymmetric_normalization' (332) panicked at crates/idenso/src/color/test/form_reference.rs:171:5:
  239. 18.51 s gammaloop-nextest-spenso> assertion `left == right` failed
  240. 18.51 s gammaloop-nextest-spenso> left: "-1*f(coad(8,standalone_metric_j),coad(8,standalone_metric_s),coad(8,standalone_metric_u))"
  241. 18.51 s gammaloop-nextest-spenso> right: "f(coad(8,standalone_metric_j),coad(8,standalone_metric_s),coad(8,standalone_metric_u))"
  242. 18.51 s gammaloop-nextest-spenso> stack backtrace:
  243. 18.51 s gammaloop-nextest-spenso> 0: __rustc::rust_begin_unwind
  244. 18.51 s gammaloop-nextest-spenso> 1: core::panicking::panic_fmt
  245. 18.51 s gammaloop-nextest-spenso> 2: core::panicking::assert_failed_inner
  246. 18.51 s gammaloop-nextest-spenso> 3: core::panicking::assert_failed::<alloc::string::String, alloc::string::String>
  247. 18.51 s gammaloop-nextest-spenso> 4: idenso::color::test::form_reference::metric_contraction_respects_antisymmetric_normalization
  248. 18.51 s gammaloop-nextest-spenso> 5: <idenso::color::test::form_reference::metric_contraction_respects_antisymmetric_normalization::{closure#0} as core::ops::function::FnOnce<()>>::call_once
  249. 18.51 s gammaloop-nextest-spenso> note: Some details are omitted, run with `RUST_BACKTRACE=full` for a verbose backtrace.
  250. 18.51 s gammaloop-nextest-spenso>
  251. 18.51 s gammaloop-nextest-spenso> 2. idenso::tensor::tests::parsing::infinite_execution
  252. 18.51 s gammaloop-nextest-spenso> failure: test failure with exit code 101
  253. 18.51 s gammaloop-nextest-spenso> thread 'tensor::tests::parsing::infinite_execution' (844) panicked at /nix/store/hvwd4qqiaadc4s871lfyylxrciqrvlgs-vendor-cargo-deps/c19b7c6f923b580ac259164a89f2577984ad5ab09ee9d583b888f934adbbe8d0/insta-1.47.2/src/runtime.rs:719:13:
  254. 18.51 s gammaloop-nextest-spenso> snapshot assertion for 'infinite_execution' failed in line 910
  255. 18.51 s gammaloop-nextest-spenso> stack backtrace:
  256. 18.51 s gammaloop-nextest-spenso> 0: __rustc::rust_begin_unwind
  257. 18.51 s gammaloop-nextest-spenso> 1: core::panicking::panic_fmt
  258. 18.51 s gammaloop-nextest-spenso> 2: insta::runtime::assert_snapshot
  259. 18.51 s gammaloop-nextest-spenso> 3: idenso::tensor::tests::parsing::infinite_execution
  260. 18.51 s gammaloop-nextest-spenso> 4: <idenso::tensor::tests::parsing::infinite_execution::{closure#0} as core::ops::function::FnOnce<()>>::call_once
  261. 18.51 s gammaloop-nextest-spenso> note: Some details are omitted, run with `RUST_BACKTRACE=full` for a verbose backtrace.
  262. 18.51 s gammaloop-nextest-spenso> system-out
  263. 18.51 s gammaloop-nextest-spenso> running 1 test
  264. 18.51 s gammaloop-nextest-spenso> ━━━━━━━━━━━━━━━━━━━━━━━━━━━━━━━ Snapshot Summary ━━━━━━━━━━━━━━━━━━━━━━━━━━━━━━━
  265. 18.51 s gammaloop-nextest-spenso> Snapshot: infinite_execution
  266. 18.51 s gammaloop-nextest-spenso> Source: crates/idenso/src/tensor/tests/parsing.rs:910
  267. 18.51 s gammaloop-nextest-spenso> ────────────────────────────────────────────────────────────────────────────────
  268. 18.51 s gammaloop-nextest-spenso> Expression: net_iter.snapshot_dot()
  269. 18.51 s gammaloop-nextest-spenso> ────────────────────────────────────────────────────────────────────────────────
  270. 18.51 s gammaloop-nextest-spenso> -old snapshot
  271. 18.51 s gammaloop-nextest-spenso> +new results
  272. 18.51 s gammaloop-nextest-spenso> ────────────┬───────────────────────────────────────────────────────────────────
  273. 18.51 s gammaloop-nextest-spenso> 8 8 │ 0:0:s-> ext0 [id=0 color="red"];
  274. 18.51 s gammaloop-nextest-spenso> 9 9 │ ext1 [style=invis];
  275. 18.51 s gammaloop-nextest-spenso> 10 10 │ 0:5:s-> ext1 [id=1 dir=none color="red" label="mink4|l_0"];
  276. 18.51 s gammaloop-nextest-spenso> 11 11 │ ext2 [style=invis];
  277. 18.51 s gammaloop-nextest-spenso> 12 │- 0:4:s-> ext2 [id=2 dir=none color="red" label="bis4|l_2"];
  278. 18.51 s gammaloop-nextest-spenso> 12 │+ 0:3:s-> ext2 [id=2 dir=none color="red" label="mink4|l_1"];
  279. 18.51 s gammaloop-nextest-spenso> 13 13 │ ext3 [style=invis];
  280. 18.51 s gammaloop-nextest-spenso> 14 │- 0:3:s-> ext3 [id=3 dir=none color="red" label="bis4|l_3"];
  281. 18.51 s gammaloop-nextest-spenso> 14 │+ 0:1:s-> ext3 [id=3 dir=none color="red" label="bis4|l_2"];
  282. 18.51 s gammaloop-nextest-spenso> 15 15 │ ext4 [style=invis];
  283. 18.51 s gammaloop-nextest-spenso> 16 │- 0:1:s-> ext4 [id=4 dir=none color="red" label="mink4|l_1"];
  284. 18.51 s gammaloop-nextest-spenso> 16 │+ 0:2:s-> ext4 [id=4 dir=none color="red" label="mink4|l_4"];
  285. 18.51 s gammaloop-nextest-spenso> 17 17 │ ext5 [style=invis];
  286. 18.51 s gammaloop-nextest-spenso> 18 │- 0:2:s-> ext5 [id=5 dir=none color="red" label="mink4|l_4"];
  287. 18.51 s gammaloop-nextest-spenso> 18 │+ 0:4:s-> ext5 [id=5 dir=none color="red" label="bis4|l_3"];
  288. 18.51 s gammaloop-nextest-spenso> 19 19 │ }
  289. 18.51 s gammaloop-nextest-spenso> ────────────┴───────────────────────────────────────────────────────────────────
  290. 18.51 s gammaloop-nextest-spenso> To update snapshots run `cargo insta review`
  291. 18.51 s gammaloop-nextest-spenso> Stopped on the first failure. Run `cargo insta test` to run all snapshots.
  292. 18.51 s gammaloop-nextest-spenso> test tensor::tests::parsing::infinite_execution ... FAILED
  293. 18.51 s gammaloop-nextest-spenso>
  294. 18.51 s gammaloop-nextest-spenso> failures:
  295. 18.51 s gammaloop-nextest-spenso>
  296. 18.51 s gammaloop-nextest-spenso> failures:
  297. 18.51 s gammaloop-nextest-spenso> tensor::tests::parsing::infinite_execution
  298. 18.51 s gammaloop-nextest-spenso>
  299. 18.51 s gammaloop-nextest-spenso> test result: FAILED. 0 passed; 1 failed; 0 ignored; 0 measured; 240 filtered out; finished in 0.03s
  300. 18.51 s gammaloop-nextest-spenso> system-err
  301. 18.51 s gammaloop-nextest-spenso> thread 'tensor::tests::parsing::infinite_execution' (844) panicked at /nix/store/hvwd4qqiaadc4s871lfyylxrciqrvlgs-vendor-cargo-deps/c19b7c6f923b580ac259164a89f2577984ad5ab09ee9d583b888f934adbbe8d0/insta-1.47.2/src/runtime.rs:719:13:
  302. 18.51 s gammaloop-nextest-spenso> snapshot assertion for 'infinite_execution' failed in line 910
  303. 18.51 s gammaloop-nextest-spenso> stack backtrace:
  304. 18.51 s gammaloop-nextest-spenso> 0: __rustc::rust_begin_unwind
  305. 18.51 s gammaloop-nextest-spenso> 1: core::panicking::panic_fmt
  306. 18.51 s gammaloop-nextest-spenso> 2: insta::runtime::assert_snapshot
  307. 18.51 s gammaloop-nextest-spenso> 3: idenso::tensor::tests::parsing::infinite_execution
  308. 18.51 s gammaloop-nextest-spenso> 4: <idenso::tensor::tests::parsing::infinite_execution::{closure#0} as core::ops::function::FnOnce<()>>::call_once
  309. 18.51 s gammaloop-nextest-spenso> note: Some details are omitted, run with `RUST_BACKTRACE=full` for a verbose backtrace.
  310. 18.51 s gammaloop-nextest-spenso> =========================================
  311. 18.52 s gammaloop-nextest-spenso> Extracting 2 binaries and 1 linked path to /build/nextest-archive-kFvG9S
  312. 18.59 s gammaloop-nextest-spenso> Extracted 8 files to /build/nextest-archive-kFvG9S in 0.07s
  313. 18.60 s gammaloop-nextest-spenso> ------------
  314. 18.60 s gammaloop-nextest-spenso> Nextest run ID eff65e6d-753c-4d70-8132-adad6209fb3f with nextest profile: ci_gammaloop
  315. 18.60 s gammaloop-nextest-spenso> Starting 135 tests across 2 binaries
  316. 18.67 s gammaloop-nextest-spenso> ------------
  317. 18.67 s gammaloop-nextest-spenso> Summary [ 0.075s] 135 tests run: 135 passed, 0 skipped
  318. 18.71 s gammaloop-nextest-spenso>
  319. 18.71 s gammaloop-nextest-spenso> ========== nextest test summary ==========
  320. 18.71 s gammaloop-nextest-spenso> report: target/nextest/ci_gammaloop/junit.xml
  321. 18.71 s gammaloop-nextest-spenso> tests: 135, failures: 0, errors: 0
  322. 18.71 s gammaloop-nextest-spenso> No failing testcases found.
  323. 18.71 s gammaloop-nextest-spenso> =========================================
  324. 18.73 s gammaloop-nextest-spenso> Extracting 5 binaries and 2 linked paths to /build/nextest-archive-BNOYfV
  325. 18.91 s gammaloop-nextest-spenso> Extracted 19 files to /build/nextest-archive-BNOYfV in 0.19s
  326. 18.92 s gammaloop-nextest-spenso> ------------
  327. 18.92 s gammaloop-nextest-spenso> Nextest run ID c18047dc-7b02-4b7a-be23-818613f8620b with nextest profile: ci_gammaloop
  328. 18.92 s gammaloop-nextest-spenso> Starting 25 tests across 5 binaries (1 test skipped via profile.ci_gammaloop.default-filter)
  329. 19.10 s gammaloop-nextest-spenso> ------------
  330. 19.10 s gammaloop-nextest-spenso> Summary [ 0.183s] 25 tests run: 25 passed, 1 skipped
  331. 19.16 s gammaloop-nextest-spenso>
  332. 19.16 s gammaloop-nextest-spenso> ========== nextest test summary ==========
  333. 19.16 s gammaloop-nextest-spenso> report: target/nextest/ci_gammaloop/junit.xml
  334. 19.16 s gammaloop-nextest-spenso> tests: 25, failures: 0, errors: 0
  335. 19.16 s gammaloop-nextest-spenso> No failing testcases found.
  336. 19.16 s gammaloop-nextest-spenso> =========================================
  337. 19.17 s gammaloop-nextest-spenso> Extracting 2 binaries and 1 linked path to /build/nextest-archive-NcUfmU
  338. 19.22 s gammaloop-nextest-spenso> Extracted 8 files to /build/nextest-archive-NcUfmU in 0.05s
  339. 19.23 s gammaloop-nextest-spenso> ------------
  340. 19.23 s gammaloop-nextest-spenso> Nextest run ID 1c3843c7-25f7-4f9b-acde-12bac725f895 with nextest profile: ci_gammaloop
  341. 19.23 s gammaloop-nextest-spenso> Starting 1 test across 2 binaries
  342. 19.23 s gammaloop-nextest-spenso> ------------
  343. 19.23 s gammaloop-nextest-spenso> Summary [ 0.005s] 1 test run: 1 passed, 0 skipped
  344. 19.26 s gammaloop-nextest-spenso>
  345. 19.26 s gammaloop-nextest-spenso> ========== nextest test summary ==========
  346. 19.26 s gammaloop-nextest-spenso> report: target/nextest/ci_gammaloop/junit.xml
  347. 19.26 s gammaloop-nextest-spenso> tests: 1, failures: 0, errors: 0
  348. 19.26 s gammaloop-nextest-spenso> No failing testcases found.
  349. 19.26 s gammaloop-nextest-spenso> =========================================
  350. 19.27 s gammaloop-nextest-spenso> Extracting 1 binary and 1 linked path to /build/nextest-archive-k68jjU
  351. 19.32 s gammaloop-nextest-spenso> Extracted 7 files to /build/nextest-archive-k68jjU in 0.05s
  352. 19.33 s gammaloop-nextest-spenso> ------------
  353. 19.33 s gammaloop-nextest-spenso> Nextest run ID 81856b5c-44fe-4e37-8ca9-316297d5e665 with nextest profile: ci_gammaloop
  354. 19.33 s gammaloop-nextest-spenso> Starting 0 tests across 1 binary
  355. 19.33 s gammaloop-nextest-spenso> ------------
  356. 19.33 s gammaloop-nextest-spenso> Summary [ 0.000s] 0 tests run: 0 passed, 0 skipped
  357. 19.36 s gammaloop-nextest-spenso>
  358. 19.36 s gammaloop-nextest-spenso> ========== nextest test summary ==========
  359. 19.36 s gammaloop-nextest-spenso> report: target/nextest/ci_gammaloop/junit.xml
  360. 19.36 s gammaloop-nextest-spenso> tests: 0, failures: 0, errors: 0
  361. 19.36 s gammaloop-nextest-spenso> No failing testcases found.
  362. 19.36 s gammaloop-nextest-spenso> =========================================
  363. 19.39 s error: Cannot build '/nix/store/f7dlapwy00q35hpz63fxwqijy6397ql2-gammaloop-nextest-spenso.drv'.
  364. 19.39 s Reason: builder failed with exit code 100.
  365. 19.39 s Output paths:
  366. 19.39 s /nix/store/n4ly992ql65w80b8anh5nb2sbxg5pdzw-gammaloop-nextest-spenso
  367. 19.39 s Last 325 log lines:
  368. 19.39 s > Extracting 5 binaries and 2 linked paths to /build/nextest-archive-pPYx73
  369. 19.39 s > Extracted 19 files to /build/nextest-archive-pPYx73 in 0.16s
  370. 19.39 s > ------------
  371. 19.39 s > Nextest run ID b716e426-055b-44e6-bd22-7e2ee0adb6d6 with nextest profile: ci_gammaloop
  372. 19.39 s > Starting 224 tests across 5 binaries (26 tests skipped, including 2 tests via profile.ci_gammaloop.default-filter)
  373. 19.39 s > FAIL [ 0.012s] ( 44/224) idenso color::test::form_reference::metric_contraction_respects_antisymmetric_normalization
  374. 19.39 s > stdout ---
  375. 19.39 s >
  376. 19.39 s > running 1 test
  377. 19.39 s > test color::test::form_reference::metric_contraction_respects_antisymmetric_normalization ... FAILED
  378. 19.39 s >
  379. 19.39 s > failures:
  380. 19.39 s >
  381. 19.39 s > failures:
  382. 19.39 s > color::test::form_reference::metric_contraction_respects_antisymmetric_normalization
  383. 19.39 s >
  384. 19.39 s > test result: FAILED. 0 passed; 1 failed; 0 ignored; 0 measured; 240 filtered out; finished in 0.00s
  385. 19.39 s >
  386. 19.39 s > stderr ---
  387. 19.39 s >
  388. 19.39 s > thread 'color::test::form_reference::metric_contraction_respects_antisymmetric_normalization' (332) panicked at crates/idenso/src/color/test/form_reference.rs:171:5:
  389. 19.39 s > assertion `left == right` failed
  390. 19.39 s > left: "-1*f(coad(8,standalone_metric_j),coad(8,standalone_metric_s),coad(8,standalone_metric_u))"
  391. 19.39 s > right: "f(coad(8,standalone_metric_j),coad(8,standalone_metric_s),coad(8,standalone_metric_u))"
  392. 19.39 s > stack backtrace:
  393. 19.39 s > 0: __rustc::rust_begin_unwind
  394. 19.39 s > 1: core::panicking::panic_fmt
  395. 19.39 s > 2: core::panicking::assert_failed_inner
  396. 19.39 s > 3: core::panicking::assert_failed::<alloc::string::String, alloc::string::String>
  397. 19.39 s > 4: idenso::color::test::form_reference::metric_contraction_respects_antisymmetric_normalization
  398. 19.39 s > 5: <idenso::color::test::form_reference::metric_contraction_respects_antisymmetric_normalization::{closure#0} as core::ops::function::FnOnce<()>>::call_once
  399. 19.39 s > note: Some details are omitted, run with `RUST_BACKTRACE=full` for a verbose backtrace.
  400. 19.39 s >
  401. 19.39 s > FAIL [ 0.038s] (220/224) idenso tensor::tests::parsing::infinite_execution
  402. 19.39 s > stdout ---
  403. 19.39 s >
  404. 19.39 s > running 1 test
  405. 19.39 s > ━━━━━━━━━━━━━━━━━━━━━━━━━━━━━━━ Snapshot Summary ━━━━━━━━━━━━━━━━━━━━━━━━━━━━━━━
  406. 19.39 s > Snapshot: infinite_execution
  407. 19.39 s > Source: crates/idenso/src/tensor/tests/parsing.rs:910
  408. 19.39 s > ────────────────────────────────────────────────────────────────────────────────
  409. 19.39 s > Expression: net_iter.snapshot_dot()
  410. 19.39 s > ────────────────────────────────────────────────────────────────────────────────
  411. 19.39 s > -old snapshot
  412. 19.39 s > +new results
  413. 19.39 s > ────────────┬───────────────────────────────────────────────────────────────────
  414. 19.39 s > 8 8 │ 0:0:s -> ext0 [id=0 color="red"];
  415. 19.39 s > 9 9 │ ext1 [style=invis];
  416. 19.39 s > 10 10 │ 0:5:s -> ext1 [id=1 dir=none color="red" label="mink4|l_0"];
  417. 19.39 s > 11 11 │ ext2 [style=invis];
  418. 19.39 s > 12 │- 0:4:s -> ext2 [id=2 dir=none color="red" label="bis4|l_2"];
  419. 19.39 s > 12 │+ 0:3:s -> ext2 [id=2 dir=none color="red" label="mink4|l_1"];
  420. 19.39 s > 13 13 │ ext3 [style=invis];
  421. 19.39 s > 14 │- 0:3:s -> ext3 [id=3 dir=none color="red" label="bis4|l_3"];
  422. 19.39 s > 14 │+ 0:1:s -> ext3 [id=3 dir=none color="red" label="bis4|l_2"];
  423. 19.39 s > 15 15 │ ext4 [style=invis];
  424. 19.39 s > 16 │- 0:1:s -> ext4 [id=4 dir=none color="red" label="mink4|l_1"];
  425. 19.39 s > 16 │+ 0:2:s -> ext4 [id=4 dir=none color="red" label="mink4|l_4"];
  426. 19.39 s > 17 17 │ ext5 [style=invis];
  427. 19.39 s > 18 │- 0:2:s -> ext5 [id=5 dir=none color="red" label="mink4|l_4"];
  428. 19.39 s > 18 │+ 0:4:s -> ext5 [id=5 dir=none color="red" label="bis4|l_3"];
  429. 19.39 s > 19 19 │ }
  430. 19.39 s > ────────────┴───────────────────────────────────────────────────────────────────
  431. 19.39 s > To update snapshots run `cargo insta review`
  432. 19.39 s > Stopped on the first failure. Run `cargo insta test` to run all snapshots.
  433. 19.39 s > test tensor::tests::parsing::infinite_execution ... FAILED
  434. 19.39 s >
  435. 19.39 s > failures:
  436. 19.39 s >
  437. 19.39 s > failures:
  438. 19.39 s > tensor::tests::parsing::infinite_execution
  439. 19.39 s >
  440. 19.39 s > test result: FAILED. 0 passed; 1 failed; 0 ignored; 0 measured; 240 filtered out; finished in 0.03s
  441. 19.39 s >
  442. 19.39 s > stderr ---
  443. 19.39 s >
  444. 19.39 s > thread 'tensor::tests::parsing::infinite_execution' (844) panicked at /nix/store/hvwd4qqiaadc4s871lfyylxrciqrvlgs-vendor-cargo-deps/c19b7c6f923b580ac259164a89f2577984ad5ab09ee9d583b888f934adbbe8d0/insta-1.47.2/src/runtime.rs:719:13:
  445. 19.39 s > snapshot assertion for 'infinite_execution' failed in line 910
  446. 19.39 s > stack backtrace:
  447. 19.39 s > 0: __rustc::rust_begin_unwind
  448. 19.39 s > 1: core::panicking::panic_fmt
  449. 19.39 s > 2: insta::runtime::assert_snapshot
  450. 19.39 s > 3: idenso::tensor::tests::parsing::infinite_execution
  451. 19.39 s > 4: <idenso::tensor::tests::parsing::infinite_execution::{closure#0} as core::ops::function::FnOnce<()>>::call_once
  452. 19.39 s > note: Some details are omitted, run with `RUST_BACKTRACE=full` for a verbose backtrace.
  453. 19.39 s >
  454. 19.39 s > ------------
  455. 19.39 s > Summary [ 1.532s] 224 tests run: 222 passed, 2 failed, 26 skipped
  456. 19.39 s > FAIL [ 0.012s] ( 44/224) idenso color::test::form_reference::metric_contraction_respects_antisymmetric_normalization
  457. 19.39 s > stdout ---
  458. 19.39 s >
  459. 19.39 s > running 1 test
  460. 19.39 s > test color::test::form_reference::metric_contraction_respects_antisymmetric_normalization ... FAILED
  461. 19.39 s >
  462. 19.39 s > failures:
  463. 19.39 s >
  464. 19.39 s > failures:
  465. 19.39 s > color::test::form_reference::metric_contraction_respects_antisymmetric_normalization
  466. 19.39 s >
  467. 19.39 s > test result: FAILED. 0 passed; 1 failed; 0 ignored; 0 measured; 240 filtered out; finished in 0.00s
  468. 19.39 s >
  469. 19.39 s > stderr ---
  470. 19.39 s >
  471. 19.39 s > thread 'color::test::form_reference::metric_contraction_respects_antisymmetric_normalization' (332) panicked at crates/idenso/src/color/test/form_reference.rs:171:5:
  472. 19.39 s > assertion `left == right` failed
  473. 19.39 s > left: "-1*f(coad(8,standalone_metric_j),coad(8,standalone_metric_s),coad(8,standalone_metric_u))"
  474. 19.39 s > right: "f(coad(8,standalone_metric_j),coad(8,standalone_metric_s),coad(8,standalone_metric_u))"
  475. 19.39 s > stack backtrace:
  476. 19.39 s > 0: __rustc::rust_begin_unwind
  477. 19.39 s > 1: core::panicking::panic_fmt
  478. 19.39 s > 2: core::panicking::assert_failed_inner
  479. 19.39 s > 3: core::panicking::assert_failed::<alloc::string::String, alloc::string::String>
  480. 19.39 s > 4: idenso::color::test::form_reference::metric_contraction_respects_antisymmetric_normalization
  481. 19.39 s > 5: <idenso::color::test::form_reference::metric_contraction_respects_antisymmetric_normalization::{closure#0} as core::ops::function::FnOnce<()>>::call_once
  482. 19.39 s > note: Some details are omitted, run with `RUST_BACKTRACE=full` for a verbose backtrace.
  483. 19.39 s >
  484. 19.39 s > FAIL [ 0.038s] (220/224) idenso tensor::tests::parsing::infinite_execution
  485. 19.39 s > stdout ---
  486. 19.39 s >
  487. 19.39 s > running 1 test
  488. 19.39 s > ━━━━━━━━━━━━━━━━━━━━━━━━━━━━━━━ Snapshot Summary ━━━━━━━━━━━━━━━━━━━━━━━━━━━━━━━
  489. 19.39 s > Snapshot: infinite_execution
  490. 19.39 s > Source: crates/idenso/src/tensor/tests/parsing.rs:910
  491. 19.39 s > ────────────────────────────────────────────────────────────────────────────────
  492. 19.39 s > Expression: net_iter.snapshot_dot()
  493. 19.39 s > ────────────────────────────────────────────────────────────────────────────────
  494. 19.39 s > -old snapshot
  495. 19.39 s > +new results
  496. 19.39 s > ────────────┬───────────────────────────────────────────────────────────────────
  497. 19.39 s > 8 8 │ 0:0:s -> ext0 [id=0 color="red"];
  498. 19.39 s > 9 9 │ ext1 [style=invis];
  499. 19.39 s > 10 10 │ 0:5:s -> ext1 [id=1 dir=none color="red" label="mink4|l_0"];
  500. 19.39 s > 11 11 │ ext2 [style=invis];
  501. 19.39 s > 12 │- 0:4:s -> ext2 [id=2 dir=none color="red" label="bis4|l_2"];
  502. 19.39 s > 12 │+ 0:3:s -> ext2 [id=2 dir=none color="red" label="mink4|l_1"];
  503. 19.39 s > 13 13 │ ext3 [style=invis];
  504. 19.39 s > 14 │- 0:3:s -> ext3 [id=3 dir=none color="red" label="bis4|l_3"];
  505. 19.39 s > 14 │+ 0:1:s -> ext3 [id=3 dir=none color="red" label="bis4|l_2"];
  506. 19.39 s > 15 15 │ ext4 [style=invis];
  507. 19.39 s > 16 │- 0:1:s -> ext4 [id=4 dir=none color="red" label="mink4|l_1"];
  508. 19.39 s > 16 │+ 0:2:s -> ext4 [id=4 dir=none color="red" label="mink4|l_4"];
  509. 19.39 s > 17 17 │ ext5 [style=invis];
  510. 19.39 s > 18 │- 0:2:s -> ext5 [id=5 dir=none color="red" label="mink4|l_4"];
  511. 19.39 s > 18 │+ 0:4:s -> ext5 [id=5 dir=none color="red" label="bis4|l_3"];
  512. 19.39 s > 19 19 │ }
  513. 19.39 s > ────────────┴───────────────────────────────────────────────────────────────────
  514. 19.39 s > To update snapshots run `cargo insta review`
  515. 19.39 s > Stopped on the first failure. Run `cargo insta test` to run all snapshots.
  516. 19.39 s > test tensor::tests::parsing::infinite_execution ... FAILED
  517. 19.39 s >
  518. 19.39 s > failures:
  519. 19.39 s >
  520. 19.39 s > failures:
  521. 19.39 s > tensor::tests::parsing::infinite_execution
  522. 19.39 s >
  523. 19.39 s > test result: FAILED. 0 passed; 1 failed; 0 ignored; 0 measured; 240 filtered out; finished in 0.03s
  524. 19.39 s >
  525. 19.39 s > stderr ---
  526. 19.39 s >
  527. 19.39 s > thread 'tensor::tests::parsing::infinite_execution' (844) panicked at /nix/store/hvwd4qqiaadc4s871lfyylxrciqrvlgs-vendor-cargo-deps/c19b7c6f923b580ac259164a89f2577984ad5ab09ee9d583b888f934adbbe8d0/insta-1.47.2/src/runtime.rs:719:13:
  528. 19.39 s > snapshot assertion for 'infinite_execution' failed in line 910
  529. 19.39 s > stack backtrace:
  530. 19.39 s > 0: __rustc::rust_begin_unwind
  531. 19.39 s > 1: core::panicking::panic_fmt
  532. 19.39 s > 2: insta::runtime::assert_snapshot
  533. 19.39 s > 3: idenso::tensor::tests::parsing::infinite_execution
  534. 19.39 s > 4: <idenso::tensor::tests::parsing::infinite_execution::{closure#0} as core::ops::function::FnOnce<()>>::call_once
  535. 19.39 s > note: Some details are omitted, run with `RUST_BACKTRACE=full` for a verbose backtrace.
  536. 19.39 s >
  537. 19.39 s > error: test run failed
  538. 19.39 s >
  539. 19.39 s > ========== nextest test summary ==========
  540. 19.39 s > report: target/nextest/ci_gammaloop/junit.xml
  541. 19.39 s > tests: 224, failures: 2, errors: 0
  542. 19.39 s >
  543. 19.39 s > 1. idenso::color::test::form_reference::metric_contraction_respects_antisymmetric_normalization
  544. 19.39 s > failure: test failure with exit code 101
  545. 19.39 s > thread 'color::test::form_reference::metric_contraction_respects_antisymmetric_normalization' (332) panicked at crates/idenso/src/color/test/form_reference.rs:171:5:
  546. 19.39 s > assertion `left == right` failed
  547. 19.39 s > left: "-1*f(coad(8,standalone_metric_j),coad(8,standalone_metric_s),coad(8,standalone_metric_u))"
  548. 19.39 s > right: "f(coad(8,standalone_metric_j),coad(8,standalone_metric_s),coad(8,standalone_metric_u))"
  549. 19.39 s > stack backtrace:
  550. 19.39 s > 0: __rustc::rust_begin_unwind
  551. 19.39 s > 1: core::panicking::panic_fmt
  552. 19.39 s > 2: core::panicking::assert_failed_inner
  553. 19.39 s > 3: core::panicking::assert_failed::<alloc::string::String, alloc::string::String>
  554. 19.39 s > 4: idenso::color::test::form_reference::metric_contraction_respects_antisymmetric_normalization
  555. 19.39 s > 5: <idenso::color::test::form_reference::metric_contraction_respects_antisymmetric_normalization::{closure#0} as core::ops::function::FnOnce<()>>::call_once
  556. 19.39 s > note: Some details are omitted, run with `RUST_BACKTRACE=full` for a verbose backtrace.
  557. 19.39 s > system-out
  558. 19.39 s > running 1 test
  559. 19.39 s > test color::test::form_reference::metric_contraction_respects_antisymmetric_normalization ... FAILED
  560. 19.39 s >
  561. 19.39 s > failures:
  562. 19.39 s >
  563. 19.39 s > failures:
  564. 19.39 s > color::test::form_reference::metric_contraction_respects_antisymmetric_normalization
  565. 19.39 s >
  566. 19.39 s > test result: FAILED. 0 passed; 1 failed; 0 ignored; 0 measured; 240 filtered out; finished in 0.00s
  567. 19.39 s > system-err
  568. 19.39 s > thread 'color::test::form_reference::metric_contraction_respects_antisymmetric_normalization' (332) panicked at crates/idenso/src/color/test/form_reference.rs:171:5:
  569. 19.39 s > assertion `left == right` failed
  570. 19.39 s > left: "-1*f(coad(8,standalone_metric_j),coad(8,standalone_metric_s),coad(8,standalone_metric_u))"
  571. 19.39 s > right: "f(coad(8,standalone_metric_j),coad(8,standalone_metric_s),coad(8,standalone_metric_u))"
  572. 19.39 s > stack backtrace:
  573. 19.39 s > 0: __rustc::rust_begin_unwind
  574. 19.39 s > 1: core::panicking::panic_fmt
  575. 19.39 s > 2: core::panicking::assert_failed_inner
  576. 19.39 s > 3: core::panicking::assert_failed::<alloc::string::String, alloc::string::String>
  577. 19.39 s > 4: idenso::color::test::form_reference::metric_contraction_respects_antisymmetric_normalization
  578. 19.39 s > 5: <idenso::color::test::form_reference::metric_contraction_respects_antisymmetric_normalization::{closure#0} as core::ops::function::FnOnce<()>>::call_once
  579. 19.39 s > note: Some details are omitted, run with `RUST_BACKTRACE=full` for a verbose backtrace.
  580. 19.39 s >
  581. 19.39 s > 2. idenso::tensor::tests::parsing::infinite_execution
  582. 19.39 s > failure: test failure with exit code 101
  583. 19.39 s > thread 'tensor::tests::parsing::infinite_execution' (844) panicked at /nix/store/hvwd4qqiaadc4s871lfyylxrciqrvlgs-vendor-cargo-deps/c19b7c6f923b580ac259164a89f2577984ad5ab09ee9d583b888f934adbbe8d0/insta-1.47.2/src/runtime.rs:719:13:
  584. 19.39 s > snapshot assertion for 'infinite_execution' failed in line 910
  585. 19.39 s > stack backtrace:
  586. 19.39 s > 0: __rustc::rust_begin_unwind
  587. 19.39 s > 1: core::panicking::panic_fmt
  588. 19.39 s > 2: insta::runtime::assert_snapshot
  589. 19.39 s > 3: idenso::tensor::tests::parsing::infinite_execution
  590. 19.39 s > 4: <idenso::tensor::tests::parsing::infinite_execution::{closure#0} as core::ops::function::FnOnce<()>>::call_once
  591. 19.39 s > note: Some details are omitted, run with `RUST_BACKTRACE=full` for a verbose backtrace.
  592. 19.39 s > system-out
  593. 19.39 s > running 1 test
  594. 19.39 s > ━━━━━━━━━━━━━━━━━━━━━━━━━━━━━━━ Snapshot Summary ━━━━━━━━━━━━━━━━━━━━━━━━━━━━━━━
  595. 19.39 s > Snapshot: infinite_execution
  596. 19.39 s > Source: crates/idenso/src/tensor/tests/parsing.rs:910
  597. 19.39 s > ────────────────────────────────────────────────────────────────────────────────
  598. 19.39 s > Expression: net_iter.snapshot_dot()
  599. 19.39 s > ────────────────────────────────────────────────────────────────────────────────
  600. 19.39 s > -old snapshot
  601. 19.39 s > +new results
  602. 19.39 s > ────────────┬───────────────────────────────────────────────────────────────────
  603. 19.39 s > 8 8 │ 0:0:s-> ext0 [id=0 color="red"];
  604. 19.39 s > 9 9 │ ext1 [style=invis];
  605. 19.39 s > 10 10 │ 0:5:s-> ext1 [id=1 dir=none color="red" label="mink4|l_0"];
  606. 19.39 s > 11 11 │ ext2 [style=invis];
  607. 19.39 s > 12 │- 0:4:s-> ext2 [id=2 dir=none color="red" label="bis4|l_2"];
  608. 19.39 s > 12 │+ 0:3:s-> ext2 [id=2 dir=none color="red" label="mink4|l_1"];
  609. 19.39 s > 13 13 │ ext3 [style=invis];
  610. 19.39 s > 14 │- 0:3:s-> ext3 [id=3 dir=none color="red" label="bis4|l_3"];
  611. 19.39 s > 14 │+ 0:1:s-> ext3 [id=3 dir=none color="red" label="bis4|l_2"];
  612. 19.39 s > 15 15 │ ext4 [style=invis];
  613. 19.39 s > 16 │- 0:1:s-> ext4 [id=4 dir=none color="red" label="mink4|l_1"];
  614. 19.39 s > 16 │+ 0:2:s-> ext4 [id=4 dir=none color="red" label="mink4|l_4"];
  615. 19.39 s > 17 17 │ ext5 [style=invis];
  616. 19.39 s > 18 │- 0:2:s-> ext5 [id=5 dir=none color="red" label="mink4|l_4"];
  617. 19.39 s > 18 │+ 0:4:s-> ext5 [id=5 dir=none color="red" label="bis4|l_3"];
  618. 19.39 s > 19 19 │ }
  619. 19.39 s > ────────────┴───────────────────────────────────────────────────────────────────
  620. 19.39 s > To update snapshots run `cargo insta review`
  621. 19.39 s > Stopped on the first failure. Run `cargo insta test` to run all snapshots.
  622. 19.39 s > test tensor::tests::parsing::infinite_execution ... FAILED
  623. 19.39 s >
  624. 19.39 s > failures:
  625. 19.39 s >
  626. 19.39 s > failures:
  627. 19.39 s > tensor::tests::parsing::infinite_execution
  628. 19.39 s >
  629. 19.39 s > test result: FAILED. 0 passed; 1 failed; 0 ignored; 0 measured; 240 filtered out; finished in 0.03s
  630. 19.39 s > system-err
  631. 19.39 s > thread 'tensor::tests::parsing::infinite_execution' (844) panicked at /nix/store/hvwd4qqiaadc4s871lfyylxrciqrvlgs-vendor-cargo-deps/c19b7c6f923b580ac259164a89f2577984ad5ab09ee9d583b888f934adbbe8d0/insta-1.47.2/src/runtime.rs:719:13:
  632. 19.39 s > snapshot assertion for 'infinite_execution' failed in line 910
  633. 19.39 s > stack backtrace:
  634. 19.39 s > 0: __rustc::rust_begin_unwind
  635. 19.39 s > 1: core::panicking::panic_fmt
  636. 19.39 s > 2: insta::runtime::assert_snapshot
  637. 19.39 s > 3: idenso::tensor::tests::parsing::infinite_execution
  638. 19.39 s > 4: <idenso::tensor::tests::parsing::infinite_execution::{closure#0} as core::ops::function::FnOnce<()>>::call_once
  639. 19.39 s > note: Some details are omitted, run with `RUST_BACKTRACE=full` for a verbose backtrace.
  640. 19.39 s > =========================================
  641. 19.39 s > Extracting 2 binaries and 1 linked path to /build/nextest-archive-kFvG9S
  642. 19.39 s > Extracted 8 files to /build/nextest-archive-kFvG9S in 0.07s
  643. 19.39 s > ------------
  644. 19.39 s > Nextest run ID eff65e6d-753c-4d70-8132-adad6209fb3f with nextest profile: ci_gammaloop
  645. 19.39 s > Starting 135 tests across 2 binaries
  646. 19.39 s > ------------
  647. 19.39 s > Summary [ 0.075s] 135 tests run: 135 passed, 0 skipped
  648. 19.39 s >
  649. 19.39 s > ========== nextest test summary ==========
  650. 19.39 s > report: target/nextest/ci_gammaloop/junit.xml
  651. 19.39 s > tests: 135, failures: 0, errors: 0
  652. 19.39 s > No failing testcases found.
  653. 19.39 s > =========================================
  654. 19.39 s > Extracting 5 binaries and 2 linked paths to /build/nextest-archive-BNOYfV
  655. 19.39 s > Extracted 19 files to /build/nextest-archive-BNOYfV in 0.19s
  656. 19.39 s > ------------
  657. 19.39 s > Nextest run ID c18047dc-7b02-4b7a-be23-818613f8620b with nextest profile: ci_gammaloop
  658. 19.39 s > Starting 25 tests across 5 binaries (1 test skipped via profile.ci_gammaloop.default-filter)
  659. 19.39 s > ------------
  660. 19.39 s > Summary [ 0.183s] 25 tests run: 25 passed, 1 skipped
  661. 19.39 s >
  662. 19.39 s > ========== nextest test summary ==========
  663. 19.39 s > report: target/nextest/ci_gammaloop/junit.xml
  664. 19.39 s > tests: 25, failures: 0, errors: 0
  665. 19.39 s > No failing testcases found.
  666. 19.39 s > =========================================
  667. 19.39 s > Extracting 2 binaries and 1 linked path to /build/nextest-archive-NcUfmU
  668. 19.39 s > Extracted 8 files to /build/nextest-archive-NcUfmU in 0.05s
  669. 19.39 s > ------------
  670. 19.39 s > Nextest run ID 1c3843c7-25f7-4f9b-acde-12bac725f895 with nextest profile: ci_gammaloop
  671. 19.39 s > Starting 1 test across 2 binaries
  672. 19.39 s > ------------
  673. 19.39 s > Summary [ 0.005s] 1 test run: 1 passed, 0 skipped
  674. 19.39 s >
  675. 19.39 s > ========== nextest test summary ==========
  676. 19.39 s > report: target/nextest/ci_gammaloop/junit.xml
  677. 19.39 s > tests: 1, failures: 0, errors: 0
  678. 19.39 s > No failing testcases found.
  679. 19.39 s > =========================================
  680. 19.39 s > Extracting 1 binary and 1 linked path to /build/nextest-archive-k68jjU
  681. 19.39 s > Extracted 7 files to /build/nextest-archive-k68jjU in 0.05s
  682. 19.39 s > ------------
  683. 19.39 s > Nextest run ID 81856b5c-44fe-4e37-8ca9-316297d5e665 with nextest profile: ci_gammaloop
  684. 19.39 s > Starting 0 tests across 1 binary
  685. 19.39 s > ------------
  686. 19.39 s > Summary [ 0.000s] 0 tests run: 0 passed, 0 skipped
  687. 19.39 s >
  688. 19.39 s > ========== nextest test summary ==========
  689. 19.39 s > report: target/nextest/ci_gammaloop/junit.xml
  690. 19.39 s > tests: 0, failures: 0, errors: 0
  691. 19.39 s > No failing testcases found.
  692. 19.39 s > =========================================
  693. 19.39 s For full logs, run:
  694. 19.39 s nix log /nix/store/f7dlapwy00q35hpz63fxwqijy6397ql2-gammaloop-nextest-spenso.drv
  695. 19.48 s [0 built (1 failed), 0.0Run failed.