test packages.x86_64-linux.nix-ci-check-gammaloop-nextest-spenso

Reproduce this run
Original Run
  1. 0.71 s $ /nix/store/9ypz3flqsrl5xl495mm8h645gadjsxi1-coreutils-9.11/bin/timeout --kill-after=15s 7200s /nix/store/23zk8sgzamrbmj1fday15szf7f2279s8-nix-2.34.7/bin/nix --extra-experimental-features nix-command --extra-experimental-features flakes flake clone git+https://github.com/alphal00p/gammaloop --dest /tmp/nix-ci-worker/stable-pwd/repo/
  2. 0.72 s Cloning into '/tmp/nix-ci-worker/stable-pwd/repo'...
  3. 1.46 s remote: Enumerating objects: 65276, done.
  4. 1.70 s remote: Counting objects: 0% (1/7927) remote: Counting objects: 1% (80/7927) remote: Counting objects: 2% (159/7927) remote: Counting objects: 3% (238/7927) remote: Counting objects: 4% (318/7927) remote: Counting objects: 5% (397/7927) remote: Counting objects: 6% (476/7927) remote: Counting objects: 7% (555/7927) remote: Counting objects: 8% (635/7927) remote: Counting objects: 9% (714/7927) remote: Counting objects: 10% (793/7927) remote: Counting objects: 11% (872/7927) remote: Counting objects: 12% (952/7927) remote: Counting objects: 13% (1031/7927) remote: Counting objects: 14% (1110/7927) remote: Counting objects: 15% (1190/7927) remote: Counting objects: 16% (1269/7927) remote: Counting objects: 17% (1348/7927) remote: Counting objects: 18% (1427/7927) remote: Counting objects: 19% (1507/7927) remote: Counting objects: 20% (1586/7927) remote: Counting objects: 21% (1665/7927) remote: Counting objects: 22% (1744/7927) remote: Counting objects: 23% (1824/7927) remote: Counting objects: 24% (1903/7927) remote: Counting objects: 25% (1982/7927) remote: Counting objects: 26% (2062/7927) remote: Counting objects: 27% (2141/7927) remote: Counting objects: 28% (2220/7927) remote: Counting objects: 29% (2299/7927) remote: Counting objects: 30% (2379/7927) remote: Counting objects: 31% (2458/7927) remote: Counting objects: 32% (2537/7927) remote: Counting objects: 33% (2616/7927) remote: Counting objects: 34% (2696/7927) remote: Counting objects: 35% (2775/7927) remote: Counting objects: 36% (2854/7927) remote: Counting objects: 37% (2933/7927) remote: Counting objects: 38% (3013/7927) remote: Counting objects: 39% (3092/7927) remote: Counting objects: 40% (3171/7927) remote: Counting objects: 41% (3251/7927) remote: Counting objects: 42% (3330/7927) remote: Counting objects: 43% (3409/7927) remote: Counting objects: 44% (3488/7927) remote: Counting objects: 45% (3568/7927) remote: Counting objects: 46% (3647/7927) remote: Counting objects: 47% (3726/7927) remote: Counting objects: 48% (3805/7927) remote: Counting objects: 49% (3885/7927) remote: Counting objects: 50% (3964/7927) remote: Counting objects: 51% (4043/7927) remote: Counting objects: 52% (4123/7927) remote: Counting objects: 53% (4202/7927) remote: Counting objects: 54% (4281/7927) remote: Counting objects: 55% (4360/7927) remote: Counting objects: 56% (4440/7927) remote: Counting objects: 57% (4519/7927) remote: Counting objects: 58% (4598/7927) remote: Counting objects: 59% (4677/7927) remote: Counting objects: 60% (4757/7927) remote: Counting objects: 61% (4836/7927) remote: Counting objects: 62% (4915/7927) remote: Counting objects: 63% (4995/7927) remote: Counting objects: 64% (5074/7927) remote: Counting objects: 65% (5153/7927) remote: Counting objects: 66% (5232/7927) remote: Counting objects: 67% (5312/7927) remote: Counting objects: 68% (5391/7927) remote: Counting objects: 69% (5470/7927) remote: Counting objects: 70% (5549/7927) remote: Counting objects: 71% (5629/7927) remote: Counting objects: 72% (5708/7927) remote: Counting objects: 73% (5787/7927) remote: Counting objects: 74% (5866/7927) remote: Counting objects: 75% (5946/7927) remote: Counting objects: 76% (6025/7927) remote: Counting objects: 77% (6104/7927) remote: Counting objects: 78% (6184/7927) remote: Counting objects: 79% (6263/7927) remote: Counting objects: 80% (6342/7927) remote: Counting objects: 81% (6421/7927) remote: Counting objects: 82% (6501/7927) remote: Counting objects: 83% (6580/7927) remote: Counting objects: 84% (6659/7927) remote: Counting objects: 85% (6738/7927) remote: Counting objects: 86% (6818/7927) remote: Counting objects: 87% (6897/7927) remote: Counting objects: 88% (6976/7927) remote: Counting objects: 89% (7056/7927) remote: Counting objects: 90% (7135/7927) remote: Counting objects: 91% (7214/7927) remote: Counting objects: 92% (7293/7927) remote: Counting objects: 93% (7373/7927) remote: Counting objects: 94% (7452/7927) remote: Counting objects: 95% (7531/7927) remote: Counting objects: 96% (7610/7927) remote: Counting objects: 97% (7690/7927) remote: Counting objects: 98% (7769/7927) remote: Counting objects: 99% (7848/7927) remote: Counting objects: 100% (7927/7927) remote: Counting objects: 100% (7927/7927), done.
  5. 3.12 s remote: Compressing objects: 0% (1/1589) remote: Compressing objects: 1% (16/1589) remote: Compressing objects: 2% (32/1589) remote: Compressing objects: 3% (48/1589) remote: Compressing objects: 4% (64/1589) remote: Compressing objects: 5% (80/1589) remote: Compressing objects: 6% (96/1589) remote: Compressing objects: 7% (112/1589) remote: Compressing objects: 8% (128/1589) remote: Compressing objects: 9% (144/1589) remote: Compressing objects: 10% (159/1589) remote: Compressing objects: 11% (175/1589) remote: Compressing objects: 12% (191/1589) remote: Compressing objects: 13% (207/1589) remote: Compressing objects: 14% (223/1589) remote: Compressing objects: 15% (239/1589) remote: Compressing objects: 15% (242/1589) remote: Compressing objects: 16% (255/1589) remote: Compressing objects: 17% (271/1589) remote: Compressing objects: 18% (287/1589) remote: Compressing objects: 19% (302/1589) remote: Compressing objects: 20% (318/1589) remote: Compressing objects: 21% (334/1589) remote: Compressing objects: 22% (350/1589) remote: Compressing objects: 23% (366/1589) remote: Compressing objects: 24% (382/1589) remote: Compressing objects: 25% (398/1589) remote: Compressing objects: 26% (414/1589) remote: Compressing objects: 27% (430/1589) remote: Compressing objects: 28% (445/1589) remote: Compressing objects: 29% (461/1589) remote: Compressing objects: 30% (477/1589) remote: Compressing objects: 31% (493/1589) remote: Compressing objects: 32% (509/1589) remote: Compressing objects: 33% (525/1589) remote: Compressing objects: 34% (541/1589) remote: Compressing objects: 35% (557/1589) remote: Compressing objects: 36% (573/1589) remote: Compressing objects: 37% (588/1589) remote: Compressing objects: 38% (604/1589) remote: Compressing objects: 39% (620/1589) remote: Compressing objects: 40% (636/1589) remote: Compressing objects: 41% (652/1589) remote: Compressing objects: 42% (668/1589) remote: Compressing objects: 43% (684/1589) remote: Compressing objects: 44% (700/1589) remote: Compressing objects: 45% (716/1589) remote: Compressing objects: 46% (731/1589) remote: Compressing objects: 47% (747/1589) remote: Compressing objects: 48% (763/1589) remote: Compressing objects: 49% (779/1589) remote: Compressing objects: 50% (795/1589) remote: Compressing objects: 51% (811/1589) remote: Compressing objects: 52% (827/1589) remote: Compressing objects: 53% (843/1589) remote: Compressing objects: 54% (859/1589) remote: Compressing objects: 55% (874/1589) remote: Compressing objects: 56% (890/1589) remote: Compressing objects: 57% (906/1589) remote: Compressing objects: 58% (922/1589) remote: Compressing objects: 59% (938/1589) remote: Compressing objects: 60% (954/1589) remote: Compressing objects: 61% (970/1589) remote: Compressing objects: 62% (986/1589) remote: Compressing objects: 63% (1002/1589) remote: Compressing objects: 64% (1017/1589) remote: Compressing objects: 65% (1033/1589) remote: Compressing objects: 66% (1049/1589) remote: Compressing objects: 67% (1065/1589) remote: Compressing objects: 68% (1081/1589) remote: Compressing objects: 69% (1097/1589) remote: Compressing objects: 70% (1113/1589) remote: Compressing objects: 71% (1129/1589) remote: Compressing objects: 72% (1145/1589) remote: Compressing objects: 73% (1160/1589) remote: Compressing objects: 74% (1176/1589) remote: Compressing objects: 75% (1192/1589) remote: Compressing objects: 76% (1208/1589) remote: Compressing objects: 77% (1224/1589) remote: Compressing objects: 78% (1240/1589) remote: Compressing objects: 79% (1256/1589) remote: Compressing objects: 80% (1272/1589) remote: Compressing objects: 81% (1288/1589) remote: Compressing objects: 82% (1303/1589) remote: Compressing objects: 83% (1319/1589) remote: Compressing objects: 84% (1335/1589) remote: Compressing objects: 85% (1351/1589) remote: Compressing objects: 86% (1367/1589) remote: Compressing objects: 87% (1383/1589) remote: Compressing objects: 88% (1399/1589) remote: Compressing objects: 89% (1415/1589) remote: Compressing objects: 90% (1431/1589) remote: Compressing objects: 91% (1446/1589) remote: Compressing objects: 92% (1462/1589) remote: Compressing objects: 93% (1478/1589) remote: Compressing objects: 94% (1494/1589) remote: Compressing objects: 95% (1510/1589) remote: Compressing objects: 96% (1526/1589) remote: Compressing objects: 97% (1542/1589) remote: Compressing objects: 98% (1558/1589) remote: Compressing objects: 99% (1574/1589) remote: Compressing objects: 100% (1589/1589) remote: Compressing objects: 100% (1589/1589), done.
  6. 5.87 s Receiving objects: 0% (1/65276) Receiving objects: 1% (653/65276) Receiving objects: 2% (1306/65276) Receiving objects: 3% (1959/65276) Receiving objects: 4% (2612/65276) Receiving objects: 5% (3264/65276) Receiving objects: 6% (3917/65276) Receiving objects: 7% (4570/65276) Receiving objects: 8% (5223/65276) Receiving objects: 9% (5875/65276) Receiving objects: 10% (6528/65276) Receiving objects: 11% (7181/65276) Receiving objects: 12% (7834/65276), 15.94 MiB | 31.86 MiB/s Receiving objects: 13% (8486/65276), 15.94 MiB | 31.86 MiB/s Receiving objects: 14% (9139/65276), 15.94 MiB | 31.86 MiB/s Receiving objects: 15% (9792/65276), 15.94 MiB | 31.86 MiB/s Receiving objects: 16% (10445/65276), 15.94 MiB | 31.86 MiB/s Receiving objects: 17% (11097/65276), 15.94 MiB | 31.86 MiB/s Receiving objects: 18% (11750/65276), 15.94 MiB | 31.86 MiB/s Receiving objects: 19% (12403/65276), 15.94 MiB | 31.86 MiB/s Receiving objects: 20% (13056/65276), 15.94 MiB | 31.86 MiB/s Receiving objects: 21% (13708/65276), 15.94 MiB | 31.86 MiB/s Receiving objects: 22% (14361/65276), 15.94 MiB | 31.86 MiB/s Receiving objects: 23% (15014/65276), 15.94 MiB | 31.86 MiB/s Receiving objects: 24% (15667/65276), 15.94 MiB | 31.86 MiB/s Receiving objects: 25% (16319/65276), 15.94 MiB | 31.86 MiB/s Receiving objects: 26% (16972/65276), 15.94 MiB | 31.86 MiB/s Receiving objects: 27% (17625/65276), 15.94 MiB | 31.86 MiB/s Receiving objects: 28% (18278/65276), 15.94 MiB | 31.86 MiB/s Receiving objects: 29% (18931/65276), 15.94 MiB | 31.86 MiB/s Receiving objects: 30% (19583/65276), 15.94 MiB | 31.86 MiB/s Receiving objects: 31% (20236/65276), 15.94 MiB | 31.86 MiB/s Receiving objects: 32% (20889/65276), 15.94 MiB | 31.86 MiB/s Receiving objects: 33% (21542/65276), 15.94 MiB | 31.86 MiB/s Receiving objects: 34% (22194/65276), 15.94 MiB | 31.86 MiB/s Receiving objects: 35% (22847/65276), 15.94 MiB | 31.86 MiB/s Receiving objects: 36% (23500/65276), 15.94 MiB | 31.86 MiB/s Receiving objects: 37% (24153/65276), 15.94 MiB | 31.86 MiB/s Receiving objects: 38% (24805/65276), 15.94 MiB | 31.86 MiB/s Receiving objects: 39% (25458/65276), 15.94 MiB | 31.86 MiB/s Receiving objects: 40% (26111/65276), 15.94 MiB | 31.86 MiB/s Receiving objects: 41% (26764/65276), 15.94 MiB | 31.86 MiB/s Receiving objects: 42% (27416/65276), 15.94 MiB | 31.86 MiB/s Receiving objects: 43% (28069/65276), 15.94 MiB | 31.86 MiB/s Receiving objects: 44% (28722/65276), 15.94 MiB | 31.86 MiB/s Receiving objects: 45% (29375/65276), 15.94 MiB | 31.86 MiB/s Receiving objects: 46% (30027/65276), 15.94 MiB | 31.86 MiB/s Receiving objects: 47% (30680/65276), 15.94 MiB | 31.86 MiB/s Receiving objects: 48% (31333/65276), 15.94 MiB | 31.86 MiB/s Receiving objects: 49% (31986/65276), 15.94 MiB | 31.86 MiB/s Receiving objects: 50% (32638/65276), 15.94 MiB | 31.86 MiB/s Receiving objects: 51% (33291/65276), 15.94 MiB | 31.86 MiB/s Receiving objects: 52% (33944/65276), 15.94 MiB | 31.86 MiB/s Receiving objects: 52% (33952/65276), 15.94 MiB | 31.86 MiB/s Receiving objects: 53% (34597/65276), 32.38 MiB | 32.37 MiB/s Receiving objects: 54% (35250/65276), 32.38 MiB | 32.37 MiB/s Receiving objects: 55% (35902/65276), 32.38 MiB | 32.37 MiB/s Receiving objects: 56% (36555/65276), 32.38 MiB | 32.37 MiB/s Receiving objects: 57% (37208/65276), 32.38 MiB | 32.37 MiB/s Receiving objects: 58% (37861/65276), 32.38 MiB | 32.37 MiB/s Receiving objects: 59% (38513/65276), 32.38 MiB | 32.37 MiB/s Receiving objects: 60% (39166/65276), 32.38 MiB | 32.37 MiB/s Receiving objects: 61% (39819/65276), 32.38 MiB | 32.37 MiB/s Receiving objects: 62% (40472/65276), 47.56 MiB | 31.43 MiB/s Receiving objects: 63% (41124/65276), 47.56 MiB | 31.43 MiB/s Receiving objects: 64% (41777/65276), 47.56 MiB | 31.43 MiB/s Receiving objects: 65% (42430/65276), 47.56 MiB | 31.43 MiB/s Receiving objects: 66% (43083/65276), 47.56 MiB | 31.43 MiB/s Receiving objects: 67% (43735/65276), 47.56 MiB | 31.43 MiB/s Receiving objects: 68% (44388/65276), 47.56 MiB | 31.43 MiB/s Receiving objects: 69% (45041/65276), 47.56 MiB | 31.43 MiB/s Receiving objects: 70% (45694/65276), 47.56 MiB | 31.43 MiB/s Receiving objects: 71% (46346/65276), 47.56 MiB | 31.43 MiB/s Receiving objects: 72% (46999/65276), 47.56 MiB | 31.43 MiB/s Receiving objects: 73% (47652/65276), 47.56 MiB | 31.43 MiB/s Receiving objects: 74% (48305/65276), 47.56 MiB | 31.43 MiB/s Receiving objects: 74% (48916/65276), 63.46 MiB | 31.54 MiB/s Receiving objects: 75% (48957/65276), 63.46 MiB | 31.54 MiB/s Receiving objects: 76% (49610/65276), 63.46 MiB | 31.54 MiB/s Receiving objects: 77% (50263/65276), 63.46 MiB | 31.54 MiB/s Receiving objects: 78% (50916/65276), 63.46 MiB | 31.54 MiB/s Receiving objects: 79% (51569/65276), 63.46 MiB | 31.54 MiB/s Receiving objects: 80% (52221/65276), 63.46 MiB | 31.54 MiB/s Receiving objects: 81% (52874/65276), 63.46 MiB | 31.54 MiB/s Receiving objects: 82% (53527/65276), 63.46 MiB | 31.54 MiB/s Receiving objects: 83% (54180/65276), 63.46 MiB | 31.54 MiB/s Receiving objects: 84% (54832/65276), 63.46 MiB | 31.54 MiB/s Receiving objects: 85% (55485/65276), 80.77 MiB | 32.16 MiB/s Receiving objects: 86% (56138/65276), 80.77 MiB | 32.16 MiB/s Receiving objects: 87% (56791/65276), 80.77 MiB | 32.16 MiB/s Receiving objects: 88% (57443/65276), 80.77 MiB | 32.16 MiB/s Receiving objects: 89% (58096/65276), 80.77 MiB | 32.16 MiB/s Receiving objects: 90% (58749/65276), 80.77 MiB | 32.16 MiB/s Receiving objects: 91% (59402/65276), 80.77 MiB | 32.16 MiB/s Receiving objects: 92% (60054/65276), 80.77 MiB | 32.16 MiB/s Receiving objects: 93% (60707/65276), 80.77 MiB | 32.16 MiB/s Receiving objects: 94% (61360/65276), 80.77 MiB | 32.16 MiB/s Receiving objects: 95% (62013/65276), 80.77 MiB | 32.16 MiB/s Receiving objects: 96% (62665/65276), 80.77 MiB | 32.16 MiB/s Receiving objects: 97% (63318/65276), 80.77 MiB | 32.16 MiB/s Receiving objects: 98% (63971/65276), 80.77 MiB | 32.16 MiB/s Receiving objects: 99% (64624/65276), 80.77 MiB | 32.16 MiB/s remote: Total 65276 (delta 6872), reused 6421 (delta 6328), pack-reused 57349 (from 1)
  7. 5.89 s Receiving objects: 100% (65276/65276), 80.77 MiB | 32.16 MiB/s Receiving objects: 100% (65276/65276), 87.60 MiB | 31.86 MiB/s, done.
  8. 6.54 s Resolving deltas: 0% (0/45990) Resolving deltas: 1% (460/45990) Resolving deltas: 2% (920/45990) Resolving deltas: 3% (1380/45990) Resolving deltas: 4% (1841/45990) Resolving deltas: 5% (2300/45990) Resolving deltas: 6% (2760/45990) Resolving deltas: 7% (3220/45990) Resolving deltas: 8% (3680/45990) Resolving deltas: 9% (4140/45990) Resolving deltas: 10% (4599/45990) Resolving deltas: 11% (5059/45990) Resolving deltas: 12% (5520/45990) Resolving deltas: 13% (5979/45990) Resolving deltas: 14% (6439/45990) Resolving deltas: 15% (6899/45990) Resolving deltas: 16% (7359/45990) Resolving deltas: 17% (7821/45990) Resolving deltas: 18% (8279/45990) Resolving deltas: 19% (8739/45990) Resolving deltas: 20% (9198/45990) Resolving deltas: 21% (9660/45990) Resolving deltas: 22% (10118/45990) Resolving deltas: 23% (10578/45990) Resolving deltas: 24% (11038/45990) Resolving deltas: 25% (11498/45990) Resolving deltas: 26% (11958/45990) Resolving deltas: 27% (12418/45990) Resolving deltas: 28% (12878/45990) Resolving deltas: 29% (13338/45990) Resolving deltas: 30% (13798/45990) Resolving deltas: 31% (14258/45990) Resolving deltas: 32% (14721/45990) Resolving deltas: 33% (15178/45990) Resolving deltas: 34% (15637/45990) Resolving deltas: 35% (16097/45990) Resolving deltas: 36% (16557/45990) Resolving deltas: 37% (17017/45990) Resolving deltas: 38% (17477/45990) Resolving deltas: 39% (17937/45990) Resolving deltas: 40% (18397/45990) Resolving deltas: 41% (18856/45990) Resolving deltas: 42% (19316/45990) Resolving deltas: 43% (19776/45990) Resolving deltas: 44% (20236/45990) Resolving deltas: 45% (20696/45990) Resolving deltas: 46% (21156/45990) Resolving deltas: 47% (21617/45990) Resolving deltas: 48% (22076/45990) Resolving deltas: 49% (22536/45990) Resolving deltas: 50% (22995/45990) Resolving deltas: 51% (23455/45990) Resolving deltas: 52% (23915/45990) Resolving deltas: 53% (24375/45990) Resolving deltas: 54% (24835/45990) Resolving deltas: 55% (25295/45990) Resolving deltas: 56% (25755/45990) Resolving deltas: 57% (26215/45990) Resolving deltas: 58% (26675/45990) Resolving deltas: 59% (27137/45990) Resolving deltas: 60% (27595/45990) Resolving deltas: 61% (28054/45990) Resolving deltas: 62% (28514/45990) Resolving deltas: 63% (28974/45990) Resolving deltas: 64% (29434/45990) Resolving deltas: 65% (29894/45990) Resolving deltas: 66% (30354/45990) Resolving deltas: 67% (30814/45990) Resolving deltas: 68% (31274/45990) Resolving deltas: 69% (31734/45990) Resolving deltas: 70% (32193/45990) Resolving deltas: 71% (32653/45990) Resolving deltas: 72% (33113/45990) Resolving deltas: 73% (33573/45990) Resolving deltas: 74% (34033/45990) Resolving deltas: 75% (34493/45990) Resolving deltas: 76% (34953/45990) Resolving deltas: 77% (35413/45990) Resolving deltas: 78% (35873/45990) Resolving deltas: 79% (36333/45990) Resolving deltas: 80% (36793/45990) Resolving deltas: 81% (37252/45990) Resolving deltas: 82% (37713/45990) Resolving deltas: 83% (38172/45990) Resolving deltas: 84% (38632/45990) Resolving deltas: 85% (39092/45990) Resolving deltas: 86% (39554/45990) Resolving deltas: 87% (40012/45990) Resolving deltas: 88% (40472/45990) Resolving deltas: 89% (40933/45990) Resolving deltas: 90% (41391/45990) Resolving deltas: 91% (41851/45990) Resolving deltas: 92% (42311/45990) Resolving deltas: 93% (42771/45990) Resolving deltas: 94% (43231/45990) Resolving deltas: 95% (43693/45990) Resolving deltas: 96% (44151/45990) Resolving deltas: 97% (44612/45990) Resolving deltas: 98% (45071/45990) Resolving deltas: 99% (45531/45990) Resolving deltas: 100% (45990/45990) Resolving deltas: 100% (45990/45990), done.
  9. 6.87 s Fetching commit 19107fed4b8ff70444a6725c1fcebd873f2872d7 for vakint_rustred ...
  10. 6.87 s $ /nix/store/bcnisk3ydfgv26v2gw3zlky24g00yww2-git-2.54.0/bin/git fetch origin 19107fed4b8ff70444a6725c1fcebd873f2872d7
  11. 7.27 s From https://github.com/alphal00p/gammaloop
  12. 7.27 s * branch 19107fed4b8ff70444a6725c1fcebd873f2872d7 -> FETCH_HEAD
  13. 7.28 s $ /nix/store/9ypz3flqsrl5xl495mm8h645gadjsxi1-coreutils-9.11/bin/timeout --kill-after=15s 7200s /nix/store/bcnisk3ydfgv26v2gw3zlky24g00yww2-git-2.54.0/bin/git -c advice.detachedHead=false checkout 19107fed4b8ff70444a6725c1fcebd873f2872d7
  14. 7.34 s HEAD is now at 19107fed migrate shipped RustRed artifacts to schema V3
  15. 7.35 s $ /nix/store/9ypz3flqsrl5xl495mm8h645gadjsxi1-coreutils-9.11/bin/timeout --kill-after=15s 7200s /nix/store/23zk8sgzamrbmj1fday15szf7f2279s8-nix-2.34.7/bin/nix --extra-experimental-features nix-command --extra-experimental-features flakes --log-format internal-json run .#packages.x86_64-linux.nix-ci-check-gammaloop-nextest-spenso --print-build-logs
  16. 11.49 s
  17. 16.22 s evaluating derivation 'g copying '/nix/store/bbqb evaluating derivation 'g copying '/nix/store/bbqb evaluating derivation 'g querying gammaloop-nexte querying info about miss querying gammaloop-nexte [0/1 built, 0.0 KiB DL] [1/0/1 built, 0.0 KiB DLgammaloop-nextest-spenso> Extracting 5 binaries and 2 linked paths to /build/nextest-archive-mi7o37
  18. 16.39 s gammaloop-nextest-spenso> Extracted 19 files to /build/nextest-archive-mi7o37 in 0.17s
  19. 16.40 s gammaloop-nextest-spenso> ------------
  20. 16.40 s gammaloop-nextest-spenso> Nextest run ID 9ed749c7-4762-4bd9-8ff4-40966848bb20 with nextest profile: ci_gammaloop
  21. 16.40 s gammaloop-nextest-spenso> Starting 224 tests across 5 binaries (26 tests skipped, including 2 tests via profile.ci_gammaloop.default-filter)
  22. 16.49 s gammaloop-nextest-spenso> FAIL [ 0.011s] ( 46/224) idenso color::test::form_reference::metric_contraction_respects_antisymmetric_normalization
  23. 16.49 s gammaloop-nextest-spenso> stdout ---
  24. 16.49 s gammaloop-nextest-spenso>
  25. 16.49 s gammaloop-nextest-spenso> running 1 test
  26. 16.49 s gammaloop-nextest-spenso> test color::test::form_reference::metric_contraction_respects_antisymmetric_normalization ... FAILED
  27. 16.49 s gammaloop-nextest-spenso>
  28. 16.49 s gammaloop-nextest-spenso> failures:
  29. 16.49 s gammaloop-nextest-spenso>
  30. 16.49 s gammaloop-nextest-spenso> failures:
  31. 16.49 s gammaloop-nextest-spenso> color::test::form_reference::metric_contraction_respects_antisymmetric_normalization
  32. 16.49 s gammaloop-nextest-spenso>
  33. 16.49 s gammaloop-nextest-spenso> test result: FAILED. 0 passed; 1 failed; 0 ignored; 0 measured; 240 filtered out; finished in 0.00s
  34. 16.49 s gammaloop-nextest-spenso>
  35. 16.49 s gammaloop-nextest-spenso> stderr ---
  36. 16.49 s gammaloop-nextest-spenso>
  37. 16.49 s gammaloop-nextest-spenso> thread 'color::test::form_reference::metric_contraction_respects_antisymmetric_normalization' (338) panicked at crates/idenso/src/color/test/form_reference.rs:171:5:
  38. 16.49 s gammaloop-nextest-spenso> assertion `left == right` failed
  39. 16.49 s gammaloop-nextest-spenso> left: "-1*f(coad(8,standalone_metric_j),coad(8,standalone_metric_s),coad(8,standalone_metric_u))"
  40. 16.49 s gammaloop-nextest-spenso> right: "f(coad(8,standalone_metric_j),coad(8,standalone_metric_s),coad(8,standalone_metric_u))"
  41. 16.49 s gammaloop-nextest-spenso> stack backtrace:
  42. 16.49 s gammaloop-nextest-spenso> 0: __rustc::rust_begin_unwind
  43. 16.49 s gammaloop-nextest-spenso> 1: core::panicking::panic_fmt
  44. 16.49 s gammaloop-nextest-spenso> 2: core::panicking::assert_failed_inner
  45. 16.49 s gammaloop-nextest-spenso> 3: core::panicking::assert_failed::<alloc::string::String, alloc::string::String>
  46. 16.49 s gammaloop-nextest-spenso> 4: idenso::color::test::form_reference::metric_contraction_respects_antisymmetric_normalization
  47. 16.49 s gammaloop-nextest-spenso> 5: <idenso::color::test::form_reference::metric_contraction_respects_antisymmetric_normalization::{closure#0} as core::ops::function::FnOnce<()>>::call_once
  48. 16.49 s gammaloop-nextest-spenso> note: Some details are omitted, run with `RUST_BACKTRACE=full` for a verbose backtrace.
  49. 16.49 s gammaloop-nextest-spenso>
  50. 16.88 s gammaloop-nextest-spenso> FAIL [ 0.201s] (221/224) idenso tensor::tests::parsing::infinite_execution
  51. 16.88 s gammaloop-nextest-spenso> stdout ---
  52. 16.88 s gammaloop-nextest-spenso>
  53. 16.88 s gammaloop-nextest-spenso> running 1 test
  54. 16.88 s gammaloop-nextest-spenso> ━━━━━━━━━━━━━━━━━━━━━━━━━━━━━━━ Snapshot Summary ━━━━━━━━━━━━━━━━━━━━━━━━━━━━━━━
  55. 16.88 s gammaloop-nextest-spenso> Snapshot: infinite_execution
  56. 16.88 s gammaloop-nextest-spenso> Source: crates/idenso/src/tensor/tests/parsing.rs:910
  57. 16.88 s gammaloop-nextest-spenso> ────────────────────────────────────────────────────────────────────────────────
  58. 16.88 s gammaloop-nextest-spenso> Expression: net_iter.snapshot_dot()
  59. 16.88 s gammaloop-nextest-spenso> ────────────────────────────────────────────────────────────────────────────────
  60. 16.88 s gammaloop-nextest-spenso> -old snapshot
  61. 16.88 s gammaloop-nextest-spenso> +new results
  62. 16.88 s gammaloop-nextest-spenso> ────────────┬───────────────────────────────────────────────────────────────────
  63. 16.88 s gammaloop-nextest-spenso> 8 8 │ 0:0:s -> ext0 [id=0 color="red"];
  64. 16.88 s gammaloop-nextest-spenso> 9 9 │ ext1 [style=invis];
  65. 16.88 s gammaloop-nextest-spenso> 10 10 │ 0:5:s -> ext1 [id=1 dir=none color="red" label="mink4|l_0"];
  66. 16.88 s gammaloop-nextest-spenso> 11 11 │ ext2 [style=invis];
  67. 16.88 s gammaloop-nextest-spenso> 12 │- 0:4:s -> ext2 [id=2 dir=none color="red" label="bis4|l_2"];
  68. 16.88 s gammaloop-nextest-spenso> 12 │+ 0:3:s -> ext2 [id=2 dir=none color="red" label="mink4|l_1"];
  69. 16.88 s gammaloop-nextest-spenso> 13 13 │ ext3 [style=invis];
  70. 16.88 s gammaloop-nextest-spenso> 14 │- 0:3:s -> ext3 [id=3 dir=none color="red" label="bis4|l_3"];
  71. 16.88 s gammaloop-nextest-spenso> 14 │+ 0:1:s -> ext3 [id=3 dir=none color="red" label="bis4|l_2"];
  72. 16.88 s gammaloop-nextest-spenso> 15 15 │ ext4 [style=invis];
  73. 16.88 s gammaloop-nextest-spenso> 16 │- 0:1:s -> ext4 [id=4 dir=none color="red" label="mink4|l_1"];
  74. 16.88 s gammaloop-nextest-spenso> 16 │+ 0:2:s -> ext4 [id=4 dir=none color="red" label="mink4|l_4"];
  75. 16.88 s gammaloop-nextest-spenso> 17 17 │ ext5 [style=invis];
  76. 16.88 s gammaloop-nextest-spenso> 18 │- 0:2:s -> ext5 [id=5 dir=none color="red" label="mink4|l_4"];
  77. 16.88 s gammaloop-nextest-spenso> 18 │+ 0:4:s -> ext5 [id=5 dir=none color="red" label="bis4|l_3"];
  78. 16.88 s gammaloop-nextest-spenso> 19 19 │ }
  79. 16.88 s gammaloop-nextest-spenso> ────────────┴───────────────────────────────────────────────────────────────────
  80. 16.88 s gammaloop-nextest-spenso> To update snapshots run `cargo insta review`
  81. 16.88 s gammaloop-nextest-spenso> Stopped on the first failure. Run `cargo insta test` to run all snapshots.
  82. 16.88 s gammaloop-nextest-spenso> test tensor::tests::parsing::infinite_execution ... FAILED
  83. 16.88 s gammaloop-nextest-spenso>
  84. 16.88 s gammaloop-nextest-spenso> failures:
  85. 16.88 s gammaloop-nextest-spenso>
  86. 16.88 s gammaloop-nextest-spenso> failures:
  87. 16.88 s gammaloop-nextest-spenso> tensor::tests::parsing::infinite_execution
  88. 16.88 s gammaloop-nextest-spenso>
  89. 16.88 s gammaloop-nextest-spenso> test result: FAILED. 0 passed; 1 failed; 0 ignored; 0 measured; 240 filtered out; finished in 0.19s
  90. 16.88 s gammaloop-nextest-spenso>
  91. 16.88 s gammaloop-nextest-spenso> stderr ---
  92. 16.88 s gammaloop-nextest-spenso>
  93. 16.88 s gammaloop-nextest-spenso> thread 'tensor::tests::parsing::infinite_execution' (838) panicked at /nix/store/hvwd4qqiaadc4s871lfyylxrciqrvlgs-vendor-cargo-deps/c19b7c6f923b580ac259164a89f2577984ad5ab09ee9d583b888f934adbbe8d0/insta-1.47.2/src/runtime.rs:719:13:
  94. 16.88 s gammaloop-nextest-spenso> snapshot assertion for 'infinite_execution' failed in line 910
  95. 16.88 s gammaloop-nextest-spenso> stack backtrace:
  96. 16.88 s gammaloop-nextest-spenso> 0: __rustc::rust_begin_unwind
  97. 16.88 s gammaloop-nextest-spenso> 1: core::panicking::panic_fmt
  98. 16.88 s gammaloop-nextest-spenso> 2: insta::runtime::assert_snapshot
  99. 16.88 s gammaloop-nextest-spenso> 3: idenso::tensor::tests::parsing::infinite_execution
  100. 16.88 s gammaloop-nextest-spenso> 4: <idenso::tensor::tests::parsing::infinite_execution::{closure#0} as core::ops::function::FnOnce<()>>::call_once
  101. 16.88 s gammaloop-nextest-spenso> note: Some details are omitted, run with `RUST_BACKTRACE=full` for a verbose backtrace.
  102. 16.88 s gammaloop-nextest-spenso>
  103. 18.17 s gammaloop-nextest-spenso> ------------
  104. 18.17 s gammaloop-nextest-spenso> Summary [ 1.765s] 224 tests run: 222 passed, 2 failed, 26 skipped
  105. 18.17 s gammaloop-nextest-spenso> FAIL [ 0.011s] ( 46/224) idenso color::test::form_reference::metric_contraction_respects_antisymmetric_normalization
  106. 18.17 s gammaloop-nextest-spenso> stdout ---
  107. 18.17 s gammaloop-nextest-spenso>
  108. 18.17 s gammaloop-nextest-spenso> running 1 test
  109. 18.17 s gammaloop-nextest-spenso> test color::test::form_reference::metric_contraction_respects_antisymmetric_normalization ... FAILED
  110. 18.17 s gammaloop-nextest-spenso>
  111. 18.17 s gammaloop-nextest-spenso> failures:
  112. 18.17 s gammaloop-nextest-spenso>
  113. 18.17 s gammaloop-nextest-spenso> failures:
  114. 18.17 s gammaloop-nextest-spenso> color::test::form_reference::metric_contraction_respects_antisymmetric_normalization
  115. 18.17 s gammaloop-nextest-spenso>
  116. 18.17 s gammaloop-nextest-spenso> test result: FAILED. 0 passed; 1 failed; 0 ignored; 0 measured; 240 filtered out; finished in 0.00s
  117. 18.17 s gammaloop-nextest-spenso>
  118. 18.17 s gammaloop-nextest-spenso> stderr ---
  119. 18.17 s gammaloop-nextest-spenso>
  120. 18.17 s gammaloop-nextest-spenso> thread 'color::test::form_reference::metric_contraction_respects_antisymmetric_normalization' (338) panicked at crates/idenso/src/color/test/form_reference.rs:171:5:
  121. 18.17 s gammaloop-nextest-spenso> assertion `left == right` failed
  122. 18.17 s gammaloop-nextest-spenso> left: "-1*f(coad(8,standalone_metric_j),coad(8,standalone_metric_s),coad(8,standalone_metric_u))"
  123. 18.17 s gammaloop-nextest-spenso> right: "f(coad(8,standalone_metric_j),coad(8,standalone_metric_s),coad(8,standalone_metric_u))"
  124. 18.17 s gammaloop-nextest-spenso> stack backtrace:
  125. 18.17 s gammaloop-nextest-spenso> 0: __rustc::rust_begin_unwind
  126. 18.17 s gammaloop-nextest-spenso> 1: core::panicking::panic_fmt
  127. 18.17 s gammaloop-nextest-spenso> 2: core::panicking::assert_failed_inner
  128. 18.17 s gammaloop-nextest-spenso> 3: core::panicking::assert_failed::<alloc::string::String, alloc::string::String>
  129. 18.17 s gammaloop-nextest-spenso> 4: idenso::color::test::form_reference::metric_contraction_respects_antisymmetric_normalization
  130. 18.17 s gammaloop-nextest-spenso> 5: <idenso::color::test::form_reference::metric_contraction_respects_antisymmetric_normalization::{closure#0} as core::ops::function::FnOnce<()>>::call_once
  131. 18.17 s gammaloop-nextest-spenso> note: Some details are omitted, run with `RUST_BACKTRACE=full` for a verbose backtrace.
  132. 18.17 s gammaloop-nextest-spenso>
  133. 18.17 s gammaloop-nextest-spenso> FAIL [ 0.201s] (221/224) idenso tensor::tests::parsing::infinite_execution
  134. 18.17 s gammaloop-nextest-spenso> stdout ---
  135. 18.17 s gammaloop-nextest-spenso>
  136. 18.17 s gammaloop-nextest-spenso> running 1 test
  137. 18.17 s gammaloop-nextest-spenso> ━━━━━━━━━━━━━━━━━━━━━━━━━━━━━━━ Snapshot Summary ━━━━━━━━━━━━━━━━━━━━━━━━━━━━━━━
  138. 18.17 s gammaloop-nextest-spenso> Snapshot: infinite_execution
  139. 18.17 s gammaloop-nextest-spenso> Source: crates/idenso/src/tensor/tests/parsing.rs:910
  140. 18.17 s gammaloop-nextest-spenso> ────────────────────────────────────────────────────────────────────────────────
  141. 18.17 s gammaloop-nextest-spenso> Expression: net_iter.snapshot_dot()
  142. 18.17 s gammaloop-nextest-spenso> ────────────────────────────────────────────────────────────────────────────────
  143. 18.17 s gammaloop-nextest-spenso> -old snapshot
  144. 18.17 s gammaloop-nextest-spenso> +new results
  145. 18.17 s gammaloop-nextest-spenso> ────────────┬───────────────────────────────────────────────────────────────────
  146. 18.17 s gammaloop-nextest-spenso> 8 8 │ 0:0:s -> ext0 [id=0 color="red"];
  147. 18.17 s gammaloop-nextest-spenso> 9 9 │ ext1 [style=invis];
  148. 18.17 s gammaloop-nextest-spenso> 10 10 │ 0:5:s -> ext1 [id=1 dir=none color="red" label="mink4|l_0"];
  149. 18.17 s gammaloop-nextest-spenso> 11 11 │ ext2 [style=invis];
  150. 18.17 s gammaloop-nextest-spenso> 12 │- 0:4:s -> ext2 [id=2 dir=none color="red" label="bis4|l_2"];
  151. 18.17 s gammaloop-nextest-spenso> 12 │+ 0:3:s -> ext2 [id=2 dir=none color="red" label="mink4|l_1"];
  152. 18.17 s gammaloop-nextest-spenso> 13 13 │ ext3 [style=invis];
  153. 18.17 s gammaloop-nextest-spenso> 14 │- 0:3:s -> ext3 [id=3 dir=none color="red" label="bis4|l_3"];
  154. 18.17 s gammaloop-nextest-spenso> 14 │+ 0:1:s -> ext3 [id=3 dir=none color="red" label="bis4|l_2"];
  155. 18.17 s gammaloop-nextest-spenso> 15 15 │ ext4 [style=invis];
  156. 18.17 s gammaloop-nextest-spenso> 16 │- 0:1:s -> ext4 [id=4 dir=none color="red" label="mink4|l_1"];
  157. 18.17 s gammaloop-nextest-spenso> 16 │+ 0:2:s -> ext4 [id=4 dir=none color="red" label="mink4|l_4"];
  158. 18.17 s gammaloop-nextest-spenso> 17 17 │ ext5 [style=invis];
  159. 18.17 s gammaloop-nextest-spenso> 18 │- 0:2:s -> ext5 [id=5 dir=none color="red" label="mink4|l_4"];
  160. 18.17 s gammaloop-nextest-spenso> 18 │+ 0:4:s -> ext5 [id=5 dir=none color="red" label="bis4|l_3"];
  161. 18.17 s gammaloop-nextest-spenso> 19 19 │ }
  162. 18.17 s gammaloop-nextest-spenso> ────────────┴───────────────────────────────────────────────────────────────────
  163. 18.17 s gammaloop-nextest-spenso> To update snapshots run `cargo insta review`
  164. 18.17 s gammaloop-nextest-spenso> Stopped on the first failure. Run `cargo insta test` to run all snapshots.
  165. 18.17 s gammaloop-nextest-spenso> test tensor::tests::parsing::infinite_execution ... FAILED
  166. 18.17 s gammaloop-nextest-spenso>
  167. 18.17 s gammaloop-nextest-spenso> failures:
  168. 18.17 s gammaloop-nextest-spenso>
  169. 18.17 s gammaloop-nextest-spenso> failures:
  170. 18.17 s gammaloop-nextest-spenso> tensor::tests::parsing::infinite_execution
  171. 18.17 s gammaloop-nextest-spenso>
  172. 18.17 s gammaloop-nextest-spenso> test result: FAILED. 0 passed; 1 failed; 0 ignored; 0 measured; 240 filtered out; finished in 0.19s
  173. 18.17 s gammaloop-nextest-spenso>
  174. 18.17 s gammaloop-nextest-spenso> stderr ---
  175. 18.17 s gammaloop-nextest-spenso>
  176. 18.17 s gammaloop-nextest-spenso> thread 'tensor::tests::parsing::infinite_execution' (838) panicked at /nix/store/hvwd4qqiaadc4s871lfyylxrciqrvlgs-vendor-cargo-deps/c19b7c6f923b580ac259164a89f2577984ad5ab09ee9d583b888f934adbbe8d0/insta-1.47.2/src/runtime.rs:719:13:
  177. 18.17 s gammaloop-nextest-spenso> snapshot assertion for 'infinite_execution' failed in line 910
  178. 18.17 s gammaloop-nextest-spenso> stack backtrace:
  179. 18.17 s gammaloop-nextest-spenso> 0: __rustc::rust_begin_unwind
  180. 18.17 s gammaloop-nextest-spenso> 1: core::panicking::panic_fmt
  181. 18.17 s gammaloop-nextest-spenso> 2: insta::runtime::assert_snapshot
  182. 18.17 s gammaloop-nextest-spenso> 3: idenso::tensor::tests::parsing::infinite_execution
  183. 18.17 s gammaloop-nextest-spenso> 4: <idenso::tensor::tests::parsing::infinite_execution::{closure#0} as core::ops::function::FnOnce<()>>::call_once
  184. 18.17 s gammaloop-nextest-spenso> note: Some details are omitted, run with `RUST_BACKTRACE=full` for a verbose backtrace.
  185. 18.17 s gammaloop-nextest-spenso>
  186. 18.20 s gammaloop-nextest-spenso> error: test run failed
  187. 18.23 s gammaloop-nextest-spenso>
  188. 18.23 s gammaloop-nextest-spenso> ========== nextest test summary ==========
  189. 18.23 s gammaloop-nextest-spenso> report: target/nextest/ci_gammaloop/junit.xml
  190. 18.23 s gammaloop-nextest-spenso> tests: 224, failures: 2, errors: 0
  191. 18.23 s gammaloop-nextest-spenso>
  192. 18.23 s gammaloop-nextest-spenso> 1. idenso::color::test::form_reference::metric_contraction_respects_antisymmetric_normalization
  193. 18.23 s gammaloop-nextest-spenso> failure: test failure with exit code 101
  194. 18.23 s gammaloop-nextest-spenso> thread 'color::test::form_reference::metric_contraction_respects_antisymmetric_normalization' (338) panicked at crates/idenso/src/color/test/form_reference.rs:171:5:
  195. 18.23 s gammaloop-nextest-spenso> assertion `left == right` failed
  196. 18.23 s gammaloop-nextest-spenso> left: "-1*f(coad(8,standalone_metric_j),coad(8,standalone_metric_s),coad(8,standalone_metric_u))"
  197. 18.23 s gammaloop-nextest-spenso> right: "f(coad(8,standalone_metric_j),coad(8,standalone_metric_s),coad(8,standalone_metric_u))"
  198. 18.23 s gammaloop-nextest-spenso> stack backtrace:
  199. 18.23 s gammaloop-nextest-spenso> 0: __rustc::rust_begin_unwind
  200. 18.23 s gammaloop-nextest-spenso> 1: core::panicking::panic_fmt
  201. 18.23 s gammaloop-nextest-spenso> 2: core::panicking::assert_failed_inner
  202. 18.23 s gammaloop-nextest-spenso> 3: core::panicking::assert_failed::<alloc::string::String, alloc::string::String>
  203. 18.23 s gammaloop-nextest-spenso> 4: idenso::color::test::form_reference::metric_contraction_respects_antisymmetric_normalization
  204. 18.23 s gammaloop-nextest-spenso> 5: <idenso::color::test::form_reference::metric_contraction_respects_antisymmetric_normalization::{closure#0} as core::ops::function::FnOnce<()>>::call_once
  205. 18.23 s gammaloop-nextest-spenso> note: Some details are omitted, run with `RUST_BACKTRACE=full` for a verbose backtrace.
  206. 18.23 s gammaloop-nextest-spenso> system-out
  207. 18.23 s gammaloop-nextest-spenso> running 1 test
  208. 18.23 s gammaloop-nextest-spenso> test color::test::form_reference::metric_contraction_respects_antisymmetric_normalization ... FAILED
  209. 18.23 s gammaloop-nextest-spenso>
  210. 18.23 s gammaloop-nextest-spenso> failures:
  211. 18.23 s gammaloop-nextest-spenso>
  212. 18.23 s gammaloop-nextest-spenso> failures:
  213. 18.23 s gammaloop-nextest-spenso> color::test::form_reference::metric_contraction_respects_antisymmetric_normalization
  214. 18.23 s gammaloop-nextest-spenso>
  215. 18.23 s gammaloop-nextest-spenso> test result: FAILED. 0 passed; 1 failed; 0 ignored; 0 measured; 240 filtered out; finished in 0.00s
  216. 18.23 s gammaloop-nextest-spenso> system-err
  217. 18.23 s gammaloop-nextest-spenso> thread 'color::test::form_reference::metric_contraction_respects_antisymmetric_normalization' (338) panicked at crates/idenso/src/color/test/form_reference.rs:171:5:
  218. 18.23 s gammaloop-nextest-spenso> assertion `left == right` failed
  219. 18.23 s gammaloop-nextest-spenso> left: "-1*f(coad(8,standalone_metric_j),coad(8,standalone_metric_s),coad(8,standalone_metric_u))"
  220. 18.23 s gammaloop-nextest-spenso> right: "f(coad(8,standalone_metric_j),coad(8,standalone_metric_s),coad(8,standalone_metric_u))"
  221. 18.23 s gammaloop-nextest-spenso> stack backtrace:
  222. 18.23 s gammaloop-nextest-spenso> 0: __rustc::rust_begin_unwind
  223. 18.23 s gammaloop-nextest-spenso> 1: core::panicking::panic_fmt
  224. 18.23 s gammaloop-nextest-spenso> 2: core::panicking::assert_failed_inner
  225. 18.23 s gammaloop-nextest-spenso> 3: core::panicking::assert_failed::<alloc::string::String, alloc::string::String>
  226. 18.23 s gammaloop-nextest-spenso> 4: idenso::color::test::form_reference::metric_contraction_respects_antisymmetric_normalization
  227. 18.23 s gammaloop-nextest-spenso> 5: <idenso::color::test::form_reference::metric_contraction_respects_antisymmetric_normalization::{closure#0} as core::ops::function::FnOnce<()>>::call_once
  228. 18.23 s gammaloop-nextest-spenso> note: Some details are omitted, run with `RUST_BACKTRACE=full` for a verbose backtrace.
  229. 18.23 s gammaloop-nextest-spenso>
  230. 18.23 s gammaloop-nextest-spenso> 2. idenso::tensor::tests::parsing::infinite_execution
  231. 18.23 s gammaloop-nextest-spenso> failure: test failure with exit code 101
  232. 18.23 s gammaloop-nextest-spenso> thread 'tensor::tests::parsing::infinite_execution' (838) panicked at /nix/store/hvwd4qqiaadc4s871lfyylxrciqrvlgs-vendor-cargo-deps/c19b7c6f923b580ac259164a89f2577984ad5ab09ee9d583b888f934adbbe8d0/insta-1.47.2/src/runtime.rs:719:13:
  233. 18.23 s gammaloop-nextest-spenso> snapshot assertion for 'infinite_execution' failed in line 910
  234. 18.23 s gammaloop-nextest-spenso> stack backtrace:
  235. 18.23 s gammaloop-nextest-spenso> 0: __rustc::rust_begin_unwind
  236. 18.23 s gammaloop-nextest-spenso> 1: core::panicking::panic_fmt
  237. 18.23 s gammaloop-nextest-spenso> 2: insta::runtime::assert_snapshot
  238. 18.23 s gammaloop-nextest-spenso> 3: idenso::tensor::tests::parsing::infinite_execution
  239. 18.23 s gammaloop-nextest-spenso> 4: <idenso::tensor::tests::parsing::infinite_execution::{closure#0} as core::ops::function::FnOnce<()>>::call_once
  240. 18.23 s gammaloop-nextest-spenso> note: Some details are omitted, run with `RUST_BACKTRACE=full` for a verbose backtrace.
  241. 18.23 s gammaloop-nextest-spenso> system-out
  242. 18.23 s gammaloop-nextest-spenso> running 1 test
  243. 18.23 s gammaloop-nextest-spenso> ━━━━━━━━━━━━━━━━━━━━━━━━━━━━━━━ Snapshot Summary ━━━━━━━━━━━━━━━━━━━━━━━━━━━━━━━
  244. 18.23 s gammaloop-nextest-spenso> Snapshot: infinite_execution
  245. 18.23 s gammaloop-nextest-spenso> Source: crates/idenso/src/tensor/tests/parsing.rs:910
  246. 18.23 s gammaloop-nextest-spenso> ────────────────────────────────────────────────────────────────────────────────
  247. 18.23 s gammaloop-nextest-spenso> Expression: net_iter.snapshot_dot()
  248. 18.23 s gammaloop-nextest-spenso> ────────────────────────────────────────────────────────────────────────────────
  249. 18.23 s gammaloop-nextest-spenso> -old snapshot
  250. 18.23 s gammaloop-nextest-spenso> +new results
  251. 18.23 s gammaloop-nextest-spenso> ────────────┬───────────────────────────────────────────────────────────────────
  252. 18.23 s gammaloop-nextest-spenso> 8 8 │ 0:0:s-> ext0 [id=0 color="red"];
  253. 18.23 s gammaloop-nextest-spenso> 9 9 │ ext1 [style=invis];
  254. 18.23 s gammaloop-nextest-spenso> 10 10 │ 0:5:s-> ext1 [id=1 dir=none color="red" label="mink4|l_0"];
  255. 18.23 s gammaloop-nextest-spenso> 11 11 │ ext2 [style=invis];
  256. 18.23 s gammaloop-nextest-spenso> 12 │- 0:4:s-> ext2 [id=2 dir=none color="red" label="bis4|l_2"];
  257. 18.23 s gammaloop-nextest-spenso> 12 │+ 0:3:s-> ext2 [id=2 dir=none color="red" label="mink4|l_1"];
  258. 18.23 s gammaloop-nextest-spenso> 13 13 │ ext3 [style=invis];
  259. 18.23 s gammaloop-nextest-spenso> 14 │- 0:3:s-> ext3 [id=3 dir=none color="red" label="bis4|l_3"];
  260. 18.23 s gammaloop-nextest-spenso> 14 │+ 0:1:s-> ext3 [id=3 dir=none color="red" label="bis4|l_2"];
  261. 18.23 s gammaloop-nextest-spenso> 15 15 │ ext4 [style=invis];
  262. 18.23 s gammaloop-nextest-spenso> 16 │- 0:1:s-> ext4 [id=4 dir=none color="red" label="mink4|l_1"];
  263. 18.23 s gammaloop-nextest-spenso> 16 │+ 0:2:s-> ext4 [id=4 dir=none color="red" label="mink4|l_4"];
  264. 18.23 s gammaloop-nextest-spenso> 17 17 │ ext5 [style=invis];
  265. 18.23 s gammaloop-nextest-spenso> 18 │- 0:2:s-> ext5 [id=5 dir=none color="red" label="mink4|l_4"];
  266. 18.23 s gammaloop-nextest-spenso> 18 │+ 0:4:s-> ext5 [id=5 dir=none color="red" label="bis4|l_3"];
  267. 18.23 s gammaloop-nextest-spenso> 19 19 │ }
  268. 18.23 s gammaloop-nextest-spenso> ────────────┴───────────────────────────────────────────────────────────────────
  269. 18.23 s gammaloop-nextest-spenso> To update snapshots run `cargo insta review`
  270. 18.23 s gammaloop-nextest-spenso> Stopped on the first failure. Run `cargo insta test` to run all snapshots.
  271. 18.23 s gammaloop-nextest-spenso> test tensor::tests::parsing::infinite_execution ... FAILED
  272. 18.23 s gammaloop-nextest-spenso>
  273. 18.23 s gammaloop-nextest-spenso> failures:
  274. 18.23 s gammaloop-nextest-spenso>
  275. 18.23 s gammaloop-nextest-spenso> failures:
  276. 18.23 s gammaloop-nextest-spenso> tensor::tests::parsing::infinite_execution
  277. 18.23 s gammaloop-nextest-spenso>
  278. 18.23 s gammaloop-nextest-spenso> test result: FAILED. 0 passed; 1 failed; 0 ignored; 0 measured; 240 filtered out; finished in 0.19s
  279. 18.23 s gammaloop-nextest-spenso> system-err
  280. 18.23 s gammaloop-nextest-spenso> thread 'tensor::tests::parsing::infinite_execution' (838) panicked at /nix/store/hvwd4qqiaadc4s871lfyylxrciqrvlgs-vendor-cargo-deps/c19b7c6f923b580ac259164a89f2577984ad5ab09ee9d583b888f934adbbe8d0/insta-1.47.2/src/runtime.rs:719:13:
  281. 18.23 s gammaloop-nextest-spenso> snapshot assertion for 'infinite_execution' failed in line 910
  282. 18.23 s gammaloop-nextest-spenso> stack backtrace:
  283. 18.23 s gammaloop-nextest-spenso> 0: __rustc::rust_begin_unwind
  284. 18.23 s gammaloop-nextest-spenso> 1: core::panicking::panic_fmt
  285. 18.23 s gammaloop-nextest-spenso> 2: insta::runtime::assert_snapshot
  286. 18.23 s gammaloop-nextest-spenso> 3: idenso::tensor::tests::parsing::infinite_execution
  287. 18.23 s gammaloop-nextest-spenso> 4: <idenso::tensor::tests::parsing::infinite_execution::{closure#0} as core::ops::function::FnOnce<()>>::call_once
  288. 18.23 s gammaloop-nextest-spenso> note: Some details are omitted, run with `RUST_BACKTRACE=full` for a verbose backtrace.
  289. 18.23 s gammaloop-nextest-spenso> =========================================
  290. 18.24 s gammaloop-nextest-spenso> Extracting 2 binaries and 1 linked path to /build/nextest-archive-vezPBH
  291. 18.31 s gammaloop-nextest-spenso> Extracted 8 files to /build/nextest-archive-vezPBH in 0.07s
  292. 18.32 s gammaloop-nextest-spenso> ------------
  293. 18.32 s gammaloop-nextest-spenso> Nextest run ID da380506-786c-4264-b2ae-41837ff72fc2 with nextest profile: ci_gammaloop
  294. 18.32 s gammaloop-nextest-spenso> Starting 135 tests across 2 binaries
  295. 18.40 s gammaloop-nextest-spenso> ------------
  296. 18.40 s gammaloop-nextest-spenso> Summary [ 0.080s] 135 tests run: 135 passed, 0 skipped
  297. 18.44 s gammaloop-nextest-spenso>
  298. 18.44 s gammaloop-nextest-spenso> ========== nextest test summary ==========
  299. 18.44 s gammaloop-nextest-spenso> report: target/nextest/ci_gammaloop/junit.xml
  300. 18.44 s gammaloop-nextest-spenso> tests: 135, failures: 0, errors: 0
  301. 18.44 s gammaloop-nextest-spenso> No failing testcases found.
  302. 18.44 s gammaloop-nextest-spenso> =========================================
  303. 18.46 s gammaloop-nextest-spenso> Extracting 5 binaries and 2 linked paths to /build/nextest-archive-twOboA
  304. 18.67 s gammaloop-nextest-spenso> Extracted 19 files to /build/nextest-archive-twOboA in 0.21s
  305. 18.68 s gammaloop-nextest-spenso> ------------
  306. 18.68 s gammaloop-nextest-spenso> Nextest run ID 1b444be8-f16b-4a29-9fc1-9eb6021667c3 with nextest profile: ci_gammaloop
  307. 18.68 s gammaloop-nextest-spenso> Starting 25 tests across 5 binaries (1 test skipped via profile.ci_gammaloop.default-filter)
  308. 18.89 s gammaloop-nextest-spenso> ------------
  309. 18.89 s gammaloop-nextest-spenso> Summary [ 0.210s] 25 tests run: 25 passed, 1 skipped
  310. 18.95 s gammaloop-nextest-spenso>
  311. 18.95 s gammaloop-nextest-spenso> ========== nextest test summary ==========
  312. 18.95 s gammaloop-nextest-spenso> report: target/nextest/ci_gammaloop/junit.xml
  313. 18.95 s gammaloop-nextest-spenso> tests: 25, failures: 0, errors: 0
  314. 18.95 s gammaloop-nextest-spenso> No failing testcases found.
  315. 18.95 s gammaloop-nextest-spenso> =========================================
  316. 18.96 s gammaloop-nextest-spenso> Extracting 2 binaries and 1 linked path to /build/nextest-archive-gWCHtK
  317. 19.02 s gammaloop-nextest-spenso> Extracted 8 files to /build/nextest-archive-gWCHtK in 0.06s
  318. 19.03 s gammaloop-nextest-spenso> ------------
  319. 19.03 s gammaloop-nextest-spenso> Nextest run ID 158a9c44-83f9-415f-ae23-6ef8abfd3a02 with nextest profile: ci_gammaloop
  320. 19.03 s gammaloop-nextest-spenso> Starting 1 test across 2 binaries
  321. 19.04 s gammaloop-nextest-spenso> ------------
  322. 19.04 s gammaloop-nextest-spenso> Summary [ 0.005s] 1 test run: 1 passed, 0 skipped
  323. 19.07 s gammaloop-nextest-spenso>
  324. 19.07 s gammaloop-nextest-spenso> ========== nextest test summary ==========
  325. 19.07 s gammaloop-nextest-spenso> report: target/nextest/ci_gammaloop/junit.xml
  326. 19.07 s gammaloop-nextest-spenso> tests: 1, failures: 0, errors: 0
  327. 19.07 s gammaloop-nextest-spenso> No failing testcases found.
  328. 19.07 s gammaloop-nextest-spenso> =========================================
  329. 19.09 s gammaloop-nextest-spenso> Extracting 1 binary and 1 linked path to /build/nextest-archive-DuTeUv
  330. 19.14 s gammaloop-nextest-spenso> Extracted 7 files to /build/nextest-archive-DuTeUv in 0.05s
  331. 19.15 s gammaloop-nextest-spenso> ------------
  332. 19.15 s gammaloop-nextest-spenso> Nextest run ID d70a6a69-c7c6-490b-b2f0-f063773c04eb with nextest profile: ci_gammaloop
  333. 19.15 s gammaloop-nextest-spenso> Starting 0 tests across 1 binary
  334. 19.15 s gammaloop-nextest-spenso> ------------
  335. 19.15 s gammaloop-nextest-spenso> Summary [ 0.000s] 0 tests run: 0 passed, 0 skipped
  336. 19.18 s gammaloop-nextest-spenso>
  337. 19.18 s gammaloop-nextest-spenso> ========== nextest test summary ==========
  338. 19.18 s gammaloop-nextest-spenso> report: target/nextest/ci_gammaloop/junit.xml
  339. 19.18 s gammaloop-nextest-spenso> tests: 0, failures: 0, errors: 0
  340. 19.18 s gammaloop-nextest-spenso> No failing testcases found.
  341. 19.18 s gammaloop-nextest-spenso> =========================================
  342. 19.22 s error: Cannot build '/nix/store/f7dlapwy00q35hpz63fxwqijy6397ql2-gammaloop-nextest-spenso.drv'.
  343. 19.22 s Reason: builder failed with exit code 100.
  344. 19.22 s Output paths:
  345. 19.22 s /nix/store/n4ly992ql65w80b8anh5nb2sbxg5pdzw-gammaloop-nextest-spenso
  346. 19.22 s Last 325 log lines:
  347. 19.22 s > Extracting 5 binaries and 2 linked paths to /build/nextest-archive-mi7o37
  348. 19.22 s > Extracted 19 files to /build/nextest-archive-mi7o37 in 0.17s
  349. 19.22 s > ------------
  350. 19.22 s > Nextest run ID 9ed749c7-4762-4bd9-8ff4-40966848bb20 with nextest profile: ci_gammaloop
  351. 19.22 s > Starting 224 tests across 5 binaries (26 tests skipped, including 2 tests via profile.ci_gammaloop.default-filter)
  352. 19.22 s > FAIL [ 0.011s] ( 46/224) idenso color::test::form_reference::metric_contraction_respects_antisymmetric_normalization
  353. 19.22 s > stdout ---
  354. 19.22 s >
  355. 19.22 s > running 1 test
  356. 19.22 s > test color::test::form_reference::metric_contraction_respects_antisymmetric_normalization ... FAILED
  357. 19.22 s >
  358. 19.22 s > failures:
  359. 19.22 s >
  360. 19.22 s > failures:
  361. 19.22 s > color::test::form_reference::metric_contraction_respects_antisymmetric_normalization
  362. 19.22 s >
  363. 19.22 s > test result: FAILED. 0 passed; 1 failed; 0 ignored; 0 measured; 240 filtered out; finished in 0.00s
  364. 19.22 s >
  365. 19.22 s > stderr ---
  366. 19.22 s >
  367. 19.22 s > thread 'color::test::form_reference::metric_contraction_respects_antisymmetric_normalization' (338) panicked at crates/idenso/src/color/test/form_reference.rs:171:5:
  368. 19.22 s > assertion `left == right` failed
  369. 19.22 s > left: "-1*f(coad(8,standalone_metric_j),coad(8,standalone_metric_s),coad(8,standalone_metric_u))"
  370. 19.22 s > right: "f(coad(8,standalone_metric_j),coad(8,standalone_metric_s),coad(8,standalone_metric_u))"
  371. 19.22 s > stack backtrace:
  372. 19.22 s > 0: __rustc::rust_begin_unwind
  373. 19.22 s > 1: core::panicking::panic_fmt
  374. 19.22 s > 2: core::panicking::assert_failed_inner
  375. 19.22 s > 3: core::panicking::assert_failed::<alloc::string::String, alloc::string::String>
  376. 19.22 s > 4: idenso::color::test::form_reference::metric_contraction_respects_antisymmetric_normalization
  377. 19.22 s > 5: <idenso::color::test::form_reference::metric_contraction_respects_antisymmetric_normalization::{closure#0} as core::ops::function::FnOnce<()>>::call_once
  378. 19.22 s > note: Some details are omitted, run with `RUST_BACKTRACE=full` for a verbose backtrace.
  379. 19.22 s >
  380. 19.22 s > FAIL [ 0.201s] (221/224) idenso tensor::tests::parsing::infinite_execution
  381. 19.22 s > stdout ---
  382. 19.22 s >
  383. 19.22 s > running 1 test
  384. 19.22 s > ━━━━━━━━━━━━━━━━━━━━━━━━━━━━━━━ Snapshot Summary ━━━━━━━━━━━━━━━━━━━━━━━━━━━━━━━
  385. 19.22 s > Snapshot: infinite_execution
  386. 19.22 s > Source: crates/idenso/src/tensor/tests/parsing.rs:910
  387. 19.22 s > ────────────────────────────────────────────────────────────────────────────────
  388. 19.22 s > Expression: net_iter.snapshot_dot()
  389. 19.22 s > ────────────────────────────────────────────────────────────────────────────────
  390. 19.22 s > -old snapshot
  391. 19.22 s > +new results
  392. 19.22 s > ────────────┬───────────────────────────────────────────────────────────────────
  393. 19.22 s > 8 8 │ 0:0:s -> ext0 [id=0 color="red"];
  394. 19.22 s > 9 9 │ ext1 [style=invis];
  395. 19.22 s > 10 10 │ 0:5:s -> ext1 [id=1 dir=none color="red" label="mink4|l_0"];
  396. 19.22 s > 11 11 │ ext2 [style=invis];
  397. 19.22 s > 12 │- 0:4:s -> ext2 [id=2 dir=none color="red" label="bis4|l_2"];
  398. 19.22 s > 12 │+ 0:3:s -> ext2 [id=2 dir=none color="red" label="mink4|l_1"];
  399. 19.22 s > 13 13 │ ext3 [style=invis];
  400. 19.22 s > 14 │- 0:3:s -> ext3 [id=3 dir=none color="red" label="bis4|l_3"];
  401. 19.22 s > 14 │+ 0:1:s -> ext3 [id=3 dir=none color="red" label="bis4|l_2"];
  402. 19.22 s > 15 15 │ ext4 [style=invis];
  403. 19.22 s > 16 │- 0:1:s -> ext4 [id=4 dir=none color="red" label="mink4|l_1"];
  404. 19.22 s > 16 │+ 0:2:s -> ext4 [id=4 dir=none color="red" label="mink4|l_4"];
  405. 19.22 s > 17 17 │ ext5 [style=invis];
  406. 19.22 s > 18 │- 0:2:s -> ext5 [id=5 dir=none color="red" label="mink4|l_4"];
  407. 19.22 s > 18 │+ 0:4:s -> ext5 [id=5 dir=none color="red" label="bis4|l_3"];
  408. 19.22 s > 19 19 │ }
  409. 19.22 s > ────────────┴───────────────────────────────────────────────────────────────────
  410. 19.22 s > To update snapshots run `cargo insta review`
  411. 19.22 s > Stopped on the first failure. Run `cargo insta test` to run all snapshots.
  412. 19.22 s > test tensor::tests::parsing::infinite_execution ... FAILED
  413. 19.22 s >
  414. 19.22 s > failures:
  415. 19.22 s >
  416. 19.22 s > failures:
  417. 19.22 s > tensor::tests::parsing::infinite_execution
  418. 19.22 s >
  419. 19.22 s > test result: FAILED. 0 passed; 1 failed; 0 ignored; 0 measured; 240 filtered out; finished in 0.19s
  420. 19.22 s >
  421. 19.22 s > stderr ---
  422. 19.22 s >
  423. 19.22 s > thread 'tensor::tests::parsing::infinite_execution' (838) panicked at /nix/store/hvwd4qqiaadc4s871lfyylxrciqrvlgs-vendor-cargo-deps/c19b7c6f923b580ac259164a89f2577984ad5ab09ee9d583b888f934adbbe8d0/insta-1.47.2/src/runtime.rs:719:13:
  424. 19.22 s > snapshot assertion for 'infinite_execution' failed in line 910
  425. 19.22 s > stack backtrace:
  426. 19.22 s > 0: __rustc::rust_begin_unwind
  427. 19.22 s > 1: core::panicking::panic_fmt
  428. 19.22 s > 2: insta::runtime::assert_snapshot
  429. 19.22 s > 3: idenso::tensor::tests::parsing::infinite_execution
  430. 19.22 s > 4: <idenso::tensor::tests::parsing::infinite_execution::{closure#0} as core::ops::function::FnOnce<()>>::call_once
  431. 19.22 s > note: Some details are omitted, run with `RUST_BACKTRACE=full` for a verbose backtrace.
  432. 19.22 s >
  433. 19.22 s > ------------
  434. 19.22 s > Summary [ 1.765s] 224 tests run: 222 passed, 2 failed, 26 skipped
  435. 19.22 s > FAIL [ 0.011s] ( 46/224) idenso color::test::form_reference::metric_contraction_respects_antisymmetric_normalization
  436. 19.22 s > stdout ---
  437. 19.22 s >
  438. 19.22 s > running 1 test
  439. 19.22 s > test color::test::form_reference::metric_contraction_respects_antisymmetric_normalization ... FAILED
  440. 19.22 s >
  441. 19.22 s > failures:
  442. 19.22 s >
  443. 19.22 s > failures:
  444. 19.22 s > color::test::form_reference::metric_contraction_respects_antisymmetric_normalization
  445. 19.22 s >
  446. 19.22 s > test result: FAILED. 0 passed; 1 failed; 0 ignored; 0 measured; 240 filtered out; finished in 0.00s
  447. 19.22 s >
  448. 19.22 s > stderr ---
  449. 19.22 s >
  450. 19.22 s > thread 'color::test::form_reference::metric_contraction_respects_antisymmetric_normalization' (338) panicked at crates/idenso/src/color/test/form_reference.rs:171:5:
  451. 19.22 s > assertion `left == right` failed
  452. 19.22 s > left: "-1*f(coad(8,standalone_metric_j),coad(8,standalone_metric_s),coad(8,standalone_metric_u))"
  453. 19.22 s > right: "f(coad(8,standalone_metric_j),coad(8,standalone_metric_s),coad(8,standalone_metric_u))"
  454. 19.22 s > stack backtrace:
  455. 19.22 s > 0: __rustc::rust_begin_unwind
  456. 19.22 s > 1: core::panicking::panic_fmt
  457. 19.22 s > 2: core::panicking::assert_failed_inner
  458. 19.22 s > 3: core::panicking::assert_failed::<alloc::string::String, alloc::string::String>
  459. 19.22 s > 4: idenso::color::test::form_reference::metric_contraction_respects_antisymmetric_normalization
  460. 19.22 s > 5: <idenso::color::test::form_reference::metric_contraction_respects_antisymmetric_normalization::{closure#0} as core::ops::function::FnOnce<()>>::call_once
  461. 19.22 s > note: Some details are omitted, run with `RUST_BACKTRACE=full` for a verbose backtrace.
  462. 19.22 s >
  463. 19.22 s > FAIL [ 0.201s] (221/224) idenso tensor::tests::parsing::infinite_execution
  464. 19.22 s > stdout ---
  465. 19.22 s >
  466. 19.22 s > running 1 test
  467. 19.22 s > ━━━━━━━━━━━━━━━━━━━━━━━━━━━━━━━ Snapshot Summary ━━━━━━━━━━━━━━━━━━━━━━━━━━━━━━━
  468. 19.22 s > Snapshot: infinite_execution
  469. 19.22 s > Source: crates/idenso/src/tensor/tests/parsing.rs:910
  470. 19.22 s > ────────────────────────────────────────────────────────────────────────────────
  471. 19.22 s > Expression: net_iter.snapshot_dot()
  472. 19.22 s > ────────────────────────────────────────────────────────────────────────────────
  473. 19.22 s > -old snapshot
  474. 19.22 s > +new results
  475. 19.22 s > ────────────┬───────────────────────────────────────────────────────────────────
  476. 19.22 s > 8 8 │ 0:0:s -> ext0 [id=0 color="red"];
  477. 19.22 s > 9 9 │ ext1 [style=invis];
  478. 19.22 s > 10 10 │ 0:5:s -> ext1 [id=1 dir=none color="red" label="mink4|l_0"];
  479. 19.22 s > 11 11 │ ext2 [style=invis];
  480. 19.22 s > 12 │- 0:4:s -> ext2 [id=2 dir=none color="red" label="bis4|l_2"];
  481. 19.22 s > 12 │+ 0:3:s -> ext2 [id=2 dir=none color="red" label="mink4|l_1"];
  482. 19.22 s > 13 13 │ ext3 [style=invis];
  483. 19.22 s > 14 │- 0:3:s -> ext3 [id=3 dir=none color="red" label="bis4|l_3"];
  484. 19.22 s > 14 │+ 0:1:s -> ext3 [id=3 dir=none color="red" label="bis4|l_2"];
  485. 19.22 s > 15 15 │ ext4 [style=invis];
  486. 19.22 s > 16 │- 0:1:s -> ext4 [id=4 dir=none color="red" label="mink4|l_1"];
  487. 19.22 s > 16 │+ 0:2:s -> ext4 [id=4 dir=none color="red" label="mink4|l_4"];
  488. 19.22 s > 17 17 │ ext5 [style=invis];
  489. 19.22 s > 18 │- 0:2:s -> ext5 [id=5 dir=none color="red" label="mink4|l_4"];
  490. 19.22 s > 18 │+ 0:4:s -> ext5 [id=5 dir=none color="red" label="bis4|l_3"];
  491. 19.22 s > 19 19 │ }
  492. 19.22 s > ────────────┴───────────────────────────────────────────────────────────────────
  493. 19.22 s > To update snapshots run `cargo insta review`
  494. 19.22 s > Stopped on the first failure. Run `cargo insta test` to run all snapshots.
  495. 19.22 s > test tensor::tests::parsing::infinite_execution ... FAILED
  496. 19.22 s >
  497. 19.22 s > failures:
  498. 19.22 s >
  499. 19.22 s > failures:
  500. 19.22 s > tensor::tests::parsing::infinite_execution
  501. 19.22 s >
  502. 19.22 s > test result: FAILED. 0 passed; 1 failed; 0 ignored; 0 measured; 240 filtered out; finished in 0.19s
  503. 19.22 s >
  504. 19.22 s > stderr ---
  505. 19.22 s >
  506. 19.22 s > thread 'tensor::tests::parsing::infinite_execution' (838) panicked at /nix/store/hvwd4qqiaadc4s871lfyylxrciqrvlgs-vendor-cargo-deps/c19b7c6f923b580ac259164a89f2577984ad5ab09ee9d583b888f934adbbe8d0/insta-1.47.2/src/runtime.rs:719:13:
  507. 19.22 s > snapshot assertion for 'infinite_execution' failed in line 910
  508. 19.22 s > stack backtrace:
  509. 19.22 s > 0: __rustc::rust_begin_unwind
  510. 19.22 s > 1: core::panicking::panic_fmt
  511. 19.22 s > 2: insta::runtime::assert_snapshot
  512. 19.22 s > 3: idenso::tensor::tests::parsing::infinite_execution
  513. 19.22 s > 4: <idenso::tensor::tests::parsing::infinite_execution::{closure#0} as core::ops::function::FnOnce<()>>::call_once
  514. 19.22 s > note: Some details are omitted, run with `RUST_BACKTRACE=full` for a verbose backtrace.
  515. 19.22 s >
  516. 19.22 s > error: test run failed
  517. 19.22 s >
  518. 19.22 s > ========== nextest test summary ==========
  519. 19.22 s > report: target/nextest/ci_gammaloop/junit.xml
  520. 19.22 s > tests: 224, failures: 2, errors: 0
  521. 19.22 s >
  522. 19.22 s > 1. idenso::color::test::form_reference::metric_contraction_respects_antisymmetric_normalization
  523. 19.22 s > failure: test failure with exit code 101
  524. 19.22 s > thread 'color::test::form_reference::metric_contraction_respects_antisymmetric_normalization' (338) panicked at crates/idenso/src/color/test/form_reference.rs:171:5:
  525. 19.22 s > assertion `left == right` failed
  526. 19.22 s > left: "-1*f(coad(8,standalone_metric_j),coad(8,standalone_metric_s),coad(8,standalone_metric_u))"
  527. 19.22 s > right: "f(coad(8,standalone_metric_j),coad(8,standalone_metric_s),coad(8,standalone_metric_u))"
  528. 19.22 s > stack backtrace:
  529. 19.22 s > 0: __rustc::rust_begin_unwind
  530. 19.22 s > 1: core::panicking::panic_fmt
  531. 19.22 s > 2: core::panicking::assert_failed_inner
  532. 19.22 s > 3: core::panicking::assert_failed::<alloc::string::String, alloc::string::String>
  533. 19.22 s > 4: idenso::color::test::form_reference::metric_contraction_respects_antisymmetric_normalization
  534. 19.22 s > 5: <idenso::color::test::form_reference::metric_contraction_respects_antisymmetric_normalization::{closure#0} as core::ops::function::FnOnce<()>>::call_once
  535. 19.22 s > note: Some details are omitted, run with `RUST_BACKTRACE=full` for a verbose backtrace.
  536. 19.22 s > system-out
  537. 19.22 s > running 1 test
  538. 19.22 s > test color::test::form_reference::metric_contraction_respects_antisymmetric_normalization ... FAILED
  539. 19.22 s >
  540. 19.22 s > failures:
  541. 19.22 s >
  542. 19.22 s > failures:
  543. 19.22 s > color::test::form_reference::metric_contraction_respects_antisymmetric_normalization
  544. 19.22 s >
  545. 19.22 s > test result: FAILED. 0 passed; 1 failed; 0 ignored; 0 measured; 240 filtered out; finished in 0.00s
  546. 19.22 s > system-err
  547. 19.22 s > thread 'color::test::form_reference::metric_contraction_respects_antisymmetric_normalization' (338) panicked at crates/idenso/src/color/test/form_reference.rs:171:5:
  548. 19.22 s > assertion `left == right` failed
  549. 19.22 s > left: "-1*f(coad(8,standalone_metric_j),coad(8,standalone_metric_s),coad(8,standalone_metric_u))"
  550. 19.22 s > right: "f(coad(8,standalone_metric_j),coad(8,standalone_metric_s),coad(8,standalone_metric_u))"
  551. 19.22 s > stack backtrace:
  552. 19.22 s > 0: __rustc::rust_begin_unwind
  553. 19.22 s > 1: core::panicking::panic_fmt
  554. 19.22 s > 2: core::panicking::assert_failed_inner
  555. 19.22 s > 3: core::panicking::assert_failed::<alloc::string::String, alloc::string::String>
  556. 19.22 s > 4: idenso::color::test::form_reference::metric_contraction_respects_antisymmetric_normalization
  557. 19.22 s > 5: <idenso::color::test::form_reference::metric_contraction_respects_antisymmetric_normalization::{closure#0} as core::ops::function::FnOnce<()>>::call_once
  558. 19.22 s > note: Some details are omitted, run with `RUST_BACKTRACE=full` for a verbose backtrace.
  559. 19.22 s >
  560. 19.22 s > 2. idenso::tensor::tests::parsing::infinite_execution
  561. 19.22 s > failure: test failure with exit code 101
  562. 19.22 s > thread 'tensor::tests::parsing::infinite_execution' (838) panicked at /nix/store/hvwd4qqiaadc4s871lfyylxrciqrvlgs-vendor-cargo-deps/c19b7c6f923b580ac259164a89f2577984ad5ab09ee9d583b888f934adbbe8d0/insta-1.47.2/src/runtime.rs:719:13:
  563. 19.22 s > snapshot assertion for 'infinite_execution' failed in line 910
  564. 19.22 s > stack backtrace:
  565. 19.22 s > 0: __rustc::rust_begin_unwind
  566. 19.22 s > 1: core::panicking::panic_fmt
  567. 19.22 s > 2: insta::runtime::assert_snapshot
  568. 19.22 s > 3: idenso::tensor::tests::parsing::infinite_execution
  569. 19.22 s > 4: <idenso::tensor::tests::parsing::infinite_execution::{closure#0} as core::ops::function::FnOnce<()>>::call_once
  570. 19.22 s > note: Some details are omitted, run with `RUST_BACKTRACE=full` for a verbose backtrace.
  571. 19.22 s > system-out
  572. 19.22 s > running 1 test
  573. 19.22 s > ━━━━━━━━━━━━━━━━━━━━━━━━━━━━━━━ Snapshot Summary ━━━━━━━━━━━━━━━━━━━━━━━━━━━━━━━
  574. 19.22 s > Snapshot: infinite_execution
  575. 19.22 s > Source: crates/idenso/src/tensor/tests/parsing.rs:910
  576. 19.22 s > ────────────────────────────────────────────────────────────────────────────────
  577. 19.22 s > Expression: net_iter.snapshot_dot()
  578. 19.22 s > ────────────────────────────────────────────────────────────────────────────────
  579. 19.22 s > -old snapshot
  580. 19.22 s > +new results
  581. 19.22 s > ────────────┬───────────────────────────────────────────────────────────────────
  582. 19.22 s > 8 8 │ 0:0:s-> ext0 [id=0 color="red"];
  583. 19.22 s > 9 9 │ ext1 [style=invis];
  584. 19.22 s > 10 10 │ 0:5:s-> ext1 [id=1 dir=none color="red" label="mink4|l_0"];
  585. 19.22 s > 11 11 │ ext2 [style=invis];
  586. 19.22 s > 12 │- 0:4:s-> ext2 [id=2 dir=none color="red" label="bis4|l_2"];
  587. 19.22 s > 12 │+ 0:3:s-> ext2 [id=2 dir=none color="red" label="mink4|l_1"];
  588. 19.22 s > 13 13 │ ext3 [style=invis];
  589. 19.22 s > 14 │- 0:3:s-> ext3 [id=3 dir=none color="red" label="bis4|l_3"];
  590. 19.22 s > 14 │+ 0:1:s-> ext3 [id=3 dir=none color="red" label="bis4|l_2"];
  591. 19.22 s > 15 15 │ ext4 [style=invis];
  592. 19.22 s > 16 │- 0:1:s-> ext4 [id=4 dir=none color="red" label="mink4|l_1"];
  593. 19.22 s > 16 │+ 0:2:s-> ext4 [id=4 dir=none color="red" label="mink4|l_4"];
  594. 19.22 s > 17 17 │ ext5 [style=invis];
  595. 19.22 s > 18 │- 0:2:s-> ext5 [id=5 dir=none color="red" label="mink4|l_4"];
  596. 19.22 s > 18 │+ 0:4:s-> ext5 [id=5 dir=none color="red" label="bis4|l_3"];
  597. 19.22 s > 19 19 │ }
  598. 19.22 s > ────────────┴───────────────────────────────────────────────────────────────────
  599. 19.22 s > To update snapshots run `cargo insta review`
  600. 19.22 s > Stopped on the first failure. Run `cargo insta test` to run all snapshots.
  601. 19.22 s > test tensor::tests::parsing::infinite_execution ... FAILED
  602. 19.22 s >
  603. 19.22 s > failures:
  604. 19.22 s >
  605. 19.22 s > failures:
  606. 19.22 s > tensor::tests::parsing::infinite_execution
  607. 19.22 s >
  608. 19.22 s > test result: FAILED. 0 passed; 1 failed; 0 ignored; 0 measured; 240 filtered out; finished in 0.19s
  609. 19.22 s > system-err
  610. 19.22 s > thread 'tensor::tests::parsing::infinite_execution' (838) panicked at /nix/store/hvwd4qqiaadc4s871lfyylxrciqrvlgs-vendor-cargo-deps/c19b7c6f923b580ac259164a89f2577984ad5ab09ee9d583b888f934adbbe8d0/insta-1.47.2/src/runtime.rs:719:13:
  611. 19.22 s > snapshot assertion for 'infinite_execution' failed in line 910
  612. 19.22 s > stack backtrace:
  613. 19.22 s > 0: __rustc::rust_begin_unwind
  614. 19.22 s > 1: core::panicking::panic_fmt
  615. 19.22 s > 2: insta::runtime::assert_snapshot
  616. 19.22 s > 3: idenso::tensor::tests::parsing::infinite_execution
  617. 19.22 s > 4: <idenso::tensor::tests::parsing::infinite_execution::{closure#0} as core::ops::function::FnOnce<()>>::call_once
  618. 19.22 s > note: Some details are omitted, run with `RUST_BACKTRACE=full` for a verbose backtrace.
  619. 19.22 s > =========================================
  620. 19.22 s > Extracting 2 binaries and 1 linked path to /build/nextest-archive-vezPBH
  621. 19.22 s > Extracted 8 files to /build/nextest-archive-vezPBH in 0.07s
  622. 19.22 s > ------------
  623. 19.22 s > Nextest run ID da380506-786c-4264-b2ae-41837ff72fc2 with nextest profile: ci_gammaloop
  624. 19.22 s > Starting 135 tests across 2 binaries
  625. 19.22 s > ------------
  626. 19.22 s > Summary [ 0.080s] 135 tests run: 135 passed, 0 skipped
  627. 19.22 s >
  628. 19.22 s > ========== nextest test summary ==========
  629. 19.22 s > report: target/nextest/ci_gammaloop/junit.xml
  630. 19.22 s > tests: 135, failures: 0, errors: 0
  631. 19.22 s > No failing testcases found.
  632. 19.22 s > =========================================
  633. 19.22 s > Extracting 5 binaries and 2 linked paths to /build/nextest-archive-twOboA
  634. 19.22 s > Extracted 19 files to /build/nextest-archive-twOboA in 0.21s
  635. 19.22 s > ------------
  636. 19.22 s > Nextest run ID 1b444be8-f16b-4a29-9fc1-9eb6021667c3 with nextest profile: ci_gammaloop
  637. 19.22 s > Starting 25 tests across 5 binaries (1 test skipped via profile.ci_gammaloop.default-filter)
  638. 19.22 s > ------------
  639. 19.22 s > Summary [ 0.210s] 25 tests run: 25 passed, 1 skipped
  640. 19.22 s >
  641. 19.22 s > ========== nextest test summary ==========
  642. 19.22 s > report: target/nextest/ci_gammaloop/junit.xml
  643. 19.22 s > tests: 25, failures: 0, errors: 0
  644. 19.22 s > No failing testcases found.
  645. 19.22 s > =========================================
  646. 19.22 s > Extracting 2 binaries and 1 linked path to /build/nextest-archive-gWCHtK
  647. 19.22 s > Extracted 8 files to /build/nextest-archive-gWCHtK in 0.06s
  648. 19.22 s > ------------
  649. 19.22 s > Nextest run ID 158a9c44-83f9-415f-ae23-6ef8abfd3a02 with nextest profile: ci_gammaloop
  650. 19.22 s > Starting 1 test across 2 binaries
  651. 19.22 s > ------------
  652. 19.22 s > Summary [ 0.005s] 1 test run: 1 passed, 0 skipped
  653. 19.22 s >
  654. 19.22 s > ========== nextest test summary ==========
  655. 19.22 s > report: target/nextest/ci_gammaloop/junit.xml
  656. 19.22 s > tests: 1, failures: 0, errors: 0
  657. 19.22 s > No failing testcases found.
  658. 19.22 s > =========================================
  659. 19.22 s > Extracting 1 binary and 1 linked path to /build/nextest-archive-DuTeUv
  660. 19.22 s > Extracted 7 files to /build/nextest-archive-DuTeUv in 0.05s
  661. 19.22 s > ------------
  662. 19.22 s > Nextest run ID d70a6a69-c7c6-490b-b2f0-f063773c04eb with nextest profile: ci_gammaloop
  663. 19.22 s > Starting 0 tests across 1 binary
  664. 19.22 s > ------------
  665. 19.22 s > Summary [ 0.000s] 0 tests run: 0 passed, 0 skipped
  666. 19.22 s >
  667. 19.22 s > ========== nextest test summary ==========
  668. 19.22 s > report: target/nextest/ci_gammaloop/junit.xml
  669. 19.22 s > tests: 0, failures: 0, errors: 0
  670. 19.22 s > No failing testcases found.
  671. 19.22 s > =========================================
  672. 19.22 s For full logs, run:
  673. 19.22 s nix log /nix/store/f7dlapwy00q35hpz63fxwqijy6397ql2-gammaloop-nextest-spenso.drv
  674. 19.32 s [0 built (1 failed), 0.0Run failed.