1. 0.90 s $ /nix/store/9ypz3flqsrl5xl495mm8h645gadjsxi1-coreutils-9.11/bin/timeout --kill-after=15s 7200s /nix/store/23zk8sgzamrbmj1fday15szf7f2279s8-nix-2.34.7/bin/nix --extra-experimental-features nix-command --extra-experimental-features flakes flake clone git+https://github.com/alphal00p/gammaloop --dest /tmp/nix-ci-worker/stable-pwd/repo/
  2. 1.83 s Cloning into '/tmp/nix-ci-worker/stable-pwd/repo'...
  3. 1.83 s remote: Enumerating objects: 65034, done.
  4. 1.83 s remote: Counting objects: 0% (1/7685) remote: Counting objects: 1% (77/7685) remote: Counting objects: 2% (154/7685) remote: Counting objects: 3% (231/7685) remote: Counting objects: 4% (308/7685) remote: Counting objects: 5% (385/7685) remote: Counting objects: 6% (462/7685) remote: Counting objects: 7% (538/7685) remote: Counting objects: 8% (615/7685) remote: Counting objects: 9% (692/7685) remote: Counting objects: 10% (769/7685) remote: Counting objects: 11% (846/7685) remote: Counting objects: 12% (923/7685) remote: Counting objects: 13% (1000/7685) remote: Counting objects: 14% (1076/7685) remote: Counting objects: 15% (1153/7685) remote: Counting objects: 16% (1230/7685) remote: Counting objects: 17% (1307/7685) remote: Counting objects: 18% (1384/7685) remote: Counting objects: 19% (1461/7685) remote: Counting objects: 20% (1537/7685) remote: Counting objects: 21% (1614/7685) remote: Counting objects: 22% (1691/7685) remote: Counting objects: 23% (1768/7685) remote: Counting objects: 24% (1845/7685) remote: Counting objects: 25% (1922/7685) remote: Counting objects: 26% (1999/7685) remote: Counting objects: 27% (2075/7685) remote: Counting objects: 28% (2152/7685) remote: Counting objects: 29% (2229/7685) remote: Counting objects: 30% (2306/7685) remote: Counting objects: 31% (2383/7685) remote: Counting objects: 32% (2460/7685) remote: Counting objects: 33% (2537/7685) remote: Counting objects: 34% (2613/7685) remote: Counting objects: 35% (2690/7685) remote: Counting objects: 36% (2767/7685) remote: Counting objects: 37% (2844/7685) remote: Counting objects: 38% (2921/7685) remote: Counting objects: 39% (2998/7685) remote: Counting objects: 40% (3074/7685) remote: Counting objects: 41% (3151/7685) remote: Counting objects: 42% (3228/7685) remote: Counting objects: 43% (3305/7685) remote: Counting objects: 44% (3382/7685) remote: Counting objects: 45% (3459/7685) remote: Counting objects: 46% (3536/7685) remote: Counting objects: 47% (3612/7685) remote: Counting objects: 48% (3689/7685) remote: Counting objects: 49% (3766/7685) remote: Counting objects: 50% (3843/7685) remote: Counting objects: 51% (3920/7685) remote: Counting objects: 52% (3997/7685) remote: Counting objects: 53% (4074/7685) remote: Counting objects: 54% (4150/7685) remote: Counting objects: 55% (4227/7685) remote: Counting objects: 56% (4304/7685) remote: Counting objects: 57% (4381/7685) remote: Counting objects: 58% (4458/7685) remote: Counting objects: 59% (4535/7685) remote: Counting objects: 60% (4611/7685) remote: Counting objects: 61% (4688/7685) remote: Counting objects: 62% (4765/7685) remote: Counting objects: 63% (4842/7685) remote: Counting objects: 64% (4919/7685) remote: Counting objects: 65% (4996/7685) remote: Counting objects: 66% (5073/7685) remote: Counting objects: 67% (5149/7685) remote: Counting objects: 68% (5226/7685) remote: Counting objects: 69% (5303/7685) remote: Counting objects: 70% (5380/7685) remote: Counting objects: 71% (5457/7685) remote: Counting objects: 72% (5534/7685) remote: Counting objects: 73% (5611/7685) remote: Counting objects: 74% (5687/7685) remote: Counting objects: 75% (5764/7685) remote: Counting objects: 76% (5841/7685) remote: Counting objects: 77% (5918/7685) remote: Counting objects: 78% (5995/7685) remote: Counting objects: 79% (6072/7685) remote: Counting objects: 80% (6148/7685) remote: Counting objects: 81% (6225/7685) remote: Counting objects: 82% (6302/7685) remote: Counting objects: 83% (6379/7685) remote: Counting objects: 84% (6456/7685) remote: Counting objects: 85% (6533/7685) remote: Counting objects: 86% (6610/7685) remote: Counting objects: 87% (6686/7685) remote: Counting objects: 88% (6763/7685) remote: Counting objects: 89% (6840/7685) remote: Counting objects: 90% (6917/7685) remote: Counting objects: 91% (6994/7685) remote: Counting objects: 92% (7071/7685) remote: Counting objects: 93% (7148/7685) remote: Counting objects: 94% (7224/7685) remote: Counting objects: 95% (7301/7685) remote: Counting objects: 96% (7378/7685) remote: Counting objects: 97% (7455/7685) remote: Counting objects: 98% (7532/7685) remote: Counting objects: 99% (7609/7685) remote: Counting objects: 100% (7685/7685) remote: Counting objects: 100% (7685/7685), done.
  5. 2.24 s remote: Compressing objects: 0% (1/1415) remote: Compressing objects: 1% (15/1415) remote: Compressing objects: 2% (29/1415) remote: Compressing objects: 3% (43/1415) remote: Compressing objects: 4% (57/1415) remote: Compressing objects: 5% (71/1415) remote: Compressing objects: 6% (85/1415) remote: Compressing objects: 7% (100/1415) remote: Compressing objects: 8% (114/1415) remote: Compressing objects: 9% (128/1415) remote: Compressing objects: 10% (142/1415) remote: Compressing objects: 11% (156/1415) remote: Compressing objects: 12% (170/1415) remote: Compressing objects: 13% (184/1415) remote: Compressing objects: 13% (192/1415) remote: Compressing objects: 14% (199/1415) remote: Compressing objects: 15% (213/1415) remote: Compressing objects: 16% (227/1415) remote: Compressing objects: 17% (241/1415) remote: Compressing objects: 18% (255/1415) remote: Compressing objects: 19% (269/1415) remote: Compressing objects: 20% (283/1415) remote: Compressing objects: 21% (298/1415) remote: Compressing objects: 22% (312/1415) remote: Compressing objects: 23% (326/1415) remote: Compressing objects: 24% (340/1415) remote: Compressing objects: 25% (354/1415) remote: Compressing objects: 26% (368/1415) remote: Compressing objects: 27% (383/1415) remote: Compressing objects: 28% (397/1415) remote: Compressing objects: 29% (411/1415) remote: Compressing objects: 30% (425/1415) remote: Compressing objects: 31% (439/1415) remote: Compressing objects: 32% (453/1415) remote: Compressing objects: 33% (467/1415) remote: Compressing objects: 34% (482/1415) remote: Compressing objects: 35% (496/1415) remote: Compressing objects: 36% (510/1415) remote: Compressing objects: 37% (524/1415) remote: Compressing objects: 38% (538/1415) remote: Compressing objects: 39% (552/1415) remote: Compressing objects: 40% (566/1415) remote: Compressing objects: 41% (581/1415) remote: Compressing objects: 42% (595/1415) remote: Compressing objects: 43% (609/1415) remote: Compressing objects: 44% (623/1415) remote: Compressing objects: 45% (637/1415) remote: Compressing objects: 46% (651/1415) remote: Compressing objects: 47% (666/1415) remote: Compressing objects: 48% (680/1415) remote: Compressing objects: 49% (694/1415) remote: Compressing objects: 50% (708/1415) remote: Compressing objects: 51% (722/1415) remote: Compressing objects: 52% (736/1415) remote: Compressing objects: 53% (750/1415) remote: Compressing objects: 54% (765/1415) remote: Compressing objects: 55% (779/1415) remote: Compressing objects: 56% (793/1415) remote: Compressing objects: 57% (807/1415) remote: Compressing objects: 58% (821/1415) remote: Compressing objects: 59% (835/1415) remote: Compressing objects: 60% (849/1415) remote: Compressing objects: 61% (864/1415) remote: Compressing objects: 62% (878/1415) remote: Compressing objects: 63% (892/1415) remote: Compressing objects: 64% (906/1415) remote: Compressing objects: 65% (920/1415) remote: Compressing objects: 66% (934/1415) remote: Compressing objects: 67% (949/1415) remote: Compressing objects: 68% (963/1415) remote: Compressing objects: 69% (977/1415) remote: Compressing objects: 70% (991/1415) remote: Compressing objects: 71% (1005/1415) remote: Compressing objects: 72% (1019/1415) remote: Compressing objects: 73% (1033/1415) remote: Compressing objects: 74% (1048/1415) remote: Compressing objects: 75% (1062/1415) remote: Compressing objects: 76% (1076/1415) remote: Compressing objects: 77% (1090/1415) remote: Compressing objects: 78% (1104/1415) remote: Compressing objects: 79% (1118/1415) remote: Compressing objects: 80% (1132/1415) remote: Compressing objects: 81% (1147/1415) remote: Compressing objects: 82% (1161/1415) remote: Compressing objects: 83% (1175/1415) remote: Compressing objects: 84% (1189/1415) remote: Compressing objects: 85% (1203/1415) remote: Compressing objects: 86% (1217/1415) remote: Compressing objects: 87% (1232/1415) remote: Compressing objects: 88% (1246/1415) remote: Compressing objects: 89% (1260/1415) remote: Compressing objects: 90% (1274/1415) remote: Compressing objects: 91% (1288/1415) remote: Compressing objects: 92% (1302/1415) remote: Compressing objects: 93% (1316/1415) remote: Compressing objects: 94% (1331/1415) remote: Compressing objects: 95% (1345/1415) remote: Compressing objects: 96% (1359/1415) remote: Compressing objects: 97% (1373/1415) remote: Compressing objects: 98% (1387/1415) remote: Compressing objects: 99% (1401/1415) remote: Compressing objects: 100% (1415/1415) remote: Compressing objects: 100% (1415/1415), done.
  6. 4.90 s Receiving objects: 0% (1/65034) Receiving objects: 1% (651/65034) Receiving objects: 2% (1301/65034) Receiving objects: 3% (1952/65034) Receiving objects: 4% (2602/65034) Receiving objects: 5% (3252/65034) Receiving objects: 6% (3903/65034) Receiving objects: 7% (4553/65034) Receiving objects: 8% (5203/65034) Receiving objects: 9% (5854/65034) Receiving objects: 10% (6504/65034) Receiving objects: 11% (7154/65034) Receiving objects: 12% (7805/65034), 13.91 MiB | 27.81 MiB/s Receiving objects: 13% (8455/65034), 13.91 MiB | 27.81 MiB/s Receiving objects: 14% (9105/65034), 13.91 MiB | 27.81 MiB/s Receiving objects: 15% (9756/65034), 13.91 MiB | 27.81 MiB/s Receiving objects: 16% (10406/65034), 13.91 MiB | 27.81 MiB/s Receiving objects: 17% (11056/65034), 13.91 MiB | 27.81 MiB/s Receiving objects: 18% (11707/65034), 13.91 MiB | 27.81 MiB/s Receiving objects: 19% (12357/65034), 13.91 MiB | 27.81 MiB/s Receiving objects: 20% (13007/65034), 13.91 MiB | 27.81 MiB/s Receiving objects: 21% (13658/65034), 13.91 MiB | 27.81 MiB/s Receiving objects: 22% (14308/65034), 13.91 MiB | 27.81 MiB/s Receiving objects: 23% (14958/65034), 13.91 MiB | 27.81 MiB/s Receiving objects: 24% (15609/65034), 13.91 MiB | 27.81 MiB/s Receiving objects: 25% (16259/65034), 13.91 MiB | 27.81 MiB/s Receiving objects: 26% (16909/65034), 13.91 MiB | 27.81 MiB/s Receiving objects: 27% (17560/65034), 13.91 MiB | 27.81 MiB/s Receiving objects: 28% (18210/65034), 13.91 MiB | 27.81 MiB/s Receiving objects: 29% (18860/65034), 13.91 MiB | 27.81 MiB/s Receiving objects: 30% (19511/65034), 13.91 MiB | 27.81 MiB/s Receiving objects: 31% (20161/65034), 13.91 MiB | 27.81 MiB/s Receiving objects: 32% (20811/65034), 13.91 MiB | 27.81 MiB/s Receiving objects: 33% (21462/65034), 13.91 MiB | 27.81 MiB/s Receiving objects: 34% (22112/65034), 13.91 MiB | 27.81 MiB/s Receiving objects: 35% (22762/65034), 13.91 MiB | 27.81 MiB/s Receiving objects: 36% (23413/65034), 13.91 MiB | 27.81 MiB/s Receiving objects: 37% (24063/65034), 13.91 MiB | 27.81 MiB/s Receiving objects: 38% (24713/65034), 13.91 MiB | 27.81 MiB/s Receiving objects: 39% (25364/65034), 13.91 MiB | 27.81 MiB/s Receiving objects: 40% (26014/65034), 13.91 MiB | 27.81 MiB/s Receiving objects: 41% (26664/65034), 13.91 MiB | 27.81 MiB/s Receiving objects: 42% (27315/65034), 13.91 MiB | 27.81 MiB/s Receiving objects: 43% (27965/65034), 13.91 MiB | 27.81 MiB/s Receiving objects: 44% (28615/65034), 13.91 MiB | 27.81 MiB/s Receiving objects: 45% (29266/65034), 13.91 MiB | 27.81 MiB/s Receiving objects: 46% (29916/65034), 13.91 MiB | 27.81 MiB/s Receiving objects: 47% (30566/65034), 13.91 MiB | 27.81 MiB/s Receiving objects: 48% (31217/65034), 13.91 MiB | 27.81 MiB/s Receiving objects: 49% (31867/65034), 13.91 MiB | 27.81 MiB/s Receiving objects: 50% (32517/65034), 13.91 MiB | 27.81 MiB/s Receiving objects: 51% (33168/65034), 13.91 MiB | 27.81 MiB/s Receiving objects: 51% (33771/65034), 13.91 MiB | 27.81 MiB/s Receiving objects: 52% (33818/65034), 31.80 MiB | 31.79 MiB/s Receiving objects: 53% (34469/65034), 31.80 MiB | 31.79 MiB/s Receiving objects: 54% (35119/65034), 31.80 MiB | 31.79 MiB/s Receiving objects: 55% (35769/65034), 31.80 MiB | 31.79 MiB/s Receiving objects: 56% (36420/65034), 31.80 MiB | 31.79 MiB/s Receiving objects: 57% (37070/65034), 31.80 MiB | 31.79 MiB/s Receiving objects: 58% (37720/65034), 31.80 MiB | 31.79 MiB/s Receiving objects: 59% (38371/65034), 31.80 MiB | 31.79 MiB/s Receiving objects: 60% (39021/65034), 31.80 MiB | 31.79 MiB/s Receiving objects: 61% (39671/65034), 31.80 MiB | 31.79 MiB/s Receiving objects: 62% (40322/65034), 31.80 MiB | 31.79 MiB/s Receiving objects: 63% (40972/65034), 48.55 MiB | 32.36 MiB/s Receiving objects: 64% (41622/65034), 48.55 MiB | 32.36 MiB/s Receiving objects: 65% (42273/65034), 48.55 MiB | 32.36 MiB/s Receiving objects: 66% (42923/65034), 48.55 MiB | 32.36 MiB/s Receiving objects: 67% (43573/65034), 48.55 MiB | 32.36 MiB/s Receiving objects: 68% (44224/65034), 48.55 MiB | 32.36 MiB/s Receiving objects: 69% (44874/65034), 48.55 MiB | 32.36 MiB/s Receiving objects: 70% (45524/65034), 48.55 MiB | 32.36 MiB/s Receiving objects: 71% (46175/65034), 48.55 MiB | 32.36 MiB/s Receiving objects: 72% (46825/65034), 48.55 MiB | 32.36 MiB/s Receiving objects: 73% (47475/65034), 48.55 MiB | 32.36 MiB/s Receiving objects: 74% (48126/65034), 48.55 MiB | 32.36 MiB/s Receiving objects: 75% (48776/65034), 48.55 MiB | 32.36 MiB/s Receiving objects: 75% (48916/65034), 65.71 MiB | 32.85 MiB/s Receiving objects: 76% (49426/65034), 65.71 MiB | 32.85 MiB/s Receiving objects: 77% (50077/65034), 65.71 MiB | 32.85 MiB/s Receiving objects: 78% (50727/65034), 65.71 MiB | 32.85 MiB/s Receiving objects: 79% (51377/65034), 65.71 MiB | 32.85 MiB/s Receiving objects: 80% (52028/65034), 65.71 MiB | 32.85 MiB/s Receiving objects: 81% (52678/65034), 65.71 MiB | 32.85 MiB/s Receiving objects: 82% (53328/65034), 65.71 MiB | 32.85 MiB/s Receiving objects: 83% (53979/65034), 65.71 MiB | 32.85 MiB/s Receiving objects: 84% (54629/65034), 65.71 MiB | 32.85 MiB/s Receiving objects: 85% (55279/65034), 65.71 MiB | 32.85 MiB/s Receiving objects: 86% (55930/65034), 65.71 MiB | 32.85 MiB/s Receiving objects: 87% (56580/65034), 81.49 MiB | 32.54 MiB/s Receiving objects: 88% (57230/65034), 81.49 MiB | 32.54 MiB/s Receiving objects: 89% (57881/65034), 81.49 MiB | 32.54 MiB/s Receiving objects: 90% (58531/65034), 81.49 MiB | 32.54 MiB/s Receiving objects: 91% (59181/65034), 81.49 MiB | 32.54 MiB/s Receiving objects: 92% (59832/65034), 81.49 MiB | 32.54 MiB/s Receiving objects: 93% (60482/65034), 81.49 MiB | 32.54 MiB/s Receiving objects: 94% (61132/65034), 81.49 MiB | 32.54 MiB/s Receiving objects: 95% (61783/65034), 81.49 MiB | 32.54 MiB/s Receiving objects: 96% (62433/65034), 81.49 MiB | 32.54 MiB/s Receiving objects: 97% (63083/65034), 81.49 MiB | 32.54 MiB/s Receiving objects: 98% (63734/65034), 81.49 MiB | 32.54 MiB/s Receiving objects: 99% (64384/65034), 81.49 MiB | 32.54 MiB/s remote: Total 65034 (delta 6786), reused 6277 (delta 6269), pack-reused 57349 (from 1)
  7. 4.90 s Receiving objects: 100% (65034/65034), 81.49 MiB | 32.54 MiB/s Receiving objects: 100% (65034/65034), 86.98 MiB | 32.70 MiB/s, done.
  8. 6.59 s Resolving deltas: 0% (0/45904) Resolving deltas: 1% (460/45904) Resolving deltas: 2% (920/45904) Resolving deltas: 3% (1378/45904) Resolving deltas: 4% (1837/45904) Resolving deltas: 5% (2296/45904) Resolving deltas: 6% (2755/45904) Resolving deltas: 7% (3214/45904) Resolving deltas: 8% (3676/45904) Resolving deltas: 9% (4132/45904) Resolving deltas: 10% (4591/45904) Resolving deltas: 11% (5051/45904) Resolving deltas: 12% (5509/45904) Resolving deltas: 13% (5968/45904) Resolving deltas: 14% (6428/45904) Resolving deltas: 15% (6886/45904) Resolving deltas: 16% (7345/45904) Resolving deltas: 17% (7804/45904) Resolving deltas: 18% (8263/45904) Resolving deltas: 19% (8722/45904) Resolving deltas: 20% (9181/45904) Resolving deltas: 21% (9640/45904) Resolving deltas: 22% (10099/45904) Resolving deltas: 23% (10558/45904) Resolving deltas: 24% (11017/45904) Resolving deltas: 25% (11476/45904) Resolving deltas: 26% (11936/45904) Resolving deltas: 27% (12395/45904) Resolving deltas: 28% (12854/45904) Resolving deltas: 29% (13313/45904) Resolving deltas: 30% (13772/45904) Resolving deltas: 31% (14231/45904) Resolving deltas: 32% (14690/45904) Resolving deltas: 33% (15149/45904) Resolving deltas: 34% (15608/45904) Resolving deltas: 35% (16067/45904) Resolving deltas: 36% (16526/45904) Resolving deltas: 37% (16985/45904) Resolving deltas: 38% (17444/45904) Resolving deltas: 39% (17903/45904) Resolving deltas: 40% (18362/45904) Resolving deltas: 41% (18821/45904) Resolving deltas: 42% (19280/45904) Resolving deltas: 43% (19739/45904) Resolving deltas: 44% (20198/45904) Resolving deltas: 45% (20657/45904) Resolving deltas: 46% (21116/45904) Resolving deltas: 47% (21575/45904) Resolving deltas: 48% (22034/45904) Resolving deltas: 49% (22493/45904) Resolving deltas: 50% (22952/45904) Resolving deltas: 51% (23413/45904) Resolving deltas: 52% (23871/45904) Resolving deltas: 53% (24330/45904) Resolving deltas: 54% (24789/45904) Resolving deltas: 55% (25248/45904) Resolving deltas: 56% (25707/45904) Resolving deltas: 57% (26167/45904) Resolving deltas: 58% (26625/45904) Resolving deltas: 59% (27085/45904) Resolving deltas: 60% (27543/45904) Resolving deltas: 61% (28002/45904) Resolving deltas: 62% (28461/45904) Resolving deltas: 63% (28920/45904) Resolving deltas: 64% (29379/45904) Resolving deltas: 65% (29838/45904) Resolving deltas: 66% (30297/45904) Resolving deltas: 67% (30756/45904) Resolving deltas: 68% (31217/45904) Resolving deltas: 69% (31674/45904) Resolving deltas: 70% (32133/45904) Resolving deltas: 70% (32385/45904) Resolving deltas: 71% (32594/45904) Resolving deltas: 72% (33051/45904) Resolving deltas: 73% (33510/45904) Resolving deltas: 74% (33969/45904) Resolving deltas: 75% (34428/45904) Resolving deltas: 76% (34888/45904) Resolving deltas: 77% (35347/45904) Resolving deltas: 78% (35806/45904) Resolving deltas: 79% (36265/45904) Resolving deltas: 80% (36724/45904) Resolving deltas: 81% (37183/45904) Resolving deltas: 82% (37642/45904) Resolving deltas: 83% (38101/45904) Resolving deltas: 84% (38560/45904) Resolving deltas: 85% (39019/45904) Resolving deltas: 86% (39478/45904) Resolving deltas: 87% (39937/45904) Resolving deltas: 88% (40396/45904) Resolving deltas: 89% (40855/45904) Resolving deltas: 90% (41314/45904) Resolving deltas: 91% (41773/45904) Resolving deltas: 92% (42232/45904) Resolving deltas: 93% (42691/45904) Resolving deltas: 94% (43151/45904) Resolving deltas: 95% (43610/45904) Resolving deltas: 96% (44068/45904) Resolving deltas: 97% (44527/45904) Resolving deltas: 98% (44986/45904) Resolving deltas: 99% (45445/45904) Resolving deltas: 100% (45904/45904) Resolving deltas: 100% (45904/45904), done.
  9. 6.99 s Fetching commit 1de6cf5dc4b80d0f0bf9aa8e901ee6bd43e45b8d for vakint_rustred ...
  10. 6.99 s $ /nix/store/bcnisk3ydfgv26v2gw3zlky24g00yww2-git-2.54.0/bin/git fetch origin 1de6cf5dc4b80d0f0bf9aa8e901ee6bd43e45b8d
  11. 7.42 s From https://github.com/alphal00p/gammaloop
  12. 7.42 s * branch 1de6cf5dc4b80d0f0bf9aa8e901ee6bd43e45b8d -> FETCH_HEAD
  13. 7.44 s $ /nix/store/9ypz3flqsrl5xl495mm8h645gadjsxi1-coreutils-9.11/bin/timeout --kill-after=15s 7200s /nix/store/bcnisk3ydfgv26v2gw3zlky24g00yww2-git-2.54.0/bin/git -c advice.detachedHead=false checkout 1de6cf5dc4b80d0f0bf9aa8e901ee6bd43e45b8d
  14. 7.65 s HEAD is now at 1de6cf5d Implement FORM-less RustRed tensor mode
  15. 7.65 s $ /nix/store/9ypz3flqsrl5xl495mm8h645gadjsxi1-coreutils-9.11/bin/timeout --kill-after=15s 7200s /nix/store/23zk8sgzamrbmj1fday15szf7f2279s8-nix-2.34.7/bin/nix --extra-experimental-features nix-command --extra-experimental-features flakes --log-format internal-json run .#packages.x86_64-linux.nix-ci-check-gammaloop-nextest-spenso --print-build-logs
  16. 13.25 s
  17. 13.30 s Downloading cached gammaloop-nextest-binaries-spenso-idenso from https://cache.nix-ci.com
  18. 13.32 s Downloading cached gammaloop-nextest-binaries-spenso-spenso from https://cache.nix-ci.com
  19. 13.32 s Downloading cached gammaloop-nextest-binaries-spenso-spenso-hep-lib from https://cache.nix-ci.com
  20. 13.32 s Downloading cached gammaloop-nextest-binaries-spenso-spenso-macros from https://cache.nix-ci.com
  21. 13.32 s Downloading cached gammaloop-nextest-binaries-spenso-symbolica-utils from https://cache.nix-ci.com
  22. 13.61 s Downloaded cached gammaloop-nextest-binaries-spenso-spenso-macros (6.5 MiB) in 289ms
  23. 13.61 s Progress: 0 of 1 built, 1 of 7 downloaded from cache (4 downloading)
  24. 13.61 s Downloaded cached gammaloop-nextest-binaries-spenso-symbolica-utils (6.3 MiB) in 289ms
  25. 13.61 s Progress: 0 of 1 built, 2 of 7 downloaded from cache (3 downloading)
  26. 13.70 s Downloaded cached gammaloop-nextest-binaries-spenso-spenso (10.2 MiB) in 386ms
  27. 13.70 s Progress: 0 of 1 built, 3 of 7 downloaded from cache (2 downloading)
  28. 14.02 s Downloaded cached gammaloop-nextest-binaries-spenso-idenso (29.3 MiB) in 713ms
  29. 14.02 s Progress: 0 of 1 built, 4 of 7 downloaded from cache (1 downloading)
  30. 14.06 s Downloaded cached gammaloop-nextest-binaries-spenso-spenso-hep-lib (34 MiB) in 737ms
  31. 14.06 s Progress: 0 of 1 built, 5 of 7 downloaded from cache
  32. 14.06 s Downloading cached gammaloop-nextest-binaries-spenso from https://cache.nix-ci.com
  33. 14.06 s Downloaded cached gammaloop-nextest-binaries-spenso (1920 B) in 5ms
  34. 14.06 s Progress: 0 of 1 built, 6 of 7 downloaded from cache
  35. 14.06 s Downloading cached nix-ci-check-gammaloop-nextest-spenso from https://cache.nix-ci.com
  36. 14.07 s Downloaded cached nix-ci-check-gammaloop-nextest-spenso (1016 B) in 4ms
  37. 14.07 s Progress: 0 of 1 built, 7 of 7 downloaded from cache
  38. 22.50 s evaluating derivation 'g copying '/nix/store/yk26 evaluating derivation 'g copying '/nix/store/yk26 evaluating derivation 'g copying '/nix/store/yk26 evaluating derivation 'g copying '/nix/store/yk26 evaluating derivation 'g copying '/nix/store/yk26 evaluating derivation 'g copying '/nix/store/yk26 evaluating derivation 'g querying gammaloop-nexte [0.0 KiB DL] [0/1 built, 0.0 KiB DL] [1/0/1 built, 0.0 KiB DLgammaloop-nextest-spenso> Extracting 5 binaries and 2 linked paths to /build/nextest-archive-DieXcd
  39. 22.81 s gammaloop-nextest-spenso> Extracted 19 files to /build/nextest-archive-DieXcd in 0.31s
  40. 22.85 s gammaloop-nextest-spenso> ------------
  41. 22.85 s gammaloop-nextest-spenso> Nextest run ID cd011d7c-910c-434d-b2f0-0ad22c43d633 with nextest profile: ci_gammaloop
  42. 22.85 s gammaloop-nextest-spenso> Starting 224 tests across 5 binaries (26 tests skipped, including 2 tests via profile.ci_gammaloop.default-filter)
  43. 23.04 s gammaloop-nextest-spenso> FAIL [ 0.024s] ( 41/224) idenso color::test::form_reference::metric_contraction_respects_antisymmetric_normalization
  44. 23.04 s gammaloop-nextest-spenso> stdout ---
  45. 23.04 s gammaloop-nextest-spenso>
  46. 23.04 s gammaloop-nextest-spenso> running 1 test
  47. 23.04 s gammaloop-nextest-spenso> test color::test::form_reference::metric_contraction_respects_antisymmetric_normalization ... FAILED
  48. 23.04 s gammaloop-nextest-spenso>
  49. 23.04 s gammaloop-nextest-spenso> failures:
  50. 23.04 s gammaloop-nextest-spenso>
  51. 23.04 s gammaloop-nextest-spenso> failures:
  52. 23.04 s gammaloop-nextest-spenso> color::test::form_reference::metric_contraction_respects_antisymmetric_normalization
  53. 23.04 s gammaloop-nextest-spenso>
  54. 23.04 s gammaloop-nextest-spenso> test result: FAILED. 0 passed; 1 failed; 0 ignored; 0 measured; 240 filtered out; finished in 0.01s
  55. 23.04 s gammaloop-nextest-spenso>
  56. 23.04 s gammaloop-nextest-spenso> stderr ---
  57. 23.04 s gammaloop-nextest-spenso>
  58. 23.04 s gammaloop-nextest-spenso> thread 'color::test::form_reference::metric_contraction_respects_antisymmetric_normalization' (329) panicked at crates/idenso/src/color/test/form_reference.rs:171:5:
  59. 23.04 s gammaloop-nextest-spenso> assertion `left == right` failed
  60. 23.04 s gammaloop-nextest-spenso> left: "-1*f(coad(8,standalone_metric_j),coad(8,standalone_metric_s),coad(8,standalone_metric_u))"
  61. 23.04 s gammaloop-nextest-spenso> right: "f(coad(8,standalone_metric_j),coad(8,standalone_metric_s),coad(8,standalone_metric_u))"
  62. 23.04 s gammaloop-nextest-spenso> stack backtrace:
  63. 23.04 s gammaloop-nextest-spenso> 0: __rustc::rust_begin_unwind
  64. 23.04 s gammaloop-nextest-spenso> 1: core::panicking::panic_fmt
  65. 23.04 s gammaloop-nextest-spenso> 2: core::panicking::assert_failed_inner
  66. 23.04 s gammaloop-nextest-spenso> 3: core::panicking::assert_failed::<alloc::string::String, alloc::string::String>
  67. 23.04 s gammaloop-nextest-spenso> 4: idenso::color::test::form_reference::metric_contraction_respects_antisymmetric_normalization
  68. 23.04 s gammaloop-nextest-spenso> 5: <idenso::color::test::form_reference::metric_contraction_respects_antisymmetric_normalization::{closure#0} as core::ops::function::FnOnce<()>>::call_once
  69. 23.04 s gammaloop-nextest-spenso> note: Some details are omitted, run with `RUST_BACKTRACE=full` for a verbose backtrace.
  70. 23.04 s gammaloop-nextest-spenso>
  71. 23.67 s gammaloop-nextest-spenso> FAIL [ 0.113s] (219/224) idenso tensor::tests::parsing::infinite_execution
  72. 23.67 s gammaloop-nextest-spenso> stdout ---
  73. 23.67 s gammaloop-nextest-spenso>
  74. 23.67 s gammaloop-nextest-spenso> running 1 test
  75. 23.67 s gammaloop-nextest-spenso> ━━━━━━━━━━━━━━━━━━━━━━━━━━━━━━━ Snapshot Summary ━━━━━━━━━━━━━━━━━━━━━━━━━━━━━━━
  76. 23.67 s gammaloop-nextest-spenso> Snapshot: infinite_execution
  77. 23.67 s gammaloop-nextest-spenso> Source: crates/idenso/src/tensor/tests/parsing.rs:910
  78. 23.67 s gammaloop-nextest-spenso> ────────────────────────────────────────────────────────────────────────────────
  79. 23.67 s gammaloop-nextest-spenso> Expression: net_iter.snapshot_dot()
  80. 23.67 s gammaloop-nextest-spenso> ────────────────────────────────────────────────────────────────────────────────
  81. 23.67 s gammaloop-nextest-spenso> -old snapshot
  82. 23.67 s gammaloop-nextest-spenso> +new results
  83. 23.67 s gammaloop-nextest-spenso> ────────────┬───────────────────────────────────────────────────────────────────
  84. 23.67 s gammaloop-nextest-spenso> 8 8 │ 0:0:s -> ext0 [id=0 color="red"];
  85. 23.67 s gammaloop-nextest-spenso> 9 9 │ ext1 [style=invis];
  86. 23.67 s gammaloop-nextest-spenso> 10 10 │ 0:5:s -> ext1 [id=1 dir=none color="red" label="mink4|l_0"];
  87. 23.67 s gammaloop-nextest-spenso> 11 11 │ ext2 [style=invis];
  88. 23.67 s gammaloop-nextest-spenso> 12 │- 0:4:s -> ext2 [id=2 dir=none color="red" label="bis4|l_2"];
  89. 23.67 s gammaloop-nextest-spenso> 12 │+ 0:3:s -> ext2 [id=2 dir=none color="red" label="mink4|l_1"];
  90. 23.67 s gammaloop-nextest-spenso> 13 13 │ ext3 [style=invis];
  91. 23.67 s gammaloop-nextest-spenso> 14 │- 0:3:s -> ext3 [id=3 dir=none color="red" label="bis4|l_3"];
  92. 23.67 s gammaloop-nextest-spenso> 14 │+ 0:1:s -> ext3 [id=3 dir=none color="red" label="bis4|l_2"];
  93. 23.67 s gammaloop-nextest-spenso> 15 15 │ ext4 [style=invis];
  94. 23.67 s gammaloop-nextest-spenso> 16 │- 0:1:s -> ext4 [id=4 dir=none color="red" label="mink4|l_1"];
  95. 23.67 s gammaloop-nextest-spenso> 16 │+ 0:2:s -> ext4 [id=4 dir=none color="red" label="mink4|l_4"];
  96. 23.67 s gammaloop-nextest-spenso> 17 17 │ ext5 [style=invis];
  97. 23.67 s gammaloop-nextest-spenso> 18 │- 0:2:s -> ext5 [id=5 dir=none color="red" label="mink4|l_4"];
  98. 23.67 s gammaloop-nextest-spenso> 18 │+ 0:4:s -> ext5 [id=5 dir=none color="red" label="bis4|l_3"];
  99. 23.67 s gammaloop-nextest-spenso> 19 19 │ }
  100. 23.67 s gammaloop-nextest-spenso> ────────────┴───────────────────────────────────────────────────────────────────
  101. 23.67 s gammaloop-nextest-spenso> To update snapshots run `cargo insta review`
  102. 23.67 s gammaloop-nextest-spenso> Stopped on the first failure. Run `cargo insta test` to run all snapshots.
  103. 23.67 s gammaloop-nextest-spenso> test tensor::tests::parsing::infinite_execution ... FAILED
  104. 23.67 s gammaloop-nextest-spenso>
  105. 23.67 s gammaloop-nextest-spenso> failures:
  106. 23.67 s gammaloop-nextest-spenso>
  107. 23.67 s gammaloop-nextest-spenso> failures:
  108. 23.67 s gammaloop-nextest-spenso> tensor::tests::parsing::infinite_execution
  109. 23.67 s gammaloop-nextest-spenso>
  110. 23.67 s gammaloop-nextest-spenso> test result: FAILED. 0 passed; 1 failed; 0 ignored; 0 measured; 240 filtered out; finished in 0.09s
  111. 23.67 s gammaloop-nextest-spenso>
  112. 23.67 s gammaloop-nextest-spenso> stderr ---
  113. 23.67 s gammaloop-nextest-spenso>
  114. 23.67 s gammaloop-nextest-spenso> thread 'tensor::tests::parsing::infinite_execution' (844) panicked at /nix/store/0f9p2h9240ylfzayilfjv4gr7scagfs3-vendor-cargo-deps/c19b7c6f923b580ac259164a89f2577984ad5ab09ee9d583b888f934adbbe8d0/insta-1.47.2/src/runtime.rs:719:13:
  115. 23.67 s gammaloop-nextest-spenso> snapshot assertion for 'infinite_execution' failed in line 910
  116. 23.67 s gammaloop-nextest-spenso> stack backtrace:
  117. 23.67 s gammaloop-nextest-spenso> 0: __rustc::rust_begin_unwind
  118. 23.67 s gammaloop-nextest-spenso> 1: core::panicking::panic_fmt
  119. 23.67 s gammaloop-nextest-spenso> 2: insta::runtime::assert_snapshot
  120. 23.67 s gammaloop-nextest-spenso> 3: idenso::tensor::tests::parsing::infinite_execution
  121. 23.67 s gammaloop-nextest-spenso> 4: <idenso::tensor::tests::parsing::infinite_execution::{closure#0} as core::ops::function::FnOnce<()>>::call_once
  122. 23.67 s gammaloop-nextest-spenso> note: Some details are omitted, run with `RUST_BACKTRACE=full` for a verbose backtrace.
  123. 23.67 s gammaloop-nextest-spenso>
  124. 26.49 s gammaloop-nextest-spenso> ------------
  125. 26.49 s gammaloop-nextest-spenso> Summary [ 3.632s] 224 tests run: 222 passed, 2 failed, 26 skipped
  126. 26.49 s gammaloop-nextest-spenso> FAIL [ 0.024s] ( 41/224) idenso color::test::form_reference::metric_contraction_respects_antisymmetric_normalization
  127. 26.49 s gammaloop-nextest-spenso> stdout ---
  128. 26.49 s gammaloop-nextest-spenso>
  129. 26.49 s gammaloop-nextest-spenso> running 1 test
  130. 26.49 s gammaloop-nextest-spenso> test color::test::form_reference::metric_contraction_respects_antisymmetric_normalization ... FAILED
  131. 26.49 s gammaloop-nextest-spenso>
  132. 26.49 s gammaloop-nextest-spenso> failures:
  133. 26.49 s gammaloop-nextest-spenso>
  134. 26.49 s gammaloop-nextest-spenso> failures:
  135. 26.49 s gammaloop-nextest-spenso> color::test::form_reference::metric_contraction_respects_antisymmetric_normalization
  136. 26.49 s gammaloop-nextest-spenso>
  137. 26.49 s gammaloop-nextest-spenso> test result: FAILED. 0 passed; 1 failed; 0 ignored; 0 measured; 240 filtered out; finished in 0.01s
  138. 26.49 s gammaloop-nextest-spenso>
  139. 26.49 s gammaloop-nextest-spenso> stderr ---
  140. 26.49 s gammaloop-nextest-spenso>
  141. 26.49 s gammaloop-nextest-spenso> thread 'color::test::form_reference::metric_contraction_respects_antisymmetric_normalization' (329) panicked at crates/idenso/src/color/test/form_reference.rs:171:5:
  142. 26.49 s gammaloop-nextest-spenso> assertion `left == right` failed
  143. 26.49 s gammaloop-nextest-spenso> left: "-1*f(coad(8,standalone_metric_j),coad(8,standalone_metric_s),coad(8,standalone_metric_u))"
  144. 26.49 s gammaloop-nextest-spenso> right: "f(coad(8,standalone_metric_j),coad(8,standalone_metric_s),coad(8,standalone_metric_u))"
  145. 26.49 s gammaloop-nextest-spenso> stack backtrace:
  146. 26.49 s gammaloop-nextest-spenso> 0: __rustc::rust_begin_unwind
  147. 26.49 s gammaloop-nextest-spenso> 1: core::panicking::panic_fmt
  148. 26.49 s gammaloop-nextest-spenso> 2: core::panicking::assert_failed_inner
  149. 26.49 s gammaloop-nextest-spenso> 3: core::panicking::assert_failed::<alloc::string::String, alloc::string::String>
  150. 26.49 s gammaloop-nextest-spenso> 4: idenso::color::test::form_reference::metric_contraction_respects_antisymmetric_normalization
  151. 26.49 s gammaloop-nextest-spenso> 5: <idenso::color::test::form_reference::metric_contraction_respects_antisymmetric_normalization::{closure#0} as core::ops::function::FnOnce<()>>::call_once
  152. 26.49 s gammaloop-nextest-spenso> note: Some details are omitted, run with `RUST_BACKTRACE=full` for a verbose backtrace.
  153. 26.49 s gammaloop-nextest-spenso>
  154. 26.49 s gammaloop-nextest-spenso> FAIL [ 0.113s] (219/224) idenso tensor::tests::parsing::infinite_execution
  155. 26.49 s gammaloop-nextest-spenso> stdout ---
  156. 26.49 s gammaloop-nextest-spenso>
  157. 26.49 s gammaloop-nextest-spenso> running 1 test
  158. 26.49 s gammaloop-nextest-spenso> ━━━━━━━━━━━━━━━━━━━━━━━━━━━━━━━ Snapshot Summary ━━━━━━━━━━━━━━━━━━━━━━━━━━━━━━━
  159. 26.49 s gammaloop-nextest-spenso> Snapshot: infinite_execution
  160. 26.49 s gammaloop-nextest-spenso> Source: crates/idenso/src/tensor/tests/parsing.rs:910
  161. 26.49 s gammaloop-nextest-spenso> ────────────────────────────────────────────────────────────────────────────────
  162. 26.49 s gammaloop-nextest-spenso> Expression: net_iter.snapshot_dot()
  163. 26.49 s gammaloop-nextest-spenso> ────────────────────────────────────────────────────────────────────────────────
  164. 26.49 s gammaloop-nextest-spenso> -old snapshot
  165. 26.49 s gammaloop-nextest-spenso> +new results
  166. 26.49 s gammaloop-nextest-spenso> ────────────┬───────────────────────────────────────────────────────────────────
  167. 26.49 s gammaloop-nextest-spenso> 8 8 │ 0:0:s -> ext0 [id=0 color="red"];
  168. 26.49 s gammaloop-nextest-spenso> 9 9 │ ext1 [style=invis];
  169. 26.49 s gammaloop-nextest-spenso> 10 10 │ 0:5:s -> ext1 [id=1 dir=none color="red" label="mink4|l_0"];
  170. 26.49 s gammaloop-nextest-spenso> 11 11 │ ext2 [style=invis];
  171. 26.49 s gammaloop-nextest-spenso> 12 │- 0:4:s -> ext2 [id=2 dir=none color="red" label="bis4|l_2"];
  172. 26.49 s gammaloop-nextest-spenso> 12 │+ 0:3:s -> ext2 [id=2 dir=none color="red" label="mink4|l_1"];
  173. 26.49 s gammaloop-nextest-spenso> 13 13 │ ext3 [style=invis];
  174. 26.49 s gammaloop-nextest-spenso> 14 │- 0:3:s -> ext3 [id=3 dir=none color="red" label="bis4|l_3"];
  175. 26.49 s gammaloop-nextest-spenso> 14 │+ 0:1:s -> ext3 [id=3 dir=none color="red" label="bis4|l_2"];
  176. 26.49 s gammaloop-nextest-spenso> 15 15 │ ext4 [style=invis];
  177. 26.49 s gammaloop-nextest-spenso> 16 │- 0:1:s -> ext4 [id=4 dir=none color="red" label="mink4|l_1"];
  178. 26.49 s gammaloop-nextest-spenso> 16 │+ 0:2:s -> ext4 [id=4 dir=none color="red" label="mink4|l_4"];
  179. 26.49 s gammaloop-nextest-spenso> 17 17 │ ext5 [style=invis];
  180. 26.49 s gammaloop-nextest-spenso> 18 │- 0:2:s -> ext5 [id=5 dir=none color="red" label="mink4|l_4"];
  181. 26.49 s gammaloop-nextest-spenso> 18 │+ 0:4:s -> ext5 [id=5 dir=none color="red" label="bis4|l_3"];
  182. 26.49 s gammaloop-nextest-spenso> 19 19 │ }
  183. 26.49 s gammaloop-nextest-spenso> ────────────┴───────────────────────────────────────────────────────────────────
  184. 26.49 s gammaloop-nextest-spenso> To update snapshots run `cargo insta review`
  185. 26.49 s gammaloop-nextest-spenso> Stopped on the first failure. Run `cargo insta test` to run all snapshots.
  186. 26.49 s gammaloop-nextest-spenso> test tensor::tests::parsing::infinite_execution ... FAILED
  187. 26.49 s gammaloop-nextest-spenso>
  188. 26.49 s gammaloop-nextest-spenso> failures:
  189. 26.49 s gammaloop-nextest-spenso>
  190. 26.49 s gammaloop-nextest-spenso> failures:
  191. 26.49 s gammaloop-nextest-spenso> tensor::tests::parsing::infinite_execution
  192. 26.49 s gammaloop-nextest-spenso>
  193. 26.49 s gammaloop-nextest-spenso> test result: FAILED. 0 passed; 1 failed; 0 ignored; 0 measured; 240 filtered out; finished in 0.09s
  194. 26.49 s gammaloop-nextest-spenso>
  195. 26.49 s gammaloop-nextest-spenso> stderr ---
  196. 26.49 s gammaloop-nextest-spenso>
  197. 26.49 s gammaloop-nextest-spenso> thread 'tensor::tests::parsing::infinite_execution' (844) panicked at /nix/store/0f9p2h9240ylfzayilfjv4gr7scagfs3-vendor-cargo-deps/c19b7c6f923b580ac259164a89f2577984ad5ab09ee9d583b888f934adbbe8d0/insta-1.47.2/src/runtime.rs:719:13:
  198. 26.49 s gammaloop-nextest-spenso> snapshot assertion for 'infinite_execution' failed in line 910
  199. 26.49 s gammaloop-nextest-spenso> stack backtrace:
  200. 26.49 s gammaloop-nextest-spenso> 0: __rustc::rust_begin_unwind
  201. 26.49 s gammaloop-nextest-spenso> 1: core::panicking::panic_fmt
  202. 26.49 s gammaloop-nextest-spenso> 2: insta::runtime::assert_snapshot
  203. 26.49 s gammaloop-nextest-spenso> 3: idenso::tensor::tests::parsing::infinite_execution
  204. 26.49 s gammaloop-nextest-spenso> 4: <idenso::tensor::tests::parsing::infinite_execution::{closure#0} as core::ops::function::FnOnce<()>>::call_once
  205. 26.49 s gammaloop-nextest-spenso> note: Some details are omitted, run with `RUST_BACKTRACE=full` for a verbose backtrace.
  206. 26.49 s gammaloop-nextest-spenso>
  207. 26.53 s gammaloop-nextest-spenso> error: test run failed
  208. 26.59 s gammaloop-nextest-spenso>
  209. 26.59 s gammaloop-nextest-spenso> ========== nextest test summary ==========
  210. 26.59 s gammaloop-nextest-spenso> report: target/nextest/ci_gammaloop/junit.xml
  211. 26.59 s gammaloop-nextest-spenso> tests: 224, failures: 2, errors: 0
  212. 26.59 s gammaloop-nextest-spenso>
  213. 26.59 s gammaloop-nextest-spenso> 1. idenso::color::test::form_reference::metric_contraction_respects_antisymmetric_normalization
  214. 26.59 s gammaloop-nextest-spenso> failure: test failure with exit code 101
  215. 26.59 s gammaloop-nextest-spenso> thread 'color::test::form_reference::metric_contraction_respects_antisymmetric_normalization' (329) panicked at crates/idenso/src/color/test/form_reference.rs:171:5:
  216. 26.59 s gammaloop-nextest-spenso> assertion `left == right` failed
  217. 26.59 s gammaloop-nextest-spenso> left: "-1*f(coad(8,standalone_metric_j),coad(8,standalone_metric_s),coad(8,standalone_metric_u))"
  218. 26.59 s gammaloop-nextest-spenso> right: "f(coad(8,standalone_metric_j),coad(8,standalone_metric_s),coad(8,standalone_metric_u))"
  219. 26.59 s gammaloop-nextest-spenso> stack backtrace:
  220. 26.59 s gammaloop-nextest-spenso> 0: __rustc::rust_begin_unwind
  221. 26.59 s gammaloop-nextest-spenso> 1: core::panicking::panic_fmt
  222. 26.59 s gammaloop-nextest-spenso> 2: core::panicking::assert_failed_inner
  223. 26.59 s gammaloop-nextest-spenso> 3: core::panicking::assert_failed::<alloc::string::String, alloc::string::String>
  224. 26.59 s gammaloop-nextest-spenso> 4: idenso::color::test::form_reference::metric_contraction_respects_antisymmetric_normalization
  225. 26.59 s gammaloop-nextest-spenso> 5: <idenso::color::test::form_reference::metric_contraction_respects_antisymmetric_normalization::{closure#0} as core::ops::function::FnOnce<()>>::call_once
  226. 26.59 s gammaloop-nextest-spenso> note: Some details are omitted, run with `RUST_BACKTRACE=full` for a verbose backtrace.
  227. 26.59 s gammaloop-nextest-spenso> system-out
  228. 26.59 s gammaloop-nextest-spenso> running 1 test
  229. 26.59 s gammaloop-nextest-spenso> test color::test::form_reference::metric_contraction_respects_antisymmetric_normalization ... FAILED
  230. 26.59 s gammaloop-nextest-spenso>
  231. 26.59 s gammaloop-nextest-spenso> failures:
  232. 26.59 s gammaloop-nextest-spenso>
  233. 26.59 s gammaloop-nextest-spenso> failures:
  234. 26.59 s gammaloop-nextest-spenso> color::test::form_reference::metric_contraction_respects_antisymmetric_normalization
  235. 26.59 s gammaloop-nextest-spenso>
  236. 26.59 s gammaloop-nextest-spenso> test result: FAILED. 0 passed; 1 failed; 0 ignored; 0 measured; 240 filtered out; finished in 0.01s
  237. 26.59 s gammaloop-nextest-spenso> system-err
  238. 26.59 s gammaloop-nextest-spenso> thread 'color::test::form_reference::metric_contraction_respects_antisymmetric_normalization' (329) panicked at crates/idenso/src/color/test/form_reference.rs:171:5:
  239. 26.59 s gammaloop-nextest-spenso> assertion `left == right` failed
  240. 26.59 s gammaloop-nextest-spenso> left: "-1*f(coad(8,standalone_metric_j),coad(8,standalone_metric_s),coad(8,standalone_metric_u))"
  241. 26.59 s gammaloop-nextest-spenso> right: "f(coad(8,standalone_metric_j),coad(8,standalone_metric_s),coad(8,standalone_metric_u))"
  242. 26.59 s gammaloop-nextest-spenso> stack backtrace:
  243. 26.60 s gammaloop-nextest-spenso> 0: __rustc::rust_begin_unwind
  244. 26.60 s gammaloop-nextest-spenso> 1: core::panicking::panic_fmt
  245. 26.60 s gammaloop-nextest-spenso> 2: core::panicking::assert_failed_inner
  246. 26.60 s gammaloop-nextest-spenso> 3: core::panicking::assert_failed::<alloc::string::String, alloc::string::String>
  247. 26.60 s gammaloop-nextest-spenso> 4: idenso::color::test::form_reference::metric_contraction_respects_antisymmetric_normalization
  248. 26.60 s gammaloop-nextest-spenso> 5: <idenso::color::test::form_reference::metric_contraction_respects_antisymmetric_normalization::{closure#0} as core::ops::function::FnOnce<()>>::call_once
  249. 26.60 s gammaloop-nextest-spenso> note: Some details are omitted, run with `RUST_BACKTRACE=full` for a verbose backtrace.
  250. 26.60 s gammaloop-nextest-spenso>
  251. 26.60 s gammaloop-nextest-spenso> 2. idenso::tensor::tests::parsing::infinite_execution
  252. 26.60 s gammaloop-nextest-spenso> failure: test failure with exit code 101
  253. 26.60 s gammaloop-nextest-spenso> thread 'tensor::tests::parsing::infinite_execution' (844) panicked at /nix/store/0f9p2h9240ylfzayilfjv4gr7scagfs3-vendor-cargo-deps/c19b7c6f923b580ac259164a89f2577984ad5ab09ee9d583b888f934adbbe8d0/insta-1.47.2/src/runtime.rs:719:13:
  254. 26.60 s gammaloop-nextest-spenso> snapshot assertion for 'infinite_execution' failed in line 910
  255. 26.60 s gammaloop-nextest-spenso> stack backtrace:
  256. 26.60 s gammaloop-nextest-spenso> 0: __rustc::rust_begin_unwind
  257. 26.60 s gammaloop-nextest-spenso> 1: core::panicking::panic_fmt
  258. 26.60 s gammaloop-nextest-spenso> 2: insta::runtime::assert_snapshot
  259. 26.60 s gammaloop-nextest-spenso> 3: idenso::tensor::tests::parsing::infinite_execution
  260. 26.60 s gammaloop-nextest-spenso> 4: <idenso::tensor::tests::parsing::infinite_execution::{closure#0} as core::ops::function::FnOnce<()>>::call_once
  261. 26.60 s gammaloop-nextest-spenso> note: Some details are omitted, run with `RUST_BACKTRACE=full` for a verbose backtrace.
  262. 26.60 s gammaloop-nextest-spenso> system-out
  263. 26.60 s gammaloop-nextest-spenso> running 1 test
  264. 26.60 s gammaloop-nextest-spenso> ━━━━━━━━━━━━━━━━━━━━━━━━━━━━━━━ Snapshot Summary ━━━━━━━━━━━━━━━━━━━━━━━━━━━━━━━
  265. 26.60 s gammaloop-nextest-spenso> Snapshot: infinite_execution
  266. 26.60 s gammaloop-nextest-spenso> Source: crates/idenso/src/tensor/tests/parsing.rs:910
  267. 26.60 s gammaloop-nextest-spenso> ────────────────────────────────────────────────────────────────────────────────
  268. 26.60 s gammaloop-nextest-spenso> Expression: net_iter.snapshot_dot()
  269. 26.60 s gammaloop-nextest-spenso> ────────────────────────────────────────────────────────────────────────────────
  270. 26.60 s gammaloop-nextest-spenso> -old snapshot
  271. 26.60 s gammaloop-nextest-spenso> +new results
  272. 26.60 s gammaloop-nextest-spenso> ────────────┬───────────────────────────────────────────────────────────────────
  273. 26.60 s gammaloop-nextest-spenso> 8 8 │ 0:0:s-> ext0 [id=0 color="red"];
  274. 26.60 s gammaloop-nextest-spenso> 9 9 │ ext1 [style=invis];
  275. 26.60 s gammaloop-nextest-spenso> 10 10 │ 0:5:s-> ext1 [id=1 dir=none color="red" label="mink4|l_0"];
  276. 26.60 s gammaloop-nextest-spenso> 11 11 │ ext2 [style=invis];
  277. 26.60 s gammaloop-nextest-spenso> 12 │- 0:4:s-> ext2 [id=2 dir=none color="red" label="bis4|l_2"];
  278. 26.60 s gammaloop-nextest-spenso> 12 │+ 0:3:s-> ext2 [id=2 dir=none color="red" label="mink4|l_1"];
  279. 26.60 s gammaloop-nextest-spenso> 13 13 │ ext3 [style=invis];
  280. 26.60 s gammaloop-nextest-spenso> 14 │- 0:3:s-> ext3 [id=3 dir=none color="red" label="bis4|l_3"];
  281. 26.60 s gammaloop-nextest-spenso> 14 │+ 0:1:s-> ext3 [id=3 dir=none color="red" label="bis4|l_2"];
  282. 26.60 s gammaloop-nextest-spenso> 15 15 │ ext4 [style=invis];
  283. 26.60 s gammaloop-nextest-spenso> 16 │- 0:1:s-> ext4 [id=4 dir=none color="red" label="mink4|l_1"];
  284. 26.60 s gammaloop-nextest-spenso> 16 │+ 0:2:s-> ext4 [id=4 dir=none color="red" label="mink4|l_4"];
  285. 26.60 s gammaloop-nextest-spenso> 17 17 │ ext5 [style=invis];
  286. 26.60 s gammaloop-nextest-spenso> 18 │- 0:2:s-> ext5 [id=5 dir=none color="red" label="mink4|l_4"];
  287. 26.60 s gammaloop-nextest-spenso> 18 │+ 0:4:s-> ext5 [id=5 dir=none color="red" label="bis4|l_3"];
  288. 26.60 s gammaloop-nextest-spenso> 19 19 │ }
  289. 26.60 s gammaloop-nextest-spenso> ────────────┴───────────────────────────────────────────────────────────────────
  290. 26.60 s gammaloop-nextest-spenso> To update snapshots run `cargo insta review`
  291. 26.60 s gammaloop-nextest-spenso> Stopped on the first failure. Run `cargo insta test` to run all snapshots.
  292. 26.60 s gammaloop-nextest-spenso> test tensor::tests::parsing::infinite_execution ... FAILED
  293. 26.60 s gammaloop-nextest-spenso>
  294. 26.60 s gammaloop-nextest-spenso> failures:
  295. 26.60 s gammaloop-nextest-spenso>
  296. 26.60 s gammaloop-nextest-spenso> failures:
  297. 26.60 s gammaloop-nextest-spenso> tensor::tests::parsing::infinite_execution
  298. 26.60 s gammaloop-nextest-spenso>
  299. 26.60 s gammaloop-nextest-spenso> test result: FAILED. 0 passed; 1 failed; 0 ignored; 0 measured; 240 filtered out; finished in 0.09s
  300. 26.60 s gammaloop-nextest-spenso> system-err
  301. 26.60 s gammaloop-nextest-spenso> thread 'tensor::tests::parsing::infinite_execution' (844) panicked at /nix/store/0f9p2h9240ylfzayilfjv4gr7scagfs3-vendor-cargo-deps/c19b7c6f923b580ac259164a89f2577984ad5ab09ee9d583b888f934adbbe8d0/insta-1.47.2/src/runtime.rs:719:13:
  302. 26.60 s gammaloop-nextest-spenso> snapshot assertion for 'infinite_execution' failed in line 910
  303. 26.60 s gammaloop-nextest-spenso> stack backtrace:
  304. 26.60 s gammaloop-nextest-spenso> 0: __rustc::rust_begin_unwind
  305. 26.60 s gammaloop-nextest-spenso> 1: core::panicking::panic_fmt
  306. 26.60 s gammaloop-nextest-spenso> 2: insta::runtime::assert_snapshot
  307. 26.60 s gammaloop-nextest-spenso> 3: idenso::tensor::tests::parsing::infinite_execution
  308. 26.60 s gammaloop-nextest-spenso> 4: <idenso::tensor::tests::parsing::infinite_execution::{closure#0} as core::ops::function::FnOnce<()>>::call_once
  309. 26.60 s gammaloop-nextest-spenso> note: Some details are omitted, run with `RUST_BACKTRACE=full` for a verbose backtrace.
  310. 26.60 s gammaloop-nextest-spenso> =========================================
  311. 26.63 s gammaloop-nextest-spenso> Extracting 2 binaries and 1 linked path to /build/nextest-archive-41ZuUV
  312. 26.76 s gammaloop-nextest-spenso> Extracted 8 files to /build/nextest-archive-41ZuUV in 0.13s
  313. 26.80 s gammaloop-nextest-spenso> ------------
  314. 26.80 s gammaloop-nextest-spenso> Nextest run ID 116e64c0-ed16-46e1-be86-b9a8d90c0459 with nextest profile: ci_gammaloop
  315. 26.80 s gammaloop-nextest-spenso> Starting 135 tests across 2 binaries
  316. 27.04 s gammaloop-nextest-spenso> ------------
  317. 27.04 s gammaloop-nextest-spenso> Summary [ 0.241s] 135 tests run: 135 passed, 0 skipped
  318. 27.12 s gammaloop-nextest-spenso>
  319. 27.12 s gammaloop-nextest-spenso> ========== nextest test summary ==========
  320. 27.12 s gammaloop-nextest-spenso> report: target/nextest/ci_gammaloop/junit.xml
  321. 27.12 s gammaloop-nextest-spenso> tests: 135, failures: 0, errors: 0
  322. 27.12 s gammaloop-nextest-spenso> No failing testcases found.
  323. 27.12 s gammaloop-nextest-spenso> =========================================
  324. 27.14 s gammaloop-nextest-spenso> Extracting 5 binaries and 2 linked paths to /build/nextest-archive-TT17WT
  325. 27.48 s gammaloop-nextest-spenso> Extracted 19 files to /build/nextest-archive-TT17WT in 0.34s
  326. 27.58 s gammaloop-nextest-spenso> ------------
  327. 27.58 s gammaloop-nextest-spenso> Nextest run ID 673dcf04-426e-43e0-840e-149ccc580c17 with nextest profile: ci_gammaloop
  328. 27.61 s gammaloop-nextest-spenso> Starting 25 tests across 5 binaries (1 test skipped via profile.ci_gammaloop.default-filter)
  329. 28.10 s gammaloop-nextest-spenso> ------------
  330. 28.10 s gammaloop-nextest-spenso> Summary [ 0.520s] 25 tests run: 25 passed, 1 skipped
  331. 28.25 s gammaloop-nextest-spenso>
  332. 28.25 s gammaloop-nextest-spenso> ========== nextest test summary ==========
  333. 28.25 s gammaloop-nextest-spenso> report: target/nextest/ci_gammaloop/junit.xml
  334. 28.25 s gammaloop-nextest-spenso> tests: 25, failures: 0, errors: 0
  335. 28.25 s gammaloop-nextest-spenso> No failing testcases found.
  336. 28.25 s gammaloop-nextest-spenso> =========================================
  337. 28.29 s gammaloop-nextest-spenso> Extracting 2 binaries and 1 linked path to /build/nextest-archive-btZZmw
  338. 28.38 s gammaloop-nextest-spenso> Extracted 8 files to /build/nextest-archive-btZZmw in 0.10s
  339. 28.43 s gammaloop-nextest-spenso> ------------
  340. 28.43 s gammaloop-nextest-spenso> Nextest run ID 0afcdcbe-42ca-49ad-a9ad-dabdedb4f004 with nextest profile: ci_gammaloop
  341. 28.43 s gammaloop-nextest-spenso> Starting 1 test across 2 binaries
  342. 28.45 s gammaloop-nextest-spenso> ------------
  343. 28.45 s gammaloop-nextest-spenso> Summary [ 0.017s] 1 test run: 1 passed, 0 skipped
  344. 28.52 s gammaloop-nextest-spenso>
  345. 28.52 s gammaloop-nextest-spenso> ========== nextest test summary ==========
  346. 28.52 s gammaloop-nextest-spenso> report: target/nextest/ci_gammaloop/junit.xml
  347. 28.52 s gammaloop-nextest-spenso> tests: 1, failures: 0, errors: 0
  348. 28.52 s gammaloop-nextest-spenso> No failing testcases found.
  349. 28.52 s gammaloop-nextest-spenso> =========================================
  350. 28.55 s gammaloop-nextest-spenso> Extracting 1 binary and 1 linked path to /build/nextest-archive-dk4nAo
  351. 28.66 s gammaloop-nextest-spenso> Extracted 7 files to /build/nextest-archive-dk4nAo in 0.10s
  352. 28.70 s gammaloop-nextest-spenso> ------------
  353. 28.70 s gammaloop-nextest-spenso> Nextest run ID 639b8ccc-98bf-46c5-9787-cc9c9c06e02b with nextest profile: ci_gammaloop
  354. 28.70 s gammaloop-nextest-spenso> Starting 0 tests across 1 binary
  355. 28.71 s gammaloop-nextest-spenso> ------------
  356. 28.71 s gammaloop-nextest-spenso> Summary [ 0.007s] 0 tests run: 0 passed, 0 skipped
  357. 28.80 s gammaloop-nextest-spenso>
  358. 28.80 s gammaloop-nextest-spenso> ========== nextest test summary ==========
  359. 28.80 s gammaloop-nextest-spenso> report: target/nextest/ci_gammaloop/junit.xml
  360. 28.80 s gammaloop-nextest-spenso> tests: 0, failures: 0, errors: 0
  361. 28.80 s gammaloop-nextest-spenso> No failing testcases found.
  362. 28.80 s gammaloop-nextest-spenso> =========================================
  363. 28.88 s [0 built (1 failed), 0.0error: Cannot build '/nix/store/fllp83dbxw52lklxvq55v8x8yhs6mfhc-gammaloop-nextest-spenso.drv'.
  364. 28.88 s Reason: builder failed with exit code 100.
  365. 28.88 s Output paths:
  366. 28.88 s /nix/store/ipv4chj3sji5ba51pvyl9qs2fk62cydz-gammaloop-nextest-spenso
  367. 28.88 s Last 325 log lines:
  368. 28.88 s > Extracting 5 binaries and 2 linked paths to /build/nextest-archive-DieXcd
  369. 28.88 s > Extracted 19 files to /build/nextest-archive-DieXcd in 0.31s
  370. 28.88 s > ------------
  371. 28.88 s > Nextest run ID cd011d7c-910c-434d-b2f0-0ad22c43d633 with nextest profile: ci_gammaloop
  372. 28.88 s > Starting 224 tests across 5 binaries (26 tests skipped, including 2 tests via profile.ci_gammaloop.default-filter)
  373. 28.88 s > FAIL [ 0.024s] ( 41/224) idenso color::test::form_reference::metric_contraction_respects_antisymmetric_normalization
  374. 28.88 s > stdout ---
  375. 28.88 s >
  376. 28.88 s > running 1 test
  377. 28.88 s > test color::test::form_reference::metric_contraction_respects_antisymmetric_normalization ... FAILED
  378. 28.88 s >
  379. 28.88 s > failures:
  380. 28.88 s >
  381. 28.88 s > failures:
  382. 28.88 s > color::test::form_reference::metric_contraction_respects_antisymmetric_normalization
  383. 28.88 s >
  384. 28.88 s > test result: FAILED. 0 passed; 1 failed; 0 ignored; 0 measured; 240 filtered out; finished in 0.01s
  385. 28.88 s >
  386. 28.88 s > stderr ---
  387. 28.88 s >
  388. 28.88 s > thread 'color::test::form_reference::metric_contraction_respects_antisymmetric_normalization' (329) panicked at crates/idenso/src/color/test/form_reference.rs:171:5:
  389. 28.88 s > assertion `left == right` failed
  390. 28.88 s > left: "-1*f(coad(8,standalone_metric_j),coad(8,standalone_metric_s),coad(8,standalone_metric_u))"
  391. 28.88 s > right: "f(coad(8,standalone_metric_j),coad(8,standalone_metric_s),coad(8,standalone_metric_u))"
  392. 28.88 s > stack backtrace:
  393. 28.88 s > 0: __rustc::rust_begin_unwind
  394. 28.88 s > 1: core::panicking::panic_fmt
  395. 28.88 s > 2: core::panicking::assert_failed_inner
  396. 28.88 s > 3: core::panicking::assert_failed::<alloc::string::String, alloc::string::String>
  397. 28.88 s > 4: idenso::color::test::form_reference::metric_contraction_respects_antisymmetric_normalization
  398. 28.88 s > 5: <idenso::color::test::form_reference::metric_contraction_respects_antisymmetric_normalization::{closure#0} as core::ops::function::FnOnce<()>>::call_once
  399. 28.88 s > note: Some details are omitted, run with `RUST_BACKTRACE=full` for a verbose backtrace.
  400. 28.88 s >
  401. 28.88 s > FAIL [ 0.113s] (219/224) idenso tensor::tests::parsing::infinite_execution
  402. 28.88 s > stdout ---
  403. 28.88 s >
  404. 28.88 s > running 1 test
  405. 28.88 s > ━━━━━━━━━━━━━━━━━━━━━━━━━━━━━━━ Snapshot Summary ━━━━━━━━━━━━━━━━━━━━━━━━━━━━━━━
  406. 28.88 s > Snapshot: infinite_execution
  407. 28.88 s > Source: crates/idenso/src/tensor/tests/parsing.rs:910
  408. 28.88 s > ────────────────────────────────────────────────────────────────────────────────
  409. 28.88 s > Expression: net_iter.snapshot_dot()
  410. 28.88 s > ────────────────────────────────────────────────────────────────────────────────
  411. 28.88 s > -old snapshot
  412. 28.88 s > +new results
  413. 28.88 s > ────────────┬───────────────────────────────────────────────────────────────────
  414. 28.88 s > 8 8 │ 0:0:s -> ext0 [id=0 color="red"];
  415. 28.88 s > 9 9 │ ext1 [style=invis];
  416. 28.88 s > 10 10 │ 0:5:s -> ext1 [id=1 dir=none color="red" label="mink4|l_0"];
  417. 28.88 s > 11 11 │ ext2 [style=invis];
  418. 28.88 s > 12 │- 0:4:s -> ext2 [id=2 dir=none color="red" label="bis4|l_2"];
  419. 28.88 s > 12 │+ 0:3:s -> ext2 [id=2 dir=none color="red" label="mink4|l_1"];
  420. 28.88 s > 13 13 │ ext3 [style=invis];
  421. 28.88 s > 14 │- 0:3:s -> ext3 [id=3 dir=none color="red" label="bis4|l_3"];
  422. 28.88 s > 14 │+ 0:1:s -> ext3 [id=3 dir=none color="red" label="bis4|l_2"];
  423. 28.88 s > 15 15 │ ext4 [style=invis];
  424. 28.88 s > 16 │- 0:1:s -> ext4 [id=4 dir=none color="red" label="mink4|l_1"];
  425. 28.88 s > 16 │+ 0:2:s -> ext4 [id=4 dir=none color="red" label="mink4|l_4"];
  426. 28.88 s > 17 17 │ ext5 [style=invis];
  427. 28.88 s > 18 │- 0:2:s -> ext5 [id=5 dir=none color="red" label="mink4|l_4"];
  428. 28.88 s > 18 │+ 0:4:s -> ext5 [id=5 dir=none color="red" label="bis4|l_3"];
  429. 28.88 s > 19 19 │ }
  430. 28.88 s > ────────────┴───────────────────────────────────────────────────────────────────
  431. 28.88 s > To update snapshots run `cargo insta review`
  432. 28.88 s > Stopped on the first failure. Run `cargo insta test` to run all snapshots.
  433. 28.88 s > test tensor::tests::parsing::infinite_execution ... FAILED
  434. 28.88 s >
  435. 28.88 s > failures:
  436. 28.88 s >
  437. 28.88 s > failures:
  438. 28.88 s > tensor::tests::parsing::infinite_execution
  439. 28.88 s >
  440. 28.88 s > test result: FAILED. 0 passed; 1 failed; 0 ignored; 0 measured; 240 filtered out; finished in 0.09s
  441. 28.88 s >
  442. 28.88 s > stderr ---
  443. 28.88 s >
  444. 28.88 s > thread 'tensor::tests::parsing::infinite_execution' (844) panicked at /nix/store/0f9p2h9240ylfzayilfjv4gr7scagfs3-vendor-cargo-deps/c19b7c6f923b580ac259164a89f2577984ad5ab09ee9d583b888f934adbbe8d0/insta-1.47.2/src/runtime.rs:719:13:
  445. 28.88 s > snapshot assertion for 'infinite_execution' failed in line 910
  446. 28.88 s > stack backtrace:
  447. 28.88 s > 0: __rustc::rust_begin_unwind
  448. 28.88 s > 1: core::panicking::panic_fmt
  449. 28.88 s > 2: insta::runtime::assert_snapshot
  450. 28.88 s > 3: idenso::tensor::tests::parsing::infinite_execution
  451. 28.88 s > 4: <idenso::tensor::tests::parsing::infinite_execution::{closure#0} as core::ops::function::FnOnce<()>>::call_once
  452. 28.88 s > note: Some details are omitted, run with `RUST_BACKTRACE=full` for a verbose backtrace.
  453. 28.88 s >
  454. 28.88 s > ------------
  455. 28.88 s > Summary [ 3.632s] 224 tests run: 222 passed, 2 failed, 26 skipped
  456. 28.88 s > FAIL [ 0.024s] ( 41/224) idenso color::test::form_reference::metric_contraction_respects_antisymmetric_normalization
  457. 28.88 s > stdout ---
  458. 28.88 s >
  459. 28.88 s > running 1 test
  460. 28.88 s > test color::test::form_reference::metric_contraction_respects_antisymmetric_normalization ... FAILED
  461. 28.88 s >
  462. 28.88 s > failures:
  463. 28.88 s >
  464. 28.88 s > failures:
  465. 28.88 s > color::test::form_reference::metric_contraction_respects_antisymmetric_normalization
  466. 28.88 s >
  467. 28.88 s > test result: FAILED. 0 passed; 1 failed; 0 ignored; 0 measured; 240 filtered out; finished in 0.01s
  468. 28.88 s >
  469. 28.88 s > stderr ---
  470. 28.88 s >
  471. 28.88 s > thread 'color::test::form_reference::metric_contraction_respects_antisymmetric_normalization' (329) panicked at crates/idenso/src/color/test/form_reference.rs:171:5:
  472. 28.88 s > assertion `left == right` failed
  473. 28.88 s > left: "-1*f(coad(8,standalone_metric_j),coad(8,standalone_metric_s),coad(8,standalone_metric_u))"
  474. 28.88 s > right: "f(coad(8,standalone_metric_j),coad(8,standalone_metric_s),coad(8,standalone_metric_u))"
  475. 28.88 s > stack backtrace:
  476. 28.88 s > 0: __rustc::rust_begin_unwind
  477. 28.88 s > 1: core::panicking::panic_fmt
  478. 28.88 s > 2: core::panicking::assert_failed_inner
  479. 28.88 s > 3: core::panicking::assert_failed::<alloc::string::String, alloc::string::String>
  480. 28.88 s > 4: idenso::color::test::form_reference::metric_contraction_respects_antisymmetric_normalization
  481. 28.88 s > 5: <idenso::color::test::form_reference::metric_contraction_respects_antisymmetric_normalization::{closure#0} as core::ops::function::FnOnce<()>>::call_once
  482. 28.88 s > note: Some details are omitted, run with `RUST_BACKTRACE=full` for a verbose backtrace.
  483. 28.88 s >
  484. 28.88 s > FAIL [ 0.113s] (219/224) idenso tensor::tests::parsing::infinite_execution
  485. 28.88 s > stdout ---
  486. 28.88 s >
  487. 28.88 s > running 1 test
  488. 28.88 s > ━━━━━━━━━━━━━━━━━━━━━━━━━━━━━━━ Snapshot Summary ━━━━━━━━━━━━━━━━━━━━━━━━━━━━━━━
  489. 28.88 s > Snapshot: infinite_execution
  490. 28.88 s > Source: crates/idenso/src/tensor/tests/parsing.rs:910
  491. 28.88 s > ────────────────────────────────────────────────────────────────────────────────
  492. 28.88 s > Expression: net_iter.snapshot_dot()
  493. 28.88 s > ────────────────────────────────────────────────────────────────────────────────
  494. 28.88 s > -old snapshot
  495. 28.88 s > +new results
  496. 28.88 s > ────────────┬───────────────────────────────────────────────────────────────────
  497. 28.88 s > 8 8 │ 0:0:s -> ext0 [id=0 color="red"];
  498. 28.88 s > 9 9 │ ext1 [style=invis];
  499. 28.88 s > 10 10 │ 0:5:s -> ext1 [id=1 dir=none color="red" label="mink4|l_0"];
  500. 28.88 s > 11 11 │ ext2 [style=invis];
  501. 28.88 s > 12 │- 0:4:s -> ext2 [id=2 dir=none color="red" label="bis4|l_2"];
  502. 28.88 s > 12 │+ 0:3:s -> ext2 [id=2 dir=none color="red" label="mink4|l_1"];
  503. 28.88 s > 13 13 │ ext3 [style=invis];
  504. 28.88 s > 14 │- 0:3:s -> ext3 [id=3 dir=none color="red" label="bis4|l_3"];
  505. 28.88 s > 14 │+ 0:1:s -> ext3 [id=3 dir=none color="red" label="bis4|l_2"];
  506. 28.88 s > 15 15 │ ext4 [style=invis];
  507. 28.88 s > 16 │- 0:1:s -> ext4 [id=4 dir=none color="red" label="mink4|l_1"];
  508. 28.88 s > 16 │+ 0:2:s -> ext4 [id=4 dir=none color="red" label="mink4|l_4"];
  509. 28.88 s > 17 17 │ ext5 [style=invis];
  510. 28.88 s > 18 │- 0:2:s -> ext5 [id=5 dir=none color="red" label="mink4|l_4"];
  511. 28.88 s > 18 │+ 0:4:s -> ext5 [id=5 dir=none color="red" label="bis4|l_3"];
  512. 28.88 s > 19 19 │ }
  513. 28.88 s > ────────────┴───────────────────────────────────────────────────────────────────
  514. 28.88 s > To update snapshots run `cargo insta review`
  515. 28.88 s > Stopped on the first failure. Run `cargo insta test` to run all snapshots.
  516. 28.88 s > test tensor::tests::parsing::infinite_execution ... FAILED
  517. 28.88 s >
  518. 28.88 s > failures:
  519. 28.88 s >
  520. 28.88 s > failures:
  521. 28.88 s > tensor::tests::parsing::infinite_execution
  522. 28.88 s >
  523. 28.88 s > test result: FAILED. 0 passed; 1 failed; 0 ignored; 0 measured; 240 filtered out; finished in 0.09s
  524. 28.88 s >
  525. 28.88 s > stderr ---
  526. 28.88 s >
  527. 28.88 s > thread 'tensor::tests::parsing::infinite_execution' (844) panicked at /nix/store/0f9p2h9240ylfzayilfjv4gr7scagfs3-vendor-cargo-deps/c19b7c6f923b580ac259164a89f2577984ad5ab09ee9d583b888f934adbbe8d0/insta-1.47.2/src/runtime.rs:719:13:
  528. 28.88 s > snapshot assertion for 'infinite_execution' failed in line 910
  529. 28.88 s > stack backtrace:
  530. 28.88 s > 0: __rustc::rust_begin_unwind
  531. 28.88 s > 1: core::panicking::panic_fmt
  532. 28.88 s > 2: insta::runtime::assert_snapshot
  533. 28.88 s > 3: idenso::tensor::tests::parsing::infinite_execution
  534. 28.88 s > 4: <idenso::tensor::tests::parsing::infinite_execution::{closure#0} as core::ops::function::FnOnce<()>>::call_once
  535. 28.88 s > note: Some details are omitted, run with `RUST_BACKTRACE=full` for a verbose backtrace.
  536. 28.88 s >
  537. 28.88 s > error: test run failed
  538. 28.88 s >
  539. 28.88 s > ========== nextest test summary ==========
  540. 28.88 s > report: target/nextest/ci_gammaloop/junit.xml
  541. 28.88 s > tests: 224, failures: 2, errors: 0
  542. 28.88 s >
  543. 28.88 s > 1. idenso::color::test::form_reference::metric_contraction_respects_antisymmetric_normalization
  544. 28.88 s > failure: test failure with exit code 101
  545. 28.88 s > thread 'color::test::form_reference::metric_contraction_respects_antisymmetric_normalization' (329) panicked at crates/idenso/src/color/test/form_reference.rs:171:5:
  546. 28.88 s > assertion `left == right` failed
  547. 28.88 s > left: "-1*f(coad(8,standalone_metric_j),coad(8,standalone_metric_s),coad(8,standalone_metric_u))"
  548. 28.88 s > right: "f(coad(8,standalone_metric_j),coad(8,standalone_metric_s),coad(8,standalone_metric_u))"
  549. 28.88 s > stack backtrace:
  550. 28.88 s > 0: __rustc::rust_begin_unwind
  551. 28.88 s > 1: core::panicking::panic_fmt
  552. 28.88 s > 2: core::panicking::assert_failed_inner
  553. 28.88 s > 3: core::panicking::assert_failed::<alloc::string::String, alloc::string::String>
  554. 28.88 s > 4: idenso::color::test::form_reference::metric_contraction_respects_antisymmetric_normalization
  555. 28.88 s > 5: <idenso::color::test::form_reference::metric_contraction_respects_antisymmetric_normalization::{closure#0} as core::ops::function::FnOnce<()>>::call_once
  556. 28.88 s > note: Some details are omitted, run with `RUST_BACKTRACE=full` for a verbose backtrace.
  557. 28.88 s > system-out
  558. 28.88 s > running 1 test
  559. 28.89 s > test color::test::form_reference::metric_contraction_respects_antisymmetric_normalization ... FAILED
  560. 28.89 s >
  561. 28.89 s > failures:
  562. 28.89 s >
  563. 28.89 s > failures:
  564. 28.89 s > color::test::form_reference::metric_contraction_respects_antisymmetric_normalization
  565. 28.89 s >
  566. 28.89 s > test result: FAILED. 0 passed; 1 failed; 0 ignored; 0 measured; 240 filtered out; finished in 0.01s
  567. 28.89 s > system-err
  568. 28.89 s > thread 'color::test::form_reference::metric_contraction_respects_antisymmetric_normalization' (329) panicked at crates/idenso/src/color/test/form_reference.rs:171:5:
  569. 28.89 s > assertion `left == right` failed
  570. 28.89 s > left: "-1*f(coad(8,standalone_metric_j),coad(8,standalone_metric_s),coad(8,standalone_metric_u))"
  571. 28.89 s > right: "f(coad(8,standalone_metric_j),coad(8,standalone_metric_s),coad(8,standalone_metric_u))"
  572. 28.89 s > stack backtrace:
  573. 28.89 s > 0: __rustc::rust_begin_unwind
  574. 28.89 s > 1: core::panicking::panic_fmt
  575. 28.89 s > 2: core::panicking::assert_failed_inner
  576. 28.89 s > 3: core::panicking::assert_failed::<alloc::string::String, alloc::string::String>
  577. 28.89 s > 4: idenso::color::test::form_reference::metric_contraction_respects_antisymmetric_normalization
  578. 28.89 s > 5: <idenso::color::test::form_reference::metric_contraction_respects_antisymmetric_normalization::{closure#0} as core::ops::function::FnOnce<()>>::call_once
  579. 28.89 s > note: Some details are omitted, run with `RUST_BACKTRACE=full` for a verbose backtrace.
  580. 28.89 s >
  581. 28.89 s > 2. idenso::tensor::tests::parsing::infinite_execution
  582. 28.89 s > failure: test failure with exit code 101
  583. 28.89 s > thread 'tensor::tests::parsing::infinite_execution' (844) panicked at /nix/store/0f9p2h9240ylfzayilfjv4gr7scagfs3-vendor-cargo-deps/c19b7c6f923b580ac259164a89f2577984ad5ab09ee9d583b888f934adbbe8d0/insta-1.47.2/src/runtime.rs:719:13:
  584. 28.89 s > snapshot assertion for 'infinite_execution' failed in line 910
  585. 28.89 s > stack backtrace:
  586. 28.89 s > 0: __rustc::rust_begin_unwind
  587. 28.89 s > 1: core::panicking::panic_fmt
  588. 28.89 s > 2: insta::runtime::assert_snapshot
  589. 28.89 s > 3: idenso::tensor::tests::parsing::infinite_execution
  590. 28.89 s > 4: <idenso::tensor::tests::parsing::infinite_execution::{closure#0} as core::ops::function::FnOnce<()>>::call_once
  591. 28.89 s > note: Some details are omitted, run with `RUST_BACKTRACE=full` for a verbose backtrace.
  592. 28.89 s > system-out
  593. 28.89 s > running 1 test
  594. 28.89 s > ━━━━━━━━━━━━━━━━━━━━━━━━━━━━━━━ Snapshot Summary ━━━━━━━━━━━━━━━━━━━━━━━━━━━━━━━
  595. 28.89 s > Snapshot: infinite_execution
  596. 28.89 s > Source: crates/idenso/src/tensor/tests/parsing.rs:910
  597. 28.89 s > ────────────────────────────────────────────────────────────────────────────────
  598. 28.89 s > Expression: net_iter.snapshot_dot()
  599. 28.89 s > ────────────────────────────────────────────────────────────────────────────────
  600. 28.89 s > -old snapshot
  601. 28.89 s > +new results
  602. 28.89 s > ────────────┬───────────────────────────────────────────────────────────────────
  603. 28.89 s > 8 8 │ 0:0:s-> ext0 [id=0 color="red"];
  604. 28.89 s > 9 9 │ ext1 [style=invis];
  605. 28.89 s > 10 10 │ 0:5:s-> ext1 [id=1 dir=none color="red" label="mink4|l_0"];
  606. 28.89 s > 11 11 │ ext2 [style=invis];
  607. 28.89 s > 12 │- 0:4:s-> ext2 [id=2 dir=none color="red" label="bis4|l_2"];
  608. 28.89 s > 12 │+ 0:3:s-> ext2 [id=2 dir=none color="red" label="mink4|l_1"];
  609. 28.89 s > 13 13 │ ext3 [style=invis];
  610. 28.89 s > 14 │- 0:3:s-> ext3 [id=3 dir=none color="red" label="bis4|l_3"];
  611. 28.89 s > 14 │+ 0:1:s-> ext3 [id=3 dir=none color="red" label="bis4|l_2"];
  612. 28.89 s > 15 15 │ ext4 [style=invis];
  613. 28.89 s > 16 │- 0:1:s-> ext4 [id=4 dir=none color="red" label="mink4|l_1"];
  614. 28.89 s > 16 │+ 0:2:s-> ext4 [id=4 dir=none color="red" label="mink4|l_4"];
  615. 28.89 s > 17 17 │ ext5 [style=invis];
  616. 28.89 s > 18 │- 0:2:s-> ext5 [id=5 dir=none color="red" label="mink4|l_4"];
  617. 28.89 s > 18 │+ 0:4:s-> ext5 [id=5 dir=none color="red" label="bis4|l_3"];
  618. 28.89 s > 19 19 │ }
  619. 28.89 s > ────────────┴───────────────────────────────────────────────────────────────────
  620. 28.89 s > To update snapshots run `cargo insta review`
  621. 28.89 s > Stopped on the first failure. Run `cargo insta test` to run all snapshots.
  622. 28.89 s > test tensor::tests::parsing::infinite_execution ... FAILED
  623. 28.89 s >
  624. 28.89 s > failures:
  625. 28.89 s >
  626. 28.89 s > failures:
  627. 28.89 s > tensor::tests::parsing::infinite_execution
  628. 28.89 s >
  629. 28.89 s > test result: FAILED. 0 passed; 1 failed; 0 ignored; 0 measured; 240 filtered out; finished in 0.09s
  630. 28.89 s > system-err
  631. 28.89 s > thread 'tensor::tests::parsing::infinite_execution' (844) panicked at /nix/store/0f9p2h9240ylfzayilfjv4gr7scagfs3-vendor-cargo-deps/c19b7c6f923b580ac259164a89f2577984ad5ab09ee9d583b888f934adbbe8d0/insta-1.47.2/src/runtime.rs:719:13:
  632. 28.89 s > snapshot assertion for 'infinite_execution' failed in line 910
  633. 28.89 s > stack backtrace:
  634. 28.89 s > 0: __rustc::rust_begin_unwind
  635. 28.89 s > 1: core::panicking::panic_fmt
  636. 28.89 s > 2: insta::runtime::assert_snapshot
  637. 28.89 s > 3: idenso::tensor::tests::parsing::infinite_execution
  638. 28.89 s > 4: <idenso::tensor::tests::parsing::infinite_execution::{closure#0} as core::ops::function::FnOnce<()>>::call_once
  639. 28.89 s > note: Some details are omitted, run with `RUST_BACKTRACE=full` for a verbose backtrace.
  640. 28.89 s > =========================================
  641. 28.89 s > Extracting 2 binaries and 1 linked path to /build/nextest-archive-41ZuUV
  642. 28.89 s > Extracted 8 files to /build/nextest-archive-41ZuUV in 0.13s
  643. 28.89 s > ------------
  644. 28.89 s > Nextest run ID 116e64c0-ed16-46e1-be86-b9a8d90c0459 with nextest profile: ci_gammaloop
  645. 28.89 s > Starting 135 tests across 2 binaries
  646. 28.89 s > ------------
  647. 28.89 s > Summary [ 0.241s] 135 tests run: 135 passed, 0 skipped
  648. 28.89 s >
  649. 28.89 s > ========== nextest test summary ==========
  650. 28.89 s > report: target/nextest/ci_gammaloop/junit.xml
  651. 28.89 s > tests: 135, failures: 0, errors: 0
  652. 28.89 s > No failing testcases found.
  653. 28.89 s > =========================================
  654. 28.89 s > Extracting 5 binaries and 2 linked paths to /build/nextest-archive-TT17WT
  655. 28.90 s > Extracted 19 files to /build/nextest-archive-TT17WT in 0.34s
  656. 28.90 s > ------------
  657. 28.90 s > Nextest run ID 673dcf04-426e-43e0-840e-149ccc580c17 with nextest profile: ci_gammaloop
  658. 28.90 s > Starting 25 tests across 5 binaries (1 test skipped via profile.ci_gammaloop.default-filter)
  659. 28.90 s > ------------
  660. 28.90 s > Summary [ 0.520s] 25 tests run: 25 passed, 1 skipped
  661. 28.90 s >
  662. 28.90 s > ========== nextest test summary ==========
  663. 28.90 s > report: target/nextest/ci_gammaloop/junit.xml
  664. 28.90 s > tests: 25, failures: 0, errors: 0
  665. 28.90 s > No failing testcases found.
  666. 28.90 s > =========================================
  667. 28.90 s > Extracting 2 binaries and 1 linked path to /build/nextest-archive-btZZmw
  668. 28.90 s > Extracted 8 files to /build/nextest-archive-btZZmw in 0.10s
  669. 28.90 s > ------------
  670. 28.90 s > Nextest run ID 0afcdcbe-42ca-49ad-a9ad-dabdedb4f004 with nextest profile: ci_gammaloop
  671. 28.90 s > Starting 1 test across 2 binaries
  672. 28.90 s > ------------
  673. 28.90 s > Summary [ 0.017s] 1 test run: 1 passed, 0 skipped
  674. 28.90 s >
  675. 28.90 s > ========== nextest test summary ==========
  676. 28.90 s > report: target/nextest/ci_gammaloop/junit.xml
  677. 28.90 s > tests: 1, failures: 0, errors: 0
  678. 28.90 s > No failing testcases found.
  679. 28.90 s > =========================================
  680. 28.90 s > Extracting 1 binary and 1 linked path to /build/nextest-archive-dk4nAo
  681. 28.90 s > Extracted 7 files to /build/nextest-archive-dk4nAo in 0.10s
  682. 28.90 s > ------------
  683. 28.90 s > Nextest run ID 639b8ccc-98bf-46c5-9787-cc9c9c06e02b with nextest profile: ci_gammaloop
  684. 28.90 s > Starting 0 tests across 1 binary
  685. 28.90 s > ------------
  686. 28.90 s > Summary [ 0.007s] 0 tests run: 0 passed, 0 skipped
  687. 28.90 s >
  688. 28.90 s > ========== nextest test summary ==========
  689. 28.90 s > report: target/nextest/ci_gammaloop/junit.xml
  690. 28.90 s > tests: 0, failures: 0, errors: 0
  691. 28.90 s > No failing testcases found.
  692. 28.90 s > =========================================
  693. 28.90 s For full logs, run:
  694. 28.90 s nix log /nix/store/fllp83dbxw52lklxvq55v8x8yhs6mfhc-gammaloop-nextest-spenso.drv
  695. 29.09 s Run failed.