test packages.x86_64-linux.nix-ci-check-gammaloop-nextest-spenso

Reproduce this run
Original Run
  1. 0.26 s $ /nix/store/9ypz3flqsrl5xl495mm8h645gadjsxi1-coreutils-9.11/bin/timeout --kill-after=15s 7200s /nix/store/23zk8sgzamrbmj1fday15szf7f2279s8-nix-2.34.7/bin/nix --extra-experimental-features nix-command --extra-experimental-features flakes flake clone git+https://github.com/alphal00p/gammaloop --dest /tmp/nix-ci-worker/stable-pwd/repo/
  2. 0.43 s Cloning into '/tmp/nix-ci-worker/stable-pwd/repo'...
  3. 1.28 s remote: Enumerating objects: 65034, done.
  4. 1.50 s remote: Counting objects: 0% (1/7706) remote: Counting objects: 1% (78/7706) remote: Counting objects: 2% (155/7706) remote: Counting objects: 3% (232/7706) remote: Counting objects: 4% (309/7706) remote: Counting objects: 5% (386/7706) remote: Counting objects: 6% (463/7706) remote: Counting objects: 7% (540/7706) remote: Counting objects: 8% (617/7706) remote: Counting objects: 9% (694/7706) remote: Counting objects: 10% (771/7706) remote: Counting objects: 11% (848/7706) remote: Counting objects: 12% (925/7706) remote: Counting objects: 13% (1002/7706) remote: Counting objects: 14% (1079/7706) remote: Counting objects: 15% (1156/7706) remote: Counting objects: 16% (1233/7706) remote: Counting objects: 17% (1311/7706) remote: Counting objects: 18% (1388/7706) remote: Counting objects: 19% (1465/7706) remote: Counting objects: 20% (1542/7706) remote: Counting objects: 21% (1619/7706) remote: Counting objects: 22% (1696/7706) remote: Counting objects: 23% (1773/7706) remote: Counting objects: 24% (1850/7706) remote: Counting objects: 25% (1927/7706) remote: Counting objects: 26% (2004/7706) remote: Counting objects: 27% (2081/7706) remote: Counting objects: 28% (2158/7706) remote: Counting objects: 29% (2235/7706) remote: Counting objects: 30% (2312/7706) remote: Counting objects: 31% (2389/7706) remote: Counting objects: 32% (2466/7706) remote: Counting objects: 33% (2543/7706) remote: Counting objects: 34% (2621/7706) remote: Counting objects: 35% (2698/7706) remote: Counting objects: 36% (2775/7706) remote: Counting objects: 37% (2852/7706) remote: Counting objects: 38% (2929/7706) remote: Counting objects: 39% (3006/7706) remote: Counting objects: 40% (3083/7706) remote: Counting objects: 41% (3160/7706) remote: Counting objects: 42% (3237/7706) remote: Counting objects: 43% (3314/7706) remote: Counting objects: 44% (3391/7706) remote: Counting objects: 45% (3468/7706) remote: Counting objects: 46% (3545/7706) remote: Counting objects: 47% (3622/7706) remote: Counting objects: 48% (3699/7706) remote: Counting objects: 49% (3776/7706) remote: Counting objects: 50% (3853/7706) remote: Counting objects: 51% (3931/7706) remote: Counting objects: 52% (4008/7706) remote: Counting objects: 53% (4085/7706) remote: Counting objects: 54% (4162/7706) remote: Counting objects: 55% (4239/7706) remote: Counting objects: 56% (4316/7706) remote: Counting objects: 57% (4393/7706) remote: Counting objects: 58% (4470/7706) remote: Counting objects: 59% (4547/7706) remote: Counting objects: 60% (4624/7706) remote: Counting objects: 61% (4701/7706) remote: Counting objects: 62% (4778/7706) remote: Counting objects: 63% (4855/7706) remote: Counting objects: 64% (4932/7706) remote: Counting objects: 65% (5009/7706) remote: Counting objects: 66% (5086/7706) remote: Counting objects: 67% (5164/7706) remote: Counting objects: 68% (5241/7706) remote: Counting objects: 69% (5318/7706) remote: Counting objects: 70% (5395/7706) remote: Counting objects: 71% (5472/7706) remote: Counting objects: 72% (5549/7706) remote: Counting objects: 73% (5626/7706) remote: Counting objects: 74% (5703/7706) remote: Counting objects: 75% (5780/7706) remote: Counting objects: 76% (5857/7706) remote: Counting objects: 77% (5934/7706) remote: Counting objects: 78% (6011/7706) remote: Counting objects: 79% (6088/7706) remote: Counting objects: 80% (6165/7706) remote: Counting objects: 81% (6242/7706) remote: Counting objects: 82% (6319/7706) remote: Counting objects: 83% (6396/7706) remote: Counting objects: 84% (6474/7706) remote: Counting objects: 85% (6551/7706) remote: Counting objects: 86% (6628/7706) remote: Counting objects: 87% (6705/7706) remote: Counting objects: 88% (6782/7706) remote: Counting objects: 89% (6859/7706) remote: Counting objects: 90% (6936/7706) remote: Counting objects: 91% (7013/7706) remote: Counting objects: 92% (7090/7706) remote: Counting objects: 93% (7167/7706) remote: Counting objects: 94% (7244/7706) remote: Counting objects: 95% (7321/7706) remote: Counting objects: 96% (7398/7706) remote: Counting objects: 97% (7475/7706) remote: Counting objects: 98% (7552/7706) remote: Counting objects: 99% (7629/7706) remote: Counting objects: 100% (7706/7706) remote: Counting objects: 100% (7706/7706), done.
  5. 2.78 s remote: Compressing objects: 0% (1/1417) remote: Compressing objects: 1% (15/1417) remote: Compressing objects: 2% (29/1417) remote: Compressing objects: 3% (43/1417) remote: Compressing objects: 4% (57/1417) remote: Compressing objects: 5% (71/1417) remote: Compressing objects: 6% (86/1417) remote: Compressing objects: 7% (100/1417) remote: Compressing objects: 8% (114/1417) remote: Compressing objects: 9% (128/1417) remote: Compressing objects: 10% (142/1417) remote: Compressing objects: 11% (156/1417) remote: Compressing objects: 12% (171/1417) remote: Compressing objects: 13% (185/1417) remote: Compressing objects: 13% (187/1417) remote: Compressing objects: 14% (199/1417) remote: Compressing objects: 15% (213/1417) remote: Compressing objects: 16% (227/1417) remote: Compressing objects: 17% (241/1417) remote: Compressing objects: 18% (256/1417) remote: Compressing objects: 19% (270/1417) remote: Compressing objects: 20% (284/1417) remote: Compressing objects: 21% (298/1417) remote: Compressing objects: 22% (312/1417) remote: Compressing objects: 23% (326/1417) remote: Compressing objects: 24% (341/1417) remote: Compressing objects: 25% (355/1417) remote: Compressing objects: 26% (369/1417) remote: Compressing objects: 27% (383/1417) remote: Compressing objects: 28% (397/1417) remote: Compressing objects: 29% (411/1417) remote: Compressing objects: 30% (426/1417) remote: Compressing objects: 31% (440/1417) remote: Compressing objects: 32% (454/1417) remote: Compressing objects: 33% (468/1417) remote: Compressing objects: 34% (482/1417) remote: Compressing objects: 35% (496/1417) remote: Compressing objects: 36% (511/1417) remote: Compressing objects: 37% (525/1417) remote: Compressing objects: 38% (539/1417) remote: Compressing objects: 39% (553/1417) remote: Compressing objects: 40% (567/1417) remote: Compressing objects: 41% (581/1417) remote: Compressing objects: 42% (596/1417) remote: Compressing objects: 43% (610/1417) remote: Compressing objects: 44% (624/1417) remote: Compressing objects: 45% (638/1417) remote: Compressing objects: 46% (652/1417) remote: Compressing objects: 47% (666/1417) remote: Compressing objects: 48% (681/1417) remote: Compressing objects: 49% (695/1417) remote: Compressing objects: 50% (709/1417) remote: Compressing objects: 51% (723/1417) remote: Compressing objects: 52% (737/1417) remote: Compressing objects: 53% (752/1417) remote: Compressing objects: 54% (766/1417) remote: Compressing objects: 55% (780/1417) remote: Compressing objects: 56% (794/1417) remote: Compressing objects: 57% (808/1417) remote: Compressing objects: 58% (822/1417) remote: Compressing objects: 59% (837/1417) remote: Compressing objects: 60% (851/1417) remote: Compressing objects: 61% (865/1417) remote: Compressing objects: 62% (879/1417) remote: Compressing objects: 63% (893/1417) remote: Compressing objects: 64% (907/1417) remote: Compressing objects: 65% (922/1417) remote: Compressing objects: 66% (936/1417) remote: Compressing objects: 67% (950/1417) remote: Compressing objects: 68% (964/1417) remote: Compressing objects: 69% (978/1417) remote: Compressing objects: 70% (992/1417) remote: Compressing objects: 71% (1007/1417) remote: Compressing objects: 72% (1021/1417) remote: Compressing objects: 73% (1035/1417) remote: Compressing objects: 74% (1049/1417) remote: Compressing objects: 75% (1063/1417) remote: Compressing objects: 76% (1077/1417) remote: Compressing objects: 77% (1092/1417) remote: Compressing objects: 78% (1106/1417) remote: Compressing objects: 79% (1120/1417) remote: Compressing objects: 80% (1134/1417) remote: Compressing objects: 81% (1148/1417) remote: Compressing objects: 82% (1162/1417) remote: Compressing objects: 83% (1177/1417) remote: Compressing objects: 84% (1191/1417) remote: Compressing objects: 85% (1205/1417) remote: Compressing objects: 86% (1219/1417) remote: Compressing objects: 87% (1233/1417) remote: Compressing objects: 88% (1247/1417) remote: Compressing objects: 89% (1262/1417) remote: Compressing objects: 90% (1276/1417) remote: Compressing objects: 91% (1290/1417) remote: Compressing objects: 92% (1304/1417) remote: Compressing objects: 93% (1318/1417) remote: Compressing objects: 94% (1332/1417) remote: Compressing objects: 95% (1347/1417) remote: Compressing objects: 96% (1361/1417) remote: Compressing objects: 97% (1375/1417) remote: Compressing objects: 98% (1389/1417) remote: Compressing objects: 99% (1403/1417) remote: Compressing objects: 100% (1417/1417) remote: Compressing objects: 100% (1417/1417), done.
  6. 5.70 s Receiving objects: 0% (1/65034) Receiving objects: 1% (651/65034) Receiving objects: 2% (1301/65034) Receiving objects: 3% (1952/65034) Receiving objects: 4% (2602/65034) Receiving objects: 5% (3252/65034) Receiving objects: 6% (3903/65034) Receiving objects: 7% (4553/65034) Receiving objects: 8% (5203/65034), 9.18 MiB | 18.35 MiB/s Receiving objects: 9% (5854/65034), 9.18 MiB | 18.35 MiB/s Receiving objects: 10% (6504/65034), 9.18 MiB | 18.35 MiB/s Receiving objects: 11% (7154/65034), 9.18 MiB | 18.35 MiB/s Receiving objects: 12% (7805/65034), 9.18 MiB | 18.35 MiB/s Receiving objects: 13% (8455/65034), 9.18 MiB | 18.35 MiB/s Receiving objects: 14% (9105/65034), 9.18 MiB | 18.35 MiB/s Receiving objects: 15% (9756/65034), 9.18 MiB | 18.35 MiB/s Receiving objects: 16% (10406/65034), 9.18 MiB | 18.35 MiB/s Receiving objects: 17% (11056/65034), 9.18 MiB | 18.35 MiB/s Receiving objects: 17% (11671/65034), 9.18 MiB | 18.35 MiB/s Receiving objects: 18% (11707/65034), 9.18 MiB | 18.35 MiB/s Receiving objects: 19% (12357/65034), 19.40 MiB | 19.39 MiB/s Receiving objects: 20% (13007/65034), 19.40 MiB | 19.39 MiB/s Receiving objects: 21% (13658/65034), 19.40 MiB | 19.39 MiB/s Receiving objects: 22% (14308/65034), 19.40 MiB | 19.39 MiB/s Receiving objects: 23% (14958/65034), 19.40 MiB | 19.39 MiB/s Receiving objects: 24% (15609/65034), 19.40 MiB | 19.39 MiB/s Receiving objects: 25% (16259/65034), 19.40 MiB | 19.39 MiB/s Receiving objects: 26% (16909/65034), 19.40 MiB | 19.39 MiB/s Receiving objects: 27% (17560/65034), 19.40 MiB | 19.39 MiB/s Receiving objects: 28% (18210/65034), 19.40 MiB | 19.39 MiB/s Receiving objects: 29% (18860/65034), 19.40 MiB | 19.39 MiB/s Receiving objects: 30% (19511/65034), 19.40 MiB | 19.39 MiB/s Receiving objects: 31% (20161/65034), 19.40 MiB | 19.39 MiB/s Receiving objects: 32% (20811/65034), 19.40 MiB | 19.39 MiB/s Receiving objects: 33% (21462/65034), 19.40 MiB | 19.39 MiB/s Receiving objects: 34% (22112/65034), 19.40 MiB | 19.39 MiB/s Receiving objects: 35% (22762/65034), 19.40 MiB | 19.39 MiB/s Receiving objects: 36% (23413/65034), 19.40 MiB | 19.39 MiB/s Receiving objects: 37% (24063/65034), 19.40 MiB | 19.39 MiB/s Receiving objects: 38% (24713/65034), 19.40 MiB | 19.39 MiB/s Receiving objects: 39% (25364/65034), 19.40 MiB | 19.39 MiB/s Receiving objects: 40% (26014/65034), 19.40 MiB | 19.39 MiB/s Receiving objects: 41% (26664/65034), 19.40 MiB | 19.39 MiB/s Receiving objects: 42% (27315/65034), 19.40 MiB | 19.39 MiB/s Receiving objects: 43% (27965/65034), 19.40 MiB | 19.39 MiB/s Receiving objects: 44% (28615/65034), 19.40 MiB | 19.39 MiB/s Receiving objects: 45% (29266/65034), 19.40 MiB | 19.39 MiB/s Receiving objects: 46% (29916/65034), 19.40 MiB | 19.39 MiB/s Receiving objects: 47% (30566/65034), 19.40 MiB | 19.39 MiB/s Receiving objects: 48% (31217/65034), 19.40 MiB | 19.39 MiB/s Receiving objects: 49% (31867/65034), 19.40 MiB | 19.39 MiB/s Receiving objects: 50% (32517/65034), 19.40 MiB | 19.39 MiB/s Receiving objects: 51% (33168/65034), 19.40 MiB | 19.39 MiB/s Receiving objects: 52% (33818/65034), 19.40 MiB | 19.39 MiB/s Receiving objects: 53% (34469/65034), 19.40 MiB | 19.39 MiB/s Receiving objects: 54% (35119/65034), 36.96 MiB | 24.64 MiB/s Receiving objects: 55% (35769/65034), 36.96 MiB | 24.64 MiB/s Receiving objects: 56% (36420/65034), 36.96 MiB | 24.64 MiB/s Receiving objects: 57% (37070/65034), 36.96 MiB | 24.64 MiB/s Receiving objects: 58% (37720/65034), 36.96 MiB | 24.64 MiB/s Receiving objects: 59% (38371/65034), 36.96 MiB | 24.64 MiB/s Receiving objects: 60% (39021/65034), 36.96 MiB | 24.64 MiB/s Receiving objects: 61% (39671/65034), 36.96 MiB | 24.64 MiB/s Receiving objects: 62% (40322/65034), 36.96 MiB | 24.64 MiB/s Receiving objects: 63% (40972/65034), 36.96 MiB | 24.64 MiB/s Receiving objects: 64% (41622/65034), 36.96 MiB | 24.64 MiB/s Receiving objects: 65% (42273/65034), 36.96 MiB | 24.64 MiB/s Receiving objects: 66% (42923/65034), 36.96 MiB | 24.64 MiB/s Receiving objects: 67% (43573/65034), 36.96 MiB | 24.64 MiB/s Receiving objects: 68% (44224/65034), 36.96 MiB | 24.64 MiB/s Receiving objects: 69% (44874/65034), 36.96 MiB | 24.64 MiB/s Receiving objects: 70% (45524/65034), 36.96 MiB | 24.64 MiB/s Receiving objects: 71% (46175/65034), 36.96 MiB | 24.64 MiB/s Receiving objects: 71% (46594/65034), 58.63 MiB | 29.28 MiB/s Receiving objects: 72% (46825/65034), 58.63 MiB | 29.28 MiB/s Receiving objects: 73% (47475/65034), 58.63 MiB | 29.28 MiB/s Receiving objects: 74% (48126/65034), 58.63 MiB | 29.28 MiB/s Receiving objects: 75% (48776/65034), 58.63 MiB | 29.28 MiB/s Receiving objects: 76% (49426/65034), 58.63 MiB | 29.28 MiB/s Receiving objects: 77% (50077/65034), 58.63 MiB | 29.28 MiB/s Receiving objects: 78% (50727/65034), 58.63 MiB | 29.28 MiB/s Receiving objects: 79% (51377/65034), 58.63 MiB | 29.28 MiB/s Receiving objects: 80% (52028/65034), 74.05 MiB | 29.59 MiB/s Receiving objects: 81% (52678/65034), 74.05 MiB | 29.59 MiB/s Receiving objects: 82% (53328/65034), 74.05 MiB | 29.59 MiB/s Receiving objects: 83% (53979/65034), 74.05 MiB | 29.59 MiB/s Receiving objects: 84% (54629/65034), 74.05 MiB | 29.59 MiB/s Receiving objects: 85% (55279/65034), 74.05 MiB | 29.59 MiB/s Receiving objects: 86% (55930/65034), 74.05 MiB | 29.59 MiB/s Receiving objects: 87% (56580/65034), 74.05 MiB | 29.59 MiB/s Receiving objects: 88% (57230/65034), 74.05 MiB | 29.59 MiB/s Receiving objects: 89% (57881/65034), 74.05 MiB | 29.59 MiB/s Receiving objects: 90% (58531/65034), 74.05 MiB | 29.59 MiB/s Receiving objects: 91% (59181/65034), 74.05 MiB | 29.59 MiB/s Receiving objects: 92% (59832/65034), 74.05 MiB | 29.59 MiB/s Receiving objects: 93% (60482/65034), 74.05 MiB | 29.59 MiB/s Receiving objects: 94% (61132/65034), 74.05 MiB | 29.59 MiB/s Receiving objects: 95% (61783/65034), 74.05 MiB | 29.59 MiB/s Receiving objects: 96% (62433/65034), 74.05 MiB | 29.59 MiB/s Receiving objects: 97% (63083/65034), 74.05 MiB | 29.59 MiB/s Receiving objects: 98% (63734/65034), 74.05 MiB | 29.59 MiB/s Receiving objects: 99% (64384/65034), 74.05 MiB | 29.59 MiB/s remote: Total 65034 (delta 6807), reused 6296 (delta 6288), pack-reused 57328 (from 1)
  7. 5.72 s Receiving objects: 100% (65034/65034), 74.05 MiB | 29.59 MiB/s Receiving objects: 100% (65034/65034), 86.99 MiB | 29.86 MiB/s, done.
  8. 7.84 s Resolving deltas: 0% (0/45904) Resolving deltas: 1% (461/45904) Resolving deltas: 2% (919/45904) Resolving deltas: 3% (1378/45904) Resolving deltas: 4% (1837/45904) Resolving deltas: 5% (2296/45904) Resolving deltas: 6% (2755/45904) Resolving deltas: 7% (3214/45904) Resolving deltas: 8% (3673/45904) Resolving deltas: 9% (4132/45904) Resolving deltas: 10% (4593/45904) Resolving deltas: 11% (5050/45904) Resolving deltas: 12% (5509/45904) Resolving deltas: 13% (5968/45904) Resolving deltas: 14% (6427/45904) Resolving deltas: 15% (6886/45904) Resolving deltas: 16% (7345/45904) Resolving deltas: 17% (7804/45904) Resolving deltas: 18% (8263/45904) Resolving deltas: 19% (8722/45904) Resolving deltas: 20% (9181/45904) Resolving deltas: 21% (9640/45904) Resolving deltas: 22% (10099/45904) Resolving deltas: 23% (10558/45904) Resolving deltas: 24% (11017/45904) Resolving deltas: 25% (11476/45904) Resolving deltas: 26% (11936/45904) Resolving deltas: 27% (12395/45904) Resolving deltas: 28% (12854/45904) Resolving deltas: 29% (13313/45904) Resolving deltas: 30% (13772/45904) Resolving deltas: 31% (14232/45904) Resolving deltas: 32% (14690/45904) Resolving deltas: 33% (15149/45904) Resolving deltas: 34% (15608/45904) Resolving deltas: 35% (16067/45904) Resolving deltas: 36% (16526/45904) Resolving deltas: 37% (16985/45904) Resolving deltas: 38% (17444/45904) Resolving deltas: 39% (17903/45904) Resolving deltas: 40% (18362/45904) Resolving deltas: 41% (18821/45904) Resolving deltas: 42% (19280/45904) Resolving deltas: 43% (19740/45904) Resolving deltas: 44% (20199/45904) Resolving deltas: 45% (20657/45904) Resolving deltas: 46% (21116/45904) Resolving deltas: 47% (21575/45904) Resolving deltas: 48% (22034/45904) Resolving deltas: 49% (22493/45904) Resolving deltas: 50% (22952/45904) Resolving deltas: 51% (23412/45904) Resolving deltas: 52% (23871/45904) Resolving deltas: 53% (24330/45904) Resolving deltas: 54% (24789/45904) Resolving deltas: 55% (25248/45904) Resolving deltas: 56% (25707/45904) Resolving deltas: 57% (26166/45904) Resolving deltas: 58% (26625/45904) Resolving deltas: 59% (27084/45904) Resolving deltas: 60% (27543/45904) Resolving deltas: 61% (28002/45904) Resolving deltas: 61% (28038/45904) Resolving deltas: 62% (28461/45904) Resolving deltas: 63% (28920/45904) Resolving deltas: 64% (29379/45904) Resolving deltas: 65% (29838/45904) Resolving deltas: 66% (30297/45904) Resolving deltas: 67% (30757/45904) Resolving deltas: 68% (31215/45904) Resolving deltas: 69% (31675/45904) Resolving deltas: 70% (32133/45904) Resolving deltas: 71% (32592/45904) Resolving deltas: 72% (33051/45904) Resolving deltas: 73% (33510/45904) Resolving deltas: 74% (33969/45904) Resolving deltas: 75% (34428/45904) Resolving deltas: 76% (34889/45904) Resolving deltas: 77% (35347/45904) Resolving deltas: 78% (35806/45904) Resolving deltas: 79% (36265/45904) Resolving deltas: 80% (36726/45904) Resolving deltas: 81% (37183/45904) Resolving deltas: 82% (37642/45904) Resolving deltas: 83% (38101/45904) Resolving deltas: 84% (38560/45904) Resolving deltas: 85% (39019/45904) Resolving deltas: 86% (39478/45904) Resolving deltas: 87% (39937/45904) Resolving deltas: 88% (40396/45904) Resolving deltas: 89% (40855/45904) Resolving deltas: 90% (41314/45904) Resolving deltas: 91% (41773/45904) Resolving deltas: 92% (42232/45904) Resolving deltas: 92% (42641/45904) Resolving deltas: 93% (42691/45904) Resolving deltas: 94% (43150/45904) Resolving deltas: 95% (43609/45904) Resolving deltas: 96% (44068/45904) Resolving deltas: 97% (44527/45904) Resolving deltas: 98% (44986/45904) Resolving deltas: 99% (45446/45904) Resolving deltas: 100% (45904/45904) Resolving deltas: 100% (45904/45904), done.
  9. 8.23 s Fetching commit 1de6cf5dc4b80d0f0bf9aa8e901ee6bd43e45b8d for vakint_rustred ...
  10. 8.23 s $ /nix/store/bcnisk3ydfgv26v2gw3zlky24g00yww2-git-2.54.0/bin/git fetch origin 1de6cf5dc4b80d0f0bf9aa8e901ee6bd43e45b8d
  11. 8.76 s From https://github.com/alphal00p/gammaloop
  12. 8.76 s * branch 1de6cf5dc4b80d0f0bf9aa8e901ee6bd43e45b8d -> FETCH_HEAD
  13. 8.79 s $ /nix/store/9ypz3flqsrl5xl495mm8h645gadjsxi1-coreutils-9.11/bin/timeout --kill-after=15s 7200s /nix/store/bcnisk3ydfgv26v2gw3zlky24g00yww2-git-2.54.0/bin/git -c advice.detachedHead=false checkout 1de6cf5dc4b80d0f0bf9aa8e901ee6bd43e45b8d
  14. 9.03 s HEAD is now at 1de6cf5d Implement FORM-less RustRed tensor mode
  15. 9.05 s $ /nix/store/9ypz3flqsrl5xl495mm8h645gadjsxi1-coreutils-9.11/bin/timeout --kill-after=15s 7200s /nix/store/23zk8sgzamrbmj1fday15szf7f2279s8-nix-2.34.7/bin/nix --extra-experimental-features nix-command --extra-experimental-features flakes --log-format internal-json run .#packages.x86_64-linux.nix-ci-check-gammaloop-nextest-spenso --print-build-logs
  16. 13.97 s
  17. 14.21 s Downloading cached gammaloop-nextest-binaries-spenso-idenso from https://cache.nix-ci.com
  18. 14.23 s Downloading cached gammaloop-nextest-binaries-spenso-spenso from https://cache.nix-ci.com
  19. 14.23 s Downloading cached gammaloop-nextest-binaries-spenso-spenso-hep-lib from https://cache.nix-ci.com
  20. 14.23 s Downloading cached gammaloop-nextest-binaries-spenso-spenso-macros from https://cache.nix-ci.com
  21. 14.23 s Downloading cached gammaloop-nextest-binaries-spenso-symbolica-utils from https://cache.nix-ci.com
  22. 14.42 s Downloaded cached gammaloop-nextest-binaries-spenso-symbolica-utils (6.3 MiB) in 192ms
  23. 14.42 s Progress: 0 of 7 built, 1 of 5 downloaded from cache (4 downloading)
  24. 14.43 s Downloaded cached gammaloop-nextest-binaries-spenso-spenso-macros (6.5 MiB) in 195ms
  25. 14.43 s Progress: 0 of 6 built, 2 of 5 downloaded from cache (3 downloading)
  26. 14.50 s Downloaded cached gammaloop-nextest-binaries-spenso-spenso (10.2 MiB) in 267ms
  27. 14.50 s Progress: 0 of 5 built, 3 of 5 downloaded from cache (2 downloading)
  28. 14.72 s Downloaded cached gammaloop-nextest-binaries-spenso-idenso (29.3 MiB) in 504ms
  29. 14.72 s Progress: 0 of 4 built, 4 of 5 downloaded from cache (1 downloading)
  30. 14.75 s Downloaded cached gammaloop-nextest-binaries-spenso-spenso-hep-lib (34 MiB) in 517ms
  31. 14.75 s Progress: 0 of 3 built, 5 of 5 downloaded from cache
  32. 14.78 s Building /nix/store/8iwz0c0kk8v2949mwv09ivqhmgn4arfz-gammaloop-nextest-binaries-spenso.drv
  33. 14.84 s [gammaloop-nextest-binaries-spenso:post-build] Uploading to the NixCI cache: /nix/store/88fi41gcpld7yl7dsaxzwpm82x7cr4jw-gammaloop-nextest-binaries-spenso
  34. 14.88 s [gammaloop-nextest-binaries-spenso:post-build] warning: 'warn-short-path-literals' is deprecated, use 'lint-short-path-literals = ignore' instead
  35. 14.89 s [gammaloop-nextest-binaries-spenso:post-build] copying 1 paths...
  36. 14.89 s [gammaloop-nextest-binaries-spenso:post-build] copying path '/nix/store/88fi41gcpld7yl7dsaxzwpm82x7cr4jw-gammaloop-nextest-binaries-spenso' to 'https://cache.nix-ci.com'...
  37. 14.96 s [gammaloop-nextest-binaries-spenso:post-build] warning: 'warn-short-path-literals' is deprecated, use 'lint-short-path-literals = ignore' instead
  38. 15.10 s [gammaloop-nextest-binaries-spenso:post-build] copying 0 paths...
  39. 15.12 s Uploaded gammaloop-nextest-binaries-spenso in 293ms
  40. 15.13 s Progress: 1 of 3 built, 5 of 5 downloaded from cache
  41. 15.13 s Built gammaloop-nextest-binaries-spenso in 349ms
  42. 15.21 s Building /nix/store/gaiw98blnxzm2r87gd0agj4ynjx2cv8d-nix-ci-check-gammaloop-nextest-spenso.drv
  43. 15.28 s [nix-ci-check-gammaloop-nextest-spenso:post-build] Uploading to the NixCI cache: /nix/store/irv46dym128ajmxmq5kxcamdmah39pf8-nix-ci-check-gammaloop-nextest-spenso
  44. 15.31 s [nix-ci-check-gammaloop-nextest-spenso:post-build] warning: 'warn-short-path-literals' is deprecated, use 'lint-short-path-literals = ignore' instead
  45. 15.33 s [nix-ci-check-gammaloop-nextest-spenso:post-build] copying 1 paths...
  46. 15.33 s [nix-ci-check-gammaloop-nextest-spenso:post-build] copying path '/nix/store/irv46dym128ajmxmq5kxcamdmah39pf8-nix-ci-check-gammaloop-nextest-spenso' to 'https://cache.nix-ci.com'...
  47. 15.40 s [nix-ci-check-gammaloop-nextest-spenso:post-build] warning: 'warn-short-path-literals' is deprecated, use 'lint-short-path-literals = ignore' instead
  48. 15.58 s [nix-ci-check-gammaloop-nextest-spenso:post-build] copying 0 paths...
  49. 15.61 s Uploaded nix-ci-check-gammaloop-nextest-spenso in 339ms
  50. 15.61 s Progress: 2 of 3 built, 5 of 5 downloaded from cache
  51. 15.61 s Built nix-ci-check-gammaloop-nextest-spenso in 397ms
  52. 15.61 s Progress: 3 of 3 built, 5 of 5 downloaded from cache
  53. 20.34 s evaluating derivation 'g copying '/nix/store/yk26 evaluating derivation 'g copying '/nix/store/yk26 evaluating derivation 'g querying gammaloop-nexte [0/1 built, 0.0 KiB DL] [1/0/1 built, 0.0 KiB DLgammaloop-nextest-spenso> Extracting 5 binaries and 2 linked paths to /build/nextest-archive-1yt10E
  54. 20.52 s gammaloop-nextest-spenso> Extracted 19 files to /build/nextest-archive-1yt10E in 0.18s
  55. 20.53 s gammaloop-nextest-spenso> ------------
  56. 20.53 s gammaloop-nextest-spenso> Nextest run ID 9a170369-269d-438c-9591-f7ba8dbb3ca0 with nextest profile: ci_gammaloop
  57. 20.53 s gammaloop-nextest-spenso> Starting 224 tests across 5 binaries (26 tests skipped, including 2 tests via profile.ci_gammaloop.default-filter)
  58. 20.62 s gammaloop-nextest-spenso> FAIL [ 0.012s] ( 45/224) idenso color::test::form_reference::metric_contraction_respects_antisymmetric_normalization
  59. 20.62 s gammaloop-nextest-spenso> stdout ---
  60. 20.62 s gammaloop-nextest-spenso>
  61. 20.62 s gammaloop-nextest-spenso> running 1 test
  62. 20.62 s gammaloop-nextest-spenso> test color::test::form_reference::metric_contraction_respects_antisymmetric_normalization ... FAILED
  63. 20.62 s gammaloop-nextest-spenso>
  64. 20.62 s gammaloop-nextest-spenso> failures:
  65. 20.62 s gammaloop-nextest-spenso>
  66. 20.62 s gammaloop-nextest-spenso> failures:
  67. 20.62 s gammaloop-nextest-spenso> color::test::form_reference::metric_contraction_respects_antisymmetric_normalization
  68. 20.62 s gammaloop-nextest-spenso>
  69. 20.62 s gammaloop-nextest-spenso> test result: FAILED. 0 passed; 1 failed; 0 ignored; 0 measured; 240 filtered out; finished in 0.00s
  70. 20.62 s gammaloop-nextest-spenso>
  71. 20.62 s gammaloop-nextest-spenso> stderr ---
  72. 20.62 s gammaloop-nextest-spenso>
  73. 20.62 s gammaloop-nextest-spenso> thread 'color::test::form_reference::metric_contraction_respects_antisymmetric_normalization' (322) panicked at crates/idenso/src/color/test/form_reference.rs:171:5:
  74. 20.62 s gammaloop-nextest-spenso> assertion `left == right` failed
  75. 20.62 s gammaloop-nextest-spenso> left: "-1*f(coad(8,standalone_metric_j),coad(8,standalone_metric_s),coad(8,standalone_metric_u))"
  76. 20.62 s gammaloop-nextest-spenso> right: "f(coad(8,standalone_metric_j),coad(8,standalone_metric_s),coad(8,standalone_metric_u))"
  77. 20.62 s gammaloop-nextest-spenso> stack backtrace:
  78. 20.62 s gammaloop-nextest-spenso> 0: __rustc::rust_begin_unwind
  79. 20.62 s gammaloop-nextest-spenso> 1: core::panicking::panic_fmt
  80. 20.62 s gammaloop-nextest-spenso> 2: core::panicking::assert_failed_inner
  81. 20.62 s gammaloop-nextest-spenso> 3: core::panicking::assert_failed::<alloc::string::String, alloc::string::String>
  82. 20.62 s gammaloop-nextest-spenso> 4: idenso::color::test::form_reference::metric_contraction_respects_antisymmetric_normalization
  83. 20.62 s gammaloop-nextest-spenso> 5: <idenso::color::test::form_reference::metric_contraction_respects_antisymmetric_normalization::{closure#0} as core::ops::function::FnOnce<()>>::call_once
  84. 20.62 s gammaloop-nextest-spenso> note: Some details are omitted, run with `RUST_BACKTRACE=full` for a verbose backtrace.
  85. 20.62 s gammaloop-nextest-spenso>
  86. 21.03 s gammaloop-nextest-spenso> FAIL [ 0.116s] (221/224) idenso tensor::tests::parsing::infinite_execution
  87. 21.03 s gammaloop-nextest-spenso> stdout ---
  88. 21.03 s gammaloop-nextest-spenso>
  89. 21.03 s gammaloop-nextest-spenso> running 1 test
  90. 21.03 s gammaloop-nextest-spenso> ━━━━━━━━━━━━━━━━━━━━━━━━━━━━━━━ Snapshot Summary ━━━━━━━━━━━━━━━━━━━━━━━━━━━━━━━
  91. 21.03 s gammaloop-nextest-spenso> Snapshot: infinite_execution
  92. 21.03 s gammaloop-nextest-spenso> Source: crates/idenso/src/tensor/tests/parsing.rs:910
  93. 21.03 s gammaloop-nextest-spenso> ────────────────────────────────────────────────────────────────────────────────
  94. 21.03 s gammaloop-nextest-spenso> Expression: net_iter.snapshot_dot()
  95. 21.03 s gammaloop-nextest-spenso> ────────────────────────────────────────────────────────────────────────────────
  96. 21.03 s gammaloop-nextest-spenso> -old snapshot
  97. 21.03 s gammaloop-nextest-spenso> +new results
  98. 21.03 s gammaloop-nextest-spenso> ────────────┬───────────────────────────────────────────────────────────────────
  99. 21.03 s gammaloop-nextest-spenso> 8 8 │ 0:0:s -> ext0 [id=0 color="red"];
  100. 21.03 s gammaloop-nextest-spenso> 9 9 │ ext1 [style=invis];
  101. 21.03 s gammaloop-nextest-spenso> 10 10 │ 0:5:s -> ext1 [id=1 dir=none color="red" label="mink4|l_0"];
  102. 21.03 s gammaloop-nextest-spenso> 11 11 │ ext2 [style=invis];
  103. 21.03 s gammaloop-nextest-spenso> 12 │- 0:4:s -> ext2 [id=2 dir=none color="red" label="bis4|l_2"];
  104. 21.03 s gammaloop-nextest-spenso> 12 │+ 0:3:s -> ext2 [id=2 dir=none color="red" label="mink4|l_1"];
  105. 21.03 s gammaloop-nextest-spenso> 13 13 │ ext3 [style=invis];
  106. 21.03 s gammaloop-nextest-spenso> 14 │- 0:3:s -> ext3 [id=3 dir=none color="red" label="bis4|l_3"];
  107. 21.03 s gammaloop-nextest-spenso> 14 │+ 0:1:s -> ext3 [id=3 dir=none color="red" label="bis4|l_2"];
  108. 21.03 s gammaloop-nextest-spenso> 15 15 │ ext4 [style=invis];
  109. 21.03 s gammaloop-nextest-spenso> 16 │- 0:1:s -> ext4 [id=4 dir=none color="red" label="mink4|l_1"];
  110. 21.03 s gammaloop-nextest-spenso> 16 │+ 0:2:s -> ext4 [id=4 dir=none color="red" label="mink4|l_4"];
  111. 21.03 s gammaloop-nextest-spenso> 17 17 │ ext5 [style=invis];
  112. 21.03 s gammaloop-nextest-spenso> 18 │- 0:2:s -> ext5 [id=5 dir=none color="red" label="mink4|l_4"];
  113. 21.03 s gammaloop-nextest-spenso> 18 │+ 0:4:s -> ext5 [id=5 dir=none color="red" label="bis4|l_3"];
  114. 21.03 s gammaloop-nextest-spenso> 19 19 │ }
  115. 21.03 s gammaloop-nextest-spenso> ────────────┴───────────────────────────────────────────────────────────────────
  116. 21.03 s gammaloop-nextest-spenso> To update snapshots run `cargo insta review`
  117. 21.03 s gammaloop-nextest-spenso> Stopped on the first failure. Run `cargo insta test` to run all snapshots.
  118. 21.03 s gammaloop-nextest-spenso> test tensor::tests::parsing::infinite_execution ... FAILED
  119. 21.03 s gammaloop-nextest-spenso>
  120. 21.03 s gammaloop-nextest-spenso> failures:
  121. 21.03 s gammaloop-nextest-spenso>
  122. 21.03 s gammaloop-nextest-spenso> failures:
  123. 21.03 s gammaloop-nextest-spenso> tensor::tests::parsing::infinite_execution
  124. 21.03 s gammaloop-nextest-spenso>
  125. 21.03 s gammaloop-nextest-spenso> test result: FAILED. 0 passed; 1 failed; 0 ignored; 0 measured; 240 filtered out; finished in 0.10s
  126. 21.03 s gammaloop-nextest-spenso>
  127. 21.03 s gammaloop-nextest-spenso> stderr ---
  128. 21.03 s gammaloop-nextest-spenso>
  129. 21.03 s gammaloop-nextest-spenso> thread 'tensor::tests::parsing::infinite_execution' (853) panicked at /nix/store/0f9p2h9240ylfzayilfjv4gr7scagfs3-vendor-cargo-deps/c19b7c6f923b580ac259164a89f2577984ad5ab09ee9d583b888f934adbbe8d0/insta-1.47.2/src/runtime.rs:719:13:
  130. 21.03 s gammaloop-nextest-spenso> snapshot assertion for 'infinite_execution' failed in line 910
  131. 21.03 s gammaloop-nextest-spenso> stack backtrace:
  132. 21.03 s gammaloop-nextest-spenso> 0: __rustc::rust_begin_unwind
  133. 21.03 s gammaloop-nextest-spenso> 1: core::panicking::panic_fmt
  134. 21.03 s gammaloop-nextest-spenso> 2: insta::runtime::assert_snapshot
  135. 21.03 s gammaloop-nextest-spenso> 3: idenso::tensor::tests::parsing::infinite_execution
  136. 21.03 s gammaloop-nextest-spenso> 4: <idenso::tensor::tests::parsing::infinite_execution::{closure#0} as core::ops::function::FnOnce<()>>::call_once
  137. 21.03 s gammaloop-nextest-spenso> note: Some details are omitted, run with `RUST_BACKTRACE=full` for a verbose backtrace.
  138. 21.03 s gammaloop-nextest-spenso>
  139. 22.89 s gammaloop-nextest-spenso> ------------
  140. 22.89 s gammaloop-nextest-spenso> Summary [ 2.353s] 224 tests run: 222 passed, 2 failed, 26 skipped
  141. 22.89 s gammaloop-nextest-spenso> FAIL [ 0.012s] ( 45/224) idenso color::test::form_reference::metric_contraction_respects_antisymmetric_normalization
  142. 22.89 s gammaloop-nextest-spenso> stdout ---
  143. 22.89 s gammaloop-nextest-spenso>
  144. 22.89 s gammaloop-nextest-spenso> running 1 test
  145. 22.89 s gammaloop-nextest-spenso> test color::test::form_reference::metric_contraction_respects_antisymmetric_normalization ... FAILED
  146. 22.89 s gammaloop-nextest-spenso>
  147. 22.89 s gammaloop-nextest-spenso> failures:
  148. 22.89 s gammaloop-nextest-spenso>
  149. 22.89 s gammaloop-nextest-spenso> failures:
  150. 22.89 s gammaloop-nextest-spenso> color::test::form_reference::metric_contraction_respects_antisymmetric_normalization
  151. 22.89 s gammaloop-nextest-spenso>
  152. 22.89 s gammaloop-nextest-spenso> test result: FAILED. 0 passed; 1 failed; 0 ignored; 0 measured; 240 filtered out; finished in 0.00s
  153. 22.89 s gammaloop-nextest-spenso>
  154. 22.89 s gammaloop-nextest-spenso> stderr ---
  155. 22.89 s gammaloop-nextest-spenso>
  156. 22.89 s gammaloop-nextest-spenso> thread 'color::test::form_reference::metric_contraction_respects_antisymmetric_normalization' (322) panicked at crates/idenso/src/color/test/form_reference.rs:171:5:
  157. 22.89 s gammaloop-nextest-spenso> assertion `left == right` failed
  158. 22.89 s gammaloop-nextest-spenso> left: "-1*f(coad(8,standalone_metric_j),coad(8,standalone_metric_s),coad(8,standalone_metric_u))"
  159. 22.89 s gammaloop-nextest-spenso> right: "f(coad(8,standalone_metric_j),coad(8,standalone_metric_s),coad(8,standalone_metric_u))"
  160. 22.89 s gammaloop-nextest-spenso> stack backtrace:
  161. 22.89 s gammaloop-nextest-spenso> 0: __rustc::rust_begin_unwind
  162. 22.89 s gammaloop-nextest-spenso> 1: core::panicking::panic_fmt
  163. 22.89 s gammaloop-nextest-spenso> 2: core::panicking::assert_failed_inner
  164. 22.89 s gammaloop-nextest-spenso> 3: core::panicking::assert_failed::<alloc::string::String, alloc::string::String>
  165. 22.89 s gammaloop-nextest-spenso> 4: idenso::color::test::form_reference::metric_contraction_respects_antisymmetric_normalization
  166. 22.89 s gammaloop-nextest-spenso> 5: <idenso::color::test::form_reference::metric_contraction_respects_antisymmetric_normalization::{closure#0} as core::ops::function::FnOnce<()>>::call_once
  167. 22.89 s gammaloop-nextest-spenso> note: Some details are omitted, run with `RUST_BACKTRACE=full` for a verbose backtrace.
  168. 22.89 s gammaloop-nextest-spenso>
  169. 22.89 s gammaloop-nextest-spenso> FAIL [ 0.116s] (221/224) idenso tensor::tests::parsing::infinite_execution
  170. 22.89 s gammaloop-nextest-spenso> stdout ---
  171. 22.89 s gammaloop-nextest-spenso>
  172. 22.89 s gammaloop-nextest-spenso> running 1 test
  173. 22.89 s gammaloop-nextest-spenso> ━━━━━━━━━━━━━━━━━━━━━━━━━━━━━━━ Snapshot Summary ━━━━━━━━━━━━━━━━━━━━━━━━━━━━━━━
  174. 22.89 s gammaloop-nextest-spenso> Snapshot: infinite_execution
  175. 22.89 s gammaloop-nextest-spenso> Source: crates/idenso/src/tensor/tests/parsing.rs:910
  176. 22.89 s gammaloop-nextest-spenso> ────────────────────────────────────────────────────────────────────────────────
  177. 22.89 s gammaloop-nextest-spenso> Expression: net_iter.snapshot_dot()
  178. 22.89 s gammaloop-nextest-spenso> ────────────────────────────────────────────────────────────────────────────────
  179. 22.89 s gammaloop-nextest-spenso> -old snapshot
  180. 22.89 s gammaloop-nextest-spenso> +new results
  181. 22.89 s gammaloop-nextest-spenso> ────────────┬───────────────────────────────────────────────────────────────────
  182. 22.89 s gammaloop-nextest-spenso> 8 8 │ 0:0:s -> ext0 [id=0 color="red"];
  183. 22.89 s gammaloop-nextest-spenso> 9 9 │ ext1 [style=invis];
  184. 22.89 s gammaloop-nextest-spenso> 10 10 │ 0:5:s -> ext1 [id=1 dir=none color="red" label="mink4|l_0"];
  185. 22.89 s gammaloop-nextest-spenso> 11 11 │ ext2 [style=invis];
  186. 22.89 s gammaloop-nextest-spenso> 12 │- 0:4:s -> ext2 [id=2 dir=none color="red" label="bis4|l_2"];
  187. 22.89 s gammaloop-nextest-spenso> 12 │+ 0:3:s -> ext2 [id=2 dir=none color="red" label="mink4|l_1"];
  188. 22.89 s gammaloop-nextest-spenso> 13 13 │ ext3 [style=invis];
  189. 22.89 s gammaloop-nextest-spenso> 14 │- 0:3:s -> ext3 [id=3 dir=none color="red" label="bis4|l_3"];
  190. 22.89 s gammaloop-nextest-spenso> 14 │+ 0:1:s -> ext3 [id=3 dir=none color="red" label="bis4|l_2"];
  191. 22.89 s gammaloop-nextest-spenso> 15 15 │ ext4 [style=invis];
  192. 22.89 s gammaloop-nextest-spenso> 16 │- 0:1:s -> ext4 [id=4 dir=none color="red" label="mink4|l_1"];
  193. 22.89 s gammaloop-nextest-spenso> 16 │+ 0:2:s -> ext4 [id=4 dir=none color="red" label="mink4|l_4"];
  194. 22.89 s gammaloop-nextest-spenso> 17 17 │ ext5 [style=invis];
  195. 22.89 s gammaloop-nextest-spenso> 18 │- 0:2:s -> ext5 [id=5 dir=none color="red" label="mink4|l_4"];
  196. 22.89 s gammaloop-nextest-spenso> 18 │+ 0:4:s -> ext5 [id=5 dir=none color="red" label="bis4|l_3"];
  197. 22.89 s gammaloop-nextest-spenso> 19 19 │ }
  198. 22.89 s gammaloop-nextest-spenso> ────────────┴───────────────────────────────────────────────────────────────────
  199. 22.89 s gammaloop-nextest-spenso> To update snapshots run `cargo insta review`
  200. 22.89 s gammaloop-nextest-spenso> Stopped on the first failure. Run `cargo insta test` to run all snapshots.
  201. 22.89 s gammaloop-nextest-spenso> test tensor::tests::parsing::infinite_execution ... FAILED
  202. 22.89 s gammaloop-nextest-spenso>
  203. 22.89 s gammaloop-nextest-spenso> failures:
  204. 22.89 s gammaloop-nextest-spenso>
  205. 22.89 s gammaloop-nextest-spenso> failures:
  206. 22.89 s gammaloop-nextest-spenso> tensor::tests::parsing::infinite_execution
  207. 22.89 s gammaloop-nextest-spenso>
  208. 22.89 s gammaloop-nextest-spenso> test result: FAILED. 0 passed; 1 failed; 0 ignored; 0 measured; 240 filtered out; finished in 0.10s
  209. 22.89 s gammaloop-nextest-spenso>
  210. 22.89 s gammaloop-nextest-spenso> stderr ---
  211. 22.89 s gammaloop-nextest-spenso>
  212. 22.89 s gammaloop-nextest-spenso> thread 'tensor::tests::parsing::infinite_execution' (853) panicked at /nix/store/0f9p2h9240ylfzayilfjv4gr7scagfs3-vendor-cargo-deps/c19b7c6f923b580ac259164a89f2577984ad5ab09ee9d583b888f934adbbe8d0/insta-1.47.2/src/runtime.rs:719:13:
  213. 22.89 s gammaloop-nextest-spenso> snapshot assertion for 'infinite_execution' failed in line 910
  214. 22.89 s gammaloop-nextest-spenso> stack backtrace:
  215. 22.89 s gammaloop-nextest-spenso> 0: __rustc::rust_begin_unwind
  216. 22.89 s gammaloop-nextest-spenso> 1: core::panicking::panic_fmt
  217. 22.89 s gammaloop-nextest-spenso> 2: insta::runtime::assert_snapshot
  218. 22.89 s gammaloop-nextest-spenso> 3: idenso::tensor::tests::parsing::infinite_execution
  219. 22.89 s gammaloop-nextest-spenso> 4: <idenso::tensor::tests::parsing::infinite_execution::{closure#0} as core::ops::function::FnOnce<()>>::call_once
  220. 22.89 s gammaloop-nextest-spenso> note: Some details are omitted, run with `RUST_BACKTRACE=full` for a verbose backtrace.
  221. 22.89 s gammaloop-nextest-spenso>
  222. 22.92 s gammaloop-nextest-spenso> error: test run failed
  223. 22.95 s gammaloop-nextest-spenso>
  224. 22.95 s gammaloop-nextest-spenso> ========== nextest test summary ==========
  225. 22.95 s gammaloop-nextest-spenso> report: target/nextest/ci_gammaloop/junit.xml
  226. 22.95 s gammaloop-nextest-spenso> tests: 224, failures: 2, errors: 0
  227. 22.95 s gammaloop-nextest-spenso>
  228. 22.95 s gammaloop-nextest-spenso> 1. idenso::color::test::form_reference::metric_contraction_respects_antisymmetric_normalization
  229. 22.95 s gammaloop-nextest-spenso> failure: test failure with exit code 101
  230. 22.95 s gammaloop-nextest-spenso> thread 'color::test::form_reference::metric_contraction_respects_antisymmetric_normalization' (322) panicked at crates/idenso/src/color/test/form_reference.rs:171:5:
  231. 22.95 s gammaloop-nextest-spenso> assertion `left == right` failed
  232. 22.95 s gammaloop-nextest-spenso> left: "-1*f(coad(8,standalone_metric_j),coad(8,standalone_metric_s),coad(8,standalone_metric_u))"
  233. 22.95 s gammaloop-nextest-spenso> right: "f(coad(8,standalone_metric_j),coad(8,standalone_metric_s),coad(8,standalone_metric_u))"
  234. 22.95 s gammaloop-nextest-spenso> stack backtrace:
  235. 22.95 s gammaloop-nextest-spenso> 0: __rustc::rust_begin_unwind
  236. 22.95 s gammaloop-nextest-spenso> 1: core::panicking::panic_fmt
  237. 22.95 s gammaloop-nextest-spenso> 2: core::panicking::assert_failed_inner
  238. 22.95 s gammaloop-nextest-spenso> 3: core::panicking::assert_failed::<alloc::string::String, alloc::string::String>
  239. 22.95 s gammaloop-nextest-spenso> 4: idenso::color::test::form_reference::metric_contraction_respects_antisymmetric_normalization
  240. 22.95 s gammaloop-nextest-spenso> 5: <idenso::color::test::form_reference::metric_contraction_respects_antisymmetric_normalization::{closure#0} as core::ops::function::FnOnce<()>>::call_once
  241. 22.95 s gammaloop-nextest-spenso> note: Some details are omitted, run with `RUST_BACKTRACE=full` for a verbose backtrace.
  242. 22.95 s gammaloop-nextest-spenso> system-out
  243. 22.95 s gammaloop-nextest-spenso> running 1 test
  244. 22.95 s gammaloop-nextest-spenso> test color::test::form_reference::metric_contraction_respects_antisymmetric_normalization ... FAILED
  245. 22.95 s gammaloop-nextest-spenso>
  246. 22.95 s gammaloop-nextest-spenso> failures:
  247. 22.95 s gammaloop-nextest-spenso>
  248. 22.95 s gammaloop-nextest-spenso> failures:
  249. 22.95 s gammaloop-nextest-spenso> color::test::form_reference::metric_contraction_respects_antisymmetric_normalization
  250. 22.95 s gammaloop-nextest-spenso>
  251. 22.95 s gammaloop-nextest-spenso> test result: FAILED. 0 passed; 1 failed; 0 ignored; 0 measured; 240 filtered out; finished in 0.00s
  252. 22.95 s gammaloop-nextest-spenso> system-err
  253. 22.95 s gammaloop-nextest-spenso> thread 'color::test::form_reference::metric_contraction_respects_antisymmetric_normalization' (322) panicked at crates/idenso/src/color/test/form_reference.rs:171:5:
  254. 22.95 s gammaloop-nextest-spenso> assertion `left == right` failed
  255. 22.95 s gammaloop-nextest-spenso> left: "-1*f(coad(8,standalone_metric_j),coad(8,standalone_metric_s),coad(8,standalone_metric_u))"
  256. 22.95 s gammaloop-nextest-spenso> right: "f(coad(8,standalone_metric_j),coad(8,standalone_metric_s),coad(8,standalone_metric_u))"
  257. 22.95 s gammaloop-nextest-spenso> stack backtrace:
  258. 22.95 s gammaloop-nextest-spenso> 0: __rustc::rust_begin_unwind
  259. 22.95 s gammaloop-nextest-spenso> 1: core::panicking::panic_fmt
  260. 22.95 s gammaloop-nextest-spenso> 2: core::panicking::assert_failed_inner
  261. 22.95 s gammaloop-nextest-spenso> 3: core::panicking::assert_failed::<alloc::string::String, alloc::string::String>
  262. 22.95 s gammaloop-nextest-spenso> 4: idenso::color::test::form_reference::metric_contraction_respects_antisymmetric_normalization
  263. 22.95 s gammaloop-nextest-spenso> 5: <idenso::color::test::form_reference::metric_contraction_respects_antisymmetric_normalization::{closure#0} as core::ops::function::FnOnce<()>>::call_once
  264. 22.95 s gammaloop-nextest-spenso> note: Some details are omitted, run with `RUST_BACKTRACE=full` for a verbose backtrace.
  265. 22.95 s gammaloop-nextest-spenso>
  266. 22.95 s gammaloop-nextest-spenso> 2. idenso::tensor::tests::parsing::infinite_execution
  267. 22.95 s gammaloop-nextest-spenso> failure: test failure with exit code 101
  268. 22.95 s gammaloop-nextest-spenso> thread 'tensor::tests::parsing::infinite_execution' (853) panicked at /nix/store/0f9p2h9240ylfzayilfjv4gr7scagfs3-vendor-cargo-deps/c19b7c6f923b580ac259164a89f2577984ad5ab09ee9d583b888f934adbbe8d0/insta-1.47.2/src/runtime.rs:719:13:
  269. 22.95 s gammaloop-nextest-spenso> snapshot assertion for 'infinite_execution' failed in line 910
  270. 22.95 s gammaloop-nextest-spenso> stack backtrace:
  271. 22.95 s gammaloop-nextest-spenso> 0: __rustc::rust_begin_unwind
  272. 22.95 s gammaloop-nextest-spenso> 1: core::panicking::panic_fmt
  273. 22.95 s gammaloop-nextest-spenso> 2: insta::runtime::assert_snapshot
  274. 22.95 s gammaloop-nextest-spenso> 3: idenso::tensor::tests::parsing::infinite_execution
  275. 22.95 s gammaloop-nextest-spenso> 4: <idenso::tensor::tests::parsing::infinite_execution::{closure#0} as core::ops::function::FnOnce<()>>::call_once
  276. 22.95 s gammaloop-nextest-spenso> note: Some details are omitted, run with `RUST_BACKTRACE=full` for a verbose backtrace.
  277. 22.95 s gammaloop-nextest-spenso> system-out
  278. 22.95 s gammaloop-nextest-spenso> running 1 test
  279. 22.95 s gammaloop-nextest-spenso> ━━━━━━━━━━━━━━━━━━━━━━━━━━━━━━━ Snapshot Summary ━━━━━━━━━━━━━━━━━━━━━━━━━━━━━━━
  280. 22.95 s gammaloop-nextest-spenso> Snapshot: infinite_execution
  281. 22.95 s gammaloop-nextest-spenso> Source: crates/idenso/src/tensor/tests/parsing.rs:910
  282. 22.95 s gammaloop-nextest-spenso> ────────────────────────────────────────────────────────────────────────────────
  283. 22.95 s gammaloop-nextest-spenso> Expression: net_iter.snapshot_dot()
  284. 22.95 s gammaloop-nextest-spenso> ────────────────────────────────────────────────────────────────────────────────
  285. 22.95 s gammaloop-nextest-spenso> -old snapshot
  286. 22.95 s gammaloop-nextest-spenso> +new results
  287. 22.95 s gammaloop-nextest-spenso> ────────────┬───────────────────────────────────────────────────────────────────
  288. 22.95 s gammaloop-nextest-spenso> 8 8 │ 0:0:s-> ext0 [id=0 color="red"];
  289. 22.95 s gammaloop-nextest-spenso> 9 9 │ ext1 [style=invis];
  290. 22.95 s gammaloop-nextest-spenso> 10 10 │ 0:5:s-> ext1 [id=1 dir=none color="red" label="mink4|l_0"];
  291. 22.95 s gammaloop-nextest-spenso> 11 11 │ ext2 [style=invis];
  292. 22.95 s gammaloop-nextest-spenso> 12 │- 0:4:s-> ext2 [id=2 dir=none color="red" label="bis4|l_2"];
  293. 22.95 s gammaloop-nextest-spenso> 12 │+ 0:3:s-> ext2 [id=2 dir=none color="red" label="mink4|l_1"];
  294. 22.95 s gammaloop-nextest-spenso> 13 13 │ ext3 [style=invis];
  295. 22.95 s gammaloop-nextest-spenso> 14 │- 0:3:s-> ext3 [id=3 dir=none color="red" label="bis4|l_3"];
  296. 22.95 s gammaloop-nextest-spenso> 14 │+ 0:1:s-> ext3 [id=3 dir=none color="red" label="bis4|l_2"];
  297. 22.95 s gammaloop-nextest-spenso> 15 15 │ ext4 [style=invis];
  298. 22.95 s gammaloop-nextest-spenso> 16 │- 0:1:s-> ext4 [id=4 dir=none color="red" label="mink4|l_1"];
  299. 22.95 s gammaloop-nextest-spenso> 16 │+ 0:2:s-> ext4 [id=4 dir=none color="red" label="mink4|l_4"];
  300. 22.95 s gammaloop-nextest-spenso> 17 17 │ ext5 [style=invis];
  301. 22.95 s gammaloop-nextest-spenso> 18 │- 0:2:s-> ext5 [id=5 dir=none color="red" label="mink4|l_4"];
  302. 22.95 s gammaloop-nextest-spenso> 18 │+ 0:4:s-> ext5 [id=5 dir=none color="red" label="bis4|l_3"];
  303. 22.95 s gammaloop-nextest-spenso> 19 19 │ }
  304. 22.95 s gammaloop-nextest-spenso> ────────────┴───────────────────────────────────────────────────────────────────
  305. 22.95 s gammaloop-nextest-spenso> To update snapshots run `cargo insta review`
  306. 22.95 s gammaloop-nextest-spenso> Stopped on the first failure. Run `cargo insta test` to run all snapshots.
  307. 22.95 s gammaloop-nextest-spenso> test tensor::tests::parsing::infinite_execution ... FAILED
  308. 22.95 s gammaloop-nextest-spenso>
  309. 22.95 s gammaloop-nextest-spenso> failures:
  310. 22.95 s gammaloop-nextest-spenso>
  311. 22.95 s gammaloop-nextest-spenso> failures:
  312. 22.95 s gammaloop-nextest-spenso> tensor::tests::parsing::infinite_execution
  313. 22.95 s gammaloop-nextest-spenso>
  314. 22.95 s gammaloop-nextest-spenso> test result: FAILED. 0 passed; 1 failed; 0 ignored; 0 measured; 240 filtered out; finished in 0.10s
  315. 22.95 s gammaloop-nextest-spenso> system-err
  316. 22.95 s gammaloop-nextest-spenso> thread 'tensor::tests::parsing::infinite_execution' (853) panicked at /nix/store/0f9p2h9240ylfzayilfjv4gr7scagfs3-vendor-cargo-deps/c19b7c6f923b580ac259164a89f2577984ad5ab09ee9d583b888f934adbbe8d0/insta-1.47.2/src/runtime.rs:719:13:
  317. 22.95 s gammaloop-nextest-spenso> snapshot assertion for 'infinite_execution' failed in line 910
  318. 22.95 s gammaloop-nextest-spenso> stack backtrace:
  319. 22.95 s gammaloop-nextest-spenso> 0: __rustc::rust_begin_unwind
  320. 22.95 s gammaloop-nextest-spenso> 1: core::panicking::panic_fmt
  321. 22.95 s gammaloop-nextest-spenso> 2: insta::runtime::assert_snapshot
  322. 22.95 s gammaloop-nextest-spenso> 3: idenso::tensor::tests::parsing::infinite_execution
  323. 22.95 s gammaloop-nextest-spenso> 4: <idenso::tensor::tests::parsing::infinite_execution::{closure#0} as core::ops::function::FnOnce<()>>::call_once
  324. 22.95 s gammaloop-nextest-spenso> note: Some details are omitted, run with `RUST_BACKTRACE=full` for a verbose backtrace.
  325. 22.95 s gammaloop-nextest-spenso> =========================================
  326. 22.97 s gammaloop-nextest-spenso> Extracting 2 binaries and 1 linked path to /build/nextest-archive-4WXeNz
  327. 23.09 s gammaloop-nextest-spenso> Extracted 8 files to /build/nextest-archive-4WXeNz in 0.12s
  328. 23.12 s gammaloop-nextest-spenso> ------------
  329. 23.12 s gammaloop-nextest-spenso> Nextest run ID 6d9a9b6a-c058-42be-be74-b2bee30fd10d with nextest profile: ci_gammaloop
  330. 23.12 s gammaloop-nextest-spenso> Starting 135 tests across 2 binaries
  331. 23.31 s gammaloop-nextest-spenso> ------------
  332. 23.31 s gammaloop-nextest-spenso> Summary [ 0.192s] 135 tests run: 135 passed, 0 skipped
  333. 23.36 s gammaloop-nextest-spenso>
  334. 23.36 s gammaloop-nextest-spenso> ========== nextest test summary ==========
  335. 23.36 s gammaloop-nextest-spenso> report: target/nextest/ci_gammaloop/junit.xml
  336. 23.36 s gammaloop-nextest-spenso> tests: 135, failures: 0, errors: 0
  337. 23.36 s gammaloop-nextest-spenso> No failing testcases found.
  338. 23.36 s gammaloop-nextest-spenso> =========================================
  339. 23.37 s gammaloop-nextest-spenso> Extracting 5 binaries and 2 linked paths to /build/nextest-archive-40dU6h
  340. 23.59 s gammaloop-nextest-spenso> Extracted 19 files to /build/nextest-archive-40dU6h in 0.22s
  341. 23.65 s gammaloop-nextest-spenso> ------------
  342. 23.65 s gammaloop-nextest-spenso> Nextest run ID 5a15277e-7136-4790-9ec5-28cb1e362588 with nextest profile: ci_gammaloop
  343. 23.65 s gammaloop-nextest-spenso> Starting 25 tests across 5 binaries (1 test skipped via profile.ci_gammaloop.default-filter)
  344. 24.02 s gammaloop-nextest-spenso> ------------
  345. 24.02 s gammaloop-nextest-spenso> Summary [ 0.366s] 25 tests run: 25 passed, 1 skipped
  346. 24.11 s gammaloop-nextest-spenso>
  347. 24.11 s gammaloop-nextest-spenso> ========== nextest test summary ==========
  348. 24.11 s gammaloop-nextest-spenso> report: target/nextest/ci_gammaloop/junit.xml
  349. 24.11 s gammaloop-nextest-spenso> tests: 25, failures: 0, errors: 0
  350. 24.11 s gammaloop-nextest-spenso> No failing testcases found.
  351. 24.11 s gammaloop-nextest-spenso> =========================================
  352. 24.14 s gammaloop-nextest-spenso> Extracting 2 binaries and 1 linked path to /build/nextest-archive-yWOwtN
  353. 24.21 s gammaloop-nextest-spenso> Extracted 8 files to /build/nextest-archive-yWOwtN in 0.07s
  354. 24.24 s gammaloop-nextest-spenso> ------------
  355. 24.24 s gammaloop-nextest-spenso> Nextest run ID 848b2839-b908-428f-9f42-f682b299a3b3 with nextest profile: ci_gammaloop
  356. 24.24 s gammaloop-nextest-spenso> Starting 1 test across 2 binaries
  357. 24.28 s gammaloop-nextest-spenso> ------------
  358. 24.28 s gammaloop-nextest-spenso> Summary [ 0.043s] 1 test run: 1 passed, 0 skipped
  359. 24.36 s gammaloop-nextest-spenso>
  360. 24.36 s gammaloop-nextest-spenso> ========== nextest test summary ==========
  361. 24.36 s gammaloop-nextest-spenso> report: target/nextest/ci_gammaloop/junit.xml
  362. 24.36 s gammaloop-nextest-spenso> tests: 1, failures: 0, errors: 0
  363. 24.36 s gammaloop-nextest-spenso> No failing testcases found.
  364. 24.36 s gammaloop-nextest-spenso> =========================================
  365. 24.39 s gammaloop-nextest-spenso> Extracting 1 binary and 1 linked path to /build/nextest-archive-T4OYof
  366. 24.46 s gammaloop-nextest-spenso> Extracted 7 files to /build/nextest-archive-T4OYof in 0.07s
  367. 24.49 s gammaloop-nextest-spenso> ------------
  368. 24.49 s gammaloop-nextest-spenso> Nextest run ID 8b21a134-7e56-4f3b-9e0f-4bb85ecc017a with nextest profile: ci_gammaloop
  369. 24.49 s gammaloop-nextest-spenso> Starting 0 tests across 1 binary
  370. 24.49 s gammaloop-nextest-spenso> ------------
  371. 24.49 s gammaloop-nextest-spenso> Summary [ 0.000s] 0 tests run: 0 passed, 0 skipped
  372. 24.58 s gammaloop-nextest-spenso>
  373. 24.58 s gammaloop-nextest-spenso> ========== nextest test summary ==========
  374. 24.58 s gammaloop-nextest-spenso> report: target/nextest/ci_gammaloop/junit.xml
  375. 24.58 s gammaloop-nextest-spenso> tests: 0, failures: 0, errors: 0
  376. 24.58 s gammaloop-nextest-spenso> No failing testcases found.
  377. 24.58 s gammaloop-nextest-spenso> =========================================
  378. 24.64 s error: Cannot build '/nix/store/fllp83dbxw52lklxvq55v8x8yhs6mfhc-gammaloop-nextest-spenso.drv'.
  379. 24.64 s Reason: builder failed with exit code 100.
  380. 24.64 s Output paths:
  381. 24.64 s /nix/store/ipv4chj3sji5ba51pvyl9qs2fk62cydz-gammaloop-nextest-spenso
  382. 24.64 s Last 325 log lines:
  383. 24.64 s > Extracting 5 binaries and 2 linked paths to /build/nextest-archive-1yt10E
  384. 24.64 s > Extracted 19 files to /build/nextest-archive-1yt10E in 0.18s
  385. 24.64 s > ------------
  386. 24.64 s > Nextest run ID 9a170369-269d-438c-9591-f7ba8dbb3ca0 with nextest profile: ci_gammaloop
  387. 24.64 s > Starting 224 tests across 5 binaries (26 tests skipped, including 2 tests via profile.ci_gammaloop.default-filter)
  388. 24.64 s > FAIL [ 0.012s] ( 45/224) idenso color::test::form_reference::metric_contraction_respects_antisymmetric_normalization
  389. 24.64 s > stdout ---
  390. 24.64 s >
  391. 24.64 s > running 1 test
  392. 24.64 s > test color::test::form_reference::metric_contraction_respects_antisymmetric_normalization ... FAILED
  393. 24.64 s >
  394. 24.64 s > failures:
  395. 24.64 s >
  396. 24.64 s > failures:
  397. 24.64 s > color::test::form_reference::metric_contraction_respects_antisymmetric_normalization
  398. 24.64 s >
  399. 24.64 s > test result: FAILED. 0 passed; 1 failed; 0 ignored; 0 measured; 240 filtered out; finished in 0.00s
  400. 24.64 s >
  401. 24.64 s > stderr ---
  402. 24.64 s >
  403. 24.64 s > thread 'color::test::form_reference::metric_contraction_respects_antisymmetric_normalization' (322) panicked at crates/idenso/src/color/test/form_reference.rs:171:5:
  404. 24.64 s > assertion `left == right` failed
  405. 24.64 s > left: "-1*f(coad(8,standalone_metric_j),coad(8,standalone_metric_s),coad(8,standalone_metric_u))"
  406. 24.64 s > right: "f(coad(8,standalone_metric_j),coad(8,standalone_metric_s),coad(8,standalone_metric_u))"
  407. 24.64 s > stack backtrace:
  408. 24.64 s > 0: __rustc::rust_begin_unwind
  409. 24.64 s > 1: core::panicking::panic_fmt
  410. 24.64 s > 2: core::panicking::assert_failed_inner
  411. 24.64 s > 3: core::panicking::assert_failed::<alloc::string::String, alloc::string::String>
  412. 24.64 s > 4: idenso::color::test::form_reference::metric_contraction_respects_antisymmetric_normalization
  413. 24.64 s > 5: <idenso::color::test::form_reference::metric_contraction_respects_antisymmetric_normalization::{closure#0} as core::ops::function::FnOnce<()>>::call_once
  414. 24.64 s > note: Some details are omitted, run with `RUST_BACKTRACE=full` for a verbose backtrace.
  415. 24.64 s >
  416. 24.64 s > FAIL [ 0.116s] (221/224) idenso tensor::tests::parsing::infinite_execution
  417. 24.64 s > stdout ---
  418. 24.64 s >
  419. 24.64 s > running 1 test
  420. 24.64 s > ━━━━━━━━━━━━━━━━━━━━━━━━━━━━━━━ Snapshot Summary ━━━━━━━━━━━━━━━━━━━━━━━━━━━━━━━
  421. 24.64 s > Snapshot: infinite_execution
  422. 24.64 s > Source: crates/idenso/src/tensor/tests/parsing.rs:910
  423. 24.64 s > ────────────────────────────────────────────────────────────────────────────────
  424. 24.64 s > Expression: net_iter.snapshot_dot()
  425. 24.64 s > ────────────────────────────────────────────────────────────────────────────────
  426. 24.64 s > -old snapshot
  427. 24.64 s > +new results
  428. 24.64 s > ────────────┬───────────────────────────────────────────────────────────────────
  429. 24.64 s > 8 8 │ 0:0:s -> ext0 [id=0 color="red"];
  430. 24.64 s > 9 9 │ ext1 [style=invis];
  431. 24.64 s > 10 10 │ 0:5:s -> ext1 [id=1 dir=none color="red" label="mink4|l_0"];
  432. 24.64 s > 11 11 │ ext2 [style=invis];
  433. 24.64 s > 12 │- 0:4:s -> ext2 [id=2 dir=none color="red" label="bis4|l_2"];
  434. 24.64 s > 12 │+ 0:3:s -> ext2 [id=2 dir=none color="red" label="mink4|l_1"];
  435. 24.64 s > 13 13 │ ext3 [style=invis];
  436. 24.64 s > 14 │- 0:3:s -> ext3 [id=3 dir=none color="red" label="bis4|l_3"];
  437. 24.64 s > 14 │+ 0:1:s -> ext3 [id=3 dir=none color="red" label="bis4|l_2"];
  438. 24.64 s > 15 15 │ ext4 [style=invis];
  439. 24.64 s > 16 │- 0:1:s -> ext4 [id=4 dir=none color="red" label="mink4|l_1"];
  440. 24.64 s > 16 │+ 0:2:s -> ext4 [id=4 dir=none color="red" label="mink4|l_4"];
  441. 24.64 s > 17 17 │ ext5 [style=invis];
  442. 24.64 s > 18 │- 0:2:s -> ext5 [id=5 dir=none color="red" label="mink4|l_4"];
  443. 24.64 s > 18 │+ 0:4:s -> ext5 [id=5 dir=none color="red" label="bis4|l_3"];
  444. 24.64 s > 19 19 │ }
  445. 24.64 s > ────────────┴───────────────────────────────────────────────────────────────────
  446. 24.64 s > To update snapshots run `cargo insta review`
  447. 24.64 s > Stopped on the first failure. Run `cargo insta test` to run all snapshots.
  448. 24.64 s > test tensor::tests::parsing::infinite_execution ... FAILED
  449. 24.64 s >
  450. 24.64 s > failures:
  451. 24.64 s >
  452. 24.64 s > failures:
  453. 24.64 s > tensor::tests::parsing::infinite_execution
  454. 24.64 s >
  455. 24.64 s > test result: FAILED. 0 passed; 1 failed; 0 ignored; 0 measured; 240 filtered out; finished in 0.10s
  456. 24.64 s >
  457. 24.64 s > stderr ---
  458. 24.64 s >
  459. 24.64 s > thread 'tensor::tests::parsing::infinite_execution' (853) panicked at /nix/store/0f9p2h9240ylfzayilfjv4gr7scagfs3-vendor-cargo-deps/c19b7c6f923b580ac259164a89f2577984ad5ab09ee9d583b888f934adbbe8d0/insta-1.47.2/src/runtime.rs:719:13:
  460. 24.64 s > snapshot assertion for 'infinite_execution' failed in line 910
  461. 24.64 s > stack backtrace:
  462. 24.64 s > 0: __rustc::rust_begin_unwind
  463. 24.64 s > 1: core::panicking::panic_fmt
  464. 24.64 s > 2: insta::runtime::assert_snapshot
  465. 24.64 s > 3: idenso::tensor::tests::parsing::infinite_execution
  466. 24.64 s > 4: <idenso::tensor::tests::parsing::infinite_execution::{closure#0} as core::ops::function::FnOnce<()>>::call_once
  467. 24.64 s > note: Some details are omitted, run with `RUST_BACKTRACE=full` for a verbose backtrace.
  468. 24.64 s >
  469. 24.64 s > ------------
  470. 24.64 s > Summary [ 2.353s] 224 tests run: 222 passed, 2 failed, 26 skipped
  471. 24.64 s > FAIL [ 0.012s] ( 45/224) idenso color::test::form_reference::metric_contraction_respects_antisymmetric_normalization
  472. 24.64 s > stdout ---
  473. 24.64 s >
  474. 24.64 s > running 1 test
  475. 24.64 s > test color::test::form_reference::metric_contraction_respects_antisymmetric_normalization ... FAILED
  476. 24.64 s >
  477. 24.64 s > failures:
  478. 24.64 s >
  479. 24.64 s > failures:
  480. 24.64 s > color::test::form_reference::metric_contraction_respects_antisymmetric_normalization
  481. 24.64 s >
  482. 24.64 s > test result: FAILED. 0 passed; 1 failed; 0 ignored; 0 measured; 240 filtered out; finished in 0.00s
  483. 24.64 s >
  484. 24.64 s > stderr ---
  485. 24.64 s >
  486. 24.64 s > thread 'color::test::form_reference::metric_contraction_respects_antisymmetric_normalization' (322) panicked at crates/idenso/src/color/test/form_reference.rs:171:5:
  487. 24.64 s > assertion `left == right` failed
  488. 24.64 s > left: "-1*f(coad(8,standalone_metric_j),coad(8,standalone_metric_s),coad(8,standalone_metric_u))"
  489. 24.64 s > right: "f(coad(8,standalone_metric_j),coad(8,standalone_metric_s),coad(8,standalone_metric_u))"
  490. 24.64 s > stack backtrace:
  491. 24.64 s > 0: __rustc::rust_begin_unwind
  492. 24.64 s > 1: core::panicking::panic_fmt
  493. 24.64 s > 2: core::panicking::assert_failed_inner
  494. 24.64 s > 3: core::panicking::assert_failed::<alloc::string::String, alloc::string::String>
  495. 24.64 s > 4: idenso::color::test::form_reference::metric_contraction_respects_antisymmetric_normalization
  496. 24.64 s > 5: <idenso::color::test::form_reference::metric_contraction_respects_antisymmetric_normalization::{closure#0} as core::ops::function::FnOnce<()>>::call_once
  497. 24.64 s > note: Some details are omitted, run with `RUST_BACKTRACE=full` for a verbose backtrace.
  498. 24.64 s >
  499. 24.64 s > FAIL [ 0.116s] (221/224) idenso tensor::tests::parsing::infinite_execution
  500. 24.64 s > stdout ---
  501. 24.64 s >
  502. 24.64 s > running 1 test
  503. 24.64 s > ━━━━━━━━━━━━━━━━━━━━━━━━━━━━━━━ Snapshot Summary ━━━━━━━━━━━━━━━━━━━━━━━━━━━━━━━
  504. 24.64 s > Snapshot: infinite_execution
  505. 24.64 s > Source: crates/idenso/src/tensor/tests/parsing.rs:910
  506. 24.64 s > ────────────────────────────────────────────────────────────────────────────────
  507. 24.64 s > Expression: net_iter.snapshot_dot()
  508. 24.64 s > ────────────────────────────────────────────────────────────────────────────────
  509. 24.64 s > -old snapshot
  510. 24.64 s > +new results
  511. 24.64 s > ────────────┬───────────────────────────────────────────────────────────────────
  512. 24.64 s > 8 8 │ 0:0:s -> ext0 [id=0 color="red"];
  513. 24.64 s > 9 9 │ ext1 [style=invis];
  514. 24.64 s > 10 10 │ 0:5:s -> ext1 [id=1 dir=none color="red" label="mink4|l_0"];
  515. 24.64 s > 11 11 │ ext2 [style=invis];
  516. 24.64 s > 12 │- 0:4:s -> ext2 [id=2 dir=none color="red" label="bis4|l_2"];
  517. 24.64 s > 12 │+ 0:3:s -> ext2 [id=2 dir=none color="red" label="mink4|l_1"];
  518. 24.64 s > 13 13 │ ext3 [style=invis];
  519. 24.64 s > 14 │- 0:3:s -> ext3 [id=3 dir=none color="red" label="bis4|l_3"];
  520. 24.64 s > 14 │+ 0:1:s -> ext3 [id=3 dir=none color="red" label="bis4|l_2"];
  521. 24.64 s > 15 15 │ ext4 [style=invis];
  522. 24.64 s > 16 │- 0:1:s -> ext4 [id=4 dir=none color="red" label="mink4|l_1"];
  523. 24.64 s > 16 │+ 0:2:s -> ext4 [id=4 dir=none color="red" label="mink4|l_4"];
  524. 24.64 s > 17 17 │ ext5 [style=invis];
  525. 24.64 s > 18 │- 0:2:s -> ext5 [id=5 dir=none color="red" label="mink4|l_4"];
  526. 24.64 s > 18 │+ 0:4:s -> ext5 [id=5 dir=none color="red" label="bis4|l_3"];
  527. 24.64 s > 19 19 │ }
  528. 24.64 s > ────────────┴───────────────────────────────────────────────────────────────────
  529. 24.64 s > To update snapshots run `cargo insta review`
  530. 24.64 s > Stopped on the first failure. Run `cargo insta test` to run all snapshots.
  531. 24.64 s > test tensor::tests::parsing::infinite_execution ... FAILED
  532. 24.64 s >
  533. 24.64 s > failures:
  534. 24.64 s >
  535. 24.64 s > failures:
  536. 24.64 s > tensor::tests::parsing::infinite_execution
  537. 24.64 s >
  538. 24.64 s > test result: FAILED. 0 passed; 1 failed; 0 ignored; 0 measured; 240 filtered out; finished in 0.10s
  539. 24.64 s >
  540. 24.64 s > stderr ---
  541. 24.64 s >
  542. 24.64 s > thread 'tensor::tests::parsing::infinite_execution' (853) panicked at /nix/store/0f9p2h9240ylfzayilfjv4gr7scagfs3-vendor-cargo-deps/c19b7c6f923b580ac259164a89f2577984ad5ab09ee9d583b888f934adbbe8d0/insta-1.47.2/src/runtime.rs:719:13:
  543. 24.64 s > snapshot assertion for 'infinite_execution' failed in line 910
  544. 24.64 s > stack backtrace:
  545. 24.64 s > 0: __rustc::rust_begin_unwind
  546. 24.64 s > 1: core::panicking::panic_fmt
  547. 24.64 s > 2: insta::runtime::assert_snapshot
  548. 24.64 s > 3: idenso::tensor::tests::parsing::infinite_execution
  549. 24.64 s > 4: <idenso::tensor::tests::parsing::infinite_execution::{closure#0} as core::ops::function::FnOnce<()>>::call_once
  550. 24.64 s > note: Some details are omitted, run with `RUST_BACKTRACE=full` for a verbose backtrace.
  551. 24.64 s >
  552. 24.64 s > error: test run failed
  553. 24.64 s >
  554. 24.64 s > ========== nextest test summary ==========
  555. 24.64 s > report: target/nextest/ci_gammaloop/junit.xml
  556. 24.64 s > tests: 224, failures: 2, errors: 0
  557. 24.64 s >
  558. 24.64 s > 1. idenso::color::test::form_reference::metric_contraction_respects_antisymmetric_normalization
  559. 24.64 s > failure: test failure with exit code 101
  560. 24.64 s > thread 'color::test::form_reference::metric_contraction_respects_antisymmetric_normalization' (322) panicked at crates/idenso/src/color/test/form_reference.rs:171:5:
  561. 24.64 s > assertion `left == right` failed
  562. 24.64 s > left: "-1*f(coad(8,standalone_metric_j),coad(8,standalone_metric_s),coad(8,standalone_metric_u))"
  563. 24.64 s > right: "f(coad(8,standalone_metric_j),coad(8,standalone_metric_s),coad(8,standalone_metric_u))"
  564. 24.64 s > stack backtrace:
  565. 24.64 s > 0: __rustc::rust_begin_unwind
  566. 24.64 s > 1: core::panicking::panic_fmt
  567. 24.64 s > 2: core::panicking::assert_failed_inner
  568. 24.64 s > 3: core::panicking::assert_failed::<alloc::string::String, alloc::string::String>
  569. 24.64 s > 4: idenso::color::test::form_reference::metric_contraction_respects_antisymmetric_normalization
  570. 24.64 s > 5: <idenso::color::test::form_reference::metric_contraction_respects_antisymmetric_normalization::{closure#0} as core::ops::function::FnOnce<()>>::call_once
  571. 24.64 s > note: Some details are omitted, run with `RUST_BACKTRACE=full` for a verbose backtrace.
  572. 24.64 s > system-out
  573. 24.64 s > running 1 test
  574. 24.64 s > test color::test::form_reference::metric_contraction_respects_antisymmetric_normalization ... FAILED
  575. 24.64 s >
  576. 24.64 s > failures:
  577. 24.64 s >
  578. 24.64 s > failures:
  579. 24.64 s > color::test::form_reference::metric_contraction_respects_antisymmetric_normalization
  580. 24.64 s >
  581. 24.64 s > test result: FAILED. 0 passed; 1 failed; 0 ignored; 0 measured; 240 filtered out; finished in 0.00s
  582. 24.64 s > system-err
  583. 24.64 s > thread 'color::test::form_reference::metric_contraction_respects_antisymmetric_normalization' (322) panicked at crates/idenso/src/color/test/form_reference.rs:171:5:
  584. 24.64 s > assertion `left == right` failed
  585. 24.64 s > left: "-1*f(coad(8,standalone_metric_j),coad(8,standalone_metric_s),coad(8,standalone_metric_u))"
  586. 24.64 s > right: "f(coad(8,standalone_metric_j),coad(8,standalone_metric_s),coad(8,standalone_metric_u))"
  587. 24.64 s > stack backtrace:
  588. 24.64 s > 0: __rustc::rust_begin_unwind
  589. 24.64 s > 1: core::panicking::panic_fmt
  590. 24.64 s > 2: core::panicking::assert_failed_inner
  591. 24.64 s > 3: core::panicking::assert_failed::<alloc::string::String, alloc::string::String>
  592. 24.64 s > 4: idenso::color::test::form_reference::metric_contraction_respects_antisymmetric_normalization
  593. 24.64 s > 5: <idenso::color::test::form_reference::metric_contraction_respects_antisymmetric_normalization::{closure#0} as core::ops::function::FnOnce<()>>::call_once
  594. 24.64 s > note: Some details are omitted, run with `RUST_BACKTRACE=full` for a verbose backtrace.
  595. 24.64 s >
  596. 24.64 s > 2. idenso::tensor::tests::parsing::infinite_execution
  597. 24.64 s > failure: test failure with exit code 101
  598. 24.64 s > thread 'tensor::tests::parsing::infinite_execution' (853) panicked at /nix/store/0f9p2h9240ylfzayilfjv4gr7scagfs3-vendor-cargo-deps/c19b7c6f923b580ac259164a89f2577984ad5ab09ee9d583b888f934adbbe8d0/insta-1.47.2/src/runtime.rs:719:13:
  599. 24.64 s > snapshot assertion for 'infinite_execution' failed in line 910
  600. 24.64 s > stack backtrace:
  601. 24.64 s > 0: __rustc::rust_begin_unwind
  602. 24.64 s > 1: core::panicking::panic_fmt
  603. 24.64 s > 2: insta::runtime::assert_snapshot
  604. 24.64 s > 3: idenso::tensor::tests::parsing::infinite_execution
  605. 24.64 s > 4: <idenso::tensor::tests::parsing::infinite_execution::{closure#0} as core::ops::function::FnOnce<()>>::call_once
  606. 24.64 s > note: Some details are omitted, run with `RUST_BACKTRACE=full` for a verbose backtrace.
  607. 24.64 s > system-out
  608. 24.64 s > running 1 test
  609. 24.64 s > ━━━━━━━━━━━━━━━━━━━━━━━━━━━━━━━ Snapshot Summary ━━━━━━━━━━━━━━━━━━━━━━━━━━━━━━━
  610. 24.64 s > Snapshot: infinite_execution
  611. 24.64 s > Source: crates/idenso/src/tensor/tests/parsing.rs:910
  612. 24.64 s > ────────────────────────────────────────────────────────────────────────────────
  613. 24.64 s > Expression: net_iter.snapshot_dot()
  614. 24.64 s > ────────────────────────────────────────────────────────────────────────────────
  615. 24.64 s > -old snapshot
  616. 24.64 s > +new results
  617. 24.64 s > ────────────┬───────────────────────────────────────────────────────────────────
  618. 24.64 s > 8 8 │ 0:0:s-> ext0 [id=0 color="red"];
  619. 24.64 s > 9 9 │ ext1 [style=invis];
  620. 24.64 s > 10 10 │ 0:5:s-> ext1 [id=1 dir=none color="red" label="mink4|l_0"];
  621. 24.64 s > 11 11 │ ext2 [style=invis];
  622. 24.64 s > 12 │- 0:4:s-> ext2 [id=2 dir=none color="red" label="bis4|l_2"];
  623. 24.64 s > 12 │+ 0:3:s-> ext2 [id=2 dir=none color="red" label="mink4|l_1"];
  624. 24.64 s > 13 13 │ ext3 [style=invis];
  625. 24.64 s > 14 │- 0:3:s-> ext3 [id=3 dir=none color="red" label="bis4|l_3"];
  626. 24.64 s > 14 │+ 0:1:s-> ext3 [id=3 dir=none color="red" label="bis4|l_2"];
  627. 24.64 s > 15 15 │ ext4 [style=invis];
  628. 24.64 s > 16 │- 0:1:s-> ext4 [id=4 dir=none color="red" label="mink4|l_1"];
  629. 24.64 s > 16 │+ 0:2:s-> ext4 [id=4 dir=none color="red" label="mink4|l_4"];
  630. 24.64 s > 17 17 │ ext5 [style=invis];
  631. 24.64 s > 18 │- 0:2:s-> ext5 [id=5 dir=none color="red" label="mink4|l_4"];
  632. 24.64 s > 18 │+ 0:4:s-> ext5 [id=5 dir=none color="red" label="bis4|l_3"];
  633. 24.64 s > 19 19 │ }
  634. 24.64 s > ────────────┴───────────────────────────────────────────────────────────────────
  635. 24.64 s > To update snapshots run `cargo insta review`
  636. 24.64 s > Stopped on the first failure. Run `cargo insta test` to run all snapshots.
  637. 24.64 s > test tensor::tests::parsing::infinite_execution ... FAILED
  638. 24.64 s >
  639. 24.64 s > failures:
  640. 24.64 s >
  641. 24.64 s > failures:
  642. 24.64 s > tensor::tests::parsing::infinite_execution
  643. 24.64 s >
  644. 24.64 s > test result: FAILED. 0 passed; 1 failed; 0 ignored; 0 measured; 240 filtered out; finished in 0.10s
  645. 24.64 s > system-err
  646. 24.64 s > thread 'tensor::tests::parsing::infinite_execution' (853) panicked at /nix/store/0f9p2h9240ylfzayilfjv4gr7scagfs3-vendor-cargo-deps/c19b7c6f923b580ac259164a89f2577984ad5ab09ee9d583b888f934adbbe8d0/insta-1.47.2/src/runtime.rs:719:13:
  647. 24.64 s > snapshot assertion for 'infinite_execution' failed in line 910
  648. 24.64 s > stack backtrace:
  649. 24.64 s > 0: __rustc::rust_begin_unwind
  650. 24.64 s > 1: core::panicking::panic_fmt
  651. 24.64 s > 2: insta::runtime::assert_snapshot
  652. 24.64 s > 3: idenso::tensor::tests::parsing::infinite_execution
  653. 24.64 s > 4: <idenso::tensor::tests::parsing::infinite_execution::{closure#0} as core::ops::function::FnOnce<()>>::call_once
  654. 24.64 s > note: Some details are omitted, run with `RUST_BACKTRACE=full` for a verbose backtrace.
  655. 24.64 s > =========================================
  656. 24.64 s > Extracting 2 binaries and 1 linked path to /build/nextest-archive-4WXeNz
  657. 24.64 s > Extracted 8 files to /build/nextest-archive-4WXeNz in 0.12s
  658. 24.64 s > ------------
  659. 24.64 s > Nextest run ID 6d9a9b6a-c058-42be-be74-b2bee30fd10d with nextest profile: ci_gammaloop
  660. 24.64 s > Starting 135 tests across 2 binaries
  661. 24.64 s > ------------
  662. 24.64 s > Summary [ 0.192s] 135 tests run: 135 passed, 0 skipped
  663. 24.64 s >
  664. 24.64 s > ========== nextest test summary ==========
  665. 24.64 s > report: target/nextest/ci_gammaloop/junit.xml
  666. 24.64 s > tests: 135, failures: 0, errors: 0
  667. 24.64 s > No failing testcases found.
  668. 24.64 s > =========================================
  669. 24.64 s > Extracting 5 binaries and 2 linked paths to /build/nextest-archive-40dU6h
  670. 24.64 s > Extracted 19 files to /build/nextest-archive-40dU6h in 0.22s
  671. 24.64 s > ------------
  672. 24.64 s > Nextest run ID 5a15277e-7136-4790-9ec5-28cb1e362588 with nextest profile: ci_gammaloop
  673. 24.64 s > Starting 25 tests across 5 binaries (1 test skipped via profile.ci_gammaloop.default-filter)
  674. 24.64 s > ------------
  675. 24.64 s > Summary [ 0.366s] 25 tests run: 25 passed, 1 skipped
  676. 24.64 s >
  677. 24.64 s > ========== nextest test summary ==========
  678. 24.64 s > report: target/nextest/ci_gammaloop/junit.xml
  679. 24.64 s > tests: 25, failures: 0, errors: 0
  680. 24.64 s > No failing testcases found.
  681. 24.64 s > =========================================
  682. 24.64 s > Extracting 2 binaries and 1 linked path to /build/nextest-archive-yWOwtN
  683. 24.64 s > Extracted 8 files to /build/nextest-archive-yWOwtN in 0.07s
  684. 24.64 s > ------------
  685. 24.64 s > Nextest run ID 848b2839-b908-428f-9f42-f682b299a3b3 with nextest profile: ci_gammaloop
  686. 24.64 s > Starting 1 test across 2 binaries
  687. 24.64 s > ------------
  688. 24.64 s > Summary [ 0.043s] 1 test run: 1 passed, 0 skipped
  689. 24.64 s >
  690. 24.64 s > ========== nextest test summary ==========
  691. 24.64 s > report: target/nextest/ci_gammaloop/junit.xml
  692. 24.64 s > tests: 1, failures: 0, errors: 0
  693. 24.64 s > No failing testcases found.
  694. 24.64 s > =========================================
  695. 24.64 s > Extracting 1 binary and 1 linked path to /build/nextest-archive-T4OYof
  696. 24.64 s > Extracted 7 files to /build/nextest-archive-T4OYof in 0.07s
  697. 24.64 s > ------------
  698. 24.64 s > Nextest run ID 8b21a134-7e56-4f3b-9e0f-4bb85ecc017a with nextest profile: ci_gammaloop
  699. 24.64 s > Starting 0 tests across 1 binary
  700. 24.64 s > ------------
  701. 24.64 s > Summary [ 0.000s] 0 tests run: 0 passed, 0 skipped
  702. 24.64 s >
  703. 24.64 s > ========== nextest test summary ==========
  704. 24.64 s > report: target/nextest/ci_gammaloop/junit.xml
  705. 24.64 s > tests: 0, failures: 0, errors: 0
  706. 24.64 s > No failing testcases found.
  707. 24.64 s > =========================================
  708. 24.64 s For full logs, run:
  709. 24.64 s nix log /nix/store/fllp83dbxw52lklxvq55v8x8yhs6mfhc-gammaloop-nextest-spenso.drv
  710. 24.79 s [0 built (1 failed), 0.0Run failed.