0.86 s
$ /nix/store/9ypz3flqsrl5xl495mm8h645gadjsxi1-coreutils-9.11/bin/timeout --kill-after=15s 7200s /nix/store/23zk8sgzamrbmj1fday15szf7f2279s8-nix-2.34.7/bin/nix --extra-experimental-features nix-command --extra-experimental-features flakes flake clone git+https://github.com/alphal00p/gammaloop --dest /tmp/nix-ci-worker/stable-pwd/repo/
0.88 s
Cloning into '/tmp/nix-ci-worker/stable-pwd/repo'...
0.88 s
remote: Enumerating objects: 65034, done.
0.94 s
remote: Counting objects: 0% (1/7706)
remote: Counting objects: 1% (78/7706)
remote: Counting objects: 2% (155/7706)
remote: Counting objects: 3% (232/7706)
remote: Counting objects: 4% (309/7706)
remote: Counting objects: 5% (386/7706)
remote: Counting objects: 6% (463/7706)
remote: Counting objects: 7% (540/7706)
remote: Counting objects: 8% (617/7706)
remote: Counting objects: 9% (694/7706)
remote: Counting objects: 10% (771/7706)
remote: Counting objects: 11% (848/7706)
remote: Counting objects: 12% (925/7706)
remote: Counting objects: 13% (1002/7706)
remote: Counting objects: 14% (1079/7706)
remote: Counting objects: 15% (1156/7706)
remote: Counting objects: 16% (1233/7706)
remote: Counting objects: 17% (1311/7706)
remote: Counting objects: 18% (1388/7706)
remote: Counting objects: 19% (1465/7706)
remote: Counting objects: 20% (1542/7706)
remote: Counting objects: 21% (1619/7706)
remote: Counting objects: 22% (1696/7706)
remote: Counting objects: 23% (1773/7706)
remote: Counting objects: 24% (1850/7706)
remote: Counting objects: 25% (1927/7706)
remote: Counting objects: 26% (2004/7706)
remote: Counting objects: 27% (2081/7706)
remote: Counting objects: 28% (2158/7706)
remote: Counting objects: 29% (2235/7706)
remote: Counting objects: 30% (2312/7706)
remote: Counting objects: 31% (2389/7706)
remote: Counting objects: 32% (2466/7706)
remote: Counting objects: 33% (2543/7706)
remote: Counting objects: 34% (2621/7706)
remote: Counting objects: 35% (2698/7706)
remote: Counting objects: 36% (2775/7706)
remote: Counting objects: 37% (2852/7706)
remote: Counting objects: 38% (2929/7706)
remote: Counting objects: 39% (3006/7706)
remote: Counting objects: 40% (3083/7706)
remote: Counting objects: 41% (3160/7706)
remote: Counting objects: 42% (3237/7706)
remote: Counting objects: 43% (3314/7706)
remote: Counting objects: 44% (3391/7706)
remote: Counting objects: 45% (3468/7706)
remote: Counting objects: 46% (3545/7706)
remote: Counting objects: 47% (3622/7706)
remote: Counting objects: 48% (3699/7706)
remote: Counting objects: 49% (3776/7706)
remote: Counting objects: 50% (3853/7706)
remote: Counting objects: 51% (3931/7706)
remote: Counting objects: 52% (4008/7706)
remote: Counting objects: 53% (4085/7706)
remote: Counting objects: 54% (4162/7706)
remote: Counting objects: 55% (4239/7706)
remote: Counting objects: 56% (4316/7706)
remote: Counting objects: 57% (4393/7706)
remote: Counting objects: 58% (4470/7706)
remote: Counting objects: 59% (4547/7706)
remote: Counting objects: 60% (4624/7706)
remote: Counting objects: 61% (4701/7706)
remote: Counting objects: 62% (4778/7706)
remote: Counting objects: 63% (4855/7706)
remote: Counting objects: 64% (4932/7706)
remote: Counting objects: 65% (5009/7706)
remote: Counting objects: 66% (5086/7706)
remote: Counting objects: 67% (5164/7706)
remote: Counting objects: 68% (5241/7706)
remote: Counting objects: 69% (5318/7706)
remote: Counting objects: 70% (5395/7706)
remote: Counting objects: 71% (5472/7706)
remote: Counting objects: 72% (5549/7706)
remote: Counting objects: 73% (5626/7706)
remote: Counting objects: 74% (5703/7706)
remote: Counting objects: 75% (5780/7706)
remote: Counting objects: 76% (5857/7706)
remote: Counting objects: 77% (5934/7706)
remote: Counting objects: 78% (6011/7706)
remote: Counting objects: 79% (6088/7706)
remote: Counting objects: 80% (6165/7706)
remote: Counting objects: 81% (6242/7706)
remote: Counting objects: 82% (6319/7706)
remote: Counting objects: 83% (6396/7706)
remote: Counting objects: 84% (6474/7706)
remote: Counting objects: 85% (6551/7706)
remote: Counting objects: 86% (6628/7706)
remote: Counting objects: 87% (6705/7706)
remote: Counting objects: 88% (6782/7706)
remote: Counting objects: 89% (6859/7706)
remote: Counting objects: 90% (6936/7706)
remote: Counting objects: 91% (7013/7706)
remote: Counting objects: 92% (7090/7706)
remote: Counting objects: 93% (7167/7706)
remote: Counting objects: 94% (7244/7706)
remote: Counting objects: 95% (7321/7706)
remote: Counting objects: 96% (7398/7706)
remote: Counting objects: 97% (7475/7706)
remote: Counting objects: 98% (7552/7706)
remote: Counting objects: 99% (7629/7706)
remote: Counting objects: 100% (7706/7706)
remote: Counting objects: 100% (7706/7706), done.
2.36 s
remote: Compressing objects: 0% (1/1417)
remote: Compressing objects: 1% (15/1417)
remote: Compressing objects: 2% (29/1417)
remote: Compressing objects: 3% (43/1417)
remote: Compressing objects: 4% (57/1417)
remote: Compressing objects: 5% (71/1417)
remote: Compressing objects: 6% (86/1417)
remote: Compressing objects: 7% (100/1417)
remote: Compressing objects: 8% (114/1417)
remote: Compressing objects: 9% (128/1417)
remote: Compressing objects: 10% (142/1417)
remote: Compressing objects: 11% (156/1417)
remote: Compressing objects: 12% (171/1417)
remote: Compressing objects: 13% (185/1417)
remote: Compressing objects: 13% (186/1417)
remote: Compressing objects: 14% (199/1417)
remote: Compressing objects: 15% (213/1417)
remote: Compressing objects: 16% (227/1417)
remote: Compressing objects: 17% (241/1417)
remote: Compressing objects: 18% (256/1417)
remote: Compressing objects: 19% (270/1417)
remote: Compressing objects: 20% (284/1417)
remote: Compressing objects: 21% (298/1417)
remote: Compressing objects: 22% (312/1417)
remote: Compressing objects: 23% (326/1417)
remote: Compressing objects: 24% (341/1417)
remote: Compressing objects: 25% (355/1417)
remote: Compressing objects: 26% (369/1417)
remote: Compressing objects: 27% (383/1417)
remote: Compressing objects: 28% (397/1417)
remote: Compressing objects: 29% (411/1417)
remote: Compressing objects: 30% (426/1417)
remote: Compressing objects: 31% (440/1417)
remote: Compressing objects: 32% (454/1417)
remote: Compressing objects: 33% (468/1417)
remote: Compressing objects: 34% (482/1417)
remote: Compressing objects: 35% (496/1417)
remote: Compressing objects: 36% (511/1417)
remote: Compressing objects: 37% (525/1417)
remote: Compressing objects: 38% (539/1417)
remote: Compressing objects: 39% (553/1417)
remote: Compressing objects: 40% (567/1417)
remote: Compressing objects: 41% (581/1417)
remote: Compressing objects: 42% (596/1417)
remote: Compressing objects: 43% (610/1417)
remote: Compressing objects: 44% (624/1417)
remote: Compressing objects: 45% (638/1417)
remote: Compressing objects: 46% (652/1417)
remote: Compressing objects: 47% (666/1417)
remote: Compressing objects: 48% (681/1417)
remote: Compressing objects: 49% (695/1417)
remote: Compressing objects: 50% (709/1417)
remote: Compressing objects: 51% (723/1417)
remote: Compressing objects: 52% (737/1417)
remote: Compressing objects: 53% (752/1417)
remote: Compressing objects: 54% (766/1417)
remote: Compressing objects: 55% (780/1417)
remote: Compressing objects: 56% (794/1417)
remote: Compressing objects: 57% (808/1417)
remote: Compressing objects: 58% (822/1417)
remote: Compressing objects: 59% (837/1417)
remote: Compressing objects: 60% (851/1417)
remote: Compressing objects: 61% (865/1417)
remote: Compressing objects: 62% (879/1417)
remote: Compressing objects: 63% (893/1417)
remote: Compressing objects: 64% (907/1417)
remote: Compressing objects: 65% (922/1417)
remote: Compressing objects: 66% (936/1417)
remote: Compressing objects: 67% (950/1417)
remote: Compressing objects: 68% (964/1417)
remote: Compressing objects: 69% (978/1417)
remote: Compressing objects: 70% (992/1417)
remote: Compressing objects: 71% (1007/1417)
remote: Compressing objects: 72% (1021/1417)
remote: Compressing objects: 73% (1035/1417)
remote: Compressing objects: 74% (1049/1417)
remote: Compressing objects: 75% (1063/1417)
remote: Compressing objects: 76% (1077/1417)
remote: Compressing objects: 77% (1092/1417)
remote: Compressing objects: 78% (1106/1417)
remote: Compressing objects: 79% (1120/1417)
remote: Compressing objects: 80% (1134/1417)
remote: Compressing objects: 81% (1148/1417)
remote: Compressing objects: 82% (1162/1417)
remote: Compressing objects: 83% (1177/1417)
remote: Compressing objects: 84% (1191/1417)
remote: Compressing objects: 85% (1205/1417)
remote: Compressing objects: 86% (1219/1417)
remote: Compressing objects: 87% (1233/1417)
remote: Compressing objects: 88% (1247/1417)
remote: Compressing objects: 89% (1262/1417)
remote: Compressing objects: 90% (1276/1417)
remote: Compressing objects: 91% (1290/1417)
remote: Compressing objects: 92% (1304/1417)
remote: Compressing objects: 93% (1318/1417)
remote: Compressing objects: 94% (1332/1417)
remote: Compressing objects: 95% (1347/1417)
remote: Compressing objects: 96% (1361/1417)
remote: Compressing objects: 97% (1375/1417)
remote: Compressing objects: 98% (1389/1417)
remote: Compressing objects: 99% (1403/1417)
remote: Compressing objects: 100% (1417/1417)
remote: Compressing objects: 100% (1417/1417), done.
4.92 s
Receiving objects: 0% (1/65034)
Receiving objects: 1% (651/65034)
Receiving objects: 2% (1301/65034)
Receiving objects: 3% (1952/65034)
Receiving objects: 4% (2602/65034)
Receiving objects: 5% (3252/65034)
Receiving objects: 6% (3903/65034)
Receiving objects: 7% (4553/65034)
Receiving objects: 8% (5203/65034)
Receiving objects: 9% (5854/65034)
Receiving objects: 10% (6504/65034), 9.95 MiB | 19.89 MiB/s
Receiving objects: 11% (7154/65034), 9.95 MiB | 19.89 MiB/s
Receiving objects: 12% (7805/65034), 9.95 MiB | 19.89 MiB/s
Receiving objects: 13% (8455/65034), 9.95 MiB | 19.89 MiB/s
Receiving objects: 14% (9105/65034), 9.95 MiB | 19.89 MiB/s
Receiving objects: 15% (9756/65034), 9.95 MiB | 19.89 MiB/s
Receiving objects: 16% (10406/65034), 9.95 MiB | 19.89 MiB/s
Receiving objects: 17% (11056/65034), 9.95 MiB | 19.89 MiB/s
Receiving objects: 18% (11707/65034), 9.95 MiB | 19.89 MiB/s
Receiving objects: 19% (12357/65034), 9.95 MiB | 19.89 MiB/s
Receiving objects: 20% (13007/65034), 9.95 MiB | 19.89 MiB/s
Receiving objects: 21% (13658/65034), 9.95 MiB | 19.89 MiB/s
Receiving objects: 22% (14308/65034), 9.95 MiB | 19.89 MiB/s
Receiving objects: 23% (14958/65034), 9.95 MiB | 19.89 MiB/s
Receiving objects: 24% (15609/65034), 9.95 MiB | 19.89 MiB/s
Receiving objects: 25% (16259/65034), 9.95 MiB | 19.89 MiB/s
Receiving objects: 26% (16909/65034), 9.95 MiB | 19.89 MiB/s
Receiving objects: 27% (17560/65034), 9.95 MiB | 19.89 MiB/s
Receiving objects: 28% (18210/65034), 9.95 MiB | 19.89 MiB/s
Receiving objects: 29% (18860/65034), 9.95 MiB | 19.89 MiB/s
Receiving objects: 30% (19511/65034), 9.95 MiB | 19.89 MiB/s
Receiving objects: 31% (20161/65034), 9.95 MiB | 19.89 MiB/s
Receiving objects: 32% (20811/65034), 9.95 MiB | 19.89 MiB/s
Receiving objects: 33% (21462/65034), 9.95 MiB | 19.89 MiB/s
Receiving objects: 34% (22112/65034), 9.95 MiB | 19.89 MiB/s
Receiving objects: 35% (22762/65034), 9.95 MiB | 19.89 MiB/s
Receiving objects: 36% (23413/65034), 9.95 MiB | 19.89 MiB/s
Receiving objects: 37% (24063/65034), 9.95 MiB | 19.89 MiB/s
Receiving objects: 38% (24713/65034), 9.95 MiB | 19.89 MiB/s
Receiving objects: 39% (25364/65034), 9.95 MiB | 19.89 MiB/s
Receiving objects: 40% (26014/65034), 9.95 MiB | 19.89 MiB/s
Receiving objects: 41% (26664/65034), 9.95 MiB | 19.89 MiB/s
Receiving objects: 42% (27315/65034), 9.95 MiB | 19.89 MiB/s
Receiving objects: 43% (27965/65034), 9.95 MiB | 19.89 MiB/s
Receiving objects: 44% (28615/65034), 9.95 MiB | 19.89 MiB/s
Receiving objects: 45% (29266/65034), 9.95 MiB | 19.89 MiB/s
Receiving objects: 46% (29916/65034), 9.95 MiB | 19.89 MiB/s
Receiving objects: 47% (30566/65034), 9.95 MiB | 19.89 MiB/s
Receiving objects: 48% (31217/65034), 9.95 MiB | 19.89 MiB/s
Receiving objects: 49% (31867/65034), 9.95 MiB | 19.89 MiB/s
Receiving objects: 50% (32517/65034), 9.95 MiB | 19.89 MiB/s
Receiving objects: 51% (33168/65034), 9.95 MiB | 19.89 MiB/s
Receiving objects: 52% (33818/65034), 9.95 MiB | 19.89 MiB/s
Receiving objects: 52% (34105/65034), 33.02 MiB | 33.01 MiB/s
Receiving objects: 53% (34469/65034), 33.02 MiB | 33.01 MiB/s
Receiving objects: 54% (35119/65034), 33.02 MiB | 33.01 MiB/s
Receiving objects: 55% (35769/65034), 33.02 MiB | 33.01 MiB/s
Receiving objects: 56% (36420/65034), 33.02 MiB | 33.01 MiB/s
Receiving objects: 57% (37070/65034), 33.02 MiB | 33.01 MiB/s
Receiving objects: 58% (37720/65034), 33.02 MiB | 33.01 MiB/s
Receiving objects: 59% (38371/65034), 33.02 MiB | 33.01 MiB/s
Receiving objects: 60% (39021/65034), 33.02 MiB | 33.01 MiB/s
Receiving objects: 61% (39671/65034), 33.02 MiB | 33.01 MiB/s
Receiving objects: 62% (40322/65034), 33.02 MiB | 33.01 MiB/s
Receiving objects: 63% (40972/65034), 33.02 MiB | 33.01 MiB/s
Receiving objects: 64% (41622/65034), 33.02 MiB | 33.01 MiB/s
Receiving objects: 65% (42273/65034), 33.02 MiB | 33.01 MiB/s
Receiving objects: 66% (42923/65034), 50.60 MiB | 33.51 MiB/s
Receiving objects: 67% (43573/65034), 50.60 MiB | 33.51 MiB/s
Receiving objects: 68% (44224/65034), 50.60 MiB | 33.51 MiB/s
Receiving objects: 69% (44874/65034), 50.60 MiB | 33.51 MiB/s
Receiving objects: 70% (45524/65034), 50.60 MiB | 33.51 MiB/s
Receiving objects: 71% (46175/65034), 50.60 MiB | 33.51 MiB/s
Receiving objects: 72% (46825/65034), 50.60 MiB | 33.51 MiB/s
Receiving objects: 73% (47475/65034), 50.60 MiB | 33.51 MiB/s
Receiving objects: 74% (48126/65034), 50.60 MiB | 33.51 MiB/s
Receiving objects: 75% (48776/65034), 50.60 MiB | 33.51 MiB/s
Receiving objects: 75% (49405/65034), 50.60 MiB | 33.51 MiB/s
Receiving objects: 76% (49426/65034), 50.60 MiB | 33.51 MiB/s
Receiving objects: 77% (50077/65034), 68.57 MiB | 34.12 MiB/s
Receiving objects: 78% (50727/65034), 68.57 MiB | 34.12 MiB/s
Receiving objects: 79% (51377/65034), 68.57 MiB | 34.12 MiB/s
Receiving objects: 80% (52028/65034), 68.57 MiB | 34.12 MiB/s
Receiving objects: 81% (52678/65034), 68.57 MiB | 34.12 MiB/s
Receiving objects: 82% (53328/65034), 68.57 MiB | 34.12 MiB/s
Receiving objects: 83% (53979/65034), 68.57 MiB | 34.12 MiB/s
Receiving objects: 84% (54629/65034), 68.57 MiB | 34.12 MiB/s
Receiving objects: 85% (55279/65034), 68.57 MiB | 34.12 MiB/s
Receiving objects: 86% (55930/65034), 68.57 MiB | 34.12 MiB/s
Receiving objects: 87% (56580/65034), 68.57 MiB | 34.12 MiB/s
Receiving objects: 88% (57230/65034), 68.57 MiB | 34.12 MiB/s
Receiving objects: 89% (57881/65034), 68.57 MiB | 34.12 MiB/s
Receiving objects: 90% (58531/65034), 68.57 MiB | 34.12 MiB/s
Receiving objects: 91% (59181/65034), 68.57 MiB | 34.12 MiB/s
Receiving objects: 92% (59832/65034), 68.57 MiB | 34.12 MiB/s
Receiving objects: 93% (60482/65034), 68.57 MiB | 34.12 MiB/s
Receiving objects: 94% (61132/65034), 68.57 MiB | 34.12 MiB/s
Receiving objects: 95% (61783/65034), 68.57 MiB | 34.12 MiB/s
Receiving objects: 96% (62433/65034), 68.57 MiB | 34.12 MiB/s
Receiving objects: 97% (63083/65034), 68.57 MiB | 34.12 MiB/s
Receiving objects: 98% (63734/65034), 85.38 MiB | 34.02 MiB/s
Receiving objects: 99% (64384/65034), 85.38 MiB | 34.02 MiB/s
remote: Total 65034 (delta 6807), reused 6296 (delta 6288), pack-reused 57328 (from 1)
4.92 s
Receiving objects: 100% (65034/65034), 85.38 MiB | 34.02 MiB/s
Receiving objects: 100% (65034/65034), 86.99 MiB | 34.05 MiB/s, done.
6.11 s
Resolving deltas: 0% (0/45904)
Resolving deltas: 1% (460/45904)
Resolving deltas: 2% (919/45904)
Resolving deltas: 3% (1381/45904)
Resolving deltas: 4% (1837/45904)
Resolving deltas: 5% (2297/45904)
Resolving deltas: 6% (2755/45904)
Resolving deltas: 7% (3214/45904)
Resolving deltas: 8% (3673/45904)
Resolving deltas: 9% (4132/45904)
Resolving deltas: 10% (4593/45904)
Resolving deltas: 11% (5050/45904)
Resolving deltas: 12% (5509/45904)
Resolving deltas: 13% (5968/45904)
Resolving deltas: 14% (6427/45904)
Resolving deltas: 15% (6886/45904)
Resolving deltas: 16% (7345/45904)
Resolving deltas: 17% (7804/45904)
Resolving deltas: 18% (8263/45904)
Resolving deltas: 19% (8722/45904)
Resolving deltas: 20% (9181/45904)
Resolving deltas: 21% (9640/45904)
Resolving deltas: 22% (10099/45904)
Resolving deltas: 23% (10559/45904)
Resolving deltas: 24% (11018/45904)
Resolving deltas: 25% (11476/45904)
Resolving deltas: 26% (11936/45904)
Resolving deltas: 27% (12397/45904)
Resolving deltas: 28% (12854/45904)
Resolving deltas: 29% (13313/45904)
Resolving deltas: 30% (13775/45904)
Resolving deltas: 31% (14231/45904)
Resolving deltas: 32% (14690/45904)
Resolving deltas: 33% (15149/45904)
Resolving deltas: 34% (15608/45904)
Resolving deltas: 35% (16067/45904)
Resolving deltas: 36% (16526/45904)
Resolving deltas: 37% (16985/45904)
Resolving deltas: 38% (17445/45904)
Resolving deltas: 39% (17904/45904)
Resolving deltas: 40% (18362/45904)
Resolving deltas: 41% (18821/45904)
Resolving deltas: 42% (19280/45904)
Resolving deltas: 43% (19740/45904)
Resolving deltas: 44% (20198/45904)
Resolving deltas: 45% (20657/45904)
Resolving deltas: 46% (21116/45904)
Resolving deltas: 47% (21575/45904)
Resolving deltas: 48% (22034/45904)
Resolving deltas: 49% (22493/45904)
Resolving deltas: 50% (22952/45904)
Resolving deltas: 51% (23412/45904)
Resolving deltas: 52% (23871/45904)
Resolving deltas: 53% (24330/45904)
Resolving deltas: 54% (24789/45904)
Resolving deltas: 55% (25250/45904)
Resolving deltas: 56% (25707/45904)
Resolving deltas: 57% (26166/45904)
Resolving deltas: 58% (26626/45904)
Resolving deltas: 59% (27084/45904)
Resolving deltas: 60% (27543/45904)
Resolving deltas: 61% (28002/45904)
Resolving deltas: 62% (28463/45904)
Resolving deltas: 63% (28920/45904)
Resolving deltas: 64% (29379/45904)
Resolving deltas: 65% (29838/45904)
Resolving deltas: 66% (30297/45904)
Resolving deltas: 67% (30756/45904)
Resolving deltas: 68% (31215/45904)
Resolving deltas: 69% (31674/45904)
Resolving deltas: 70% (32133/45904)
Resolving deltas: 71% (32593/45904)
Resolving deltas: 72% (33051/45904)
Resolving deltas: 73% (33510/45904)
Resolving deltas: 74% (33969/45904)
Resolving deltas: 75% (34428/45904)
Resolving deltas: 76% (34888/45904)
Resolving deltas: 77% (35347/45904)
Resolving deltas: 78% (35806/45904)
Resolving deltas: 79% (36266/45904)
Resolving deltas: 80% (36725/45904)
Resolving deltas: 81% (37183/45904)
Resolving deltas: 82% (37642/45904)
Resolving deltas: 83% (38101/45904)
Resolving deltas: 84% (38561/45904)
Resolving deltas: 84% (38741/45904)
Resolving deltas: 85% (39019/45904)
Resolving deltas: 86% (39478/45904)
Resolving deltas: 87% (39937/45904)
Resolving deltas: 88% (40396/45904)
Resolving deltas: 89% (40855/45904)
Resolving deltas: 90% (41314/45904)
Resolving deltas: 91% (41775/45904)
Resolving deltas: 92% (42232/45904)
Resolving deltas: 93% (42691/45904)
Resolving deltas: 94% (43150/45904)
Resolving deltas: 95% (43609/45904)
Resolving deltas: 96% (44068/45904)
Resolving deltas: 97% (44527/45904)
Resolving deltas: 98% (44986/45904)
Resolving deltas: 99% (45445/45904)
Resolving deltas: 100% (45904/45904)
Resolving deltas: 100% (45904/45904), done.
6.56 s
Fetching commit 1de6cf5dc4b80d0f0bf9aa8e901ee6bd43e45b8d for vakint_rustred ...
6.56 s
$ /nix/store/bcnisk3ydfgv26v2gw3zlky24g00yww2-git-2.54.0/bin/git fetch origin 1de6cf5dc4b80d0f0bf9aa8e901ee6bd43e45b8d
6.98 s
From https://github.com/alphal00p/gammaloop
6.98 s
* branch 1de6cf5dc4b80d0f0bf9aa8e901ee6bd43e45b8d -> FETCH_HEAD
7.00 s
$ /nix/store/9ypz3flqsrl5xl495mm8h645gadjsxi1-coreutils-9.11/bin/timeout --kill-after=15s 7200s /nix/store/bcnisk3ydfgv26v2gw3zlky24g00yww2-git-2.54.0/bin/git -c advice.detachedHead=false checkout 1de6cf5dc4b80d0f0bf9aa8e901ee6bd43e45b8d
7.28 s
HEAD is now at 1de6cf5d Implement FORM-less RustRed tensor mode
7.28 s
$ /nix/store/9ypz3flqsrl5xl495mm8h645gadjsxi1-coreutils-9.11/bin/timeout --kill-after=15s 7200s /nix/store/23zk8sgzamrbmj1fday15szf7f2279s8-nix-2.34.7/bin/nix --extra-experimental-features nix-command --extra-experimental-features flakes --log-format internal-json run .#packages.x86_64-linux.nix-ci-check-gammaloop-nextest-core --print-build-logs
15.89 s
16.01 s
Downloading cached gammaloop-nextest-binaries-core-gammaloop-api from https://cache.nix-ci.com
16.02 s
Downloading cached gammaloop-nextest-binaries-core-gammaloop-tracing-filter from https://cache.nix-ci.com
16.02 s
Downloading cached gammaloop-nextest-binaries-core-gammaloop-tracing-filter-macros from https://cache.nix-ci.com
16.02 s
Downloading cached gammaloop-nextest-binaries-core-gammalooprs from https://cache.nix-ci.com
16.08 s
Downloaded cached gammaloop-nextest-binaries-core-gammaloop-tracing-filter-macros (1.7 MiB) in 59ms
16.08 s
Progress: 0 of 1 built, 1 of 6 downloaded from cache (3 downloading)
16.20 s
Downloaded cached gammaloop-nextest-binaries-core-gammaloop-tracing-filter (6.6 MiB) in 184ms
16.20 s
Progress: 0 of 1 built, 2 of 6 downloaded from cache (2 downloading)
17.25 s
Downloaded cached gammaloop-nextest-binaries-core-gammaloop-api (66.7 MiB) in 1.2s
17.26 s
Progress: 0 of 1 built, 3 of 6 downloaded from cache (1 downloading)
17.34 s
Downloaded cached gammaloop-nextest-binaries-core-gammalooprs (76.8 MiB) in 1.3s
17.34 s
Progress: 0 of 1 built, 4 of 6 downloaded from cache
17.34 s
Downloading cached gammaloop-nextest-binaries-core from https://cache.nix-ci.com
17.35 s
Downloaded cached gammaloop-nextest-binaries-core (1640 B) in 5ms
17.35 s
Progress: 0 of 1 built, 5 of 6 downloaded from cache
17.35 s
Downloading cached nix-ci-check-gammaloop-nextest-core from https://cache.nix-ci.com
17.35 s
Downloaded cached nix-ci-check-gammaloop-nextest-core (1016 B) in 5ms
17.35 s
Progress: 0 of 1 built, 6 of 6 downloaded from cache
25.57 s
evaluating derivation 'g
copying '/nix/store/yk26
evaluating derivation 'g
copying '/nix/store/yk26
evaluating derivation 'g
copying '/nix/store/yk26
evaluating derivation 'g
copying '/nix/store/yk26
evaluating derivation 'g
copying '/nix/store/yk26
evaluating derivation 'g
copying '/nix/store/yk26
evaluating derivation 'g
copying '/nix/store/yk26
evaluating derivation 'g
copying '/nix/store/yk26
evaluating derivation 'g
querying gammaloop-nexte
[0 /16 built, 0.0 KiB DL]
[0 /1 built, 0.0 KiB DL]
[1 /0 /1 built, 0.0 KiB DLgammaloop-nextest-core> Extracting 3 binaries (including 1 non-test binary), 1 build script output directory, and 2 linked paths to /build/nextest-archive-17YCJ9
26.18 s
gammaloop-nextest-core> Extracted 18 files to /build/nextest-archive-17YCJ9 in 0.61s
26.19 s
gammaloop-nextest-core> ------------
26.19 s
gammaloop-nextest-core> Nextest run ID 00b0799a-414c-4ee2-aa3a-5b83639e5f95 with nextest profile: ci_gammaloop
26.19 s
gammaloop-nextest-core> Starting 339 tests across 2 binaries
26.76 s
gammaloop-nextest-core> ------------
26.76 s
gammaloop-nextest-core> Summary [ 0.571s] 339 tests run: 339 passed , 0 skipped
26.87 s
gammaloop-nextest-core>
26.87 s
gammaloop-nextest-core> ========== nextest test summary ==========
26.87 s
gammaloop-nextest-core> report: target/nextest/ci_gammaloop/junit.xml
26.87 s
gammaloop-nextest-core> tests: 339, failures: 0, errors: 0
26.87 s
gammaloop-nextest-core> No failing testcases found.
26.87 s
gammaloop-nextest-core> =========================================
26.89 s
gammaloop-nextest-core> Extracting 1 binary and 1 linked path to /build/nextest-archive-4RgJND
26.97 s
gammaloop-nextest-core> Extracted 7 files to /build/nextest-archive-4RgJND in 0.08s
26.98 s
gammaloop-nextest-core> ------------
26.98 s
gammaloop-nextest-core> Nextest run ID 49a24bee-8ab9-4622-b0d3-5d98abdb595f with nextest profile: ci_gammaloop
26.98 s
gammaloop-nextest-core> Starting 19 tests across 1 binary
27.00 s
gammaloop-nextest-core> ------------
27.00 s
gammaloop-nextest-core> Summary [ 0.016s] 19 tests run: 19 passed , 0 skipped
27.06 s
gammaloop-nextest-core>
27.06 s
gammaloop-nextest-core> ========== nextest test summary ==========
27.06 s
gammaloop-nextest-core> report: target/nextest/ci_gammaloop/junit.xml
27.06 s
gammaloop-nextest-core> tests: 19, failures: 0, errors: 0
27.06 s
gammaloop-nextest-core> No failing testcases found.
27.06 s
gammaloop-nextest-core> =========================================
27.08 s
gammaloop-nextest-core> Extracting 1 binary to /build/nextest-archive-1NWpw7
27.13 s
gammaloop-nextest-core> Extracted 4 files to /build/nextest-archive-1NWpw7 in 0.05s
27.14 s
gammaloop-nextest-core> ------------
27.14 s
gammaloop-nextest-core> Nextest run ID 72a7877c-200c-49c6-91d3-3bbee0278e89 with nextest profile: ci_gammaloop
27.14 s
gammaloop-nextest-core> Starting 0 tests across 1 binary
27.14 s
gammaloop-nextest-core> ------------
27.14 s
gammaloop-nextest-core> Summary [ 0.000s] 0 tests run: 0 passed , 0 skipped
27.19 s
gammaloop-nextest-core>
27.19 s
gammaloop-nextest-core> ========== nextest test summary ==========
27.19 s
gammaloop-nextest-core> report: target/nextest/ci_gammaloop/junit.xml
27.19 s
gammaloop-nextest-core> tests: 0, failures: 0, errors: 0
27.19 s
gammaloop-nextest-core> No failing testcases found.
27.19 s
gammaloop-nextest-core> =========================================
27.22 s
gammaloop-nextest-core> Extracting 4 binaries, 1 build script output directory, and 2 linked paths to /build/nextest-archive-MT5rBG
27.73 s
gammaloop-nextest-core> Extracted 18 files to /build/nextest-archive-MT5rBG in 0.52s
27.75 s
gammaloop-nextest-core> ------------
27.75 s
gammaloop-nextest-core> Nextest run ID 0bd59c85-4669-4a7b-b18f-4438a2d1a147 with nextest profile: ci_gammaloop
27.75 s
gammaloop-nextest-core> Starting 456 tests across 4 binaries (61 tests skipped , including 60 tests via profile.ci_gammaloop.default-filter )
29.26 s
gammaloop-nextest-core> FAIL [ 0.399s] (444/456) gammalooprs::test_renormalization finit_part_ghlo
29.26 s
gammaloop-nextest-core> stdout ---
29.26 s
gammaloop-nextest-core>
29.26 s
gammaloop-nextest-core> running 1 test
29.26 s
gammaloop-nextest-core> ren part: 1/2*GC_10^2*dot(P(0,mink (dim)),P(0,mink (dim)))*cas(2,coad (8))/ε
29.26 s
gammaloop-nextest-core> ━━━━━━━━━━━━━━━━━━━━━━━━━━━━━━━ Snapshot Summary ━━━━━━━━━━━━━━━━━━━━━━━━━━━━━━━
29.26 s
gammaloop-nextest-core> Snapshot: finit_part_ghlo
29.26 s
gammaloop-nextest-core> Source: crates/gammalooprs/tests/test_renormalization.rs:557
29.26 s
gammaloop-nextest-core> ────────────────────────────────────────────────────────────────────────────────
29.26 s
gammaloop-nextest-core> Expression: align_to_rqft(&a, &model).to_bare_ordered_string()
29.26 s
gammaloop-nextest-core> ────────────────────────────────────────────────────────────────────────────────
29.26 s
gammaloop-nextest-core> -old snapshot
29.26 s
gammaloop-nextest-core> +new results
29.26 s
gammaloop-nextest-core> ────────────┬───────────────────────────────────────────────────────────────────
29.26 s
gammaloop-nextest-core> 1 │--1/2*cas(2,coad(8))*dot(P(0,mink(4)),P(0,mink(4)))*gs^2*ε^(-1)
29.26 s
gammaloop-nextest-core> 1 │+1/2*cas(2,coad(8))*dot(P(0,mink(4)),P(0,mink(4)))*gs^2*ε^(-1)
29.26 s
gammaloop-nextest-core> ────────────┴───────────────────────────────────────────────────────────────────
29.26 s
gammaloop-nextest-core> To update snapshots run `cargo insta review`
29.26 s
gammaloop-nextest-core> Stopped on the first failure. Run `cargo insta test` to run all snapshots.
29.26 s
gammaloop-nextest-core> test finit_part_ghlo ... FAILED
29.26 s
gammaloop-nextest-core>
29.26 s
gammaloop-nextest-core> failures:
29.26 s
gammaloop-nextest-core>
29.26 s
gammaloop-nextest-core> failures:
29.26 s
gammaloop-nextest-core> finit_part_ghlo
29.26 s
gammaloop-nextest-core>
29.26 s
gammaloop-nextest-core> test result: FAILED. 0 passed; 1 failed; 0 ignored; 0 measured; 5 filtered out; finished in 0.38s
29.26 s
gammaloop-nextest-core>
29.26 s
gammaloop-nextest-core> stderr ---
29.26 s
gammaloop-nextest-core> The application panicked (crashed).
29.26 s
gammaloop-nextest-core> Message: snapshot assertion for 'finit_part_ghlo' failed in line 557
29.26 s
gammaloop-nextest-core> Location: /nix/store/0f9p2h9240ylfzayilfjv4gr7scagfs3-vendor-cargo-deps/c19b7c6f923b580ac259164a89f2577984ad5ab09ee9d583b888f934adbbe8d0/insta-1.47.2/src/runtime.rs :719
29.26 s
gammaloop-nextest-core>
29.26 s
gammaloop-nextest-core> ━━━━━━━━━━━━━━━━━━━━━━━━━━━━━━━━━━ BACKTRACE ━━━━━━━━━━━━━━━━━━━━━━━━━━━━━━━━━━━
29.26 s
gammaloop-nextest-core> 1: <color_eyre[51793ea62743adbd]::config::PanicHook>::panic_report <unknown>
29.26 s
gammaloop-nextest-core> at <unknown source file> :<unknown line>
29.26 s
gammaloop-nextest-core> 2: <color_eyre[51793ea62743adbd]::config::PanicHook>::into_panic_hook::{closure#0} <unknown>
29.26 s
gammaloop-nextest-core> at <unknown source file> :<unknown line>
29.26 s
gammaloop-nextest-core> 3: std[bcb96dfbba0ab899]::panicking::panic_with_hook <unknown>
29.26 s
gammaloop-nextest-core> at <unknown source file> :<unknown line>
29.26 s
gammaloop-nextest-core> 4: std[bcb96dfbba0ab899]::panicking::panic_handler::{closure#0} <unknown>
29.26 s
gammaloop-nextest-core> at <unknown source file> :<unknown line>
29.26 s
gammaloop-nextest-core> 5: std[bcb96dfbba0ab899]::sys::backtrace::__rust_end_short_backtrace::<std[bcb96dfbba0ab899]::panicking::panic_handler::{closure#0}, !> <unknown>
29.26 s
gammaloop-nextest-core> at <unknown source file> :<unknown line>
29.26 s
gammaloop-nextest-core> 6: __rustc[6c289b9f9c454d21]::rust_begin_unwind <unknown>
29.26 s
gammaloop-nextest-core> at <unknown source file> :<unknown line>
29.26 s
gammaloop-nextest-core> 7: core[940e698046960fd5]::panicking::panic_fmt <unknown>
29.26 s
gammaloop-nextest-core> at <unknown source file> :<unknown line>
29.26 s
gammaloop-nextest-core> 8: insta[307a548ac79ef4d9]::runtime::assert_snapshot <unknown>
29.26 s
gammaloop-nextest-core> at <unknown source file> :<unknown line>
29.26 s
gammaloop-nextest-core> 9: <test_renormalization[6420da4f660338c3]::finit_part_ghlo::{closure#0} as core[940e698046960fd5]::ops::function::FnOnce<()>>::call_once <unknown>
29.26 s
gammaloop-nextest-core> at <unknown source file> :<unknown line>
29.26 s
gammaloop-nextest-core> 10: test[75d6903177b1d7e9]::__rust_begin_short_backtrace::<core[940e698046960fd5]::result::Result<(), alloc[2ea6bcb46fca0c42]::string::String>, fn() -> core[940e698046960fd5]::result::Result<(), alloc[2ea6bcb46fca0c42]::string::String>> <unknown>
29.26 s
gammaloop-nextest-core> at <unknown source file> :<unknown line>
29.26 s
gammaloop-nextest-core> 11: test[75d6903177b1d7e9]::run_test::{closure#0} <unknown>
29.26 s
gammaloop-nextest-core> at <unknown source file> :<unknown line>
29.26 s
gammaloop-nextest-core> 12: std[bcb96dfbba0ab899]::sys::backtrace::__rust_begin_short_backtrace::<test[75d6903177b1d7e9]::run_test::{closure#1}, ()> <unknown>
29.26 s
gammaloop-nextest-core> at <unknown source file> :<unknown line>
29.26 s
gammaloop-nextest-core> 13: <std[bcb96dfbba0ab899]::thread::lifecycle::spawn_unchecked<test[75d6903177b1d7e9]::run_test::{closure#1}, ()>::{closure#1} as core[940e698046960fd5]::ops::function::FnOnce<()>>::call_once::{shim:vtable#0} <unknown>
29.26 s
gammaloop-nextest-core> at <unknown source file> :<unknown line>
29.26 s
gammaloop-nextest-core> 14: <std[bcb96dfbba0ab899]::sys::thread::unix::Thread>::new::thread_start <unknown>
29.26 s
gammaloop-nextest-core> at <unknown source file> :<unknown line>
29.26 s
gammaloop-nextest-core> 15: start_thread <unknown>
29.26 s
gammaloop-nextest-core> at <unknown source file> :<unknown line>
29.26 s
gammaloop-nextest-core> 16: __clone3 <unknown>
29.26 s
gammaloop-nextest-core> at <unknown source file> :<unknown line>
29.26 s
gammaloop-nextest-core>
29.26 s
gammaloop-nextest-core> Run with COLORBT_SHOW_HIDDEN=1 environment variable to disable frame filtering.
29.26 s
gammaloop-nextest-core> Run with RUST_BACKTRACE=full to include source snippets.
29.26 s
gammaloop-nextest-core>
31.69 s
gammaloop-nextest-core> FAIL [ 2.832s] (451/456) gammalooprs::test_renormalization finite_part_ghost_2loop
31.72 s
gammaloop-nextest-core> stdout ---
31.72 s
gammaloop-nextest-core>
31.72 s
gammaloop-nextest-core> running 1 test
31.72 s
gammaloop-nextest-core> ━━━━━━━━━━━━━━━━━━━━━━━━━━━━━━━ Snapshot Summary ━━━━━━━━━━━━━━━━━━━━━━━━━━━━━━━
31.72 s
gammaloop-nextest-core> Snapshot: finite_part_ghost_2loop-3
31.72 s
gammaloop-nextest-core> Source: crates/gammalooprs/tests/test_renormalization.rs:464
31.72 s
gammaloop-nextest-core> ────────────────────────────────────────────────────────────────────────────────
31.72 s
gammaloop-nextest-core> Expression: align_to_rqft(&a, &model).to_bare_ordered_string()
31.72 s
gammaloop-nextest-core> ────────────────────────────────────────────────────────────────────────────────
31.72 s
gammaloop-nextest-core> -old snapshot
31.72 s
gammaloop-nextest-core> +new results
31.72 s
gammaloop-nextest-core> ────────────┬───────────────────────────────────────────────────────────────────
31.72 s
gammaloop-nextest-core> 1 │-(-1𝑖/32*ε+1𝑖/16)*(cas(2,coad(8)))^2*dot(P(0,mink(4)),P(0,mink(4)))*gs^4*ε^(-2)
31.72 s
gammaloop-nextest-core> 1 │+(-1𝑖/16+1𝑖/32*ε)*(cas(2,coad(8)))^2*dot(P(0,mink(4)),P(0,mink(4)))*gs^4*ε^(-2)
31.72 s
gammaloop-nextest-core> ────────────┴───────────────────────────────────────────────────────────────────
31.72 s
gammaloop-nextest-core> To update snapshots run `cargo insta review`
31.72 s
gammaloop-nextest-core> Stopped on the first failure. Run `cargo insta test` to run all snapshots.
31.72 s
gammaloop-nextest-core> test finite_part_ghost_2loop ... FAILED
31.72 s
gammaloop-nextest-core>
31.72 s
gammaloop-nextest-core> failures:
31.72 s
gammaloop-nextest-core>
31.72 s
gammaloop-nextest-core> failures:
31.72 s
gammaloop-nextest-core> finite_part_ghost_2loop
31.72 s
gammaloop-nextest-core>
31.72 s
gammaloop-nextest-core> test result: FAILED. 0 passed; 1 failed; 0 ignored; 0 measured; 5 filtered out; finished in 2.82s
31.72 s
gammaloop-nextest-core>
31.72 s
gammaloop-nextest-core> stderr ---
31.72 s
gammaloop-nextest-core> The application panicked (crashed).
31.72 s
gammaloop-nextest-core> Message: snapshot assertion for 'finite_part_ghost_2loop-3' failed in line 464
31.72 s
gammaloop-nextest-core> Location: /nix/store/0f9p2h9240ylfzayilfjv4gr7scagfs3-vendor-cargo-deps/c19b7c6f923b580ac259164a89f2577984ad5ab09ee9d583b888f934adbbe8d0/insta-1.47.2/src/runtime.rs :719
31.72 s
gammaloop-nextest-core>
31.72 s
gammaloop-nextest-core> ━━━━━━━━━━━━━━━━━━━━━━━━━━━━━━━━━━ BACKTRACE ━━━━━━━━━━━━━━━━━━━━━━━━━━━━━━━━━━━
31.72 s
gammaloop-nextest-core> 1: <color_eyre[51793ea62743adbd]::config::PanicHook>::panic_report <unknown>
31.72 s
gammaloop-nextest-core> at <unknown source file> :<unknown line>
31.72 s
gammaloop-nextest-core> 2: <color_eyre[51793ea62743adbd]::config::PanicHook>::into_panic_hook::{closure#0} <unknown>
31.72 s
gammaloop-nextest-core> at <unknown source file> :<unknown line>
31.72 s
gammaloop-nextest-core> 3: std[bcb96dfbba0ab899]::panicking::panic_with_hook <unknown>
31.72 s
gammaloop-nextest-core> at <unknown source file> :<unknown line>
31.72 s
gammaloop-nextest-core> 4: std[bcb96dfbba0ab899]::panicking::panic_handler::{closure#0} <unknown>
31.72 s
gammaloop-nextest-core> at <unknown source file> :<unknown line>
31.72 s
gammaloop-nextest-core> 5: std[bcb96dfbba0ab899]::sys::backtrace::__rust_end_short_backtrace::<std[bcb96dfbba0ab899]::panicking::panic_handler::{closure#0}, !> <unknown>
31.72 s
gammaloop-nextest-core> at <unknown source file> :<unknown line>
31.72 s
gammaloop-nextest-core> 6: __rustc[6c289b9f9c454d21]::rust_begin_unwind <unknown>
31.72 s
gammaloop-nextest-core> at <unknown source file> :<unknown line>
31.72 s
gammaloop-nextest-core> 7: core[940e698046960fd5]::panicking::panic_fmt <unknown>
31.72 s
gammaloop-nextest-core> at <unknown source file> :<unknown line>
31.72 s
gammaloop-nextest-core> 8: insta[307a548ac79ef4d9]::runtime::assert_snapshot <unknown>
31.72 s
gammaloop-nextest-core> at <unknown source file> :<unknown line>
31.72 s
gammaloop-nextest-core> 9: test_renormalization[6420da4f660338c3]::finite_part_ghost_2loop <unknown>
31.72 s
gammaloop-nextest-core> at <unknown source file> :<unknown line>
31.72 s
gammaloop-nextest-core> 10: <test_renormalization[6420da4f660338c3]::finite_part_ghost_2loop::{closure#0} as core[940e698046960fd5]::ops::function::FnOnce<()>>::call_once <unknown>
31.72 s
gammaloop-nextest-core> at <unknown source file> :<unknown line>
31.72 s
gammaloop-nextest-core> 11: test[75d6903177b1d7e9]::__rust_begin_short_backtrace::<core[940e698046960fd5]::result::Result<(), alloc[2ea6bcb46fca0c42]::string::String>, fn() -> core[940e698046960fd5]::result::Result<(), alloc[2ea6bcb46fca0c42]::string::String>> <unknown>
31.72 s
gammaloop-nextest-core> at <unknown source file> :<unknown line>
31.72 s
gammaloop-nextest-core> 12: test[75d6903177b1d7e9]::run_test::{closure#0} <unknown>
31.72 s
gammaloop-nextest-core> at <unknown source file> :<unknown line>
31.72 s
gammaloop-nextest-core> 13: std[bcb96dfbba0ab899]::sys::backtrace::__rust_begin_short_backtrace::<test[75d6903177b1d7e9]::run_test::{closure#1}, ()> <unknown>
31.72 s
gammaloop-nextest-core> at <unknown source file> :<unknown line>
31.72 s
gammaloop-nextest-core> 14: <std[bcb96dfbba0ab899]::thread::lifecycle::spawn_unchecked<test[75d6903177b1d7e9]::run_test::{closure#1}, ()>::{closure#1} as core[940e698046960fd5]::ops::function::FnOnce<()>>::call_once::{shim:vtable#0} <unknown>
31.72 s
gammaloop-nextest-core> at <unknown source file> :<unknown line>
31.72 s
gammaloop-nextest-core> 15: <std[bcb96dfbba0ab899]::sys::thread::unix::Thread>::new::thread_start <unknown>
31.72 s
gammaloop-nextest-core> at <unknown source file> :<unknown line>
31.72 s
gammaloop-nextest-core> 16: start_thread <unknown>
31.72 s
gammaloop-nextest-core> at <unknown source file> :<unknown line>
31.72 s
gammaloop-nextest-core> 17: __clone3 <unknown>
31.72 s
gammaloop-nextest-core> at <unknown source file> :<unknown line>
31.72 s
gammaloop-nextest-core>
31.72 s
gammaloop-nextest-core> Run with COLORBT_SHOW_HIDDEN=1 environment variable to disable frame filtering.
31.72 s
gammaloop-nextest-core> Run with RUST_BACKTRACE=full to include source snippets.
31.72 s
gammaloop-nextest-core>
37.74 s
gammaloop-nextest-core> ------------
37.76 s
gammaloop-nextest-core> Summary [ 9.999s] 456 tests run: 454 passed , 2 failed , 61 skipped
37.76 s
gammaloop-nextest-core> FAIL [ 0.399s] (444/456) gammalooprs::test_renormalization finit_part_ghlo
37.76 s
gammaloop-nextest-core> stdout ---
37.76 s
gammaloop-nextest-core>
37.76 s
gammaloop-nextest-core> running 1 test
37.76 s
gammaloop-nextest-core> ren part: 1/2*GC_10^2*dot(P(0,mink (dim)),P(0,mink (dim)))*cas(2,coad (8))/ε
37.76 s
gammaloop-nextest-core> ━━━━━━━━━━━━━━━━━━━━━━━━━━━━━━━ Snapshot Summary ━━━━━━━━━━━━━━━━━━━━━━━━━━━━━━━
37.76 s
gammaloop-nextest-core> Snapshot: finit_part_ghlo
37.76 s
gammaloop-nextest-core> Source: crates/gammalooprs/tests/test_renormalization.rs:557
37.76 s
gammaloop-nextest-core> ────────────────────────────────────────────────────────────────────────────────
37.76 s
gammaloop-nextest-core> Expression: align_to_rqft(&a, &model).to_bare_ordered_string()
37.76 s
gammaloop-nextest-core> ────────────────────────────────────────────────────────────────────────────────
37.76 s
gammaloop-nextest-core> -old snapshot
37.76 s
gammaloop-nextest-core> +new results
37.76 s
gammaloop-nextest-core> ────────────┬───────────────────────────────────────────────────────────────────
37.76 s
gammaloop-nextest-core> 1 │--1/2*cas(2,coad(8))*dot(P(0,mink(4)),P(0,mink(4)))*gs^2*ε^(-1)
37.76 s
gammaloop-nextest-core> 1 │+1/2*cas(2,coad(8))*dot(P(0,mink(4)),P(0,mink(4)))*gs^2*ε^(-1)
37.76 s
gammaloop-nextest-core> ────────────┴───────────────────────────────────────────────────────────────────
37.76 s
gammaloop-nextest-core> To update snapshots run `cargo insta review`
37.76 s
gammaloop-nextest-core> Stopped on the first failure. Run `cargo insta test` to run all snapshots.
37.76 s
gammaloop-nextest-core> test finit_part_ghlo ... FAILED
37.76 s
gammaloop-nextest-core>
37.76 s
gammaloop-nextest-core> failures:
37.76 s
gammaloop-nextest-core>
37.76 s
gammaloop-nextest-core> failures:
37.76 s
gammaloop-nextest-core> finit_part_ghlo
37.76 s
gammaloop-nextest-core>
37.76 s
gammaloop-nextest-core> test result: FAILED. 0 passed; 1 failed; 0 ignored; 0 measured; 5 filtered out; finished in 0.38s
37.76 s
gammaloop-nextest-core>
37.76 s
gammaloop-nextest-core> stderr ---
37.76 s
gammaloop-nextest-core> The application panicked (crashed).
37.76 s
gammaloop-nextest-core> Message: snapshot assertion for 'finit_part_ghlo' failed in line 557
37.76 s
gammaloop-nextest-core> Location: /nix/store/0f9p2h9240ylfzayilfjv4gr7scagfs3-vendor-cargo-deps/c19b7c6f923b580ac259164a89f2577984ad5ab09ee9d583b888f934adbbe8d0/insta-1.47.2/src/runtime.rs :719
37.76 s
gammaloop-nextest-core>
37.76 s
gammaloop-nextest-core> ━━━━━━━━━━━━━━━━━━━━━━━━━━━━━━━━━━ BACKTRACE ━━━━━━━━━━━━━━━━━━━━━━━━━━━━━━━━━━━
37.76 s
gammaloop-nextest-core> 1: <color_eyre[51793ea62743adbd]::config::PanicHook>::panic_report <unknown>
37.76 s
gammaloop-nextest-core> at <unknown source file> :<unknown line>
37.76 s
gammaloop-nextest-core> 2: <color_eyre[51793ea62743adbd]::config::PanicHook>::into_panic_hook::{closure#0} <unknown>
37.76 s
gammaloop-nextest-core> at <unknown source file> :<unknown line>
37.76 s
gammaloop-nextest-core> 3: std[bcb96dfbba0ab899]::panicking::panic_with_hook <unknown>
37.76 s
gammaloop-nextest-core> at <unknown source file> :<unknown line>
37.76 s
gammaloop-nextest-core> 4: std[bcb96dfbba0ab899]::panicking::panic_handler::{closure#0} <unknown>
37.76 s
gammaloop-nextest-core> at <unknown source file> :<unknown line>
37.76 s
gammaloop-nextest-core> 5: std[bcb96dfbba0ab899]::sys::backtrace::__rust_end_short_backtrace::<std[bcb96dfbba0ab899]::panicking::panic_handler::{closure#0}, !> <unknown>
37.76 s
gammaloop-nextest-core> at <unknown source file> :<unknown line>
37.76 s
gammaloop-nextest-core> 6: __rustc[6c289b9f9c454d21]::rust_begin_unwind <unknown>
37.76 s
gammaloop-nextest-core> at <unknown source file> :<unknown line>
37.76 s
gammaloop-nextest-core> 7: core[940e698046960fd5]::panicking::panic_fmt <unknown>
37.76 s
gammaloop-nextest-core> at <unknown source file> :<unknown line>
37.76 s
gammaloop-nextest-core> 8: insta[307a548ac79ef4d9]::runtime::assert_snapshot <unknown>
37.76 s
gammaloop-nextest-core> at <unknown source file> :<unknown line>
37.76 s
gammaloop-nextest-core> 9: <test_renormalization[6420da4f660338c3]::finit_part_ghlo::{closure#0} as core[940e698046960fd5]::ops::function::FnOnce<()>>::call_once <unknown>
37.76 s
gammaloop-nextest-core> at <unknown source file> :<unknown line>
37.76 s
gammaloop-nextest-core> 10: test[75d6903177b1d7e9]::__rust_begin_short_backtrace::<core[940e698046960fd5]::result::Result<(), alloc[2ea6bcb46fca0c42]::string::String>, fn() -> core[940e698046960fd5]::result::Result<(), alloc[2ea6bcb46fca0c42]::string::String>> <unknown>
37.76 s
gammaloop-nextest-core> at <unknown source file> :<unknown line>
37.76 s
gammaloop-nextest-core> 11: test[75d6903177b1d7e9]::run_test::{closure#0} <unknown>
37.76 s
gammaloop-nextest-core> at <unknown source file> :<unknown line>
37.76 s
gammaloop-nextest-core> 12: std[bcb96dfbba0ab899]::sys::backtrace::__rust_begin_short_backtrace::<test[75d6903177b1d7e9]::run_test::{closure#1}, ()> <unknown>
37.76 s
gammaloop-nextest-core> at <unknown source file> :<unknown line>
37.76 s
gammaloop-nextest-core> 13: <std[bcb96dfbba0ab899]::thread::lifecycle::spawn_unchecked<test[75d6903177b1d7e9]::run_test::{closure#1}, ()>::{closure#1} as core[940e698046960fd5]::ops::function::FnOnce<()>>::call_once::{shim:vtable#0} <unknown>
37.76 s
gammaloop-nextest-core> at <unknown source file> :<unknown line>
37.76 s
gammaloop-nextest-core> 14: <std[bcb96dfbba0ab899]::sys::thread::unix::Thread>::new::thread_start <unknown>
37.76 s
gammaloop-nextest-core> at <unknown source file> :<unknown line>
37.76 s
gammaloop-nextest-core> 15: start_thread <unknown>
37.76 s
gammaloop-nextest-core> at <unknown source file> :<unknown line>
37.76 s
gammaloop-nextest-core> 16: __clone3 <unknown>
37.76 s
gammaloop-nextest-core> at <unknown source file> :<unknown line>
37.76 s
gammaloop-nextest-core>
37.76 s
gammaloop-nextest-core> Run with COLORBT_SHOW_HIDDEN=1 environment variable to disable frame filtering.
37.76 s
gammaloop-nextest-core> Run with RUST_BACKTRACE=full to include source snippets.
37.76 s
gammaloop-nextest-core>
37.76 s
gammaloop-nextest-core> FAIL [ 2.832s] (451/456) gammalooprs::test_renormalization finite_part_ghost_2loop
37.76 s
gammaloop-nextest-core> stdout ---
37.76 s
gammaloop-nextest-core>
37.76 s
gammaloop-nextest-core> running 1 test
37.76 s
gammaloop-nextest-core> ━━━━━━━━━━━━━━━━━━━━━━━━━━━━━━━ Snapshot Summary ━━━━━━━━━━━━━━━━━━━━━━━━━━━━━━━
37.76 s
gammaloop-nextest-core> Snapshot: finite_part_ghost_2loop-3
37.76 s
gammaloop-nextest-core> Source: crates/gammalooprs/tests/test_renormalization.rs:464
37.76 s
gammaloop-nextest-core> ────────────────────────────────────────────────────────────────────────────────
37.76 s
gammaloop-nextest-core> Expression: align_to_rqft(&a, &model).to_bare_ordered_string()
37.76 s
gammaloop-nextest-core> ────────────────────────────────────────────────────────────────────────────────
37.76 s
gammaloop-nextest-core> -old snapshot
37.76 s
gammaloop-nextest-core> +new results
37.76 s
gammaloop-nextest-core> ────────────┬───────────────────────────────────────────────────────────────────
37.76 s
gammaloop-nextest-core> 1 │-(-1𝑖/32*ε+1𝑖/16)*(cas(2,coad(8)))^2*dot(P(0,mink(4)),P(0,mink(4)))*gs^4*ε^(-2)
37.76 s
gammaloop-nextest-core> 1 │+(-1𝑖/16+1𝑖/32*ε)*(cas(2,coad(8)))^2*dot(P(0,mink(4)),P(0,mink(4)))*gs^4*ε^(-2)
37.76 s
gammaloop-nextest-core> ────────────┴───────────────────────────────────────────────────────────────────
37.76 s
gammaloop-nextest-core> To update snapshots run `cargo insta review`
37.76 s
gammaloop-nextest-core> Stopped on the first failure. Run `cargo insta test` to run all snapshots.
37.76 s
gammaloop-nextest-core> test finite_part_ghost_2loop ... FAILED
37.76 s
gammaloop-nextest-core>
37.76 s
gammaloop-nextest-core> failures:
37.76 s
gammaloop-nextest-core>
37.76 s
gammaloop-nextest-core> failures:
37.76 s
gammaloop-nextest-core> finite_part_ghost_2loop
37.76 s
gammaloop-nextest-core>
37.76 s
gammaloop-nextest-core> test result: FAILED. 0 passed; 1 failed; 0 ignored; 0 measured; 5 filtered out; finished in 2.82s
37.76 s
gammaloop-nextest-core>
37.76 s
gammaloop-nextest-core> stderr ---
37.76 s
gammaloop-nextest-core> The application panicked (crashed).
37.76 s
gammaloop-nextest-core> Message: snapshot assertion for 'finite_part_ghost_2loop-3' failed in line 464
37.76 s
gammaloop-nextest-core> Location: /nix/store/0f9p2h9240ylfzayilfjv4gr7scagfs3-vendor-cargo-deps/c19b7c6f923b580ac259164a89f2577984ad5ab09ee9d583b888f934adbbe8d0/insta-1.47.2/src/runtime.rs :719
37.76 s
gammaloop-nextest-core>
37.76 s
gammaloop-nextest-core> ━━━━━━━━━━━━━━━━━━━━━━━━━━━━━━━━━━ BACKTRACE ━━━━━━━━━━━━━━━━━━━━━━━━━━━━━━━━━━━
37.76 s
gammaloop-nextest-core> 1: <color_eyre[51793ea62743adbd]::config::PanicHook>::panic_report <unknown>
37.76 s
gammaloop-nextest-core> at <unknown source file> :<unknown line>
37.76 s
gammaloop-nextest-core> 2: <color_eyre[51793ea62743adbd]::config::PanicHook>::into_panic_hook::{closure#0} <unknown>
37.76 s
gammaloop-nextest-core> at <unknown source file> :<unknown line>
37.76 s
gammaloop-nextest-core> 3: std[bcb96dfbba0ab899]::panicking::panic_with_hook <unknown>
37.76 s
gammaloop-nextest-core> at <unknown source file> :<unknown line>
37.76 s
gammaloop-nextest-core> 4: std[bcb96dfbba0ab899]::panicking::panic_handler::{closure#0} <unknown>
37.76 s
gammaloop-nextest-core> at <unknown source file> :<unknown line>
37.76 s
gammaloop-nextest-core> 5: std[bcb96dfbba0ab899]::sys::backtrace::__rust_end_short_backtrace::<std[bcb96dfbba0ab899]::panicking::panic_handler::{closure#0}, !> <unknown>
37.76 s
gammaloop-nextest-core> at <unknown source file> :<unknown line>
37.76 s
gammaloop-nextest-core> 6: __rustc[6c289b9f9c454d21]::rust_begin_unwind <unknown>
37.76 s
gammaloop-nextest-core> at <unknown source file> :<unknown line>
37.76 s
gammaloop-nextest-core> 7: core[940e698046960fd5]::panicking::panic_fmt <unknown>
37.76 s
gammaloop-nextest-core> at <unknown source file> :<unknown line>
37.76 s
gammaloop-nextest-core> 8: insta[307a548ac79ef4d9]::runtime::assert_snapshot <unknown>
37.76 s
gammaloop-nextest-core> at <unknown source file> :<unknown line>
37.76 s
gammaloop-nextest-core> 9: test_renormalization[6420da4f660338c3]::finite_part_ghost_2loop <unknown>
37.76 s
gammaloop-nextest-core> at <unknown source file> :<unknown line>
37.76 s
gammaloop-nextest-core> 10: <test_renormalization[6420da4f660338c3]::finite_part_ghost_2loop::{closure#0} as core[940e698046960fd5]::ops::function::FnOnce<()>>::call_once <unknown>
37.76 s
gammaloop-nextest-core> at <unknown source file> :<unknown line>
37.76 s
gammaloop-nextest-core> 11: test[75d6903177b1d7e9]::__rust_begin_short_backtrace::<core[940e698046960fd5]::result::Result<(), alloc[2ea6bcb46fca0c42]::string::String>, fn() -> core[940e698046960fd5]::result::Result<(), alloc[2ea6bcb46fca0c42]::string::String>> <unknown>
37.76 s
gammaloop-nextest-core> at <unknown source file> :<unknown line>
37.76 s
gammaloop-nextest-core> 12: test[75d6903177b1d7e9]::run_test::{closure#0} <unknown>
37.76 s
gammaloop-nextest-core> at <unknown source file> :<unknown line>
37.76 s
gammaloop-nextest-core> 13: std[bcb96dfbba0ab899]::sys::backtrace::__rust_begin_short_backtrace::<test[75d6903177b1d7e9]::run_test::{closure#1}, ()> <unknown>
37.76 s
gammaloop-nextest-core> at <unknown source file> :<unknown line>
37.76 s
gammaloop-nextest-core> 14: <std[bcb96dfbba0ab899]::thread::lifecycle::spawn_unchecked<test[75d6903177b1d7e9]::run_test::{closure#1}, ()>::{closure#1} as core[940e698046960fd5]::ops::function::FnOnce<()>>::call_once::{shim:vtable#0} <unknown>
37.76 s
gammaloop-nextest-core> at <unknown source file> :<unknown line>
37.76 s
gammaloop-nextest-core> 15: <std[bcb96dfbba0ab899]::sys::thread::unix::Thread>::new::thread_start <unknown>
37.76 s
gammaloop-nextest-core> at <unknown source file> :<unknown line>
37.76 s
gammaloop-nextest-core> 16: start_thread <unknown>
37.76 s
gammaloop-nextest-core> at <unknown source file> :<unknown line>
37.76 s
gammaloop-nextest-core> 17: __clone3 <unknown>
37.76 s
gammaloop-nextest-core> at <unknown source file> :<unknown line>
37.76 s
gammaloop-nextest-core>
37.76 s
gammaloop-nextest-core> Run with COLORBT_SHOW_HIDDEN=1 environment variable to disable frame filtering.
37.76 s
gammaloop-nextest-core> Run with RUST_BACKTRACE=full to include source snippets.
37.76 s
gammaloop-nextest-core>
37.85 s
gammaloop-nextest-core> error : test run failed
37.89 s
gammaloop-nextest-core>
37.89 s
gammaloop-nextest-core> ========== nextest test summary ==========
37.89 s
gammaloop-nextest-core> report: target/nextest/ci_gammaloop/junit.xml
37.89 s
gammaloop-nextest-core> tests: 456, failures: 2, errors: 0
37.89 s
gammaloop-nextest-core>
37.89 s
gammaloop-nextest-core> 1. gammalooprs::test_renormalization::finit_part_ghlo
37.89 s
gammaloop-nextest-core> failure: test failure with exit code 101
37.89 s
gammaloop-nextest-core> system-out
37.89 s
gammaloop-nextest-core> running 1 test
37.89 s
gammaloop-nextest-core> ren part: 1/2*GC_10^2*dot(P(0,mink(dim)),P(0,mink(dim)))*cas(2,coad(8))/ε
37.89 s
gammaloop-nextest-core> ━━━━━━━━━━━━━━━━━━━━━━━━━━━━━━━ Snapshot Summary ━━━━━━━━━━━━━━━━━━━━━━━━━━━━━━━
37.89 s
gammaloop-nextest-core> Snapshot: finit_part_ghlo
37.89 s
gammaloop-nextest-core> Source: crates/gammalooprs/tests/test_renormalization.rs:557
37.89 s
gammaloop-nextest-core> ────────────────────────────────────────────────────────────────────────────────
37.89 s
gammaloop-nextest-core> Expression: align_to_rqft(&a, &model).to_bare_ordered_string()
37.89 s
gammaloop-nextest-core> ────────────────────────────────────────────────────────────────────────────────
37.89 s
gammaloop-nextest-core> -old snapshot
37.89 s
gammaloop-nextest-core> +new results
37.89 s
gammaloop-nextest-core> ────────────┬───────────────────────────────────────────────────────────────────
37.89 s
gammaloop-nextest-core> 1 │--1/2*cas(2,coad(8))*dot(P(0,mink(4)),P(0,mink(4)))*gs^2*ε^(-1)
37.89 s
gammaloop-nextest-core> 1 │+1/2*cas(2,coad(8))*dot(P(0,mink(4)),P(0,mink(4)))*gs^2*ε^(-1)
37.89 s
gammaloop-nextest-core> ────────────┴───────────────────────────────────────────────────────────────────
37.89 s
gammaloop-nextest-core> To update snapshots run `cargo insta review`
37.89 s
gammaloop-nextest-core> Stopped on the first failure. Run `cargo insta test` to run all snapshots.
37.89 s
gammaloop-nextest-core> test finit_part_ghlo ... FAILED
37.89 s
gammaloop-nextest-core>
37.89 s
gammaloop-nextest-core> failures:
37.89 s
gammaloop-nextest-core>
37.89 s
gammaloop-nextest-core> failures:
37.89 s
gammaloop-nextest-core> finit_part_ghlo
37.89 s
gammaloop-nextest-core>
37.89 s
gammaloop-nextest-core> test result: FAILED. 0 passed; 1 failed; 0 ignored; 0 measured; 5 filtered out; finished in 0.38s
37.89 s
gammaloop-nextest-core> system-err
37.89 s
gammaloop-nextest-core> The application panicked (crashed).
37.89 s
gammaloop-nextest-core> Message: snapshot assertion for 'finit_part_ghlo' failed in line 557
37.89 s
gammaloop-nextest-core> Location: /nix/store/0f9p2h9240ylfzayilfjv4gr7scagfs3-vendor-cargo-deps/c19b7c6f923b580ac259164a89f2577984ad5ab09ee9d583b888f934adbbe8d0/insta-1.47.2/src/runtime.rs:719
37.89 s
gammaloop-nextest-core>
37.89 s
gammaloop-nextest-core> ━━━━━━━━━━━━━━━━━━━━━━━━━━━━━━━━━━ BACKTRACE ━━━━━━━━━━━━━━━━━━━━━━━━━━━━━━━━━━━
37.89 s
gammaloop-nextest-core> 1: <color_eyre[51793ea62743adbd]::config::PanicHook>::panic_report<unknown>
37.89 s
gammaloop-nextest-core> at <unknown source file>:<unknown line>
37.89 s
gammaloop-nextest-core> 2: <color_eyre[51793ea62743adbd]::config::PanicHook>::into_panic_hook::{closure#0}<unknown>
37.89 s
gammaloop-nextest-core> at <unknown source file>:<unknown line>
37.89 s
gammaloop-nextest-core> 3: std[bcb96dfbba0ab899]::panicking::panic_with_hook<unknown>
37.89 s
gammaloop-nextest-core> at <unknown source file>:<unknown line>
37.89 s
gammaloop-nextest-core> 4: std[bcb96dfbba0ab899]::panicking::panic_handler::{closure#0}<unknown>
37.89 s
gammaloop-nextest-core> at <unknown source file>:<unknown line>
37.89 s
gammaloop-nextest-core> 5: std[bcb96dfbba0ab899]::sys::backtrace::__rust_end_short_backtrace::<std[bcb96dfbba0ab899]::panicking::panic_handler::{closure#0}, !><unknown>
37.89 s
gammaloop-nextest-core> at <unknown source file>:<unknown line>
37.89 s
gammaloop-nextest-core> 6: __rustc[6c289b9f9c454d21]::rust_begin_unwind<unknown>
37.89 s
gammaloop-nextest-core> at <unknown source file>:<unknown line>
37.89 s
gammaloop-nextest-core> 7: core[940e698046960fd5]::panicking::panic_fmt<unknown>
37.89 s
gammaloop-nextest-core> at <unknown source file>:<unknown line>
37.89 s
gammaloop-nextest-core> 8: insta[307a548ac79ef4d9]::runtime::assert_snapshot<unknown>
37.89 s
gammaloop-nextest-core> at <unknown source file>:<unknown line>
37.89 s
gammaloop-nextest-core> 9: <test_renormalization[6420da4f660338c3]::finit_part_ghlo::{closure#0} as core[940e698046960fd5]::ops::function::FnOnce<()>>::call_once<unknown>
37.89 s
gammaloop-nextest-core> at <unknown source file>:<unknown line>
37.89 s
gammaloop-nextest-core> 10: test[75d6903177b1d7e9]::__rust_begin_short_backtrace::<core[940e698046960fd5]::result::Result<(), alloc[2ea6bcb46fca0c42]::string::String>, fn() -> core[940e698046960fd5]::result::Result<(), alloc[2ea6bcb46fca0c42]::string::String>><unknown>
37.89 s
gammaloop-nextest-core> at <unknown source file>:<unknown line>
37.89 s
gammaloop-nextest-core> 11: test[75d6903177b1d7e9]::run_test::{closure#0}<unknown>
37.89 s
gammaloop-nextest-core> at <unknown source file>:<unknown line>
37.89 s
gammaloop-nextest-core> 12: std[bcb96dfbba0ab899]::sys::backtrace::__rust_begin_short_backtrace::<test[75d6903177b1d7e9]::run_test::{closure#1}, ()><unknown>
37.89 s
gammaloop-nextest-core> at <unknown source file>:<unknown line>
37.89 s
gammaloop-nextest-core> 13: <std[bcb96dfbba0ab899]::thread::lifecycle::spawn_unchecked<test[75d6903177b1d7e9]::run_test::{closure#1}, ()>::{closure#1} as core[940e698046960fd5]::ops::function::FnOnce<()>>::call_once::{shim:vtable#0}<unknown>
37.89 s
gammaloop-nextest-core> at <unknown source file>:<unknown line>
37.89 s
gammaloop-nextest-core> 14: <std[bcb96dfbba0ab899]::sys::thread::unix::Thread>::new::thread_start<unknown>
37.89 s
gammaloop-nextest-core> at <unknown source file>:<unknown line>
37.89 s
gammaloop-nextest-core> 15: start_thread<unknown>
37.89 s
gammaloop-nextest-core> at <unknown source file>:<unknown line>
37.89 s
gammaloop-nextest-core> 16: __clone3<unknown>
37.89 s
gammaloop-nextest-core> at <unknown source file>:<unknown line>
37.89 s
gammaloop-nextest-core>
37.89 s
gammaloop-nextest-core> Run with COLORBT_SHOW_HIDDEN=1 environment variable to disable frame filtering.
37.89 s
gammaloop-nextest-core> Run with RUST_BACKTRACE=full to include source snippets.
37.89 s
gammaloop-nextest-core>
37.89 s
gammaloop-nextest-core> 2. gammalooprs::test_renormalization::finite_part_ghost_2loop
37.89 s
gammaloop-nextest-core> failure: test failure with exit code 101
37.89 s
gammaloop-nextest-core> system-out
37.89 s
gammaloop-nextest-core> running 1 test
37.89 s
gammaloop-nextest-core> ━━━━━━━━━━━━━━━━━━━━━━━━━━━━━━━ Snapshot Summary ━━━━━━━━━━━━━━━━━━━━━━━━━━━━━━━
37.89 s
gammaloop-nextest-core> Snapshot: finite_part_ghost_2loop-3
37.89 s
gammaloop-nextest-core> Source: crates/gammalooprs/tests/test_renormalization.rs:464
37.89 s
gammaloop-nextest-core> ────────────────────────────────────────────────────────────────────────────────
37.89 s
gammaloop-nextest-core> Expression: align_to_rqft(&a, &model).to_bare_ordered_string()
37.89 s
gammaloop-nextest-core> ────────────────────────────────────────────────────────────────────────────────
37.89 s
gammaloop-nextest-core> -old snapshot
37.89 s
gammaloop-nextest-core> +new results
37.89 s
gammaloop-nextest-core> ────────────┬───────────────────────────────────────────────────────────────────
37.89 s
gammaloop-nextest-core> 1 │-(-1𝑖/32*ε+1𝑖/16)*(cas(2,coad(8)))^2*dot(P(0,mink(4)),P(0,mink(4)))*gs^4*ε^(-2)
37.89 s
gammaloop-nextest-core> 1 │+(-1𝑖/16+1𝑖/32*ε)*(cas(2,coad(8)))^2*dot(P(0,mink(4)),P(0,mink(4)))*gs^4*ε^(-2)
37.89 s
gammaloop-nextest-core> ────────────┴───────────────────────────────────────────────────────────────────
37.89 s
gammaloop-nextest-core> To update snapshots run `cargo insta review`
37.89 s
gammaloop-nextest-core> Stopped on the first failure. Run `cargo insta test` to run all snapshots.
37.89 s
gammaloop-nextest-core> test finite_part_ghost_2loop ... FAILED
37.89 s
gammaloop-nextest-core>
37.89 s
gammaloop-nextest-core> failures:
37.89 s
gammaloop-nextest-core>
37.89 s
gammaloop-nextest-core> failures:
37.89 s
gammaloop-nextest-core> finite_part_ghost_2loop
37.89 s
gammaloop-nextest-core>
37.89 s
gammaloop-nextest-core> test result: FAILED. 0 passed; 1 failed; 0 ignored; 0 measured; 5 filtered out; finished in 2.82s
37.89 s
gammaloop-nextest-core> system-err
37.89 s
gammaloop-nextest-core> The application panicked (crashed).
37.89 s
gammaloop-nextest-core> Message: snapshot assertion for 'finite_part_ghost_2loop-3' failed in line 464
37.89 s
gammaloop-nextest-core> Location: /nix/store/0f9p2h9240ylfzayilfjv4gr7scagfs3-vendor-cargo-deps/c19b7c6f923b580ac259164a89f2577984ad5ab09ee9d583b888f934adbbe8d0/insta-1.47.2/src/runtime.rs:719
37.89 s
gammaloop-nextest-core>
37.89 s
gammaloop-nextest-core> ━━━━━━━━━━━━━━━━━━━━━━━━━━━━━━━━━━ BACKTRACE ━━━━━━━━━━━━━━━━━━━━━━━━━━━━━━━━━━━
37.89 s
gammaloop-nextest-core> 1: <color_eyre[51793ea62743adbd]::config::PanicHook>::panic_report<unknown>
37.89 s
gammaloop-nextest-core> at <unknown source file>:<unknown line>
37.89 s
gammaloop-nextest-core> 2: <color_eyre[51793ea62743adbd]::config::PanicHook>::into_panic_hook::{closure#0}<unknown>
37.89 s
gammaloop-nextest-core> at <unknown source file>:<unknown line>
37.89 s
gammaloop-nextest-core> 3: std[bcb96dfbba0ab899]::panicking::panic_with_hook<unknown>
37.89 s
gammaloop-nextest-core> at <unknown source file>:<unknown line>
37.89 s
gammaloop-nextest-core> 4: std[bcb96dfbba0ab899]::panicking::panic_handler::{closure#0}<unknown>
37.89 s
gammaloop-nextest-core> at <unknown source file>:<unknown line>
37.89 s
gammaloop-nextest-core> 5: std[bcb96dfbba0ab899]::sys::backtrace::__rust_end_short_backtrace::<std[bcb96dfbba0ab899]::panicking::panic_handler::{closure#0}, !><unknown>
37.89 s
gammaloop-nextest-core> at <unknown source file>:<unknown line>
37.89 s
gammaloop-nextest-core> 6: __rustc[6c289b9f9c454d21]::rust_begin_unwind<unknown>
37.89 s
gammaloop-nextest-core> at <unknown source file>:<unknown line>
37.89 s
gammaloop-nextest-core> 7: core[940e698046960fd5]::panicking::panic_fmt<unknown>
37.89 s
gammaloop-nextest-core> at <unknown source file>:<unknown line>
37.89 s
gammaloop-nextest-core> 8: insta[307a548ac79ef4d9]::runtime::assert_snapshot<unknown>
37.89 s
gammaloop-nextest-core> at <unknown source file>:<unknown line>
37.89 s
gammaloop-nextest-core> 9: test_renormalization[6420da4f660338c3]::finite_part_ghost_2loop<unknown>
37.89 s
gammaloop-nextest-core> at <unknown source file>:<unknown line>
37.89 s
gammaloop-nextest-core> 10: <test_renormalization[6420da4f660338c3]::finite_part_ghost_2loop::{closure#0} as core[940e698046960fd5]::ops::function::FnOnce<()>>::call_once<unknown>
37.89 s
gammaloop-nextest-core> at <unknown source file>:<unknown line>
37.89 s
gammaloop-nextest-core> 11: test[75d6903177b1d7e9]::__rust_begin_short_backtrace::<core[940e698046960fd5]::result::Result<(), alloc[2ea6bcb46fca0c42]::string::String>, fn() -> core[940e698046960fd5]::result::Result<(), alloc[2ea6bcb46fca0c42]::string::String>><unknown>
37.89 s
gammaloop-nextest-core> at <unknown source file>:<unknown line>
37.89 s
gammaloop-nextest-core> 12: test[75d6903177b1d7e9]::run_test::{closure#0}<unknown>
37.89 s
gammaloop-nextest-core> at <unknown source file>:<unknown line>
37.89 s
gammaloop-nextest-core> 13: std[bcb96dfbba0ab899]::sys::backtrace::__rust_begin_short_backtrace::<test[75d6903177b1d7e9]::run_test::{closure#1}, ()><unknown>
37.89 s
gammaloop-nextest-core> at <unknown source file>:<unknown line>
37.89 s
gammaloop-nextest-core> 14: <std[bcb96dfbba0ab899]::thread::lifecycle::spawn_unchecked<test[75d6903177b1d7e9]::run_test::{closure#1}, ()>::{closure#1} as core[940e698046960fd5]::ops::function::FnOnce<()>>::call_once::{shim:vtable#0}<unknown>
37.89 s
gammaloop-nextest-core> at <unknown source file>:<unknown line>
37.89 s
gammaloop-nextest-core> 15: <std[bcb96dfbba0ab899]::sys::thread::unix::Thread>::new::thread_start<unknown>
37.89 s
gammaloop-nextest-core> at <unknown source file>:<unknown line>
37.89 s
gammaloop-nextest-core> 16: start_thread<unknown>
37.89 s
gammaloop-nextest-core> at <unknown source file>:<unknown line>
37.89 s
gammaloop-nextest-core> 17: __clone3<unknown>
37.89 s
gammaloop-nextest-core> at <unknown source file>:<unknown line>
37.89 s
gammaloop-nextest-core>
37.89 s
gammaloop-nextest-core> Run with COLORBT_SHOW_HIDDEN=1 environment variable to disable frame filtering.
37.89 s
gammaloop-nextest-core> Run with RUST_BACKTRACE=full to include source snippets.
37.89 s
gammaloop-nextest-core> =========================================
37.97 s
error: Cannot build '/nix/store/350a1r6l54bs31kmzflfk73sprvxq6ih-gammaloop-nextest-core.drv '.
37.97 s
Reason: builder failed with exit code 100 .
37.97 s
Output paths:
37.97 s
/nix/store/2ph3azwcfnfcanqmv0c10wycsr5zzz4v-gammaloop-nextest-core
37.97 s
Last 473 log lines:
37.97 s
> Extracting 3 binaries (including 1 non-test binary), 1 build script output directory, and 2 linked paths to /build/nextest-archive-17YCJ9
37.97 s
> Extracted 18 files to /build/nextest-archive-17YCJ9 in 0.61s
37.97 s
> ------------
37.97 s
> Nextest run ID 00b0799a-414c-4ee2-aa3a-5b83639e5f95 with nextest profile: ci_gammaloop
37.97 s
> Starting 339 tests across 2 binaries
37.97 s
> ------------
37.97 s
> Summary [ 0.571s] 339 tests run: 339 passed , 0 skipped
37.97 s
>
37.97 s
> ========== nextest test summary ==========
37.97 s
> report: target/nextest/ci_gammaloop/junit.xml
37.97 s
> tests: 339, failures: 0, errors: 0
37.97 s
> No failing testcases found.
37.97 s
> =========================================
37.97 s
> Extracting 1 binary and 1 linked path to /build/nextest-archive-4RgJND
37.97 s
> Extracted 7 files to /build/nextest-archive-4RgJND in 0.08s
37.97 s
> ------------
37.97 s
> Nextest run ID 49a24bee-8ab9-4622-b0d3-5d98abdb595f with nextest profile: ci_gammaloop
37.97 s
> Starting 19 tests across 1 binary
37.97 s
> ------------
37.97 s
> Summary [ 0.016s] 19 tests run: 19 passed , 0 skipped
37.97 s
>
37.97 s
> ========== nextest test summary ==========
37.97 s
> report: target/nextest/ci_gammaloop/junit.xml
37.97 s
> tests: 19, failures: 0, errors: 0
37.97 s
> No failing testcases found.
37.97 s
> =========================================
37.97 s
> Extracting 1 binary to /build/nextest-archive-1NWpw7
37.97 s
> Extracted 4 files to /build/nextest-archive-1NWpw7 in 0.05s
37.97 s
> ------------
37.97 s
> Nextest run ID 72a7877c-200c-49c6-91d3-3bbee0278e89 with nextest profile: ci_gammaloop
37.97 s
> Starting 0 tests across 1 binary
37.97 s
> ------------
37.97 s
> Summary [ 0.000s] 0 tests run: 0 passed , 0 skipped
37.97 s
>
37.97 s
> ========== nextest test summary ==========
37.97 s
> report: target/nextest/ci_gammaloop/junit.xml
37.97 s
> tests: 0, failures: 0, errors: 0
37.97 s
> No failing testcases found.
37.97 s
> =========================================
37.97 s
> Extracting 4 binaries, 1 build script output directory, and 2 linked paths to /build/nextest-archive-MT5rBG
37.97 s
> Extracted 18 files to /build/nextest-archive-MT5rBG in 0.52s
37.97 s
> ------------
37.97 s
> Nextest run ID 0bd59c85-4669-4a7b-b18f-4438a2d1a147 with nextest profile: ci_gammaloop
37.97 s
> Starting 456 tests across 4 binaries (61 tests skipped , including 60 tests via profile.ci_gammaloop.default-filter )
37.97 s
> FAIL [ 0.399s] (444/456) gammalooprs::test_renormalization finit_part_ghlo
37.97 s
> stdout ---
37.97 s
>
37.97 s
> running 1 test
37.97 s
> ren part: 1/2*GC_10^2*dot(P(0,mink (dim)),P(0,mink (dim)))*cas(2,coad (8))/ε
37.97 s
> ━━━━━━━━━━━━━━━━━━━━━━━━━━━━━━━ Snapshot Summary ━━━━━━━━━━━━━━━━━━━━━━━━━━━━━━━
37.97 s
> Snapshot: finit_part_ghlo
37.97 s
> Source: crates/gammalooprs/tests/test_renormalization.rs:557
37.97 s
> ────────────────────────────────────────────────────────────────────────────────
37.97 s
> Expression: align_to_rqft(&a, &model).to_bare_ordered_string()
37.97 s
> ────────────────────────────────────────────────────────────────────────────────
37.97 s
> -old snapshot
37.97 s
> +new results
37.97 s
> ────────────┬───────────────────────────────────────────────────────────────────
37.97 s
> 1 │--1/2*cas(2,coad(8))*dot(P(0,mink(4)),P(0,mink(4)))*gs^2*ε^(-1)
37.97 s
> 1 │+1/2*cas(2,coad(8))*dot(P(0,mink(4)),P(0,mink(4)))*gs^2*ε^(-1)
37.97 s
> ────────────┴───────────────────────────────────────────────────────────────────
37.97 s
> To update snapshots run `cargo insta review`
37.97 s
> Stopped on the first failure. Run `cargo insta test` to run all snapshots.
37.97 s
> test finit_part_ghlo ... FAILED
37.97 s
>
37.97 s
> failures:
37.97 s
>
37.97 s
> failures:
37.97 s
> finit_part_ghlo
37.97 s
>
37.97 s
> test result: FAILED. 0 passed; 1 failed; 0 ignored; 0 measured; 5 filtered out; finished in 0.38s
37.97 s
>
37.97 s
> stderr ---
37.97 s
> The application panicked (crashed).
37.97 s
> Message: snapshot assertion for 'finit_part_ghlo' failed in line 557
37.97 s
> Location: /nix/store/0f9p2h9240ylfzayilfjv4gr7scagfs3-vendor-cargo-deps/c19b7c6f923b580ac259164a89f2577984ad5ab09ee9d583b888f934adbbe8d0/insta-1.47.2/src/runtime.rs :719
37.97 s
>
37.97 s
> ━━━━━━━━━━━━━━━━━━━━━━━━━━━━━━━━━━ BACKTRACE ━━━━━━━━━━━━━━━━━━━━━━━━━━━━━━━━━━━
37.97 s
> 1: <color_eyre[51793ea62743adbd]::config::PanicHook>::panic_report <unknown>
37.97 s
> at <unknown source file> :<unknown line>
37.97 s
> 2: <color_eyre[51793ea62743adbd]::config::PanicHook>::into_panic_hook::{closure#0} <unknown>
37.97 s
> at <unknown source file> :<unknown line>
37.97 s
> 3: std[bcb96dfbba0ab899]::panicking::panic_with_hook <unknown>
37.97 s
> at <unknown source file> :<unknown line>
37.97 s
> 4: std[bcb96dfbba0ab899]::panicking::panic_handler::{closure#0} <unknown>
37.97 s
> at <unknown source file> :<unknown line>
37.97 s
> 5: std[bcb96dfbba0ab899]::sys::backtrace::__rust_end_short_backtrace::<std[bcb96dfbba0ab899]::panicking::panic_handler::{closure#0}, !> <unknown>
37.97 s
> at <unknown source file> :<unknown line>
37.97 s
> 6: __rustc[6c289b9f9c454d21]::rust_begin_unwind <unknown>
37.97 s
> at <unknown source file> :<unknown line>
37.97 s
> 7: core[940e698046960fd5]::panicking::panic_fmt <unknown>
37.97 s
> at <unknown source file> :<unknown line>
37.97 s
> 8: insta[307a548ac79ef4d9]::runtime::assert_snapshot <unknown>
37.97 s
> at <unknown source file> :<unknown line>
37.97 s
> 9: <test_renormalization[6420da4f660338c3]::finit_part_ghlo::{closure#0} as core[940e698046960fd5]::ops::function::FnOnce<()>>::call_once <unknown>
37.97 s
> at <unknown source file> :<unknown line>
37.97 s
> 10: test[75d6903177b1d7e9]::__rust_begin_short_backtrace::<core[940e698046960fd5]::result::Result<(), alloc[2ea6bcb46fca0c42]::string::String>, fn() -> core[940e698046960fd5]::result::Result<(), alloc[2ea6bcb46fca0c42]::string::String>> <unknown>
37.97 s
> at <unknown source file> :<unknown line>
37.97 s
> 11: test[75d6903177b1d7e9]::run_test::{closure#0} <unknown>
37.97 s
> at <unknown source file> :<unknown line>
37.97 s
> 12: std[bcb96dfbba0ab899]::sys::backtrace::__rust_begin_short_backtrace::<test[75d6903177b1d7e9]::run_test::{closure#1}, ()> <unknown>
37.97 s
> at <unknown source file> :<unknown line>
37.97 s
> 13: <std[bcb96dfbba0ab899]::thread::lifecycle::spawn_unchecked<test[75d6903177b1d7e9]::run_test::{closure#1}, ()>::{closure#1} as core[940e698046960fd5]::ops::function::FnOnce<()>>::call_once::{shim:vtable#0} <unknown>
37.97 s
> at <unknown source file> :<unknown line>
37.97 s
> 14: <std[bcb96dfbba0ab899]::sys::thread::unix::Thread>::new::thread_start <unknown>
37.97 s
> at <unknown source file> :<unknown line>
37.97 s
> 15: start_thread <unknown>
37.97 s
> at <unknown source file> :<unknown line>
37.97 s
> 16: __clone3 <unknown>
37.97 s
> at <unknown source file> :<unknown line>
37.97 s
>
37.97 s
> Run with COLORBT_SHOW_HIDDEN=1 environment variable to disable frame filtering.
37.97 s
> Run with RUST_BACKTRACE=full to include source snippets.
37.97 s
>
37.97 s
> FAIL [ 2.832s] (451/456) gammalooprs::test_renormalization finite_part_ghost_2loop
37.97 s
> stdout ---
37.97 s
>
37.97 s
> running 1 test
37.97 s
> ━━━━━━━━━━━━━━━━━━━━━━━━━━━━━━━ Snapshot Summary ━━━━━━━━━━━━━━━━━━━━━━━━━━━━━━━
37.97 s
> Snapshot: finite_part_ghost_2loop-3
37.97 s
> Source: crates/gammalooprs/tests/test_renormalization.rs:464
37.97 s
> ────────────────────────────────────────────────────────────────────────────────
37.97 s
> Expression: align_to_rqft(&a, &model).to_bare_ordered_string()
37.97 s
> ────────────────────────────────────────────────────────────────────────────────
37.97 s
> -old snapshot
37.97 s
> +new results
37.97 s
> ────────────┬───────────────────────────────────────────────────────────────────
37.97 s
> 1 │-(-1𝑖/32*ε+1𝑖/16)*(cas(2,coad(8)))^2*dot(P(0,mink(4)),P(0,mink(4)))*gs^4*ε^(-2)
37.97 s
> 1 │+(-1𝑖/16+1𝑖/32*ε)*(cas(2,coad(8)))^2*dot(P(0,mink(4)),P(0,mink(4)))*gs^4*ε^(-2)
37.97 s
> ────────────┴───────────────────────────────────────────────────────────────────
37.97 s
> To update snapshots run `cargo insta review`
37.97 s
> Stopped on the first failure. Run `cargo insta test` to run all snapshots.
37.97 s
> test finite_part_ghost_2loop ... FAILED
37.97 s
>
37.97 s
> failures:
37.97 s
>
37.97 s
> failures:
37.97 s
> finite_part_ghost_2loop
37.97 s
>
37.97 s
> test result: FAILED. 0 passed; 1 failed; 0 ignored; 0 measured; 5 filtered out; finished in 2.82s
37.97 s
>
37.97 s
> stderr ---
37.97 s
> The application panicked (crashed).
37.97 s
> Message: snapshot assertion for 'finite_part_ghost_2loop-3' failed in line 464
37.97 s
> Location: /nix/store/0f9p2h9240ylfzayilfjv4gr7scagfs3-vendor-cargo-deps/c19b7c6f923b580ac259164a89f2577984ad5ab09ee9d583b888f934adbbe8d0/insta-1.47.2/src/runtime.rs :719
37.97 s
>
37.97 s
> ━━━━━━━━━━━━━━━━━━━━━━━━━━━━━━━━━━ BACKTRACE ━━━━━━━━━━━━━━━━━━━━━━━━━━━━━━━━━━━
37.97 s
> 1: <color_eyre[51793ea62743adbd]::config::PanicHook>::panic_report <unknown>
37.97 s
> at <unknown source file> :<unknown line>
37.97 s
> 2: <color_eyre[51793ea62743adbd]::config::PanicHook>::into_panic_hook::{closure#0} <unknown>
37.97 s
> at <unknown source file> :<unknown line>
37.97 s
> 3: std[bcb96dfbba0ab899]::panicking::panic_with_hook <unknown>
37.97 s
> at <unknown source file> :<unknown line>
37.97 s
> 4: std[bcb96dfbba0ab899]::panicking::panic_handler::{closure#0} <unknown>
37.97 s
> at <unknown source file> :<unknown line>
37.97 s
> 5: std[bcb96dfbba0ab899]::sys::backtrace::__rust_end_short_backtrace::<std[bcb96dfbba0ab899]::panicking::panic_handler::{closure#0}, !> <unknown>
37.97 s
> at <unknown source file> :<unknown line>
37.97 s
> 6: __rustc[6c289b9f9c454d21]::rust_begin_unwind <unknown>
37.97 s
> at <unknown source file> :<unknown line>
37.97 s
> 7: core[940e698046960fd5]::panicking::panic_fmt <unknown>
37.97 s
> at <unknown source file> :<unknown line>
37.97 s
> 8: insta[307a548ac79ef4d9]::runtime::assert_snapshot <unknown>
37.97 s
> at <unknown source file> :<unknown line>
37.97 s
> 9: test_renormalization[6420da4f660338c3]::finite_part_ghost_2loop <unknown>
37.97 s
> at <unknown source file> :<unknown line>
37.97 s
> 10: <test_renormalization[6420da4f660338c3]::finite_part_ghost_2loop::{closure#0} as core[940e698046960fd5]::ops::function::FnOnce<()>>::call_once <unknown>
37.97 s
> at <unknown source file> :<unknown line>
37.97 s
> 11: test[75d6903177b1d7e9]::__rust_begin_short_backtrace::<core[940e698046960fd5]::result::Result<(), alloc[2ea6bcb46fca0c42]::string::String>, fn() -> core[940e698046960fd5]::result::Result<(), alloc[2ea6bcb46fca0c42]::string::String>> <unknown>
37.97 s
> at <unknown source file> :<unknown line>
37.97 s
> 12: test[75d6903177b1d7e9]::run_test::{closure#0} <unknown>
37.97 s
> at <unknown source file> :<unknown line>
37.97 s
> 13: std[bcb96dfbba0ab899]::sys::backtrace::__rust_begin_short_backtrace::<test[75d6903177b1d7e9]::run_test::{closure#1}, ()> <unknown>
37.97 s
> at <unknown source file> :<unknown line>
37.97 s
> 14: <std[bcb96dfbba0ab899]::thread::lifecycle::spawn_unchecked<test[75d6903177b1d7e9]::run_test::{closure#1}, ()>::{closure#1} as core[940e698046960fd5]::ops::function::FnOnce<()>>::call_once::{shim:vtable#0} <unknown>
37.97 s
> at <unknown source file> :<unknown line>
37.97 s
> 15: <std[bcb96dfbba0ab899]::sys::thread::unix::Thread>::new::thread_start <unknown>
37.97 s
> at <unknown source file> :<unknown line>
37.97 s
> 16: start_thread <unknown>
37.97 s
> at <unknown source file> :<unknown line>
37.97 s
> 17: __clone3 <unknown>
37.97 s
> at <unknown source file> :<unknown line>
37.97 s
>
37.97 s
> Run with COLORBT_SHOW_HIDDEN=1 environment variable to disable frame filtering.
37.97 s
> Run with RUST_BACKTRACE=full to include source snippets.
37.97 s
>
37.97 s
> ------------
37.97 s
> Summary [ 9.999s] 456 tests run: 454 passed , 2 failed , 61 skipped
37.97 s
> FAIL [ 0.399s] (444/456) gammalooprs::test_renormalization finit_part_ghlo
37.97 s
> stdout ---
37.97 s
>
37.97 s
> running 1 test
37.97 s
> ren part: 1/2*GC_10^2*dot(P(0,mink (dim)),P(0,mink (dim)))*cas(2,coad (8))/ε
37.97 s
> ━━━━━━━━━━━━━━━━━━━━━━━━━━━━━━━ Snapshot Summary ━━━━━━━━━━━━━━━━━━━━━━━━━━━━━━━
37.97 s
> Snapshot: finit_part_ghlo
37.97 s
> Source: crates/gammalooprs/tests/test_renormalization.rs:557
37.97 s
> ────────────────────────────────────────────────────────────────────────────────
37.97 s
> Expression: align_to_rqft(&a, &model).to_bare_ordered_string()
37.97 s
> ────────────────────────────────────────────────────────────────────────────────
37.97 s
> -old snapshot
37.97 s
> +new results
37.97 s
> ────────────┬───────────────────────────────────────────────────────────────────
37.97 s
> 1 │--1/2*cas(2,coad(8))*dot(P(0,mink(4)),P(0,mink(4)))*gs^2*ε^(-1)
37.97 s
> 1 │+1/2*cas(2,coad(8))*dot(P(0,mink(4)),P(0,mink(4)))*gs^2*ε^(-1)
37.97 s
> ────────────┴───────────────────────────────────────────────────────────────────
37.97 s
> To update snapshots run `cargo insta review`
37.97 s
> Stopped on the first failure. Run `cargo insta test` to run all snapshots.
37.97 s
> test finit_part_ghlo ... FAILED
37.97 s
>
37.97 s
> failures:
37.97 s
>
37.97 s
> failures:
37.97 s
> finit_part_ghlo
37.97 s
>
37.97 s
> test result: FAILED. 0 passed; 1 failed; 0 ignored; 0 measured; 5 filtered out; finished in 0.38s
37.97 s
>
37.97 s
> stderr ---
37.97 s
> The application panicked (crashed).
37.97 s
> Message: snapshot assertion for 'finit_part_ghlo' failed in line 557
37.97 s
> Location: /nix/store/0f9p2h9240ylfzayilfjv4gr7scagfs3-vendor-cargo-deps/c19b7c6f923b580ac259164a89f2577984ad5ab09ee9d583b888f934adbbe8d0/insta-1.47.2/src/runtime.rs :719
37.97 s
>
37.97 s
> ━━━━━━━━━━━━━━━━━━━━━━━━━━━━━━━━━━ BACKTRACE ━━━━━━━━━━━━━━━━━━━━━━━━━━━━━━━━━━━
37.97 s
> 1: <color_eyre[51793ea62743adbd]::config::PanicHook>::panic_report <unknown>
37.97 s
> at <unknown source file> :<unknown line>
37.97 s
> 2: <color_eyre[51793ea62743adbd]::config::PanicHook>::into_panic_hook::{closure#0} <unknown>
37.97 s
> at <unknown source file> :<unknown line>
37.97 s
> 3: std[bcb96dfbba0ab899]::panicking::panic_with_hook <unknown>
37.97 s
> at <unknown source file> :<unknown line>
37.97 s
> 4: std[bcb96dfbba0ab899]::panicking::panic_handler::{closure#0} <unknown>
37.97 s
> at <unknown source file> :<unknown line>
37.97 s
> 5: std[bcb96dfbba0ab899]::sys::backtrace::__rust_end_short_backtrace::<std[bcb96dfbba0ab899]::panicking::panic_handler::{closure#0}, !> <unknown>
37.97 s
> at <unknown source file> :<unknown line>
37.97 s
> 6: __rustc[6c289b9f9c454d21]::rust_begin_unwind <unknown>
37.97 s
> at <unknown source file> :<unknown line>
37.97 s
> 7: core[940e698046960fd5]::panicking::panic_fmt <unknown>
37.97 s
> at <unknown source file> :<unknown line>
37.97 s
> 8: insta[307a548ac79ef4d9]::runtime::assert_snapshot <unknown>
37.97 s
> at <unknown source file> :<unknown line>
37.97 s
> 9: <test_renormalization[6420da4f660338c3]::finit_part_ghlo::{closure#0} as core[940e698046960fd5]::ops::function::FnOnce<()>>::call_once <unknown>
37.97 s
> at <unknown source file> :<unknown line>
37.97 s
> 10: test[75d6903177b1d7e9]::__rust_begin_short_backtrace::<core[940e698046960fd5]::result::Result<(), alloc[2ea6bcb46fca0c42]::string::String>, fn() -> core[940e698046960fd5]::result::Result<(), alloc[2ea6bcb46fca0c42]::string::String>> <unknown>
37.97 s
> at <unknown source file> :<unknown line>
37.97 s
> 11: test[75d6903177b1d7e9]::run_test::{closure#0} <unknown>
37.97 s
> at <unknown source file> :<unknown line>
37.97 s
> 12: std[bcb96dfbba0ab899]::sys::backtrace::__rust_begin_short_backtrace::<test[75d6903177b1d7e9]::run_test::{closure#1}, ()> <unknown>
37.97 s
> at <unknown source file> :<unknown line>
37.97 s
> 13: <std[bcb96dfbba0ab899]::thread::lifecycle::spawn_unchecked<test[75d6903177b1d7e9]::run_test::{closure#1}, ()>::{closure#1} as core[940e698046960fd5]::ops::function::FnOnce<()>>::call_once::{shim:vtable#0} <unknown>
37.97 s
> at <unknown source file> :<unknown line>
37.97 s
> 14: <std[bcb96dfbba0ab899]::sys::thread::unix::Thread>::new::thread_start <unknown>
37.97 s
> at <unknown source file> :<unknown line>
37.97 s
> 15: start_thread <unknown>
37.97 s
> at <unknown source file> :<unknown line>
37.97 s
> 16: __clone3 <unknown>
37.97 s
> at <unknown source file> :<unknown line>
37.97 s
>
37.97 s
> Run with COLORBT_SHOW_HIDDEN=1 environment variable to disable frame filtering.
37.97 s
> Run with RUST_BACKTRACE=full to include source snippets.
37.97 s
>
37.97 s
> FAIL [ 2.832s] (451/456) gammalooprs::test_renormalization finite_part_ghost_2loop
37.97 s
> stdout ---
37.97 s
>
37.97 s
> running 1 test
37.97 s
> ━━━━━━━━━━━━━━━━━━━━━━━━━━━━━━━ Snapshot Summary ━━━━━━━━━━━━━━━━━━━━━━━━━━━━━━━
37.97 s
> Snapshot: finite_part_ghost_2loop-3
37.97 s
> Source: crates/gammalooprs/tests/test_renormalization.rs:464
37.97 s
> ────────────────────────────────────────────────────────────────────────────────
37.97 s
> Expression: align_to_rqft(&a, &model).to_bare_ordered_string()
37.97 s
> ────────────────────────────────────────────────────────────────────────────────
37.97 s
> -old snapshot
37.97 s
> +new results
37.97 s
> ────────────┬───────────────────────────────────────────────────────────────────
37.97 s
> 1 │-(-1𝑖/32*ε+1𝑖/16)*(cas(2,coad(8)))^2*dot(P(0,mink(4)),P(0,mink(4)))*gs^4*ε^(-2)
37.97 s
> 1 │+(-1𝑖/16+1𝑖/32*ε)*(cas(2,coad(8)))^2*dot(P(0,mink(4)),P(0,mink(4)))*gs^4*ε^(-2)
37.97 s
> ────────────┴───────────────────────────────────────────────────────────────────
37.97 s
> To update snapshots run `cargo insta review`
37.97 s
> Stopped on the first failure. Run `cargo insta test` to run all snapshots.
37.97 s
> test finite_part_ghost_2loop ... FAILED
37.97 s
>
37.97 s
> failures:
37.97 s
>
37.97 s
> failures:
37.97 s
> finite_part_ghost_2loop
37.97 s
>
37.97 s
> test result: FAILED. 0 passed; 1 failed; 0 ignored; 0 measured; 5 filtered out; finished in 2.82s
37.97 s
>
37.97 s
> stderr ---
37.97 s
> The application panicked (crashed).
37.97 s
> Message: snapshot assertion for 'finite_part_ghost_2loop-3' failed in line 464
37.97 s
> Location: /nix/store/0f9p2h9240ylfzayilfjv4gr7scagfs3-vendor-cargo-deps/c19b7c6f923b580ac259164a89f2577984ad5ab09ee9d583b888f934adbbe8d0/insta-1.47.2/src/runtime.rs :719
37.97 s
>
37.97 s
> ━━━━━━━━━━━━━━━━━━━━━━━━━━━━━━━━━━ BACKTRACE ━━━━━━━━━━━━━━━━━━━━━━━━━━━━━━━━━━━
37.97 s
> 1: <color_eyre[51793ea62743adbd]::config::PanicHook>::panic_report <unknown>
37.97 s
> at <unknown source file> :<unknown line>
37.97 s
> 2: <color_eyre[51793ea62743adbd]::config::PanicHook>::into_panic_hook::{closure#0} <unknown>
37.97 s
> at <unknown source file> :<unknown line>
37.97 s
> 3: std[bcb96dfbba0ab899]::panicking::panic_with_hook <unknown>
37.97 s
> at <unknown source file> :<unknown line>
37.97 s
> 4: std[bcb96dfbba0ab899]::panicking::panic_handler::{closure#0} <unknown>
37.97 s
> at <unknown source file> :<unknown line>
37.97 s
> 5: std[bcb96dfbba0ab899]::sys::backtrace::__rust_end_short_backtrace::<std[bcb96dfbba0ab899]::panicking::panic_handler::{closure#0}, !> <unknown>
37.97 s
> at <unknown source file> :<unknown line>
37.97 s
> 6: __rustc[6c289b9f9c454d21]::rust_begin_unwind <unknown>
37.97 s
> at <unknown source file> :<unknown line>
37.97 s
> 7: core[940e698046960fd5]::panicking::panic_fmt <unknown>
37.97 s
> at <unknown source file> :<unknown line>
37.97 s
> 8: insta[307a548ac79ef4d9]::runtime::assert_snapshot <unknown>
37.97 s
> at <unknown source file> :<unknown line>
37.97 s
> 9: test_renormalization[6420da4f660338c3]::finite_part_ghost_2loop <unknown>
37.97 s
> at <unknown source file> :<unknown line>
37.97 s
> 10: <test_renormalization[6420da4f660338c3]::finite_part_ghost_2loop::{closure#0} as core[940e698046960fd5]::ops::function::FnOnce<()>>::call_once <unknown>
37.97 s
> at <unknown source file> :<unknown line>
37.97 s
> 11: test[75d6903177b1d7e9]::__rust_begin_short_backtrace::<core[940e698046960fd5]::result::Result<(), alloc[2ea6bcb46fca0c42]::string::String>, fn() -> core[940e698046960fd5]::result::Result<(), alloc[2ea6bcb46fca0c42]::string::String>> <unknown>
37.97 s
> at <unknown source file> :<unknown line>
37.97 s
> 12: test[75d6903177b1d7e9]::run_test::{closure#0} <unknown>
37.97 s
> at <unknown source file> :<unknown line>
37.97 s
> 13: std[bcb96dfbba0ab899]::sys::backtrace::__rust_begin_short_backtrace::<test[75d6903177b1d7e9]::run_test::{closure#1}, ()> <unknown>
37.97 s
> at <unknown source file> :<unknown line>
37.97 s
> 14: <std[bcb96dfbba0ab899]::thread::lifecycle::spawn_unchecked<test[75d6903177b1d7e9]::run_test::{closure#1}, ()>::{closure#1} as core[940e698046960fd5]::ops::function::FnOnce<()>>::call_once::{shim:vtable#0} <unknown>
37.97 s
> at <unknown source file> :<unknown line>
37.97 s
> 15: <std[bcb96dfbba0ab899]::sys::thread::unix::Thread>::new::thread_start <unknown>
37.97 s
> at <unknown source file> :<unknown line>
37.97 s
> 16: start_thread <unknown>
37.97 s
> at <unknown source file> :<unknown line>
37.97 s
> 17: __clone3 <unknown>
37.97 s
> at <unknown source file> :<unknown line>
37.97 s
>
37.97 s
> Run with COLORBT_SHOW_HIDDEN=1 environment variable to disable frame filtering.
37.97 s
> Run with RUST_BACKTRACE=full to include source snippets.
37.97 s
>
37.97 s
> error : test run failed
37.97 s
>
37.97 s
> ========== nextest test summary ==========
37.97 s
> report: target/nextest/ci_gammaloop/junit.xml
37.97 s
> tests: 456, failures: 2, errors: 0
37.97 s
>
37.97 s
> 1. gammalooprs::test_renormalization::finit_part_ghlo
37.97 s
> failure: test failure with exit code 101
37.97 s
> system-out
37.97 s
> running 1 test
37.97 s
> ren part: 1/2*GC_10^2*dot(P(0,mink(dim)),P(0,mink(dim)))*cas(2,coad(8))/ε
37.97 s
> ━━━━━━━━━━━━━━━━━━━━━━━━━━━━━━━ Snapshot Summary ━━━━━━━━━━━━━━━━━━━━━━━━━━━━━━━
37.97 s
> Snapshot: finit_part_ghlo
37.97 s
> Source: crates/gammalooprs/tests/test_renormalization.rs:557
37.97 s
> ────────────────────────────────────────────────────────────────────────────────
37.97 s
> Expression: align_to_rqft(&a, &model).to_bare_ordered_string()
37.97 s
> ────────────────────────────────────────────────────────────────────────────────
37.97 s
> -old snapshot
37.97 s
> +new results
37.97 s
> ────────────┬───────────────────────────────────────────────────────────────────
37.97 s
> 1 │--1/2*cas(2,coad(8))*dot(P(0,mink(4)),P(0,mink(4)))*gs^2*ε^(-1)
37.97 s
> 1 │+1/2*cas(2,coad(8))*dot(P(0,mink(4)),P(0,mink(4)))*gs^2*ε^(-1)
37.97 s
> ────────────┴───────────────────────────────────────────────────────────────────
37.97 s
> To update snapshots run `cargo insta review`
37.97 s
> Stopped on the first failure. Run `cargo insta test` to run all snapshots.
37.97 s
> test finit_part_ghlo ... FAILED
37.97 s
>
37.97 s
> failures:
37.97 s
>
37.97 s
> failures:
37.97 s
> finit_part_ghlo
37.97 s
>
37.97 s
> test result: FAILED. 0 passed; 1 failed; 0 ignored; 0 measured; 5 filtered out; finished in 0.38s
37.97 s
> system-err
37.97 s
> The application panicked (crashed).
37.97 s
> Message: snapshot assertion for 'finit_part_ghlo' failed in line 557
37.97 s
> Location: /nix/store/0f9p2h9240ylfzayilfjv4gr7scagfs3-vendor-cargo-deps/c19b7c6f923b580ac259164a89f2577984ad5ab09ee9d583b888f934adbbe8d0/insta-1.47.2/src/runtime.rs:719
37.97 s
>
37.97 s
> ━━━━━━━━━━━━━━━━━━━━━━━━━━━━━━━━━━ BACKTRACE ━━━━━━━━━━━━━━━━━━━━━━━━━━━━━━━━━━━
37.97 s
> 1: <color_eyre[51793ea62743adbd]::config::PanicHook>::panic_report<unknown>
37.97 s
> at <unknown source file>:<unknown line>
37.97 s
> 2: <color_eyre[51793ea62743adbd]::config::PanicHook>::into_panic_hook::{closure#0}<unknown>
37.97 s
> at <unknown source file>:<unknown line>
37.97 s
> 3: std[bcb96dfbba0ab899]::panicking::panic_with_hook<unknown>
37.97 s
> at <unknown source file>:<unknown line>
37.97 s
> 4: std[bcb96dfbba0ab899]::panicking::panic_handler::{closure#0}<unknown>
37.97 s
> at <unknown source file>:<unknown line>
37.97 s
> 5: std[bcb96dfbba0ab899]::sys::backtrace::__rust_end_short_backtrace::<std[bcb96dfbba0ab899]::panicking::panic_handler::{closure#0}, !><unknown>
37.97 s
> at <unknown source file>:<unknown line>
37.97 s
> 6: __rustc[6c289b9f9c454d21]::rust_begin_unwind<unknown>
37.97 s
> at <unknown source file>:<unknown line>
37.97 s
> 7: core[940e698046960fd5]::panicking::panic_fmt<unknown>
37.97 s
> at <unknown source file>:<unknown line>
37.97 s
> 8: insta[307a548ac79ef4d9]::runtime::assert_snapshot<unknown>
37.97 s
> at <unknown source file>:<unknown line>
37.97 s
> 9: <test_renormalization[6420da4f660338c3]::finit_part_ghlo::{closure#0} as core[940e698046960fd5]::ops::function::FnOnce<()>>::call_once<unknown>
37.97 s
> at <unknown source file>:<unknown line>
37.97 s
> 10: test[75d6903177b1d7e9]::__rust_begin_short_backtrace::<core[940e698046960fd5]::result::Result<(), alloc[2ea6bcb46fca0c42]::string::String>, fn() -> core[940e698046960fd5]::result::Result<(), alloc[2ea6bcb46fca0c42]::string::String>><unknown>
37.97 s
> at <unknown source file>:<unknown line>
37.97 s
> 11: test[75d6903177b1d7e9]::run_test::{closure#0}<unknown>
37.97 s
> at <unknown source file>:<unknown line>
37.97 s
> 12: std[bcb96dfbba0ab899]::sys::backtrace::__rust_begin_short_backtrace::<test[75d6903177b1d7e9]::run_test::{closure#1}, ()><unknown>
37.97 s
> at <unknown source file>:<unknown line>
37.97 s
> 13: <std[bcb96dfbba0ab899]::thread::lifecycle::spawn_unchecked<test[75d6903177b1d7e9]::run_test::{closure#1}, ()>::{closure#1} as core[940e698046960fd5]::ops::function::FnOnce<()>>::call_once::{shim:vtable#0}<unknown>
37.97 s
> at <unknown source file>:<unknown line>
37.97 s
> 14: <std[bcb96dfbba0ab899]::sys::thread::unix::Thread>::new::thread_start<unknown>
37.97 s
> at <unknown source file>:<unknown line>
37.97 s
> 15: start_thread<unknown>
37.97 s
> at <unknown source file>:<unknown line>
37.97 s
> 16: __clone3<unknown>
37.97 s
> at <unknown source file>:<unknown line>
37.97 s
>
37.97 s
> Run with COLORBT_SHOW_HIDDEN=1 environment variable to disable frame filtering.
37.97 s
> Run with RUST_BACKTRACE=full to include source snippets.
37.97 s
>
37.97 s
> 2. gammalooprs::test_renormalization::finite_part_ghost_2loop
37.97 s
> failure: test failure with exit code 101
37.97 s
> system-out
37.97 s
> running 1 test
37.97 s
> ━━━━━━━━━━━━━━━━━━━━━━━━━━━━━━━ Snapshot Summary ━━━━━━━━━━━━━━━━━━━━━━━━━━━━━━━
37.97 s
> Snapshot: finite_part_ghost_2loop-3
37.97 s
> Source: crates/gammalooprs/tests/test_renormalization.rs:464
37.97 s
> ────────────────────────────────────────────────────────────────────────────────
37.97 s
> Expression: align_to_rqft(&a, &model).to_bare_ordered_string()
37.97 s
> ────────────────────────────────────────────────────────────────────────────────
37.97 s
> -old snapshot
37.97 s
> +new results
37.97 s
> ────────────┬───────────────────────────────────────────────────────────────────
37.97 s
> 1 │-(-1𝑖/32*ε+1𝑖/16)*(cas(2,coad(8)))^2*dot(P(0,mink(4)),P(0,mink(4)))*gs^4*ε^(-2)
37.97 s
> 1 │+(-1𝑖/16+1𝑖/32*ε)*(cas(2,coad(8)))^2*dot(P(0,mink(4)),P(0,mink(4)))*gs^4*ε^(-2)
37.97 s
> ────────────┴───────────────────────────────────────────────────────────────────
37.97 s
> To update snapshots run `cargo insta review`
37.97 s
> Stopped on the first failure. Run `cargo insta test` to run all snapshots.
37.97 s
> test finite_part_ghost_2loop ... FAILED
37.97 s
>
37.97 s
> failures:
37.97 s
>
37.97 s
> failures:
37.97 s
> finite_part_ghost_2loop
37.97 s
>
37.97 s
> test result: FAILED. 0 passed; 1 failed; 0 ignored; 0 measured; 5 filtered out; finished in 2.82s
37.97 s
> system-err
37.97 s
> The application panicked (crashed).
37.97 s
> Message: snapshot assertion for 'finite_part_ghost_2loop-3' failed in line 464
37.97 s
> Location: /nix/store/0f9p2h9240ylfzayilfjv4gr7scagfs3-vendor-cargo-deps/c19b7c6f923b580ac259164a89f2577984ad5ab09ee9d583b888f934adbbe8d0/insta-1.47.2/src/runtime.rs:719
37.97 s
>
37.97 s
> ━━━━━━━━━━━━━━━━━━━━━━━━━━━━━━━━━━ BACKTRACE ━━━━━━━━━━━━━━━━━━━━━━━━━━━━━━━━━━━
37.97 s
> 1: <color_eyre[51793ea62743adbd]::config::PanicHook>::panic_report<unknown>
37.97 s
> at <unknown source file>:<unknown line>
37.97 s
> 2: <color_eyre[51793ea62743adbd]::config::PanicHook>::into_panic_hook::{closure#0}<unknown>
37.97 s
> at <unknown source file>:<unknown line>
37.97 s
> 3: std[bcb96dfbba0ab899]::panicking::panic_with_hook<unknown>
37.97 s
> at <unknown source file>:<unknown line>
37.97 s
> 4: std[bcb96dfbba0ab899]::panicking::panic_handler::{closure#0}<unknown>
37.97 s
> at <unknown source file>:<unknown line>
37.97 s
> 5: std[bcb96dfbba0ab899]::sys::backtrace::__rust_end_short_backtrace::<std[bcb96dfbba0ab899]::panicking::panic_handler::{closure#0}, !><unknown>
37.97 s
> at <unknown source file>:<unknown line>
37.97 s
> 6: __rustc[6c289b9f9c454d21]::rust_begin_unwind<unknown>
37.97 s
> at <unknown source file>:<unknown line>
37.97 s
> 7: core[940e698046960fd5]::panicking::panic_fmt<unknown>
37.97 s
> at <unknown source file>:<unknown line>
37.97 s
> 8: insta[307a548ac79ef4d9]::runtime::assert_snapshot<unknown>
37.97 s
> at <unknown source file>:<unknown line>
37.97 s
> 9: test_renormalization[6420da4f660338c3]::finite_part_ghost_2loop<unknown>
37.97 s
> at <unknown source file>:<unknown line>
37.97 s
> 10: <test_renormalization[6420da4f660338c3]::finite_part_ghost_2loop::{closure#0} as core[940e698046960fd5]::ops::function::FnOnce<()>>::call_once<unknown>
37.97 s
> at <unknown source file>:<unknown line>
37.97 s
> 11: test[75d6903177b1d7e9]::__rust_begin_short_backtrace::<core[940e698046960fd5]::result::Result<(), alloc[2ea6bcb46fca0c42]::string::String>, fn() -> core[940e698046960fd5]::result::Result<(), alloc[2ea6bcb46fca0c42]::string::String>><unknown>
37.97 s
> at <unknown source file>:<unknown line>
37.97 s
> 12: test[75d6903177b1d7e9]::run_test::{closure#0}<unknown>
37.97 s
> at <unknown source file>:<unknown line>
37.97 s
> 13: std[bcb96dfbba0ab899]::sys::backtrace::__rust_begin_short_backtrace::<test[75d6903177b1d7e9]::run_test::{closure#1}, ()><unknown>
37.97 s
> at <unknown source file>:<unknown line>
37.97 s
> 14: <std[bcb96dfbba0ab899]::thread::lifecycle::spawn_unchecked<test[75d6903177b1d7e9]::run_test::{closure#1}, ()>::{closure#1} as core[940e698046960fd5]::ops::function::FnOnce<()>>::call_once::{shim:vtable#0}<unknown>
37.97 s
> at <unknown source file>:<unknown line>
37.97 s
> 15: <std[bcb96dfbba0ab899]::sys::thread::unix::Thread>::new::thread_start<unknown>
37.97 s
> at <unknown source file>:<unknown line>
37.97 s
> 16: start_thread<unknown>
37.97 s
> at <unknown source file>:<unknown line>
37.97 s
> 17: __clone3<unknown>
37.97 s
> at <unknown source file>:<unknown line>
37.97 s
>
37.97 s
> Run with COLORBT_SHOW_HIDDEN=1 environment variable to disable frame filtering.
37.97 s
> Run with RUST_BACKTRACE=full to include source snippets.
37.97 s
> =========================================
37.97 s
For full logs, run:
37.97 s
nix log /nix/store/350a1r6l54bs31kmzflfk73sprvxq6ih-gammaloop-nextest-core.drv
38.13 s
[0 built (1 failed ), 0.0 Run failed.