test packages.x86_64-linux.nix-ci-check-gammaloop-nextest-core

Reproduce this run
Retry Run
  1. 1.12 s $ /nix/store/9ypz3flqsrl5xl495mm8h645gadjsxi1-coreutils-9.11/bin/timeout --kill-after=15s 7200s /nix/store/23zk8sgzamrbmj1fday15szf7f2279s8-nix-2.34.7/bin/nix --extra-experimental-features nix-command --extra-experimental-features flakes flake clone git+https://github.com/alphal00p/gammaloop --dest /tmp/nix-ci-worker/stable-pwd/repo/
  2. 1.16 s Cloning into '/tmp/nix-ci-worker/stable-pwd/repo'...
  3. 1.44 s remote: Enumerating objects: 65231, done.
  4. 1.68 s remote: Counting objects: 0% (1/7882) remote: Counting objects: 1% (79/7882) remote: Counting objects: 2% (158/7882) remote: Counting objects: 3% (237/7882) remote: Counting objects: 4% (316/7882) remote: Counting objects: 5% (395/7882) remote: Counting objects: 6% (473/7882) remote: Counting objects: 7% (552/7882) remote: Counting objects: 8% (631/7882) remote: Counting objects: 9% (710/7882) remote: Counting objects: 10% (789/7882) remote: Counting objects: 11% (868/7882) remote: Counting objects: 12% (946/7882) remote: Counting objects: 13% (1025/7882) remote: Counting objects: 14% (1104/7882) remote: Counting objects: 15% (1183/7882) remote: Counting objects: 16% (1262/7882) remote: Counting objects: 17% (1340/7882) remote: Counting objects: 18% (1419/7882) remote: Counting objects: 19% (1498/7882) remote: Counting objects: 20% (1577/7882) remote: Counting objects: 21% (1656/7882) remote: Counting objects: 22% (1735/7882) remote: Counting objects: 23% (1813/7882) remote: Counting objects: 24% (1892/7882) remote: Counting objects: 25% (1971/7882) remote: Counting objects: 26% (2050/7882) remote: Counting objects: 27% (2129/7882) remote: Counting objects: 28% (2207/7882) remote: Counting objects: 29% (2286/7882) remote: Counting objects: 30% (2365/7882) remote: Counting objects: 31% (2444/7882) remote: Counting objects: 32% (2523/7882) remote: Counting objects: 33% (2602/7882) remote: Counting objects: 34% (2680/7882) remote: Counting objects: 35% (2759/7882) remote: Counting objects: 36% (2838/7882) remote: Counting objects: 37% (2917/7882) remote: Counting objects: 38% (2996/7882) remote: Counting objects: 39% (3074/7882) remote: Counting objects: 40% (3153/7882) remote: Counting objects: 41% (3232/7882) remote: Counting objects: 42% (3311/7882) remote: Counting objects: 43% (3390/7882) remote: Counting objects: 44% (3469/7882) remote: Counting objects: 45% (3547/7882) remote: Counting objects: 46% (3626/7882) remote: Counting objects: 47% (3705/7882) remote: Counting objects: 48% (3784/7882) remote: Counting objects: 49% (3863/7882) remote: Counting objects: 50% (3941/7882) remote: Counting objects: 51% (4020/7882) remote: Counting objects: 52% (4099/7882) remote: Counting objects: 53% (4178/7882) remote: Counting objects: 54% (4257/7882) remote: Counting objects: 55% (4336/7882) remote: Counting objects: 56% (4414/7882) remote: Counting objects: 57% (4493/7882) remote: Counting objects: 58% (4572/7882) remote: Counting objects: 59% (4651/7882) remote: Counting objects: 60% (4730/7882) remote: Counting objects: 61% (4809/7882) remote: Counting objects: 62% (4887/7882) remote: Counting objects: 63% (4966/7882) remote: Counting objects: 64% (5045/7882) remote: Counting objects: 65% (5124/7882) remote: Counting objects: 66% (5203/7882) remote: Counting objects: 67% (5281/7882) remote: Counting objects: 68% (5360/7882) remote: Counting objects: 69% (5439/7882) remote: Counting objects: 70% (5518/7882) remote: Counting objects: 71% (5597/7882) remote: Counting objects: 72% (5676/7882) remote: Counting objects: 73% (5754/7882) remote: Counting objects: 74% (5833/7882) remote: Counting objects: 75% (5912/7882) remote: Counting objects: 76% (5991/7882) remote: Counting objects: 77% (6070/7882) remote: Counting objects: 78% (6148/7882) remote: Counting objects: 79% (6227/7882) remote: Counting objects: 80% (6306/7882) remote: Counting objects: 81% (6385/7882) remote: Counting objects: 82% (6464/7882) remote: Counting objects: 83% (6543/7882) remote: Counting objects: 84% (6621/7882) remote: Counting objects: 85% (6700/7882) remote: Counting objects: 86% (6779/7882) remote: Counting objects: 87% (6858/7882) remote: Counting objects: 88% (6937/7882) remote: Counting objects: 89% (7015/7882) remote: Counting objects: 90% (7094/7882) remote: Counting objects: 91% (7173/7882) remote: Counting objects: 92% (7252/7882) remote: Counting objects: 93% (7331/7882) remote: Counting objects: 94% (7410/7882) remote: Counting objects: 95% (7488/7882) remote: Counting objects: 96% (7567/7882) remote: Counting objects: 97% (7646/7882) remote: Counting objects: 98% (7725/7882) remote: Counting objects: 99% (7804/7882) remote: Counting objects: 100% (7882/7882) remote: Counting objects: 100% (7882/7882), done.
  5. 3.09 s remote: Compressing objects: 0% (1/1559) remote: Compressing objects: 1% (16/1559) remote: Compressing objects: 2% (32/1559) remote: Compressing objects: 3% (47/1559) remote: Compressing objects: 4% (63/1559) remote: Compressing objects: 5% (78/1559) remote: Compressing objects: 6% (94/1559) remote: Compressing objects: 7% (110/1559) remote: Compressing objects: 8% (125/1559) remote: Compressing objects: 9% (141/1559) remote: Compressing objects: 10% (156/1559) remote: Compressing objects: 11% (172/1559) remote: Compressing objects: 12% (188/1559) remote: Compressing objects: 13% (203/1559) remote: Compressing objects: 14% (219/1559) remote: Compressing objects: 15% (234/1559) remote: Compressing objects: 15% (237/1559) remote: Compressing objects: 16% (250/1559) remote: Compressing objects: 17% (266/1559) remote: Compressing objects: 18% (281/1559) remote: Compressing objects: 19% (297/1559) remote: Compressing objects: 20% (312/1559) remote: Compressing objects: 21% (328/1559) remote: Compressing objects: 22% (343/1559) remote: Compressing objects: 23% (359/1559) remote: Compressing objects: 24% (375/1559) remote: Compressing objects: 25% (390/1559) remote: Compressing objects: 26% (406/1559) remote: Compressing objects: 27% (421/1559) remote: Compressing objects: 28% (437/1559) remote: Compressing objects: 29% (453/1559) remote: Compressing objects: 30% (468/1559) remote: Compressing objects: 31% (484/1559) remote: Compressing objects: 32% (499/1559) remote: Compressing objects: 33% (515/1559) remote: Compressing objects: 34% (531/1559) remote: Compressing objects: 35% (546/1559) remote: Compressing objects: 36% (562/1559) remote: Compressing objects: 37% (577/1559) remote: Compressing objects: 38% (593/1559) remote: Compressing objects: 39% (609/1559) remote: Compressing objects: 40% (624/1559) remote: Compressing objects: 41% (640/1559) remote: Compressing objects: 42% (655/1559) remote: Compressing objects: 43% (671/1559) remote: Compressing objects: 44% (686/1559) remote: Compressing objects: 45% (702/1559) remote: Compressing objects: 46% (718/1559) remote: Compressing objects: 47% (733/1559) remote: Compressing objects: 48% (749/1559) remote: Compressing objects: 49% (764/1559) remote: Compressing objects: 50% (780/1559) remote: Compressing objects: 51% (796/1559) remote: Compressing objects: 52% (811/1559) remote: Compressing objects: 53% (827/1559) remote: Compressing objects: 54% (842/1559) remote: Compressing objects: 55% (858/1559) remote: Compressing objects: 56% (874/1559) remote: Compressing objects: 57% (889/1559) remote: Compressing objects: 58% (905/1559) remote: Compressing objects: 59% (920/1559) remote: Compressing objects: 60% (936/1559) remote: Compressing objects: 61% (951/1559) remote: Compressing objects: 62% (967/1559) remote: Compressing objects: 63% (983/1559) remote: Compressing objects: 64% (998/1559) remote: Compressing objects: 65% (1014/1559) remote: Compressing objects: 66% (1029/1559) remote: Compressing objects: 67% (1045/1559) remote: Compressing objects: 68% (1061/1559) remote: Compressing objects: 69% (1076/1559) remote: Compressing objects: 70% (1092/1559) remote: Compressing objects: 71% (1107/1559) remote: Compressing objects: 72% (1123/1559) remote: Compressing objects: 73% (1139/1559) remote: Compressing objects: 74% (1154/1559) remote: Compressing objects: 75% (1170/1559) remote: Compressing objects: 76% (1185/1559) remote: Compressing objects: 77% (1201/1559) remote: Compressing objects: 78% (1217/1559) remote: Compressing objects: 79% (1232/1559) remote: Compressing objects: 80% (1248/1559) remote: Compressing objects: 81% (1263/1559) remote: Compressing objects: 82% (1279/1559) remote: Compressing objects: 83% (1294/1559) remote: Compressing objects: 84% (1310/1559) remote: Compressing objects: 85% (1326/1559) remote: Compressing objects: 86% (1341/1559) remote: Compressing objects: 87% (1357/1559) remote: Compressing objects: 88% (1372/1559) remote: Compressing objects: 89% (1388/1559) remote: Compressing objects: 90% (1404/1559) remote: Compressing objects: 91% (1419/1559) remote: Compressing objects: 92% (1435/1559) remote: Compressing objects: 93% (1450/1559) remote: Compressing objects: 94% (1466/1559) remote: Compressing objects: 95% (1482/1559) remote: Compressing objects: 96% (1497/1559) remote: Compressing objects: 97% (1513/1559) remote: Compressing objects: 98% (1528/1559) remote: Compressing objects: 99% (1544/1559) remote: Compressing objects: 100% (1559/1559) remote: Compressing objects: 100% (1559/1559), done.
  6. 6.21 s Receiving objects: 0% (1/65231) Receiving objects: 1% (653/65231) Receiving objects: 2% (1305/65231) Receiving objects: 3% (1957/65231) Receiving objects: 4% (2610/65231) Receiving objects: 5% (3262/65231) Receiving objects: 6% (3914/65231) Receiving objects: 7% (4567/65231) Receiving objects: 8% (5219/65231), 8.77 MiB | 17.52 MiB/s Receiving objects: 9% (5871/65231), 8.77 MiB | 17.52 MiB/s Receiving objects: 10% (6524/65231), 8.77 MiB | 17.52 MiB/s Receiving objects: 11% (7176/65231), 8.77 MiB | 17.52 MiB/s Receiving objects: 12% (7828/65231), 8.77 MiB | 17.52 MiB/s Receiving objects: 13% (8481/65231), 8.77 MiB | 17.52 MiB/s Receiving objects: 14% (9133/65231), 8.77 MiB | 17.52 MiB/s Receiving objects: 15% (9785/65231), 8.77 MiB | 17.52 MiB/s Receiving objects: 16% (10437/65231), 8.77 MiB | 17.52 MiB/s Receiving objects: 17% (11090/65231), 8.77 MiB | 17.52 MiB/s Receiving objects: 18% (11742/65231), 8.77 MiB | 17.52 MiB/s Receiving objects: 19% (12394/65231), 8.77 MiB | 17.52 MiB/s Receiving objects: 20% (13047/65231), 8.77 MiB | 17.52 MiB/s Receiving objects: 21% (13699/65231), 8.77 MiB | 17.52 MiB/s Receiving objects: 22% (14351/65231), 8.77 MiB | 17.52 MiB/s Receiving objects: 23% (15004/65231), 8.77 MiB | 17.52 MiB/s Receiving objects: 24% (15656/65231), 8.77 MiB | 17.52 MiB/s Receiving objects: 25% (16308/65231), 8.77 MiB | 17.52 MiB/s Receiving objects: 26% (16961/65231), 8.77 MiB | 17.52 MiB/s Receiving objects: 27% (17613/65231), 8.77 MiB | 17.52 MiB/s Receiving objects: 28% (18265/65231), 8.77 MiB | 17.52 MiB/s Receiving objects: 29% (18917/65231), 8.77 MiB | 17.52 MiB/s Receiving objects: 30% (19570/65231), 8.77 MiB | 17.52 MiB/s Receiving objects: 31% (20222/65231), 8.77 MiB | 17.52 MiB/s Receiving objects: 32% (20874/65231), 8.77 MiB | 17.52 MiB/s Receiving objects: 33% (21527/65231), 8.77 MiB | 17.52 MiB/s Receiving objects: 34% (22179/65231), 8.77 MiB | 17.52 MiB/s Receiving objects: 34% (22667/65231), 23.68 MiB | 23.40 MiB/s Receiving objects: 35% (22831/65231), 23.68 MiB | 23.40 MiB/s Receiving objects: 36% (23484/65231), 23.68 MiB | 23.40 MiB/s Receiving objects: 37% (24136/65231), 23.68 MiB | 23.40 MiB/s Receiving objects: 38% (24788/65231), 23.68 MiB | 23.40 MiB/s Receiving objects: 39% (25441/65231), 23.68 MiB | 23.40 MiB/s Receiving objects: 40% (26093/65231), 23.68 MiB | 23.40 MiB/s Receiving objects: 41% (26745/65231), 23.68 MiB | 23.40 MiB/s Receiving objects: 42% (27398/65231), 23.68 MiB | 23.40 MiB/s Receiving objects: 43% (28050/65231), 23.68 MiB | 23.40 MiB/s Receiving objects: 44% (28702/65231), 23.68 MiB | 23.40 MiB/s Receiving objects: 45% (29354/65231), 23.68 MiB | 23.40 MiB/s Receiving objects: 46% (30007/65231), 23.68 MiB | 23.40 MiB/s Receiving objects: 47% (30659/65231), 23.68 MiB | 23.40 MiB/s Receiving objects: 48% (31311/65231), 23.68 MiB | 23.40 MiB/s Receiving objects: 49% (31964/65231), 23.68 MiB | 23.40 MiB/s Receiving objects: 50% (32616/65231), 23.68 MiB | 23.40 MiB/s Receiving objects: 51% (33268/65231), 23.68 MiB | 23.40 MiB/s Receiving objects: 52% (33921/65231), 23.68 MiB | 23.40 MiB/s Receiving objects: 53% (34573/65231), 23.68 MiB | 23.40 MiB/s Receiving objects: 54% (35225/65231), 23.68 MiB | 23.40 MiB/s Receiving objects: 55% (35878/65231), 23.68 MiB | 23.40 MiB/s Receiving objects: 56% (36530/65231), 23.68 MiB | 23.40 MiB/s Receiving objects: 57% (37182/65231), 38.33 MiB | 25.27 MiB/s Receiving objects: 58% (37834/65231), 38.33 MiB | 25.27 MiB/s Receiving objects: 59% (38487/65231), 38.33 MiB | 25.27 MiB/s Receiving objects: 60% (39139/65231), 38.33 MiB | 25.27 MiB/s Receiving objects: 61% (39791/65231), 38.33 MiB | 25.27 MiB/s Receiving objects: 62% (40444/65231), 38.33 MiB | 25.27 MiB/s Receiving objects: 63% (41096/65231), 38.33 MiB | 25.27 MiB/s Receiving objects: 64% (41748/65231), 38.33 MiB | 25.27 MiB/s Receiving objects: 65% (42401/65231), 38.33 MiB | 25.27 MiB/s Receiving objects: 66% (43053/65231), 38.33 MiB | 25.27 MiB/s Receiving objects: 67% (43705/65231), 38.33 MiB | 25.27 MiB/s Receiving objects: 67% (43961/65231), 38.33 MiB | 25.27 MiB/s Receiving objects: 68% (44358/65231), 38.33 MiB | 25.27 MiB/s Receiving objects: 69% (45010/65231), 52.76 MiB | 26.12 MiB/s Receiving objects: 70% (45662/65231), 52.76 MiB | 26.12 MiB/s Receiving objects: 71% (46315/65231), 52.76 MiB | 26.12 MiB/s Receiving objects: 72% (46967/65231), 52.76 MiB | 26.12 MiB/s Receiving objects: 73% (47619/65231), 52.76 MiB | 26.12 MiB/s Receiving objects: 74% (48271/65231), 52.76 MiB | 26.12 MiB/s Receiving objects: 75% (48924/65231), 52.76 MiB | 26.12 MiB/s Receiving objects: 76% (49576/65231), 52.76 MiB | 26.12 MiB/s Receiving objects: 77% (50228/65231), 68.87 MiB | 27.29 MiB/s Receiving objects: 78% (50881/65231), 68.87 MiB | 27.29 MiB/s Receiving objects: 79% (51533/65231), 68.87 MiB | 27.29 MiB/s Receiving objects: 80% (52185/65231), 68.87 MiB | 27.29 MiB/s Receiving objects: 81% (52838/65231), 68.87 MiB | 27.29 MiB/s Receiving objects: 82% (53490/65231), 68.87 MiB | 27.29 MiB/s Receiving objects: 83% (54142/65231), 68.87 MiB | 27.29 MiB/s Receiving objects: 84% (54795/65231), 68.87 MiB | 27.29 MiB/s Receiving objects: 85% (55447/65231), 68.87 MiB | 27.29 MiB/s Receiving objects: 86% (56099/65231), 68.87 MiB | 27.29 MiB/s Receiving objects: 87% (56751/65231), 68.87 MiB | 27.29 MiB/s Receiving objects: 88% (57404/65231), 68.87 MiB | 27.29 MiB/s Receiving objects: 89% (58056/65231), 68.87 MiB | 27.29 MiB/s Receiving objects: 90% (58708/65231), 68.87 MiB | 27.29 MiB/s Receiving objects: 91% (59361/65231), 68.87 MiB | 27.29 MiB/s Receiving objects: 92% (60013/65231), 68.87 MiB | 27.29 MiB/s Receiving objects: 93% (60665/65231), 68.87 MiB | 27.29 MiB/s Receiving objects: 93% (60928/65231), 68.87 MiB | 27.29 MiB/s Receiving objects: 94% (61318/65231), 68.87 MiB | 27.29 MiB/s Receiving objects: 95% (61970/65231), 84.55 MiB | 27.89 MiB/s Receiving objects: 96% (62622/65231), 84.55 MiB | 27.89 MiB/s Receiving objects: 97% (63275/65231), 84.55 MiB | 27.89 MiB/s Receiving objects: 98% (63927/65231), 84.55 MiB | 27.89 MiB/s Receiving objects: 99% (64579/65231), 84.55 MiB | 27.89 MiB/s remote: Total 65231 (delta 6847), reused 6388 (delta 6316), pack-reused 57349 (from 1)
  7. 6.27 s Receiving objects: 100% (65231/65231), 84.55 MiB | 27.89 MiB/s Receiving objects: 100% (65231/65231), 87.55 MiB | 28.07 MiB/s, done.
  8. 6.84 s Resolving deltas: 0% (0/45965) Resolving deltas: 1% (460/45965) Resolving deltas: 2% (920/45965) Resolving deltas: 3% (1379/45965) Resolving deltas: 4% (1839/45965) Resolving deltas: 5% (2299/45965) Resolving deltas: 6% (2758/45965) Resolving deltas: 7% (3218/45965) Resolving deltas: 8% (3679/45965) Resolving deltas: 9% (4137/45965) Resolving deltas: 10% (4597/45965) Resolving deltas: 11% (5059/45965) Resolving deltas: 12% (5516/45965) Resolving deltas: 13% (5976/45965) Resolving deltas: 14% (6436/45965) Resolving deltas: 15% (6895/45965) Resolving deltas: 16% (7357/45965) Resolving deltas: 17% (7815/45965) Resolving deltas: 18% (8274/45965) Resolving deltas: 19% (8738/45965) Resolving deltas: 20% (9193/45965) Resolving deltas: 21% (9653/45965) Resolving deltas: 22% (10113/45965) Resolving deltas: 23% (10572/45965) Resolving deltas: 24% (11032/45965) Resolving deltas: 25% (11492/45965) Resolving deltas: 26% (11951/45965) Resolving deltas: 27% (12411/45965) Resolving deltas: 28% (12871/45965) Resolving deltas: 29% (13330/45965) Resolving deltas: 30% (13790/45965) Resolving deltas: 31% (14250/45965) Resolving deltas: 32% (14709/45965) Resolving deltas: 33% (15169/45965) Resolving deltas: 34% (15629/45965) Resolving deltas: 35% (16088/45965) Resolving deltas: 36% (16548/45965) Resolving deltas: 37% (17009/45965) Resolving deltas: 38% (17467/45965) Resolving deltas: 39% (17928/45965) Resolving deltas: 40% (18388/45965) Resolving deltas: 41% (18846/45965) Resolving deltas: 42% (19306/45965) Resolving deltas: 43% (19765/45965) Resolving deltas: 44% (20225/45965) Resolving deltas: 45% (20685/45965) Resolving deltas: 46% (21144/45965) Resolving deltas: 47% (21605/45965) Resolving deltas: 48% (22064/45965) Resolving deltas: 49% (22523/45965) Resolving deltas: 50% (22985/45965) Resolving deltas: 51% (23443/45965) Resolving deltas: 52% (23902/45965) Resolving deltas: 53% (24362/45965) Resolving deltas: 54% (24822/45965) Resolving deltas: 55% (25283/45965) Resolving deltas: 56% (25741/45965) Resolving deltas: 57% (26201/45965) Resolving deltas: 58% (26660/45965) Resolving deltas: 59% (27120/45965) Resolving deltas: 60% (27579/45965) Resolving deltas: 61% (28041/45965) Resolving deltas: 62% (28501/45965) Resolving deltas: 63% (28959/45965) Resolving deltas: 64% (29418/45965) Resolving deltas: 65% (29878/45965) Resolving deltas: 66% (30337/45965) Resolving deltas: 67% (30797/45965) Resolving deltas: 68% (31259/45965) Resolving deltas: 69% (31716/45965) Resolving deltas: 70% (32176/45965) Resolving deltas: 71% (32636/45965) Resolving deltas: 72% (33095/45965) Resolving deltas: 73% (33555/45965) Resolving deltas: 74% (34015/45965) Resolving deltas: 75% (34474/45965) Resolving deltas: 76% (34934/45965) Resolving deltas: 77% (35395/45965) Resolving deltas: 78% (35853/45965) Resolving deltas: 79% (36313/45965) Resolving deltas: 80% (36775/45965) Resolving deltas: 81% (37232/45965) Resolving deltas: 82% (37693/45965) Resolving deltas: 83% (38151/45965) Resolving deltas: 84% (38611/45965) Resolving deltas: 85% (39071/45965) Resolving deltas: 86% (39530/45965) Resolving deltas: 87% (39990/45965) Resolving deltas: 88% (40450/45965) Resolving deltas: 89% (40909/45965) Resolving deltas: 90% (41369/45965) Resolving deltas: 91% (41829/45965) Resolving deltas: 92% (42288/45965) Resolving deltas: 93% (42748/45965) Resolving deltas: 94% (43209/45965) Resolving deltas: 95% (43667/45965) Resolving deltas: 96% (44127/45965) Resolving deltas: 97% (44587/45965) Resolving deltas: 98% (45046/45965) Resolving deltas: 99% (45506/45965) Resolving deltas: 100% (45965/45965) Resolving deltas: 100% (45965/45965), done.
  9. 7.10 s Fetching commit 4b6103034e4ab9883c27f48dea568f6b265d3b05 for vakint_rustred ...
  10. 7.10 s $ /nix/store/bcnisk3ydfgv26v2gw3zlky24g00yww2-git-2.54.0/bin/git fetch origin 4b6103034e4ab9883c27f48dea568f6b265d3b05
  11. 7.56 s From https://github.com/alphal00p/gammaloop
  12. 7.56 s * branch 4b6103034e4ab9883c27f48dea568f6b265d3b05 -> FETCH_HEAD
  13. 7.57 s $ /nix/store/9ypz3flqsrl5xl495mm8h645gadjsxi1-coreutils-9.11/bin/timeout --kill-after=15s 7200s /nix/store/bcnisk3ydfgv26v2gw3zlky24g00yww2-git-2.54.0/bin/git -c advice.detachedHead=false checkout 4b6103034e4ab9883c27f48dea568f6b265d3b05
  14. 7.71 s HEAD is now at 4b610303 Reserve RustRed scalar evaluation boundary
  15. 7.72 s $ /nix/store/9ypz3flqsrl5xl495mm8h645gadjsxi1-coreutils-9.11/bin/timeout --kill-after=15s 7200s /nix/store/23zk8sgzamrbmj1fday15szf7f2279s8-nix-2.34.7/bin/nix --extra-experimental-features nix-command --extra-experimental-features flakes --log-format internal-json run .#packages.x86_64-linux.nix-ci-check-gammaloop-nextest-core --print-build-logs
  16. 12.78 s
  17. 19.57 s evaluating derivation 'g copying '/nix/store/n2q0 evaluating derivation 'g copying '/nix/store/n2q0 evaluating derivation 'g copying '/nix/store/n2q0 evaluating derivation 'g copying '/nix/store/n2q0 evaluating derivation 'g copying '/nix/store/n2q0 evaluating derivation 'g copying '/nix/store/n2q0 evaluating derivation 'g querying gammaloop-nexte [0/1 built, 0.0 KiB DL] [1/0/1 built, 0.0 KiB DLgammaloop-nextest-core> Extracting 3 binaries (including 1 non-test binary), 1 build script output directory, and 2 linked paths to /build/nextest-archive-jFELdJ
  18. 20.04 s gammaloop-nextest-core> Extracted 18 files to /build/nextest-archive-jFELdJ in 0.47s
  19. 20.06 s gammaloop-nextest-core> ------------
  20. 20.06 s gammaloop-nextest-core> Nextest run ID c48fbff4-d0a4-432d-ab11-b2e85eae8b1a with nextest profile: ci_gammaloop
  21. 20.06 s gammaloop-nextest-core> Starting 339 tests across 2 binaries
  22. 20.79 s gammaloop-nextest-core> ------------
  23. 20.79 s gammaloop-nextest-core> Summary [ 0.731s] 339 tests run: 339 passed, 0 skipped
  24. 20.88 s gammaloop-nextest-core>
  25. 20.88 s gammaloop-nextest-core> ========== nextest test summary ==========
  26. 20.88 s gammaloop-nextest-core> report: target/nextest/ci_gammaloop/junit.xml
  27. 20.88 s gammaloop-nextest-core> tests: 339, failures: 0, errors: 0
  28. 20.88 s gammaloop-nextest-core> No failing testcases found.
  29. 20.88 s gammaloop-nextest-core> =========================================
  30. 20.90 s gammaloop-nextest-core> Extracting 1 binary and 1 linked path to /build/nextest-archive-nWZ5Qt
  31. 20.96 s gammaloop-nextest-core> Extracted 7 files to /build/nextest-archive-nWZ5Qt in 0.06s
  32. 20.97 s gammaloop-nextest-core> ------------
  33. 20.97 s gammaloop-nextest-core> Nextest run ID 6d4093ff-321c-4308-a69c-a3544861ba15 with nextest profile: ci_gammaloop
  34. 20.97 s gammaloop-nextest-core> Starting 19 tests across 1 binary
  35. 21.00 s gammaloop-nextest-core> ------------
  36. 21.00 s gammaloop-nextest-core> Summary [ 0.025s] 19 tests run: 19 passed, 0 skipped
  37. 21.04 s gammaloop-nextest-core>
  38. 21.04 s gammaloop-nextest-core> ========== nextest test summary ==========
  39. 21.04 s gammaloop-nextest-core> report: target/nextest/ci_gammaloop/junit.xml
  40. 21.04 s gammaloop-nextest-core> tests: 19, failures: 0, errors: 0
  41. 21.04 s gammaloop-nextest-core> No failing testcases found.
  42. 21.04 s gammaloop-nextest-core> =========================================
  43. 21.05 s gammaloop-nextest-core> Extracting 1 binary to /build/nextest-archive-GyyDxj
  44. 21.09 s gammaloop-nextest-core> Extracted 4 files to /build/nextest-archive-GyyDxj in 0.03s
  45. 21.10 s gammaloop-nextest-core> ------------
  46. 21.10 s gammaloop-nextest-core> Nextest run ID e4c3dde0-0317-48be-bc99-6c18c3e18806 with nextest profile: ci_gammaloop
  47. 21.10 s gammaloop-nextest-core> Starting 0 tests across 1 binary
  48. 21.10 s gammaloop-nextest-core> ------------
  49. 21.10 s gammaloop-nextest-core> Summary [ 0.000s] 0 tests run: 0 passed, 0 skipped
  50. 21.13 s gammaloop-nextest-core>
  51. 21.13 s gammaloop-nextest-core> ========== nextest test summary ==========
  52. 21.13 s gammaloop-nextest-core> report: target/nextest/ci_gammaloop/junit.xml
  53. 21.13 s gammaloop-nextest-core> tests: 0, failures: 0, errors: 0
  54. 21.13 s gammaloop-nextest-core> No failing testcases found.
  55. 21.13 s gammaloop-nextest-core> =========================================
  56. 21.15 s gammaloop-nextest-core> Extracting 4 binaries, 1 build script output directory, and 2 linked paths to /build/nextest-archive-L74CoG
  57. 21.62 s gammaloop-nextest-core> Extracted 18 files to /build/nextest-archive-L74CoG in 0.47s
  58. 21.65 s gammaloop-nextest-core> ------------
  59. 21.65 s gammaloop-nextest-core> Nextest run ID 8bb19ae7-49bd-4de9-ae9b-f122bb825fa4 with nextest profile: ci_gammaloop
  60. 21.65 s gammaloop-nextest-core> Starting 456 tests across 4 binaries (61 tests skipped, including 60 tests via profile.ci_gammaloop.default-filter)
  61. 23.42 s gammaloop-nextest-core> FAIL [ 0.375s] (444/456) gammalooprs::test_renormalization finit_part_ghlo
  62. 23.42 s gammaloop-nextest-core> stdout ---
  63. 23.42 s gammaloop-nextest-core>
  64. 23.42 s gammaloop-nextest-core> running 1 test
  65. 23.42 s gammaloop-nextest-core> ren part: 1/2*GC_10^2*dot(P(0,mink(dim)),P(0,mink(dim)))*cas(2,coad(8))/ε
  66. 23.42 s gammaloop-nextest-core> ━━━━━━━━━━━━━━━━━━━━━━━━━━━━━━━ Snapshot Summary ━━━━━━━━━━━━━━━━━━━━━━━━━━━━━━━
  67. 23.42 s gammaloop-nextest-core> Snapshot: finit_part_ghlo
  68. 23.42 s gammaloop-nextest-core> Source: crates/gammalooprs/tests/test_renormalization.rs:557
  69. 23.42 s gammaloop-nextest-core> ────────────────────────────────────────────────────────────────────────────────
  70. 23.42 s gammaloop-nextest-core> Expression: align_to_rqft(&a, &model).to_bare_ordered_string()
  71. 23.42 s gammaloop-nextest-core> ────────────────────────────────────────────────────────────────────────────────
  72. 23.42 s gammaloop-nextest-core> -old snapshot
  73. 23.42 s gammaloop-nextest-core> +new results
  74. 23.42 s gammaloop-nextest-core> ────────────┬───────────────────────────────────────────────────────────────────
  75. 23.42 s gammaloop-nextest-core> 1 │--1/2*cas(2,coad(8))*dot(P(0,mink(4)),P(0,mink(4)))*gs^2*ε^(-1)
  76. 23.42 s gammaloop-nextest-core> 1 │+1/2*cas(2,coad(8))*dot(P(0,mink(4)),P(0,mink(4)))*gs^2*ε^(-1)
  77. 23.42 s gammaloop-nextest-core> ────────────┴───────────────────────────────────────────────────────────────────
  78. 23.42 s gammaloop-nextest-core> To update snapshots run `cargo insta review`
  79. 23.42 s gammaloop-nextest-core> Stopped on the first failure. Run `cargo insta test` to run all snapshots.
  80. 23.42 s gammaloop-nextest-core> test finit_part_ghlo ... FAILED
  81. 23.42 s gammaloop-nextest-core>
  82. 23.42 s gammaloop-nextest-core> failures:
  83. 23.42 s gammaloop-nextest-core>
  84. 23.42 s gammaloop-nextest-core> failures:
  85. 23.42 s gammaloop-nextest-core> finit_part_ghlo
  86. 23.42 s gammaloop-nextest-core>
  87. 23.42 s gammaloop-nextest-core> test result: FAILED. 0 passed; 1 failed; 0 ignored; 0 measured; 5 filtered out; finished in 0.35s
  88. 23.42 s gammaloop-nextest-core>
  89. 23.42 s gammaloop-nextest-core> stderr ---
  90. 23.42 s gammaloop-nextest-core> The application panicked (crashed).
  91. 23.42 s gammaloop-nextest-core> Message: snapshot assertion for 'finit_part_ghlo' failed in line 557
  92. 23.42 s gammaloop-nextest-core> Location: /nix/store/30svmzr0z0zpcqjyynjn7w21wgx18y4b-vendor-cargo-deps/c19b7c6f923b580ac259164a89f2577984ad5ab09ee9d583b888f934adbbe8d0/insta-1.47.2/src/runtime.rs:719
  93. 23.42 s gammaloop-nextest-core>
  94. 23.42 s gammaloop-nextest-core> ━━━━━━━━━━━━━━━━━━━━━━━━━━━━━━━━━━ BACKTRACE ━━━━━━━━━━━━━━━━━━━━━━━━━━━━━━━━━━━
  95. 23.42 s gammaloop-nextest-core> 1: <color_eyre[51793ea62743adbd]::config::PanicHook>::panic_report<unknown>
  96. 23.42 s gammaloop-nextest-core> at <unknown source file>:<unknown line>
  97. 23.42 s gammaloop-nextest-core> 2: <color_eyre[51793ea62743adbd]::config::PanicHook>::into_panic_hook::{closure#0}<unknown>
  98. 23.42 s gammaloop-nextest-core> at <unknown source file>:<unknown line>
  99. 23.42 s gammaloop-nextest-core> 3: std[bcb96dfbba0ab899]::panicking::panic_with_hook<unknown>
  100. 23.42 s gammaloop-nextest-core> at <unknown source file>:<unknown line>
  101. 23.42 s gammaloop-nextest-core> 4: std[bcb96dfbba0ab899]::panicking::panic_handler::{closure#0}<unknown>
  102. 23.42 s gammaloop-nextest-core> at <unknown source file>:<unknown line>
  103. 23.42 s gammaloop-nextest-core> 5: std[bcb96dfbba0ab899]::sys::backtrace::__rust_end_short_backtrace::<std[bcb96dfbba0ab899]::panicking::panic_handler::{closure#0}, !><unknown>
  104. 23.42 s gammaloop-nextest-core> at <unknown source file>:<unknown line>
  105. 23.42 s gammaloop-nextest-core> 6: __rustc[6c289b9f9c454d21]::rust_begin_unwind<unknown>
  106. 23.42 s gammaloop-nextest-core> at <unknown source file>:<unknown line>
  107. 23.42 s gammaloop-nextest-core> 7: core[940e698046960fd5]::panicking::panic_fmt<unknown>
  108. 23.42 s gammaloop-nextest-core> at <unknown source file>:<unknown line>
  109. 23.42 s gammaloop-nextest-core> 8: insta[307a548ac79ef4d9]::runtime::assert_snapshot<unknown>
  110. 23.42 s gammaloop-nextest-core> at <unknown source file>:<unknown line>
  111. 23.42 s gammaloop-nextest-core> 9: <test_renormalization[9b33d9b78f5a79c8]::finit_part_ghlo::{closure#0} as core[940e698046960fd5]::ops::function::FnOnce<()>>::call_once<unknown>
  112. 23.42 s gammaloop-nextest-core> at <unknown source file>:<unknown line>
  113. 23.42 s gammaloop-nextest-core> 10: test[75d6903177b1d7e9]::__rust_begin_short_backtrace::<core[940e698046960fd5]::result::Result<(), alloc[2ea6bcb46fca0c42]::string::String>, fn() -> core[940e698046960fd5]::result::Result<(), alloc[2ea6bcb46fca0c42]::string::String>><unknown>
  114. 23.42 s gammaloop-nextest-core> at <unknown source file>:<unknown line>
  115. 23.42 s gammaloop-nextest-core> 11: test[75d6903177b1d7e9]::run_test::{closure#0}<unknown>
  116. 23.42 s gammaloop-nextest-core> at <unknown source file>:<unknown line>
  117. 23.42 s gammaloop-nextest-core> 12: std[bcb96dfbba0ab899]::sys::backtrace::__rust_begin_short_backtrace::<test[75d6903177b1d7e9]::run_test::{closure#1}, ()><unknown>
  118. 23.42 s gammaloop-nextest-core> at <unknown source file>:<unknown line>
  119. 23.42 s gammaloop-nextest-core> 13: <std[bcb96dfbba0ab899]::thread::lifecycle::spawn_unchecked<test[75d6903177b1d7e9]::run_test::{closure#1}, ()>::{closure#1} as core[940e698046960fd5]::ops::function::FnOnce<()>>::call_once::{shim:vtable#0}<unknown>
  120. 23.42 s gammaloop-nextest-core> at <unknown source file>:<unknown line>
  121. 23.42 s gammaloop-nextest-core> 14: <std[bcb96dfbba0ab899]::sys::thread::unix::Thread>::new::thread_start<unknown>
  122. 23.42 s gammaloop-nextest-core> at <unknown source file>:<unknown line>
  123. 23.42 s gammaloop-nextest-core> 15: start_thread<unknown>
  124. 23.42 s gammaloop-nextest-core> at <unknown source file>:<unknown line>
  125. 23.42 s gammaloop-nextest-core> 16: __clone3<unknown>
  126. 23.42 s gammaloop-nextest-core> at <unknown source file>:<unknown line>
  127. 23.42 s gammaloop-nextest-core>
  128. 23.42 s gammaloop-nextest-core> Run with COLORBT_SHOW_HIDDEN=1 environment variable to disable frame filtering.
  129. 23.42 s gammaloop-nextest-core> Run with RUST_BACKTRACE=full to include source snippets.
  130. 23.42 s gammaloop-nextest-core>
  131. 25.95 s gammaloop-nextest-core> FAIL [ 2.866s] (452/456) gammalooprs::test_renormalization finite_part_ghost_2loop
  132. 26.02 s gammaloop-nextest-core> stdout ---
  133. 26.02 s gammaloop-nextest-core>
  134. 26.02 s gammaloop-nextest-core> running 1 test
  135. 26.02 s gammaloop-nextest-core> ━━━━━━━━━━━━━━━━━━━━━━━━━━━━━━━ Snapshot Summary ━━━━━━━━━━━━━━━━━━━━━━━━━━━━━━━
  136. 26.02 s gammaloop-nextest-core> Snapshot: finite_part_ghost_2loop-3
  137. 26.02 s gammaloop-nextest-core> Source: crates/gammalooprs/tests/test_renormalization.rs:464
  138. 26.02 s gammaloop-nextest-core> ────────────────────────────────────────────────────────────────────────────────
  139. 26.02 s gammaloop-nextest-core> Expression: align_to_rqft(&a, &model).to_bare_ordered_string()
  140. 26.02 s gammaloop-nextest-core> ────────────────────────────────────────────────────────────────────────────────
  141. 26.02 s gammaloop-nextest-core> -old snapshot
  142. 26.02 s gammaloop-nextest-core> +new results
  143. 26.02 s gammaloop-nextest-core> ────────────┬───────────────────────────────────────────────────────────────────
  144. 26.02 s gammaloop-nextest-core> 1 │-(-1𝑖/32*ε+1𝑖/16)*(cas(2,coad(8)))^2*dot(P(0,mink(4)),P(0,mink(4)))*gs^4*ε^(-2)
  145. 26.02 s gammaloop-nextest-core> 1 │+(-1𝑖/16+1𝑖/32*ε)*(cas(2,coad(8)))^2*dot(P(0,mink(4)),P(0,mink(4)))*gs^4*ε^(-2)
  146. 26.02 s gammaloop-nextest-core> ────────────┴───────────────────────────────────────────────────────────────────
  147. 26.02 s gammaloop-nextest-core> To update snapshots run `cargo insta review`
  148. 26.02 s gammaloop-nextest-core> Stopped on the first failure. Run `cargo insta test` to run all snapshots.
  149. 26.02 s gammaloop-nextest-core> test finite_part_ghost_2loop ... FAILED
  150. 26.02 s gammaloop-nextest-core>
  151. 26.02 s gammaloop-nextest-core> failures:
  152. 26.02 s gammaloop-nextest-core>
  153. 26.02 s gammaloop-nextest-core> failures:
  154. 26.02 s gammaloop-nextest-core> finite_part_ghost_2loop
  155. 26.02 s gammaloop-nextest-core>
  156. 26.02 s gammaloop-nextest-core> test result: FAILED. 0 passed; 1 failed; 0 ignored; 0 measured; 5 filtered out; finished in 2.86s
  157. 26.02 s gammaloop-nextest-core>
  158. 26.02 s gammaloop-nextest-core> stderr ---
  159. 26.02 s gammaloop-nextest-core> The application panicked (crashed).
  160. 26.02 s gammaloop-nextest-core> Message: snapshot assertion for 'finite_part_ghost_2loop-3' failed in line 464
  161. 26.02 s gammaloop-nextest-core> Location: /nix/store/30svmzr0z0zpcqjyynjn7w21wgx18y4b-vendor-cargo-deps/c19b7c6f923b580ac259164a89f2577984ad5ab09ee9d583b888f934adbbe8d0/insta-1.47.2/src/runtime.rs:719
  162. 26.02 s gammaloop-nextest-core>
  163. 26.02 s gammaloop-nextest-core> ━━━━━━━━━━━━━━━━━━━━━━━━━━━━━━━━━━ BACKTRACE ━━━━━━━━━━━━━━━━━━━━━━━━━━━━━━━━━━━
  164. 26.02 s gammaloop-nextest-core> 1: <color_eyre[51793ea62743adbd]::config::PanicHook>::panic_report<unknown>
  165. 26.02 s gammaloop-nextest-core> at <unknown source file>:<unknown line>
  166. 26.02 s gammaloop-nextest-core> 2: <color_eyre[51793ea62743adbd]::config::PanicHook>::into_panic_hook::{closure#0}<unknown>
  167. 26.02 s gammaloop-nextest-core> at <unknown source file>:<unknown line>
  168. 26.02 s gammaloop-nextest-core> 3: std[bcb96dfbba0ab899]::panicking::panic_with_hook<unknown>
  169. 26.02 s gammaloop-nextest-core> at <unknown source file>:<unknown line>
  170. 26.02 s gammaloop-nextest-core> 4: std[bcb96dfbba0ab899]::panicking::panic_handler::{closure#0}<unknown>
  171. 26.02 s gammaloop-nextest-core> at <unknown source file>:<unknown line>
  172. 26.02 s gammaloop-nextest-core> 5: std[bcb96dfbba0ab899]::sys::backtrace::__rust_end_short_backtrace::<std[bcb96dfbba0ab899]::panicking::panic_handler::{closure#0}, !><unknown>
  173. 26.02 s gammaloop-nextest-core> at <unknown source file>:<unknown line>
  174. 26.02 s gammaloop-nextest-core> 6: __rustc[6c289b9f9c454d21]::rust_begin_unwind<unknown>
  175. 26.02 s gammaloop-nextest-core> at <unknown source file>:<unknown line>
  176. 26.02 s gammaloop-nextest-core> 7: core[940e698046960fd5]::panicking::panic_fmt<unknown>
  177. 26.02 s gammaloop-nextest-core> at <unknown source file>:<unknown line>
  178. 26.02 s gammaloop-nextest-core> 8: insta[307a548ac79ef4d9]::runtime::assert_snapshot<unknown>
  179. 26.02 s gammaloop-nextest-core> at <unknown source file>:<unknown line>
  180. 26.02 s gammaloop-nextest-core> 9: test_renormalization[9b33d9b78f5a79c8]::finite_part_ghost_2loop<unknown>
  181. 26.02 s gammaloop-nextest-core> at <unknown source file>:<unknown line>
  182. 26.02 s gammaloop-nextest-core> 10: <test_renormalization[9b33d9b78f5a79c8]::finite_part_ghost_2loop::{closure#0} as core[940e698046960fd5]::ops::function::FnOnce<()>>::call_once<unknown>
  183. 26.02 s gammaloop-nextest-core> at <unknown source file>:<unknown line>
  184. 26.02 s gammaloop-nextest-core> 11: test[75d6903177b1d7e9]::__rust_begin_short_backtrace::<core[940e698046960fd5]::result::Result<(), alloc[2ea6bcb46fca0c42]::string::String>, fn() -> core[940e698046960fd5]::result::Result<(), alloc[2ea6bcb46fca0c42]::string::String>><unknown>
  185. 26.02 s gammaloop-nextest-core> at <unknown source file>:<unknown line>
  186. 26.02 s gammaloop-nextest-core> 12: test[75d6903177b1d7e9]::run_test::{closure#0}<unknown>
  187. 26.02 s gammaloop-nextest-core> at <unknown source file>:<unknown line>
  188. 26.02 s gammaloop-nextest-core> 13: std[bcb96dfbba0ab899]::sys::backtrace::__rust_begin_short_backtrace::<test[75d6903177b1d7e9]::run_test::{closure#1}, ()><unknown>
  189. 26.02 s gammaloop-nextest-core> at <unknown source file>:<unknown line>
  190. 26.02 s gammaloop-nextest-core> 14: <std[bcb96dfbba0ab899]::thread::lifecycle::spawn_unchecked<test[75d6903177b1d7e9]::run_test::{closure#1}, ()>::{closure#1} as core[940e698046960fd5]::ops::function::FnOnce<()>>::call_once::{shim:vtable#0}<unknown>
  191. 26.02 s gammaloop-nextest-core> at <unknown source file>:<unknown line>
  192. 26.02 s gammaloop-nextest-core> 15: <std[bcb96dfbba0ab899]::sys::thread::unix::Thread>::new::thread_start<unknown>
  193. 26.02 s gammaloop-nextest-core> at <unknown source file>:<unknown line>
  194. 26.02 s gammaloop-nextest-core> 16: start_thread<unknown>
  195. 26.02 s gammaloop-nextest-core> at <unknown source file>:<unknown line>
  196. 26.02 s gammaloop-nextest-core> 17: __clone3<unknown>
  197. 26.02 s gammaloop-nextest-core> at <unknown source file>:<unknown line>
  198. 26.02 s gammaloop-nextest-core>
  199. 26.02 s gammaloop-nextest-core> Run with COLORBT_SHOW_HIDDEN=1 environment variable to disable frame filtering.
  200. 26.02 s gammaloop-nextest-core> Run with RUST_BACKTRACE=full to include source snippets.
  201. 26.02 s gammaloop-nextest-core>
  202. 30.98 s gammaloop-nextest-core> ------------
  203. 31.01 s gammaloop-nextest-core> Summary [ 9.329s] 456 tests run: 454 passed, 2 failed, 61 skipped
  204. 31.01 s gammaloop-nextest-core> FAIL [ 0.375s] (444/456) gammalooprs::test_renormalization finit_part_ghlo
  205. 31.01 s gammaloop-nextest-core> stdout ---
  206. 31.01 s gammaloop-nextest-core>
  207. 31.01 s gammaloop-nextest-core> running 1 test
  208. 31.01 s gammaloop-nextest-core> ren part: 1/2*GC_10^2*dot(P(0,mink(dim)),P(0,mink(dim)))*cas(2,coad(8))/ε
  209. 31.01 s gammaloop-nextest-core> ━━━━━━━━━━━━━━━━━━━━━━━━━━━━━━━ Snapshot Summary ━━━━━━━━━━━━━━━━━━━━━━━━━━━━━━━
  210. 31.01 s gammaloop-nextest-core> Snapshot: finit_part_ghlo
  211. 31.01 s gammaloop-nextest-core> Source: crates/gammalooprs/tests/test_renormalization.rs:557
  212. 31.01 s gammaloop-nextest-core> ────────────────────────────────────────────────────────────────────────────────
  213. 31.01 s gammaloop-nextest-core> Expression: align_to_rqft(&a, &model).to_bare_ordered_string()
  214. 31.01 s gammaloop-nextest-core> ────────────────────────────────────────────────────────────────────────────────
  215. 31.01 s gammaloop-nextest-core> -old snapshot
  216. 31.01 s gammaloop-nextest-core> +new results
  217. 31.01 s gammaloop-nextest-core> ────────────┬───────────────────────────────────────────────────────────────────
  218. 31.01 s gammaloop-nextest-core> 1 │--1/2*cas(2,coad(8))*dot(P(0,mink(4)),P(0,mink(4)))*gs^2*ε^(-1)
  219. 31.01 s gammaloop-nextest-core> 1 │+1/2*cas(2,coad(8))*dot(P(0,mink(4)),P(0,mink(4)))*gs^2*ε^(-1)
  220. 31.01 s gammaloop-nextest-core> ────────────┴───────────────────────────────────────────────────────────────────
  221. 31.01 s gammaloop-nextest-core> To update snapshots run `cargo insta review`
  222. 31.01 s gammaloop-nextest-core> Stopped on the first failure. Run `cargo insta test` to run all snapshots.
  223. 31.01 s gammaloop-nextest-core> test finit_part_ghlo ... FAILED
  224. 31.01 s gammaloop-nextest-core>
  225. 31.01 s gammaloop-nextest-core> failures:
  226. 31.01 s gammaloop-nextest-core>
  227. 31.01 s gammaloop-nextest-core> failures:
  228. 31.01 s gammaloop-nextest-core> finit_part_ghlo
  229. 31.01 s gammaloop-nextest-core>
  230. 31.01 s gammaloop-nextest-core> test result: FAILED. 0 passed; 1 failed; 0 ignored; 0 measured; 5 filtered out; finished in 0.35s
  231. 31.01 s gammaloop-nextest-core>
  232. 31.01 s gammaloop-nextest-core> stderr ---
  233. 31.01 s gammaloop-nextest-core> The application panicked (crashed).
  234. 31.01 s gammaloop-nextest-core> Message: snapshot assertion for 'finit_part_ghlo' failed in line 557
  235. 31.01 s gammaloop-nextest-core> Location: /nix/store/30svmzr0z0zpcqjyynjn7w21wgx18y4b-vendor-cargo-deps/c19b7c6f923b580ac259164a89f2577984ad5ab09ee9d583b888f934adbbe8d0/insta-1.47.2/src/runtime.rs:719
  236. 31.01 s gammaloop-nextest-core>
  237. 31.01 s gammaloop-nextest-core> ━━━━━━━━━━━━━━━━━━━━━━━━━━━━━━━━━━ BACKTRACE ━━━━━━━━━━━━━━━━━━━━━━━━━━━━━━━━━━━
  238. 31.01 s gammaloop-nextest-core> 1: <color_eyre[51793ea62743adbd]::config::PanicHook>::panic_report<unknown>
  239. 31.01 s gammaloop-nextest-core> at <unknown source file>:<unknown line>
  240. 31.01 s gammaloop-nextest-core> 2: <color_eyre[51793ea62743adbd]::config::PanicHook>::into_panic_hook::{closure#0}<unknown>
  241. 31.01 s gammaloop-nextest-core> at <unknown source file>:<unknown line>
  242. 31.01 s gammaloop-nextest-core> 3: std[bcb96dfbba0ab899]::panicking::panic_with_hook<unknown>
  243. 31.01 s gammaloop-nextest-core> at <unknown source file>:<unknown line>
  244. 31.01 s gammaloop-nextest-core> 4: std[bcb96dfbba0ab899]::panicking::panic_handler::{closure#0}<unknown>
  245. 31.01 s gammaloop-nextest-core> at <unknown source file>:<unknown line>
  246. 31.01 s gammaloop-nextest-core> 5: std[bcb96dfbba0ab899]::sys::backtrace::__rust_end_short_backtrace::<std[bcb96dfbba0ab899]::panicking::panic_handler::{closure#0}, !><unknown>
  247. 31.01 s gammaloop-nextest-core> at <unknown source file>:<unknown line>
  248. 31.01 s gammaloop-nextest-core> 6: __rustc[6c289b9f9c454d21]::rust_begin_unwind<unknown>
  249. 31.01 s gammaloop-nextest-core> at <unknown source file>:<unknown line>
  250. 31.01 s gammaloop-nextest-core> 7: core[940e698046960fd5]::panicking::panic_fmt<unknown>
  251. 31.01 s gammaloop-nextest-core> at <unknown source file>:<unknown line>
  252. 31.01 s gammaloop-nextest-core> 8: insta[307a548ac79ef4d9]::runtime::assert_snapshot<unknown>
  253. 31.01 s gammaloop-nextest-core> at <unknown source file>:<unknown line>
  254. 31.01 s gammaloop-nextest-core> 9: <test_renormalization[9b33d9b78f5a79c8]::finit_part_ghlo::{closure#0} as core[940e698046960fd5]::ops::function::FnOnce<()>>::call_once<unknown>
  255. 31.01 s gammaloop-nextest-core> at <unknown source file>:<unknown line>
  256. 31.01 s gammaloop-nextest-core> 10: test[75d6903177b1d7e9]::__rust_begin_short_backtrace::<core[940e698046960fd5]::result::Result<(), alloc[2ea6bcb46fca0c42]::string::String>, fn() -> core[940e698046960fd5]::result::Result<(), alloc[2ea6bcb46fca0c42]::string::String>><unknown>
  257. 31.01 s gammaloop-nextest-core> at <unknown source file>:<unknown line>
  258. 31.01 s gammaloop-nextest-core> 11: test[75d6903177b1d7e9]::run_test::{closure#0}<unknown>
  259. 31.01 s gammaloop-nextest-core> at <unknown source file>:<unknown line>
  260. 31.01 s gammaloop-nextest-core> 12: std[bcb96dfbba0ab899]::sys::backtrace::__rust_begin_short_backtrace::<test[75d6903177b1d7e9]::run_test::{closure#1}, ()><unknown>
  261. 31.01 s gammaloop-nextest-core> at <unknown source file>:<unknown line>
  262. 31.01 s gammaloop-nextest-core> 13: <std[bcb96dfbba0ab899]::thread::lifecycle::spawn_unchecked<test[75d6903177b1d7e9]::run_test::{closure#1}, ()>::{closure#1} as core[940e698046960fd5]::ops::function::FnOnce<()>>::call_once::{shim:vtable#0}<unknown>
  263. 31.01 s gammaloop-nextest-core> at <unknown source file>:<unknown line>
  264. 31.01 s gammaloop-nextest-core> 14: <std[bcb96dfbba0ab899]::sys::thread::unix::Thread>::new::thread_start<unknown>
  265. 31.01 s gammaloop-nextest-core> at <unknown source file>:<unknown line>
  266. 31.01 s gammaloop-nextest-core> 15: start_thread<unknown>
  267. 31.01 s gammaloop-nextest-core> at <unknown source file>:<unknown line>
  268. 31.01 s gammaloop-nextest-core> 16: __clone3<unknown>
  269. 31.01 s gammaloop-nextest-core> at <unknown source file>:<unknown line>
  270. 31.01 s gammaloop-nextest-core>
  271. 31.01 s gammaloop-nextest-core> Run with COLORBT_SHOW_HIDDEN=1 environment variable to disable frame filtering.
  272. 31.01 s gammaloop-nextest-core> Run with RUST_BACKTRACE=full to include source snippets.
  273. 31.01 s gammaloop-nextest-core>
  274. 31.01 s gammaloop-nextest-core> FAIL [ 2.866s] (452/456) gammalooprs::test_renormalization finite_part_ghost_2loop
  275. 31.01 s gammaloop-nextest-core> stdout ---
  276. 31.01 s gammaloop-nextest-core>
  277. 31.01 s gammaloop-nextest-core> running 1 test
  278. 31.01 s gammaloop-nextest-core> ━━━━━━━━━━━━━━━━━━━━━━━━━━━━━━━ Snapshot Summary ━━━━━━━━━━━━━━━━━━━━━━━━━━━━━━━
  279. 31.01 s gammaloop-nextest-core> Snapshot: finite_part_ghost_2loop-3
  280. 31.01 s gammaloop-nextest-core> Source: crates/gammalooprs/tests/test_renormalization.rs:464
  281. 31.01 s gammaloop-nextest-core> ────────────────────────────────────────────────────────────────────────────────
  282. 31.01 s gammaloop-nextest-core> Expression: align_to_rqft(&a, &model).to_bare_ordered_string()
  283. 31.01 s gammaloop-nextest-core> ────────────────────────────────────────────────────────────────────────────────
  284. 31.01 s gammaloop-nextest-core> -old snapshot
  285. 31.01 s gammaloop-nextest-core> +new results
  286. 31.01 s gammaloop-nextest-core> ────────────┬───────────────────────────────────────────────────────────────────
  287. 31.01 s gammaloop-nextest-core> 1 │-(-1𝑖/32*ε+1𝑖/16)*(cas(2,coad(8)))^2*dot(P(0,mink(4)),P(0,mink(4)))*gs^4*ε^(-2)
  288. 31.01 s gammaloop-nextest-core> 1 │+(-1𝑖/16+1𝑖/32*ε)*(cas(2,coad(8)))^2*dot(P(0,mink(4)),P(0,mink(4)))*gs^4*ε^(-2)
  289. 31.01 s gammaloop-nextest-core> ────────────┴───────────────────────────────────────────────────────────────────
  290. 31.01 s gammaloop-nextest-core> To update snapshots run `cargo insta review`
  291. 31.01 s gammaloop-nextest-core> Stopped on the first failure. Run `cargo insta test` to run all snapshots.
  292. 31.01 s gammaloop-nextest-core> test finite_part_ghost_2loop ... FAILED
  293. 31.01 s gammaloop-nextest-core>
  294. 31.01 s gammaloop-nextest-core> failures:
  295. 31.01 s gammaloop-nextest-core>
  296. 31.01 s gammaloop-nextest-core> failures:
  297. 31.01 s gammaloop-nextest-core> finite_part_ghost_2loop
  298. 31.01 s gammaloop-nextest-core>
  299. 31.01 s gammaloop-nextest-core> test result: FAILED. 0 passed; 1 failed; 0 ignored; 0 measured; 5 filtered out; finished in 2.86s
  300. 31.01 s gammaloop-nextest-core>
  301. 31.01 s gammaloop-nextest-core> stderr ---
  302. 31.01 s gammaloop-nextest-core> The application panicked (crashed).
  303. 31.01 s gammaloop-nextest-core> Message: snapshot assertion for 'finite_part_ghost_2loop-3' failed in line 464
  304. 31.01 s gammaloop-nextest-core> Location: /nix/store/30svmzr0z0zpcqjyynjn7w21wgx18y4b-vendor-cargo-deps/c19b7c6f923b580ac259164a89f2577984ad5ab09ee9d583b888f934adbbe8d0/insta-1.47.2/src/runtime.rs:719
  305. 31.01 s gammaloop-nextest-core>
  306. 31.01 s gammaloop-nextest-core> ━━━━━━━━━━━━━━━━━━━━━━━━━━━━━━━━━━ BACKTRACE ━━━━━━━━━━━━━━━━━━━━━━━━━━━━━━━━━━━
  307. 31.01 s gammaloop-nextest-core> 1: <color_eyre[51793ea62743adbd]::config::PanicHook>::panic_report<unknown>
  308. 31.01 s gammaloop-nextest-core> at <unknown source file>:<unknown line>
  309. 31.01 s gammaloop-nextest-core> 2: <color_eyre[51793ea62743adbd]::config::PanicHook>::into_panic_hook::{closure#0}<unknown>
  310. 31.01 s gammaloop-nextest-core> at <unknown source file>:<unknown line>
  311. 31.01 s gammaloop-nextest-core> 3: std[bcb96dfbba0ab899]::panicking::panic_with_hook<unknown>
  312. 31.01 s gammaloop-nextest-core> at <unknown source file>:<unknown line>
  313. 31.01 s gammaloop-nextest-core> 4: std[bcb96dfbba0ab899]::panicking::panic_handler::{closure#0}<unknown>
  314. 31.01 s gammaloop-nextest-core> at <unknown source file>:<unknown line>
  315. 31.01 s gammaloop-nextest-core> 5: std[bcb96dfbba0ab899]::sys::backtrace::__rust_end_short_backtrace::<std[bcb96dfbba0ab899]::panicking::panic_handler::{closure#0}, !><unknown>
  316. 31.01 s gammaloop-nextest-core> at <unknown source file>:<unknown line>
  317. 31.01 s gammaloop-nextest-core> 6: __rustc[6c289b9f9c454d21]::rust_begin_unwind<unknown>
  318. 31.01 s gammaloop-nextest-core> at <unknown source file>:<unknown line>
  319. 31.01 s gammaloop-nextest-core> 7: core[940e698046960fd5]::panicking::panic_fmt<unknown>
  320. 31.01 s gammaloop-nextest-core> at <unknown source file>:<unknown line>
  321. 31.01 s gammaloop-nextest-core> 8: insta[307a548ac79ef4d9]::runtime::assert_snapshot<unknown>
  322. 31.01 s gammaloop-nextest-core> at <unknown source file>:<unknown line>
  323. 31.01 s gammaloop-nextest-core> 9: test_renormalization[9b33d9b78f5a79c8]::finite_part_ghost_2loop<unknown>
  324. 31.01 s gammaloop-nextest-core> at <unknown source file>:<unknown line>
  325. 31.01 s gammaloop-nextest-core> 10: <test_renormalization[9b33d9b78f5a79c8]::finite_part_ghost_2loop::{closure#0} as core[940e698046960fd5]::ops::function::FnOnce<()>>::call_once<unknown>
  326. 31.01 s gammaloop-nextest-core> at <unknown source file>:<unknown line>
  327. 31.01 s gammaloop-nextest-core> 11: test[75d6903177b1d7e9]::__rust_begin_short_backtrace::<core[940e698046960fd5]::result::Result<(), alloc[2ea6bcb46fca0c42]::string::String>, fn() -> core[940e698046960fd5]::result::Result<(), alloc[2ea6bcb46fca0c42]::string::String>><unknown>
  328. 31.01 s gammaloop-nextest-core> at <unknown source file>:<unknown line>
  329. 31.01 s gammaloop-nextest-core> 12: test[75d6903177b1d7e9]::run_test::{closure#0}<unknown>
  330. 31.01 s gammaloop-nextest-core> at <unknown source file>:<unknown line>
  331. 31.01 s gammaloop-nextest-core> 13: std[bcb96dfbba0ab899]::sys::backtrace::__rust_begin_short_backtrace::<test[75d6903177b1d7e9]::run_test::{closure#1}, ()><unknown>
  332. 31.01 s gammaloop-nextest-core> at <unknown source file>:<unknown line>
  333. 31.01 s gammaloop-nextest-core> 14: <std[bcb96dfbba0ab899]::thread::lifecycle::spawn_unchecked<test[75d6903177b1d7e9]::run_test::{closure#1}, ()>::{closure#1} as core[940e698046960fd5]::ops::function::FnOnce<()>>::call_once::{shim:vtable#0}<unknown>
  334. 31.01 s gammaloop-nextest-core> at <unknown source file>:<unknown line>
  335. 31.01 s gammaloop-nextest-core> 15: <std[bcb96dfbba0ab899]::sys::thread::unix::Thread>::new::thread_start<unknown>
  336. 31.01 s gammaloop-nextest-core> at <unknown source file>:<unknown line>
  337. 31.01 s gammaloop-nextest-core> 16: start_thread<unknown>
  338. 31.01 s gammaloop-nextest-core> at <unknown source file>:<unknown line>
  339. 31.01 s gammaloop-nextest-core> 17: __clone3<unknown>
  340. 31.01 s gammaloop-nextest-core> at <unknown source file>:<unknown line>
  341. 31.01 s gammaloop-nextest-core>
  342. 31.01 s gammaloop-nextest-core> Run with COLORBT_SHOW_HIDDEN=1 environment variable to disable frame filtering.
  343. 31.01 s gammaloop-nextest-core> Run with RUST_BACKTRACE=full to include source snippets.
  344. 31.01 s gammaloop-nextest-core>
  345. 31.03 s gammaloop-nextest-core> error: test run failed
  346. 31.06 s gammaloop-nextest-core>
  347. 31.06 s gammaloop-nextest-core> ========== nextest test summary ==========
  348. 31.06 s gammaloop-nextest-core> report: target/nextest/ci_gammaloop/junit.xml
  349. 31.06 s gammaloop-nextest-core> tests: 456, failures: 2, errors: 0
  350. 31.06 s gammaloop-nextest-core>
  351. 31.06 s gammaloop-nextest-core> 1. gammalooprs::test_renormalization::finit_part_ghlo
  352. 31.06 s gammaloop-nextest-core> failure: test failure with exit code 101
  353. 31.06 s gammaloop-nextest-core> system-out
  354. 31.06 s gammaloop-nextest-core> running 1 test
  355. 31.06 s gammaloop-nextest-core> ren part: 1/2*GC_10^2*dot(P(0,mink(dim)),P(0,mink(dim)))*cas(2,coad(8))/ε
  356. 31.06 s gammaloop-nextest-core> ━━━━━━━━━━━━━━━━━━━━━━━━━━━━━━━ Snapshot Summary ━━━━━━━━━━━━━━━━━━━━━━━━━━━━━━━
  357. 31.06 s gammaloop-nextest-core> Snapshot: finit_part_ghlo
  358. 31.06 s gammaloop-nextest-core> Source: crates/gammalooprs/tests/test_renormalization.rs:557
  359. 31.06 s gammaloop-nextest-core> ────────────────────────────────────────────────────────────────────────────────
  360. 31.06 s gammaloop-nextest-core> Expression: align_to_rqft(&a, &model).to_bare_ordered_string()
  361. 31.06 s gammaloop-nextest-core> ────────────────────────────────────────────────────────────────────────────────
  362. 31.06 s gammaloop-nextest-core> -old snapshot
  363. 31.06 s gammaloop-nextest-core> +new results
  364. 31.06 s gammaloop-nextest-core> ────────────┬───────────────────────────────────────────────────────────────────
  365. 31.06 s gammaloop-nextest-core> 1 │--1/2*cas(2,coad(8))*dot(P(0,mink(4)),P(0,mink(4)))*gs^2*ε^(-1)
  366. 31.06 s gammaloop-nextest-core> 1 │+1/2*cas(2,coad(8))*dot(P(0,mink(4)),P(0,mink(4)))*gs^2*ε^(-1)
  367. 31.06 s gammaloop-nextest-core> ────────────┴───────────────────────────────────────────────────────────────────
  368. 31.06 s gammaloop-nextest-core> To update snapshots run `cargo insta review`
  369. 31.06 s gammaloop-nextest-core> Stopped on the first failure. Run `cargo insta test` to run all snapshots.
  370. 31.06 s gammaloop-nextest-core> test finit_part_ghlo ... FAILED
  371. 31.06 s gammaloop-nextest-core>
  372. 31.06 s gammaloop-nextest-core> failures:
  373. 31.06 s gammaloop-nextest-core>
  374. 31.06 s gammaloop-nextest-core> failures:
  375. 31.06 s gammaloop-nextest-core> finit_part_ghlo
  376. 31.06 s gammaloop-nextest-core>
  377. 31.06 s gammaloop-nextest-core> test result: FAILED. 0 passed; 1 failed; 0 ignored; 0 measured; 5 filtered out; finished in 0.35s
  378. 31.06 s gammaloop-nextest-core> system-err
  379. 31.06 s gammaloop-nextest-core> The application panicked (crashed).
  380. 31.06 s gammaloop-nextest-core> Message: snapshot assertion for 'finit_part_ghlo' failed in line 557
  381. 31.06 s gammaloop-nextest-core> Location: /nix/store/30svmzr0z0zpcqjyynjn7w21wgx18y4b-vendor-cargo-deps/c19b7c6f923b580ac259164a89f2577984ad5ab09ee9d583b888f934adbbe8d0/insta-1.47.2/src/runtime.rs:719
  382. 31.06 s gammaloop-nextest-core>
  383. 31.06 s gammaloop-nextest-core> ━━━━━━━━━━━━━━━━━━━━━━━━━━━━━━━━━━ BACKTRACE ━━━━━━━━━━━━━━━━━━━━━━━━━━━━━━━━━━━
  384. 31.06 s gammaloop-nextest-core> 1: <color_eyre[51793ea62743adbd]::config::PanicHook>::panic_report<unknown>
  385. 31.06 s gammaloop-nextest-core> at <unknown source file>:<unknown line>
  386. 31.06 s gammaloop-nextest-core> 2: <color_eyre[51793ea62743adbd]::config::PanicHook>::into_panic_hook::{closure#0}<unknown>
  387. 31.06 s gammaloop-nextest-core> at <unknown source file>:<unknown line>
  388. 31.06 s gammaloop-nextest-core> 3: std[bcb96dfbba0ab899]::panicking::panic_with_hook<unknown>
  389. 31.06 s gammaloop-nextest-core> at <unknown source file>:<unknown line>
  390. 31.06 s gammaloop-nextest-core> 4: std[bcb96dfbba0ab899]::panicking::panic_handler::{closure#0}<unknown>
  391. 31.06 s gammaloop-nextest-core> at <unknown source file>:<unknown line>
  392. 31.06 s gammaloop-nextest-core> 5: std[bcb96dfbba0ab899]::sys::backtrace::__rust_end_short_backtrace::<std[bcb96dfbba0ab899]::panicking::panic_handler::{closure#0}, !><unknown>
  393. 31.06 s gammaloop-nextest-core> at <unknown source file>:<unknown line>
  394. 31.06 s gammaloop-nextest-core> 6: __rustc[6c289b9f9c454d21]::rust_begin_unwind<unknown>
  395. 31.06 s gammaloop-nextest-core> at <unknown source file>:<unknown line>
  396. 31.06 s gammaloop-nextest-core> 7: core[940e698046960fd5]::panicking::panic_fmt<unknown>
  397. 31.06 s gammaloop-nextest-core> at <unknown source file>:<unknown line>
  398. 31.06 s gammaloop-nextest-core> 8: insta[307a548ac79ef4d9]::runtime::assert_snapshot<unknown>
  399. 31.06 s gammaloop-nextest-core> at <unknown source file>:<unknown line>
  400. 31.06 s gammaloop-nextest-core> 9: <test_renormalization[9b33d9b78f5a79c8]::finit_part_ghlo::{closure#0} as core[940e698046960fd5]::ops::function::FnOnce<()>>::call_once<unknown>
  401. 31.06 s gammaloop-nextest-core> at <unknown source file>:<unknown line>
  402. 31.06 s gammaloop-nextest-core> 10: test[75d6903177b1d7e9]::__rust_begin_short_backtrace::<core[940e698046960fd5]::result::Result<(), alloc[2ea6bcb46fca0c42]::string::String>, fn() -> core[940e698046960fd5]::result::Result<(), alloc[2ea6bcb46fca0c42]::string::String>><unknown>
  403. 31.06 s gammaloop-nextest-core> at <unknown source file>:<unknown line>
  404. 31.06 s gammaloop-nextest-core> 11: test[75d6903177b1d7e9]::run_test::{closure#0}<unknown>
  405. 31.06 s gammaloop-nextest-core> at <unknown source file>:<unknown line>
  406. 31.06 s gammaloop-nextest-core> 12: std[bcb96dfbba0ab899]::sys::backtrace::__rust_begin_short_backtrace::<test[75d6903177b1d7e9]::run_test::{closure#1}, ()><unknown>
  407. 31.06 s gammaloop-nextest-core> at <unknown source file>:<unknown line>
  408. 31.06 s gammaloop-nextest-core> 13: <std[bcb96dfbba0ab899]::thread::lifecycle::spawn_unchecked<test[75d6903177b1d7e9]::run_test::{closure#1}, ()>::{closure#1} as core[940e698046960fd5]::ops::function::FnOnce<()>>::call_once::{shim:vtable#0}<unknown>
  409. 31.06 s gammaloop-nextest-core> at <unknown source file>:<unknown line>
  410. 31.06 s gammaloop-nextest-core> 14: <std[bcb96dfbba0ab899]::sys::thread::unix::Thread>::new::thread_start<unknown>
  411. 31.06 s gammaloop-nextest-core> at <unknown source file>:<unknown line>
  412. 31.06 s gammaloop-nextest-core> 15: start_thread<unknown>
  413. 31.06 s gammaloop-nextest-core> at <unknown source file>:<unknown line>
  414. 31.06 s gammaloop-nextest-core> 16: __clone3<unknown>
  415. 31.06 s gammaloop-nextest-core> at <unknown source file>:<unknown line>
  416. 31.06 s gammaloop-nextest-core>
  417. 31.06 s gammaloop-nextest-core> Run with COLORBT_SHOW_HIDDEN=1 environment variable to disable frame filtering.
  418. 31.06 s gammaloop-nextest-core> Run with RUST_BACKTRACE=full to include source snippets.
  419. 31.06 s gammaloop-nextest-core>
  420. 31.06 s gammaloop-nextest-core> 2. gammalooprs::test_renormalization::finite_part_ghost_2loop
  421. 31.06 s gammaloop-nextest-core> failure: test failure with exit code 101
  422. 31.06 s gammaloop-nextest-core> system-out
  423. 31.06 s gammaloop-nextest-core> running 1 test
  424. 31.06 s gammaloop-nextest-core> ━━━━━━━━━━━━━━━━━━━━━━━━━━━━━━━ Snapshot Summary ━━━━━━━━━━━━━━━━━━━━━━━━━━━━━━━
  425. 31.06 s gammaloop-nextest-core> Snapshot: finite_part_ghost_2loop-3
  426. 31.06 s gammaloop-nextest-core> Source: crates/gammalooprs/tests/test_renormalization.rs:464
  427. 31.06 s gammaloop-nextest-core> ────────────────────────────────────────────────────────────────────────────────
  428. 31.06 s gammaloop-nextest-core> Expression: align_to_rqft(&a, &model).to_bare_ordered_string()
  429. 31.06 s gammaloop-nextest-core> ────────────────────────────────────────────────────────────────────────────────
  430. 31.06 s gammaloop-nextest-core> -old snapshot
  431. 31.06 s gammaloop-nextest-core> +new results
  432. 31.06 s gammaloop-nextest-core> ────────────┬───────────────────────────────────────────────────────────────────
  433. 31.06 s gammaloop-nextest-core> 1 │-(-1𝑖/32*ε+1𝑖/16)*(cas(2,coad(8)))^2*dot(P(0,mink(4)),P(0,mink(4)))*gs^4*ε^(-2)
  434. 31.06 s gammaloop-nextest-core> 1 │+(-1𝑖/16+1𝑖/32*ε)*(cas(2,coad(8)))^2*dot(P(0,mink(4)),P(0,mink(4)))*gs^4*ε^(-2)
  435. 31.06 s gammaloop-nextest-core> ────────────┴───────────────────────────────────────────────────────────────────
  436. 31.06 s gammaloop-nextest-core> To update snapshots run `cargo insta review`
  437. 31.06 s gammaloop-nextest-core> Stopped on the first failure. Run `cargo insta test` to run all snapshots.
  438. 31.06 s gammaloop-nextest-core> test finite_part_ghost_2loop ... FAILED
  439. 31.06 s gammaloop-nextest-core>
  440. 31.06 s gammaloop-nextest-core> failures:
  441. 31.06 s gammaloop-nextest-core>
  442. 31.06 s gammaloop-nextest-core> failures:
  443. 31.06 s gammaloop-nextest-core> finite_part_ghost_2loop
  444. 31.06 s gammaloop-nextest-core>
  445. 31.06 s gammaloop-nextest-core> test result: FAILED. 0 passed; 1 failed; 0 ignored; 0 measured; 5 filtered out; finished in 2.86s
  446. 31.06 s gammaloop-nextest-core> system-err
  447. 31.06 s gammaloop-nextest-core> The application panicked (crashed).
  448. 31.06 s gammaloop-nextest-core> Message: snapshot assertion for 'finite_part_ghost_2loop-3' failed in line 464
  449. 31.06 s gammaloop-nextest-core> Location: /nix/store/30svmzr0z0zpcqjyynjn7w21wgx18y4b-vendor-cargo-deps/c19b7c6f923b580ac259164a89f2577984ad5ab09ee9d583b888f934adbbe8d0/insta-1.47.2/src/runtime.rs:719
  450. 31.06 s gammaloop-nextest-core>
  451. 31.06 s gammaloop-nextest-core> ━━━━━━━━━━━━━━━━━━━━━━━━━━━━━━━━━━ BACKTRACE ━━━━━━━━━━━━━━━━━━━━━━━━━━━━━━━━━━━
  452. 31.06 s gammaloop-nextest-core> 1: <color_eyre[51793ea62743adbd]::config::PanicHook>::panic_report<unknown>
  453. 31.06 s gammaloop-nextest-core> at <unknown source file>:<unknown line>
  454. 31.06 s gammaloop-nextest-core> 2: <color_eyre[51793ea62743adbd]::config::PanicHook>::into_panic_hook::{closure#0}<unknown>
  455. 31.06 s gammaloop-nextest-core> at <unknown source file>:<unknown line>
  456. 31.06 s gammaloop-nextest-core> 3: std[bcb96dfbba0ab899]::panicking::panic_with_hook<unknown>
  457. 31.06 s gammaloop-nextest-core> at <unknown source file>:<unknown line>
  458. 31.06 s gammaloop-nextest-core> 4: std[bcb96dfbba0ab899]::panicking::panic_handler::{closure#0}<unknown>
  459. 31.06 s gammaloop-nextest-core> at <unknown source file>:<unknown line>
  460. 31.06 s gammaloop-nextest-core> 5: std[bcb96dfbba0ab899]::sys::backtrace::__rust_end_short_backtrace::<std[bcb96dfbba0ab899]::panicking::panic_handler::{closure#0}, !><unknown>
  461. 31.06 s gammaloop-nextest-core> at <unknown source file>:<unknown line>
  462. 31.06 s gammaloop-nextest-core> 6: __rustc[6c289b9f9c454d21]::rust_begin_unwind<unknown>
  463. 31.06 s gammaloop-nextest-core> at <unknown source file>:<unknown line>
  464. 31.06 s gammaloop-nextest-core> 7: core[940e698046960fd5]::panicking::panic_fmt<unknown>
  465. 31.06 s gammaloop-nextest-core> at <unknown source file>:<unknown line>
  466. 31.06 s gammaloop-nextest-core> 8: insta[307a548ac79ef4d9]::runtime::assert_snapshot<unknown>
  467. 31.06 s gammaloop-nextest-core> at <unknown source file>:<unknown line>
  468. 31.06 s gammaloop-nextest-core> 9: test_renormalization[9b33d9b78f5a79c8]::finite_part_ghost_2loop<unknown>
  469. 31.06 s gammaloop-nextest-core> at <unknown source file>:<unknown line>
  470. 31.06 s gammaloop-nextest-core> 10: <test_renormalization[9b33d9b78f5a79c8]::finite_part_ghost_2loop::{closure#0} as core[940e698046960fd5]::ops::function::FnOnce<()>>::call_once<unknown>
  471. 31.06 s gammaloop-nextest-core> at <unknown source file>:<unknown line>
  472. 31.06 s gammaloop-nextest-core> 11: test[75d6903177b1d7e9]::__rust_begin_short_backtrace::<core[940e698046960fd5]::result::Result<(), alloc[2ea6bcb46fca0c42]::string::String>, fn() -> core[940e698046960fd5]::result::Result<(), alloc[2ea6bcb46fca0c42]::string::String>><unknown>
  473. 31.06 s gammaloop-nextest-core> at <unknown source file>:<unknown line>
  474. 31.06 s gammaloop-nextest-core> 12: test[75d6903177b1d7e9]::run_test::{closure#0}<unknown>
  475. 31.06 s gammaloop-nextest-core> at <unknown source file>:<unknown line>
  476. 31.06 s gammaloop-nextest-core> 13: std[bcb96dfbba0ab899]::sys::backtrace::__rust_begin_short_backtrace::<test[75d6903177b1d7e9]::run_test::{closure#1}, ()><unknown>
  477. 31.06 s gammaloop-nextest-core> at <unknown source file>:<unknown line>
  478. 31.06 s gammaloop-nextest-core> 14: <std[bcb96dfbba0ab899]::thread::lifecycle::spawn_unchecked<test[75d6903177b1d7e9]::run_test::{closure#1}, ()>::{closure#1} as core[940e698046960fd5]::ops::function::FnOnce<()>>::call_once::{shim:vtable#0}<unknown>
  479. 31.06 s gammaloop-nextest-core> at <unknown source file>:<unknown line>
  480. 31.06 s gammaloop-nextest-core> 15: <std[bcb96dfbba0ab899]::sys::thread::unix::Thread>::new::thread_start<unknown>
  481. 31.06 s gammaloop-nextest-core> at <unknown source file>:<unknown line>
  482. 31.06 s gammaloop-nextest-core> 16: start_thread<unknown>
  483. 31.06 s gammaloop-nextest-core> at <unknown source file>:<unknown line>
  484. 31.06 s gammaloop-nextest-core> 17: __clone3<unknown>
  485. 31.06 s gammaloop-nextest-core> at <unknown source file>:<unknown line>
  486. 31.06 s gammaloop-nextest-core>
  487. 31.06 s gammaloop-nextest-core> Run with COLORBT_SHOW_HIDDEN=1 environment variable to disable frame filtering.
  488. 31.06 s gammaloop-nextest-core> Run with RUST_BACKTRACE=full to include source snippets.
  489. 31.06 s gammaloop-nextest-core> =========================================
  490. 31.10 s error: Cannot build '/nix/store/2iiczbl9qsl0qn3ffghgnz4hx8kjgvcy-gammaloop-nextest-core.drv'.
  491. 31.10 s Reason: builder failed with exit code 100.
  492. 31.10 s Output paths:
  493. 31.10 s /nix/store/clxqbysad7wrdwbk8x5hpaxpm6a25736-gammaloop-nextest-core
  494. 31.10 s Last 473 log lines:
  495. 31.10 s > Extracting 3 binaries (including 1 non-test binary), 1 build script output directory, and 2 linked paths to /build/nextest-archive-jFELdJ
  496. 31.10 s > Extracted 18 files to /build/nextest-archive-jFELdJ in 0.47s
  497. 31.10 s > ------------
  498. 31.10 s > Nextest run ID c48fbff4-d0a4-432d-ab11-b2e85eae8b1a with nextest profile: ci_gammaloop
  499. 31.10 s > Starting 339 tests across 2 binaries
  500. 31.10 s > ------------
  501. 31.10 s > Summary [ 0.731s] 339 tests run: 339 passed, 0 skipped
  502. 31.10 s >
  503. 31.10 s > ========== nextest test summary ==========
  504. 31.10 s > report: target/nextest/ci_gammaloop/junit.xml
  505. 31.10 s > tests: 339, failures: 0, errors: 0
  506. 31.10 s > No failing testcases found.
  507. 31.10 s > =========================================
  508. 31.10 s > Extracting 1 binary and 1 linked path to /build/nextest-archive-nWZ5Qt
  509. 31.10 s > Extracted 7 files to /build/nextest-archive-nWZ5Qt in 0.06s
  510. 31.10 s > ------------
  511. 31.10 s > Nextest run ID 6d4093ff-321c-4308-a69c-a3544861ba15 with nextest profile: ci_gammaloop
  512. 31.10 s > Starting 19 tests across 1 binary
  513. 31.10 s > ------------
  514. 31.10 s > Summary [ 0.025s] 19 tests run: 19 passed, 0 skipped
  515. 31.10 s >
  516. 31.10 s > ========== nextest test summary ==========
  517. 31.10 s > report: target/nextest/ci_gammaloop/junit.xml
  518. 31.10 s > tests: 19, failures: 0, errors: 0
  519. 31.10 s > No failing testcases found.
  520. 31.10 s > =========================================
  521. 31.10 s > Extracting 1 binary to /build/nextest-archive-GyyDxj
  522. 31.10 s > Extracted 4 files to /build/nextest-archive-GyyDxj in 0.03s
  523. 31.10 s > ------------
  524. 31.10 s > Nextest run ID e4c3dde0-0317-48be-bc99-6c18c3e18806 with nextest profile: ci_gammaloop
  525. 31.10 s > Starting 0 tests across 1 binary
  526. 31.10 s > ------------
  527. 31.10 s > Summary [ 0.000s] 0 tests run: 0 passed, 0 skipped
  528. 31.10 s >
  529. 31.10 s > ========== nextest test summary ==========
  530. 31.10 s > report: target/nextest/ci_gammaloop/junit.xml
  531. 31.10 s > tests: 0, failures: 0, errors: 0
  532. 31.10 s > No failing testcases found.
  533. 31.10 s > =========================================
  534. 31.10 s > Extracting 4 binaries, 1 build script output directory, and 2 linked paths to /build/nextest-archive-L74CoG
  535. 31.10 s > Extracted 18 files to /build/nextest-archive-L74CoG in 0.47s
  536. 31.10 s > ------------
  537. 31.10 s > Nextest run ID 8bb19ae7-49bd-4de9-ae9b-f122bb825fa4 with nextest profile: ci_gammaloop
  538. 31.10 s > Starting 456 tests across 4 binaries (61 tests skipped, including 60 tests via profile.ci_gammaloop.default-filter)
  539. 31.10 s > FAIL [ 0.375s] (444/456) gammalooprs::test_renormalization finit_part_ghlo
  540. 31.10 s > stdout ---
  541. 31.10 s >
  542. 31.10 s > running 1 test
  543. 31.10 s > ren part: 1/2*GC_10^2*dot(P(0,mink(dim)),P(0,mink(dim)))*cas(2,coad(8))/ε
  544. 31.10 s > ━━━━━━━━━━━━━━━━━━━━━━━━━━━━━━━ Snapshot Summary ━━━━━━━━━━━━━━━━━━━━━━━━━━━━━━━
  545. 31.10 s > Snapshot: finit_part_ghlo
  546. 31.10 s > Source: crates/gammalooprs/tests/test_renormalization.rs:557
  547. 31.10 s > ────────────────────────────────────────────────────────────────────────────────
  548. 31.10 s > Expression: align_to_rqft(&a, &model).to_bare_ordered_string()
  549. 31.10 s > ────────────────────────────────────────────────────────────────────────────────
  550. 31.10 s > -old snapshot
  551. 31.10 s > +new results
  552. 31.10 s > ────────────┬───────────────────────────────────────────────────────────────────
  553. 31.10 s > 1 │--1/2*cas(2,coad(8))*dot(P(0,mink(4)),P(0,mink(4)))*gs^2*ε^(-1)
  554. 31.10 s > 1 │+1/2*cas(2,coad(8))*dot(P(0,mink(4)),P(0,mink(4)))*gs^2*ε^(-1)
  555. 31.10 s > ────────────┴───────────────────────────────────────────────────────────────────
  556. 31.10 s > To update snapshots run `cargo insta review`
  557. 31.10 s > Stopped on the first failure. Run `cargo insta test` to run all snapshots.
  558. 31.10 s > test finit_part_ghlo ... FAILED
  559. 31.10 s >
  560. 31.10 s > failures:
  561. 31.10 s >
  562. 31.10 s > failures:
  563. 31.10 s > finit_part_ghlo
  564. 31.10 s >
  565. 31.10 s > test result: FAILED. 0 passed; 1 failed; 0 ignored; 0 measured; 5 filtered out; finished in 0.35s
  566. 31.10 s >
  567. 31.10 s > stderr ---
  568. 31.10 s > The application panicked (crashed).
  569. 31.10 s > Message: snapshot assertion for 'finit_part_ghlo' failed in line 557
  570. 31.10 s > Location: /nix/store/30svmzr0z0zpcqjyynjn7w21wgx18y4b-vendor-cargo-deps/c19b7c6f923b580ac259164a89f2577984ad5ab09ee9d583b888f934adbbe8d0/insta-1.47.2/src/runtime.rs:719
  571. 31.10 s >
  572. 31.10 s > ━━━━━━━━━━━━━━━━━━━━━━━━━━━━━━━━━━ BACKTRACE ━━━━━━━━━━━━━━━━━━━━━━━━━━━━━━━━━━━
  573. 31.10 s > 1: <color_eyre[51793ea62743adbd]::config::PanicHook>::panic_report<unknown>
  574. 31.10 s > at <unknown source file>:<unknown line>
  575. 31.10 s > 2: <color_eyre[51793ea62743adbd]::config::PanicHook>::into_panic_hook::{closure#0}<unknown>
  576. 31.10 s > at <unknown source file>:<unknown line>
  577. 31.10 s > 3: std[bcb96dfbba0ab899]::panicking::panic_with_hook<unknown>
  578. 31.10 s > at <unknown source file>:<unknown line>
  579. 31.10 s > 4: std[bcb96dfbba0ab899]::panicking::panic_handler::{closure#0}<unknown>
  580. 31.10 s > at <unknown source file>:<unknown line>
  581. 31.10 s > 5: std[bcb96dfbba0ab899]::sys::backtrace::__rust_end_short_backtrace::<std[bcb96dfbba0ab899]::panicking::panic_handler::{closure#0}, !><unknown>
  582. 31.10 s > at <unknown source file>:<unknown line>
  583. 31.10 s > 6: __rustc[6c289b9f9c454d21]::rust_begin_unwind<unknown>
  584. 31.10 s > at <unknown source file>:<unknown line>
  585. 31.10 s > 7: core[940e698046960fd5]::panicking::panic_fmt<unknown>
  586. 31.10 s > at <unknown source file>:<unknown line>
  587. 31.10 s > 8: insta[307a548ac79ef4d9]::runtime::assert_snapshot<unknown>
  588. 31.10 s > at <unknown source file>:<unknown line>
  589. 31.10 s > 9: <test_renormalization[9b33d9b78f5a79c8]::finit_part_ghlo::{closure#0} as core[940e698046960fd5]::ops::function::FnOnce<()>>::call_once<unknown>
  590. 31.10 s > at <unknown source file>:<unknown line>
  591. 31.10 s > 10: test[75d6903177b1d7e9]::__rust_begin_short_backtrace::<core[940e698046960fd5]::result::Result<(), alloc[2ea6bcb46fca0c42]::string::String>, fn() -> core[940e698046960fd5]::result::Result<(), alloc[2ea6bcb46fca0c42]::string::String>><unknown>
  592. 31.10 s > at <unknown source file>:<unknown line>
  593. 31.10 s > 11: test[75d6903177b1d7e9]::run_test::{closure#0}<unknown>
  594. 31.10 s > at <unknown source file>:<unknown line>
  595. 31.10 s > 12: std[bcb96dfbba0ab899]::sys::backtrace::__rust_begin_short_backtrace::<test[75d6903177b1d7e9]::run_test::{closure#1}, ()><unknown>
  596. 31.10 s > at <unknown source file>:<unknown line>
  597. 31.10 s > 13: <std[bcb96dfbba0ab899]::thread::lifecycle::spawn_unchecked<test[75d6903177b1d7e9]::run_test::{closure#1}, ()>::{closure#1} as core[940e698046960fd5]::ops::function::FnOnce<()>>::call_once::{shim:vtable#0}<unknown>
  598. 31.10 s > at <unknown source file>:<unknown line>
  599. 31.10 s > 14: <std[bcb96dfbba0ab899]::sys::thread::unix::Thread>::new::thread_start<unknown>
  600. 31.10 s > at <unknown source file>:<unknown line>
  601. 31.10 s > 15: start_thread<unknown>
  602. 31.10 s > at <unknown source file>:<unknown line>
  603. 31.10 s > 16: __clone3<unknown>
  604. 31.10 s > at <unknown source file>:<unknown line>
  605. 31.10 s >
  606. 31.10 s > Run with COLORBT_SHOW_HIDDEN=1 environment variable to disable frame filtering.
  607. 31.10 s > Run with RUST_BACKTRACE=full to include source snippets.
  608. 31.10 s >
  609. 31.10 s > FAIL [ 2.866s] (452/456) gammalooprs::test_renormalization finite_part_ghost_2loop
  610. 31.10 s > stdout ---
  611. 31.10 s >
  612. 31.10 s > running 1 test
  613. 31.10 s > ━━━━━━━━━━━━━━━━━━━━━━━━━━━━━━━ Snapshot Summary ━━━━━━━━━━━━━━━━━━━━━━━━━━━━━━━
  614. 31.10 s > Snapshot: finite_part_ghost_2loop-3
  615. 31.10 s > Source: crates/gammalooprs/tests/test_renormalization.rs:464
  616. 31.10 s > ────────────────────────────────────────────────────────────────────────────────
  617. 31.10 s > Expression: align_to_rqft(&a, &model).to_bare_ordered_string()
  618. 31.10 s > ────────────────────────────────────────────────────────────────────────────────
  619. 31.10 s > -old snapshot
  620. 31.10 s > +new results
  621. 31.10 s > ────────────┬───────────────────────────────────────────────────────────────────
  622. 31.10 s > 1 │-(-1𝑖/32*ε+1𝑖/16)*(cas(2,coad(8)))^2*dot(P(0,mink(4)),P(0,mink(4)))*gs^4*ε^(-2)
  623. 31.10 s > 1 │+(-1𝑖/16+1𝑖/32*ε)*(cas(2,coad(8)))^2*dot(P(0,mink(4)),P(0,mink(4)))*gs^4*ε^(-2)
  624. 31.10 s > ────────────┴───────────────────────────────────────────────────────────────────
  625. 31.10 s > To update snapshots run `cargo insta review`
  626. 31.10 s > Stopped on the first failure. Run `cargo insta test` to run all snapshots.
  627. 31.10 s > test finite_part_ghost_2loop ... FAILED
  628. 31.10 s >
  629. 31.10 s > failures:
  630. 31.10 s >
  631. 31.10 s > failures:
  632. 31.10 s > finite_part_ghost_2loop
  633. 31.10 s >
  634. 31.10 s > test result: FAILED. 0 passed; 1 failed; 0 ignored; 0 measured; 5 filtered out; finished in 2.86s
  635. 31.10 s >
  636. 31.10 s > stderr ---
  637. 31.10 s > The application panicked (crashed).
  638. 31.10 s > Message: snapshot assertion for 'finite_part_ghost_2loop-3' failed in line 464
  639. 31.10 s > Location: /nix/store/30svmzr0z0zpcqjyynjn7w21wgx18y4b-vendor-cargo-deps/c19b7c6f923b580ac259164a89f2577984ad5ab09ee9d583b888f934adbbe8d0/insta-1.47.2/src/runtime.rs:719
  640. 31.10 s >
  641. 31.10 s > ━━━━━━━━━━━━━━━━━━━━━━━━━━━━━━━━━━ BACKTRACE ━━━━━━━━━━━━━━━━━━━━━━━━━━━━━━━━━━━
  642. 31.10 s > 1: <color_eyre[51793ea62743adbd]::config::PanicHook>::panic_report<unknown>
  643. 31.10 s > at <unknown source file>:<unknown line>
  644. 31.10 s > 2: <color_eyre[51793ea62743adbd]::config::PanicHook>::into_panic_hook::{closure#0}<unknown>
  645. 31.10 s > at <unknown source file>:<unknown line>
  646. 31.10 s > 3: std[bcb96dfbba0ab899]::panicking::panic_with_hook<unknown>
  647. 31.10 s > at <unknown source file>:<unknown line>
  648. 31.10 s > 4: std[bcb96dfbba0ab899]::panicking::panic_handler::{closure#0}<unknown>
  649. 31.10 s > at <unknown source file>:<unknown line>
  650. 31.10 s > 5: std[bcb96dfbba0ab899]::sys::backtrace::__rust_end_short_backtrace::<std[bcb96dfbba0ab899]::panicking::panic_handler::{closure#0}, !><unknown>
  651. 31.10 s > at <unknown source file>:<unknown line>
  652. 31.10 s > 6: __rustc[6c289b9f9c454d21]::rust_begin_unwind<unknown>
  653. 31.10 s > at <unknown source file>:<unknown line>
  654. 31.10 s > 7: core[940e698046960fd5]::panicking::panic_fmt<unknown>
  655. 31.10 s > at <unknown source file>:<unknown line>
  656. 31.10 s > 8: insta[307a548ac79ef4d9]::runtime::assert_snapshot<unknown>
  657. 31.10 s > at <unknown source file>:<unknown line>
  658. 31.10 s > 9: test_renormalization[9b33d9b78f5a79c8]::finite_part_ghost_2loop<unknown>
  659. 31.10 s > at <unknown source file>:<unknown line>
  660. 31.10 s > 10: <test_renormalization[9b33d9b78f5a79c8]::finite_part_ghost_2loop::{closure#0} as core[940e698046960fd5]::ops::function::FnOnce<()>>::call_once<unknown>
  661. 31.10 s > at <unknown source file>:<unknown line>
  662. 31.10 s > 11: test[75d6903177b1d7e9]::__rust_begin_short_backtrace::<core[940e698046960fd5]::result::Result<(), alloc[2ea6bcb46fca0c42]::string::String>, fn() -> core[940e698046960fd5]::result::Result<(), alloc[2ea6bcb46fca0c42]::string::String>><unknown>
  663. 31.10 s > at <unknown source file>:<unknown line>
  664. 31.10 s > 12: test[75d6903177b1d7e9]::run_test::{closure#0}<unknown>
  665. 31.10 s > at <unknown source file>:<unknown line>
  666. 31.10 s > 13: std[bcb96dfbba0ab899]::sys::backtrace::__rust_begin_short_backtrace::<test[75d6903177b1d7e9]::run_test::{closure#1}, ()><unknown>
  667. 31.10 s > at <unknown source file>:<unknown line>
  668. 31.10 s > 14: <std[bcb96dfbba0ab899]::thread::lifecycle::spawn_unchecked<test[75d6903177b1d7e9]::run_test::{closure#1}, ()>::{closure#1} as core[940e698046960fd5]::ops::function::FnOnce<()>>::call_once::{shim:vtable#0}<unknown>
  669. 31.10 s > at <unknown source file>:<unknown line>
  670. 31.10 s > 15: <std[bcb96dfbba0ab899]::sys::thread::unix::Thread>::new::thread_start<unknown>
  671. 31.10 s > at <unknown source file>:<unknown line>
  672. 31.10 s > 16: start_thread<unknown>
  673. 31.10 s > at <unknown source file>:<unknown line>
  674. 31.10 s > 17: __clone3<unknown>
  675. 31.10 s > at <unknown source file>:<unknown line>
  676. 31.10 s >
  677. 31.10 s > Run with COLORBT_SHOW_HIDDEN=1 environment variable to disable frame filtering.
  678. 31.10 s > Run with RUST_BACKTRACE=full to include source snippets.
  679. 31.10 s >
  680. 31.10 s > ------------
  681. 31.10 s > Summary [ 9.329s] 456 tests run: 454 passed, 2 failed, 61 skipped
  682. 31.10 s > FAIL [ 0.375s] (444/456) gammalooprs::test_renormalization finit_part_ghlo
  683. 31.10 s > stdout ---
  684. 31.10 s >
  685. 31.10 s > running 1 test
  686. 31.10 s > ren part: 1/2*GC_10^2*dot(P(0,mink(dim)),P(0,mink(dim)))*cas(2,coad(8))/ε
  687. 31.10 s > ━━━━━━━━━━━━━━━━━━━━━━━━━━━━━━━ Snapshot Summary ━━━━━━━━━━━━━━━━━━━━━━━━━━━━━━━
  688. 31.10 s > Snapshot: finit_part_ghlo
  689. 31.10 s > Source: crates/gammalooprs/tests/test_renormalization.rs:557
  690. 31.10 s > ────────────────────────────────────────────────────────────────────────────────
  691. 31.10 s > Expression: align_to_rqft(&a, &model).to_bare_ordered_string()
  692. 31.10 s > ────────────────────────────────────────────────────────────────────────────────
  693. 31.10 s > -old snapshot
  694. 31.10 s > +new results
  695. 31.10 s > ────────────┬───────────────────────────────────────────────────────────────────
  696. 31.10 s > 1 │--1/2*cas(2,coad(8))*dot(P(0,mink(4)),P(0,mink(4)))*gs^2*ε^(-1)
  697. 31.10 s > 1 │+1/2*cas(2,coad(8))*dot(P(0,mink(4)),P(0,mink(4)))*gs^2*ε^(-1)
  698. 31.10 s > ────────────┴───────────────────────────────────────────────────────────────────
  699. 31.10 s > To update snapshots run `cargo insta review`
  700. 31.10 s > Stopped on the first failure. Run `cargo insta test` to run all snapshots.
  701. 31.10 s > test finit_part_ghlo ... FAILED
  702. 31.10 s >
  703. 31.10 s > failures:
  704. 31.10 s >
  705. 31.10 s > failures:
  706. 31.10 s > finit_part_ghlo
  707. 31.10 s >
  708. 31.10 s > test result: FAILED. 0 passed; 1 failed; 0 ignored; 0 measured; 5 filtered out; finished in 0.35s
  709. 31.10 s >
  710. 31.10 s > stderr ---
  711. 31.10 s > The application panicked (crashed).
  712. 31.10 s > Message: snapshot assertion for 'finit_part_ghlo' failed in line 557
  713. 31.10 s > Location: /nix/store/30svmzr0z0zpcqjyynjn7w21wgx18y4b-vendor-cargo-deps/c19b7c6f923b580ac259164a89f2577984ad5ab09ee9d583b888f934adbbe8d0/insta-1.47.2/src/runtime.rs:719
  714. 31.10 s >
  715. 31.10 s > ━━━━━━━━━━━━━━━━━━━━━━━━━━━━━━━━━━ BACKTRACE ━━━━━━━━━━━━━━━━━━━━━━━━━━━━━━━━━━━
  716. 31.10 s > 1: <color_eyre[51793ea62743adbd]::config::PanicHook>::panic_report<unknown>
  717. 31.10 s > at <unknown source file>:<unknown line>
  718. 31.10 s > 2: <color_eyre[51793ea62743adbd]::config::PanicHook>::into_panic_hook::{closure#0}<unknown>
  719. 31.10 s > at <unknown source file>:<unknown line>
  720. 31.10 s > 3: std[bcb96dfbba0ab899]::panicking::panic_with_hook<unknown>
  721. 31.10 s > at <unknown source file>:<unknown line>
  722. 31.10 s > 4: std[bcb96dfbba0ab899]::panicking::panic_handler::{closure#0}<unknown>
  723. 31.10 s > at <unknown source file>:<unknown line>
  724. 31.10 s > 5: std[bcb96dfbba0ab899]::sys::backtrace::__rust_end_short_backtrace::<std[bcb96dfbba0ab899]::panicking::panic_handler::{closure#0}, !><unknown>
  725. 31.10 s > at <unknown source file>:<unknown line>
  726. 31.10 s > 6: __rustc[6c289b9f9c454d21]::rust_begin_unwind<unknown>
  727. 31.10 s > at <unknown source file>:<unknown line>
  728. 31.10 s > 7: core[940e698046960fd5]::panicking::panic_fmt<unknown>
  729. 31.10 s > at <unknown source file>:<unknown line>
  730. 31.10 s > 8: insta[307a548ac79ef4d9]::runtime::assert_snapshot<unknown>
  731. 31.10 s > at <unknown source file>:<unknown line>
  732. 31.10 s > 9: <test_renormalization[9b33d9b78f5a79c8]::finit_part_ghlo::{closure#0} as core[940e698046960fd5]::ops::function::FnOnce<()>>::call_once<unknown>
  733. 31.10 s > at <unknown source file>:<unknown line>
  734. 31.10 s > 10: test[75d6903177b1d7e9]::__rust_begin_short_backtrace::<core[940e698046960fd5]::result::Result<(), alloc[2ea6bcb46fca0c42]::string::String>, fn() -> core[940e698046960fd5]::result::Result<(), alloc[2ea6bcb46fca0c42]::string::String>><unknown>
  735. 31.10 s > at <unknown source file>:<unknown line>
  736. 31.10 s > 11: test[75d6903177b1d7e9]::run_test::{closure#0}<unknown>
  737. 31.10 s > at <unknown source file>:<unknown line>
  738. 31.10 s > 12: std[bcb96dfbba0ab899]::sys::backtrace::__rust_begin_short_backtrace::<test[75d6903177b1d7e9]::run_test::{closure#1}, ()><unknown>
  739. 31.10 s > at <unknown source file>:<unknown line>
  740. 31.10 s > 13: <std[bcb96dfbba0ab899]::thread::lifecycle::spawn_unchecked<test[75d6903177b1d7e9]::run_test::{closure#1}, ()>::{closure#1} as core[940e698046960fd5]::ops::function::FnOnce<()>>::call_once::{shim:vtable#0}<unknown>
  741. 31.10 s > at <unknown source file>:<unknown line>
  742. 31.10 s > 14: <std[bcb96dfbba0ab899]::sys::thread::unix::Thread>::new::thread_start<unknown>
  743. 31.10 s > at <unknown source file>:<unknown line>
  744. 31.10 s > 15: start_thread<unknown>
  745. 31.10 s > at <unknown source file>:<unknown line>
  746. 31.10 s > 16: __clone3<unknown>
  747. 31.10 s > at <unknown source file>:<unknown line>
  748. 31.10 s >
  749. 31.10 s > Run with COLORBT_SHOW_HIDDEN=1 environment variable to disable frame filtering.
  750. 31.10 s > Run with RUST_BACKTRACE=full to include source snippets.
  751. 31.10 s >
  752. 31.10 s > FAIL [ 2.866s] (452/456) gammalooprs::test_renormalization finite_part_ghost_2loop
  753. 31.10 s > stdout ---
  754. 31.10 s >
  755. 31.10 s > running 1 test
  756. 31.10 s > ━━━━━━━━━━━━━━━━━━━━━━━━━━━━━━━ Snapshot Summary ━━━━━━━━━━━━━━━━━━━━━━━━━━━━━━━
  757. 31.10 s > Snapshot: finite_part_ghost_2loop-3
  758. 31.10 s > Source: crates/gammalooprs/tests/test_renormalization.rs:464
  759. 31.10 s > ────────────────────────────────────────────────────────────────────────────────
  760. 31.10 s > Expression: align_to_rqft(&a, &model).to_bare_ordered_string()
  761. 31.10 s > ────────────────────────────────────────────────────────────────────────────────
  762. 31.10 s > -old snapshot
  763. 31.10 s > +new results
  764. 31.10 s > ────────────┬───────────────────────────────────────────────────────────────────
  765. 31.10 s > 1 │-(-1𝑖/32*ε+1𝑖/16)*(cas(2,coad(8)))^2*dot(P(0,mink(4)),P(0,mink(4)))*gs^4*ε^(-2)
  766. 31.10 s > 1 │+(-1𝑖/16+1𝑖/32*ε)*(cas(2,coad(8)))^2*dot(P(0,mink(4)),P(0,mink(4)))*gs^4*ε^(-2)
  767. 31.10 s > ────────────┴───────────────────────────────────────────────────────────────────
  768. 31.10 s > To update snapshots run `cargo insta review`
  769. 31.10 s > Stopped on the first failure. Run `cargo insta test` to run all snapshots.
  770. 31.10 s > test finite_part_ghost_2loop ... FAILED
  771. 31.10 s >
  772. 31.10 s > failures:
  773. 31.10 s >
  774. 31.10 s > failures:
  775. 31.10 s > finite_part_ghost_2loop
  776. 31.10 s >
  777. 31.10 s > test result: FAILED. 0 passed; 1 failed; 0 ignored; 0 measured; 5 filtered out; finished in 2.86s
  778. 31.10 s >
  779. 31.10 s > stderr ---
  780. 31.10 s > The application panicked (crashed).
  781. 31.10 s > Message: snapshot assertion for 'finite_part_ghost_2loop-3' failed in line 464
  782. 31.10 s > Location: /nix/store/30svmzr0z0zpcqjyynjn7w21wgx18y4b-vendor-cargo-deps/c19b7c6f923b580ac259164a89f2577984ad5ab09ee9d583b888f934adbbe8d0/insta-1.47.2/src/runtime.rs:719
  783. 31.10 s >
  784. 31.10 s > ━━━━━━━━━━━━━━━━━━━━━━━━━━━━━━━━━━ BACKTRACE ━━━━━━━━━━━━━━━━━━━━━━━━━━━━━━━━━━━
  785. 31.10 s > 1: <color_eyre[51793ea62743adbd]::config::PanicHook>::panic_report<unknown>
  786. 31.10 s > at <unknown source file>:<unknown line>
  787. 31.10 s > 2: <color_eyre[51793ea62743adbd]::config::PanicHook>::into_panic_hook::{closure#0}<unknown>
  788. 31.10 s > at <unknown source file>:<unknown line>
  789. 31.10 s > 3: std[bcb96dfbba0ab899]::panicking::panic_with_hook<unknown>
  790. 31.10 s > at <unknown source file>:<unknown line>
  791. 31.10 s > 4: std[bcb96dfbba0ab899]::panicking::panic_handler::{closure#0}<unknown>
  792. 31.10 s > at <unknown source file>:<unknown line>
  793. 31.10 s > 5: std[bcb96dfbba0ab899]::sys::backtrace::__rust_end_short_backtrace::<std[bcb96dfbba0ab899]::panicking::panic_handler::{closure#0}, !><unknown>
  794. 31.10 s > at <unknown source file>:<unknown line>
  795. 31.10 s > 6: __rustc[6c289b9f9c454d21]::rust_begin_unwind<unknown>
  796. 31.10 s > at <unknown source file>:<unknown line>
  797. 31.10 s > 7: core[940e698046960fd5]::panicking::panic_fmt<unknown>
  798. 31.10 s > at <unknown source file>:<unknown line>
  799. 31.10 s > 8: insta[307a548ac79ef4d9]::runtime::assert_snapshot<unknown>
  800. 31.10 s > at <unknown source file>:<unknown line>
  801. 31.10 s > 9: test_renormalization[9b33d9b78f5a79c8]::finite_part_ghost_2loop<unknown>
  802. 31.10 s > at <unknown source file>:<unknown line>
  803. 31.10 s > 10: <test_renormalization[9b33d9b78f5a79c8]::finite_part_ghost_2loop::{closure#0} as core[940e698046960fd5]::ops::function::FnOnce<()>>::call_once<unknown>
  804. 31.10 s > at <unknown source file>:<unknown line>
  805. 31.10 s > 11: test[75d6903177b1d7e9]::__rust_begin_short_backtrace::<core[940e698046960fd5]::result::Result<(), alloc[2ea6bcb46fca0c42]::string::String>, fn() -> core[940e698046960fd5]::result::Result<(), alloc[2ea6bcb46fca0c42]::string::String>><unknown>
  806. 31.10 s > at <unknown source file>:<unknown line>
  807. 31.10 s > 12: test[75d6903177b1d7e9]::run_test::{closure#0}<unknown>
  808. 31.10 s > at <unknown source file>:<unknown line>
  809. 31.10 s > 13: std[bcb96dfbba0ab899]::sys::backtrace::__rust_begin_short_backtrace::<test[75d6903177b1d7e9]::run_test::{closure#1}, ()><unknown>
  810. 31.10 s > at <unknown source file>:<unknown line>
  811. 31.10 s > 14: <std[bcb96dfbba0ab899]::thread::lifecycle::spawn_unchecked<test[75d6903177b1d7e9]::run_test::{closure#1}, ()>::{closure#1} as core[940e698046960fd5]::ops::function::FnOnce<()>>::call_once::{shim:vtable#0}<unknown>
  812. 31.10 s > at <unknown source file>:<unknown line>
  813. 31.10 s > 15: <std[bcb96dfbba0ab899]::sys::thread::unix::Thread>::new::thread_start<unknown>
  814. 31.10 s > at <unknown source file>:<unknown line>
  815. 31.10 s > 16: start_thread<unknown>
  816. 31.10 s > at <unknown source file>:<unknown line>
  817. 31.10 s > 17: __clone3<unknown>
  818. 31.10 s > at <unknown source file>:<unknown line>
  819. 31.10 s >
  820. 31.10 s > Run with COLORBT_SHOW_HIDDEN=1 environment variable to disable frame filtering.
  821. 31.10 s > Run with RUST_BACKTRACE=full to include source snippets.
  822. 31.10 s >
  823. 31.10 s > error: test run failed
  824. 31.10 s >
  825. 31.10 s > ========== nextest test summary ==========
  826. 31.10 s > report: target/nextest/ci_gammaloop/junit.xml
  827. 31.10 s > tests: 456, failures: 2, errors: 0
  828. 31.10 s >
  829. 31.10 s > 1. gammalooprs::test_renormalization::finit_part_ghlo
  830. 31.10 s > failure: test failure with exit code 101
  831. 31.10 s > system-out
  832. 31.10 s > running 1 test
  833. 31.10 s > ren part: 1/2*GC_10^2*dot(P(0,mink(dim)),P(0,mink(dim)))*cas(2,coad(8))/ε
  834. 31.10 s > ━━━━━━━━━━━━━━━━━━━━━━━━━━━━━━━ Snapshot Summary ━━━━━━━━━━━━━━━━━━━━━━━━━━━━━━━
  835. 31.10 s > Snapshot: finit_part_ghlo
  836. 31.10 s > Source: crates/gammalooprs/tests/test_renormalization.rs:557
  837. 31.10 s > ────────────────────────────────────────────────────────────────────────────────
  838. 31.10 s > Expression: align_to_rqft(&a, &model).to_bare_ordered_string()
  839. 31.10 s > ────────────────────────────────────────────────────────────────────────────────
  840. 31.10 s > -old snapshot
  841. 31.10 s > +new results
  842. 31.10 s > ────────────┬───────────────────────────────────────────────────────────────────
  843. 31.10 s > 1 │--1/2*cas(2,coad(8))*dot(P(0,mink(4)),P(0,mink(4)))*gs^2*ε^(-1)
  844. 31.10 s > 1 │+1/2*cas(2,coad(8))*dot(P(0,mink(4)),P(0,mink(4)))*gs^2*ε^(-1)
  845. 31.10 s > ────────────┴───────────────────────────────────────────────────────────────────
  846. 31.10 s > To update snapshots run `cargo insta review`
  847. 31.10 s > Stopped on the first failure. Run `cargo insta test` to run all snapshots.
  848. 31.10 s > test finit_part_ghlo ... FAILED
  849. 31.10 s >
  850. 31.10 s > failures:
  851. 31.10 s >
  852. 31.10 s > failures:
  853. 31.10 s > finit_part_ghlo
  854. 31.10 s >
  855. 31.10 s > test result: FAILED. 0 passed; 1 failed; 0 ignored; 0 measured; 5 filtered out; finished in 0.35s
  856. 31.10 s > system-err
  857. 31.10 s > The application panicked (crashed).
  858. 31.10 s > Message: snapshot assertion for 'finit_part_ghlo' failed in line 557
  859. 31.10 s > Location: /nix/store/30svmzr0z0zpcqjyynjn7w21wgx18y4b-vendor-cargo-deps/c19b7c6f923b580ac259164a89f2577984ad5ab09ee9d583b888f934adbbe8d0/insta-1.47.2/src/runtime.rs:719
  860. 31.10 s >
  861. 31.10 s > ━━━━━━━━━━━━━━━━━━━━━━━━━━━━━━━━━━ BACKTRACE ━━━━━━━━━━━━━━━━━━━━━━━━━━━━━━━━━━━
  862. 31.10 s > 1: <color_eyre[51793ea62743adbd]::config::PanicHook>::panic_report<unknown>
  863. 31.10 s > at <unknown source file>:<unknown line>
  864. 31.10 s > 2: <color_eyre[51793ea62743adbd]::config::PanicHook>::into_panic_hook::{closure#0}<unknown>
  865. 31.10 s > at <unknown source file>:<unknown line>
  866. 31.10 s > 3: std[bcb96dfbba0ab899]::panicking::panic_with_hook<unknown>
  867. 31.10 s > at <unknown source file>:<unknown line>
  868. 31.10 s > 4: std[bcb96dfbba0ab899]::panicking::panic_handler::{closure#0}<unknown>
  869. 31.10 s > at <unknown source file>:<unknown line>
  870. 31.10 s > 5: std[bcb96dfbba0ab899]::sys::backtrace::__rust_end_short_backtrace::<std[bcb96dfbba0ab899]::panicking::panic_handler::{closure#0}, !><unknown>
  871. 31.10 s > at <unknown source file>:<unknown line>
  872. 31.10 s > 6: __rustc[6c289b9f9c454d21]::rust_begin_unwind<unknown>
  873. 31.10 s > at <unknown source file>:<unknown line>
  874. 31.10 s > 7: core[940e698046960fd5]::panicking::panic_fmt<unknown>
  875. 31.10 s > at <unknown source file>:<unknown line>
  876. 31.10 s > 8: insta[307a548ac79ef4d9]::runtime::assert_snapshot<unknown>
  877. 31.10 s > at <unknown source file>:<unknown line>
  878. 31.10 s > 9: <test_renormalization[9b33d9b78f5a79c8]::finit_part_ghlo::{closure#0} as core[940e698046960fd5]::ops::function::FnOnce<()>>::call_once<unknown>
  879. 31.10 s > at <unknown source file>:<unknown line>
  880. 31.10 s > 10: test[75d6903177b1d7e9]::__rust_begin_short_backtrace::<core[940e698046960fd5]::result::Result<(), alloc[2ea6bcb46fca0c42]::string::String>, fn() -> core[940e698046960fd5]::result::Result<(), alloc[2ea6bcb46fca0c42]::string::String>><unknown>
  881. 31.10 s > at <unknown source file>:<unknown line>
  882. 31.10 s > 11: test[75d6903177b1d7e9]::run_test::{closure#0}<unknown>
  883. 31.10 s > at <unknown source file>:<unknown line>
  884. 31.10 s > 12: std[bcb96dfbba0ab899]::sys::backtrace::__rust_begin_short_backtrace::<test[75d6903177b1d7e9]::run_test::{closure#1}, ()><unknown>
  885. 31.10 s > at <unknown source file>:<unknown line>
  886. 31.10 s > 13: <std[bcb96dfbba0ab899]::thread::lifecycle::spawn_unchecked<test[75d6903177b1d7e9]::run_test::{closure#1}, ()>::{closure#1} as core[940e698046960fd5]::ops::function::FnOnce<()>>::call_once::{shim:vtable#0}<unknown>
  887. 31.10 s > at <unknown source file>:<unknown line>
  888. 31.10 s > 14: <std[bcb96dfbba0ab899]::sys::thread::unix::Thread>::new::thread_start<unknown>
  889. 31.10 s > at <unknown source file>:<unknown line>
  890. 31.10 s > 15: start_thread<unknown>
  891. 31.10 s > at <unknown source file>:<unknown line>
  892. 31.10 s > 16: __clone3<unknown>
  893. 31.10 s > at <unknown source file>:<unknown line>
  894. 31.10 s >
  895. 31.10 s > Run with COLORBT_SHOW_HIDDEN=1 environment variable to disable frame filtering.
  896. 31.10 s > Run with RUST_BACKTRACE=full to include source snippets.
  897. 31.10 s >
  898. 31.10 s > 2. gammalooprs::test_renormalization::finite_part_ghost_2loop
  899. 31.10 s > failure: test failure with exit code 101
  900. 31.10 s > system-out
  901. 31.10 s > running 1 test
  902. 31.10 s > ━━━━━━━━━━━━━━━━━━━━━━━━━━━━━━━ Snapshot Summary ━━━━━━━━━━━━━━━━━━━━━━━━━━━━━━━
  903. 31.10 s > Snapshot: finite_part_ghost_2loop-3
  904. 31.10 s > Source: crates/gammalooprs/tests/test_renormalization.rs:464
  905. 31.10 s > ────────────────────────────────────────────────────────────────────────────────
  906. 31.10 s > Expression: align_to_rqft(&a, &model).to_bare_ordered_string()
  907. 31.10 s > ────────────────────────────────────────────────────────────────────────────────
  908. 31.10 s > -old snapshot
  909. 31.10 s > +new results
  910. 31.10 s > ────────────┬───────────────────────────────────────────────────────────────────
  911. 31.10 s > 1 │-(-1𝑖/32*ε+1𝑖/16)*(cas(2,coad(8)))^2*dot(P(0,mink(4)),P(0,mink(4)))*gs^4*ε^(-2)
  912. 31.10 s > 1 │+(-1𝑖/16+1𝑖/32*ε)*(cas(2,coad(8)))^2*dot(P(0,mink(4)),P(0,mink(4)))*gs^4*ε^(-2)
  913. 31.10 s > ────────────┴───────────────────────────────────────────────────────────────────
  914. 31.10 s > To update snapshots run `cargo insta review`
  915. 31.10 s > Stopped on the first failure. Run `cargo insta test` to run all snapshots.
  916. 31.10 s > test finite_part_ghost_2loop ... FAILED
  917. 31.10 s >
  918. 31.10 s > failures:
  919. 31.10 s >
  920. 31.10 s > failures:
  921. 31.10 s > finite_part_ghost_2loop
  922. 31.10 s >
  923. 31.10 s > test result: FAILED. 0 passed; 1 failed; 0 ignored; 0 measured; 5 filtered out; finished in 2.86s
  924. 31.10 s > system-err
  925. 31.10 s > The application panicked (crashed).
  926. 31.10 s > Message: snapshot assertion for 'finite_part_ghost_2loop-3' failed in line 464
  927. 31.10 s > Location: /nix/store/30svmzr0z0zpcqjyynjn7w21wgx18y4b-vendor-cargo-deps/c19b7c6f923b580ac259164a89f2577984ad5ab09ee9d583b888f934adbbe8d0/insta-1.47.2/src/runtime.rs:719
  928. 31.10 s >
  929. 31.10 s > ━━━━━━━━━━━━━━━━━━━━━━━━━━━━━━━━━━ BACKTRACE ━━━━━━━━━━━━━━━━━━━━━━━━━━━━━━━━━━━
  930. 31.10 s > 1: <color_eyre[51793ea62743adbd]::config::PanicHook>::panic_report<unknown>
  931. 31.10 s > at <unknown source file>:<unknown line>
  932. 31.10 s > 2: <color_eyre[51793ea62743adbd]::config::PanicHook>::into_panic_hook::{closure#0}<unknown>
  933. 31.10 s > at <unknown source file>:<unknown line>
  934. 31.10 s > 3: std[bcb96dfbba0ab899]::panicking::panic_with_hook<unknown>
  935. 31.10 s > at <unknown source file>:<unknown line>
  936. 31.10 s > 4: std[bcb96dfbba0ab899]::panicking::panic_handler::{closure#0}<unknown>
  937. 31.10 s > at <unknown source file>:<unknown line>
  938. 31.10 s > 5: std[bcb96dfbba0ab899]::sys::backtrace::__rust_end_short_backtrace::<std[bcb96dfbba0ab899]::panicking::panic_handler::{closure#0}, !><unknown>
  939. 31.10 s > at <unknown source file>:<unknown line>
  940. 31.10 s > 6: __rustc[6c289b9f9c454d21]::rust_begin_unwind<unknown>
  941. 31.10 s > at <unknown source file>:<unknown line>
  942. 31.10 s > 7: core[940e698046960fd5]::panicking::panic_fmt<unknown>
  943. 31.10 s > at <unknown source file>:<unknown line>
  944. 31.10 s > 8: insta[307a548ac79ef4d9]::runtime::assert_snapshot<unknown>
  945. 31.10 s > at <unknown source file>:<unknown line>
  946. 31.10 s > 9: test_renormalization[9b33d9b78f5a79c8]::finite_part_ghost_2loop<unknown>
  947. 31.10 s > at <unknown source file>:<unknown line>
  948. 31.10 s > 10: <test_renormalization[9b33d9b78f5a79c8]::finite_part_ghost_2loop::{closure#0} as core[940e698046960fd5]::ops::function::FnOnce<()>>::call_once<unknown>
  949. 31.10 s > at <unknown source file>:<unknown line>
  950. 31.10 s > 11: test[75d6903177b1d7e9]::__rust_begin_short_backtrace::<core[940e698046960fd5]::result::Result<(), alloc[2ea6bcb46fca0c42]::string::String>, fn() -> core[940e698046960fd5]::result::Result<(), alloc[2ea6bcb46fca0c42]::string::String>><unknown>
  951. 31.10 s > at <unknown source file>:<unknown line>
  952. 31.10 s > 12: test[75d6903177b1d7e9]::run_test::{closure#0}<unknown>
  953. 31.10 s > at <unknown source file>:<unknown line>
  954. 31.10 s > 13: std[bcb96dfbba0ab899]::sys::backtrace::__rust_begin_short_backtrace::<test[75d6903177b1d7e9]::run_test::{closure#1}, ()><unknown>
  955. 31.10 s > at <unknown source file>:<unknown line>
  956. 31.10 s > 14: <std[bcb96dfbba0ab899]::thread::lifecycle::spawn_unchecked<test[75d6903177b1d7e9]::run_test::{closure#1}, ()>::{closure#1} as core[940e698046960fd5]::ops::function::FnOnce<()>>::call_once::{shim:vtable#0}<unknown>
  957. 31.10 s > at <unknown source file>:<unknown line>
  958. 31.10 s > 15: <std[bcb96dfbba0ab899]::sys::thread::unix::Thread>::new::thread_start<unknown>
  959. 31.10 s > at <unknown source file>:<unknown line>
  960. 31.10 s > 16: start_thread<unknown>
  961. 31.10 s > at <unknown source file>:<unknown line>
  962. 31.10 s > 17: __clone3<unknown>
  963. 31.10 s > at <unknown source file>:<unknown line>
  964. 31.10 s >
  965. 31.10 s > Run with COLORBT_SHOW_HIDDEN=1 environment variable to disable frame filtering.
  966. 31.10 s > Run with RUST_BACKTRACE=full to include source snippets.
  967. 31.10 s > =========================================
  968. 31.10 s For full logs, run:
  969. 31.10 s nix log /nix/store/2iiczbl9qsl0qn3ffghgnz4hx8kjgvcy-gammaloop-nextest-core.drv
  970. 31.18 s [0 built (1 failed), 0.0Run failed.