test packages.x86_64-linux.nix-ci-check-gammaloop-nextest-spenso

Reproduce this run
Retry Run
  1. 0.07 s $ /nix/store/9ypz3flqsrl5xl495mm8h645gadjsxi1-coreutils-9.11/bin/timeout --kill-after=15s 7200s /nix/store/23zk8sgzamrbmj1fday15szf7f2279s8-nix-2.34.7/bin/nix --extra-experimental-features nix-command --extra-experimental-features flakes flake clone git+https://github.com/alphal00p/gammaloop --dest /tmp/nix-ci-worker/stable-pwd/repo/
  2. 0.09 s Cloning into '/tmp/nix-ci-worker/stable-pwd/repo'...
  3. 0.72 s remote: Enumerating objects: 65231, done.
  4. 0.84 s remote: Counting objects: 0% (1/7903) remote: Counting objects: 1% (80/7903) remote: Counting objects: 2% (159/7903) remote: Counting objects: 3% (238/7903) remote: Counting objects: 4% (317/7903) remote: Counting objects: 5% (396/7903) remote: Counting objects: 6% (475/7903) remote: Counting objects: 7% (554/7903) remote: Counting objects: 8% (633/7903) remote: Counting objects: 9% (712/7903) remote: Counting objects: 10% (791/7903) remote: Counting objects: 11% (870/7903) remote: Counting objects: 12% (949/7903) remote: Counting objects: 13% (1028/7903) remote: Counting objects: 14% (1107/7903) remote: Counting objects: 15% (1186/7903) remote: Counting objects: 16% (1265/7903) remote: Counting objects: 17% (1344/7903) remote: Counting objects: 18% (1423/7903) remote: Counting objects: 19% (1502/7903) remote: Counting objects: 20% (1581/7903) remote: Counting objects: 21% (1660/7903) remote: Counting objects: 22% (1739/7903) remote: Counting objects: 23% (1818/7903) remote: Counting objects: 24% (1897/7903) remote: Counting objects: 25% (1976/7903) remote: Counting objects: 26% (2055/7903) remote: Counting objects: 27% (2134/7903) remote: Counting objects: 28% (2213/7903) remote: Counting objects: 29% (2292/7903) remote: Counting objects: 30% (2371/7903) remote: Counting objects: 31% (2450/7903) remote: Counting objects: 32% (2529/7903) remote: Counting objects: 33% (2608/7903) remote: Counting objects: 34% (2688/7903) remote: Counting objects: 35% (2767/7903) remote: Counting objects: 36% (2846/7903) remote: Counting objects: 37% (2925/7903) remote: Counting objects: 38% (3004/7903) remote: Counting objects: 39% (3083/7903) remote: Counting objects: 40% (3162/7903) remote: Counting objects: 41% (3241/7903) remote: Counting objects: 42% (3320/7903) remote: Counting objects: 43% (3399/7903) remote: Counting objects: 44% (3478/7903) remote: Counting objects: 45% (3557/7903) remote: Counting objects: 46% (3636/7903) remote: Counting objects: 47% (3715/7903) remote: Counting objects: 48% (3794/7903) remote: Counting objects: 49% (3873/7903) remote: Counting objects: 50% (3952/7903) remote: Counting objects: 51% (4031/7903) remote: Counting objects: 52% (4110/7903) remote: Counting objects: 53% (4189/7903) remote: Counting objects: 54% (4268/7903) remote: Counting objects: 55% (4347/7903) remote: Counting objects: 56% (4426/7903) remote: Counting objects: 57% (4505/7903) remote: Counting objects: 58% (4584/7903) remote: Counting objects: 59% (4663/7903) remote: Counting objects: 60% (4742/7903) remote: Counting objects: 61% (4821/7903) remote: Counting objects: 62% (4900/7903) remote: Counting objects: 63% (4979/7903) remote: Counting objects: 64% (5058/7903) remote: Counting objects: 65% (5137/7903) remote: Counting objects: 66% (5216/7903) remote: Counting objects: 67% (5296/7903) remote: Counting objects: 68% (5375/7903) remote: Counting objects: 69% (5454/7903) remote: Counting objects: 70% (5533/7903) remote: Counting objects: 71% (5612/7903) remote: Counting objects: 72% (5691/7903) remote: Counting objects: 73% (5770/7903) remote: Counting objects: 74% (5849/7903) remote: Counting objects: 75% (5928/7903) remote: Counting objects: 76% (6007/7903) remote: Counting objects: 77% (6086/7903) remote: Counting objects: 78% (6165/7903) remote: Counting objects: 79% (6244/7903) remote: Counting objects: 80% (6323/7903) remote: Counting objects: 81% (6402/7903) remote: Counting objects: 82% (6481/7903) remote: Counting objects: 83% (6560/7903) remote: Counting objects: 84% (6639/7903) remote: Counting objects: 85% (6718/7903) remote: Counting objects: 86% (6797/7903) remote: Counting objects: 87% (6876/7903) remote: Counting objects: 88% (6955/7903) remote: Counting objects: 89% (7034/7903) remote: Counting objects: 90% (7113/7903) remote: Counting objects: 91% (7192/7903) remote: Counting objects: 92% (7271/7903) remote: Counting objects: 93% (7350/7903) remote: Counting objects: 94% (7429/7903) remote: Counting objects: 95% (7508/7903) remote: Counting objects: 96% (7587/7903) remote: Counting objects: 97% (7666/7903) remote: Counting objects: 98% (7745/7903) remote: Counting objects: 99% (7824/7903) remote: Counting objects: 100% (7903/7903) remote: Counting objects: 100% (7903/7903), done.
  5. 2.44 s remote: Compressing objects: 0% (1/1561) remote: Compressing objects: 1% (16/1561) remote: Compressing objects: 2% (32/1561) remote: Compressing objects: 3% (47/1561) remote: Compressing objects: 4% (63/1561) remote: Compressing objects: 5% (79/1561) remote: Compressing objects: 6% (94/1561) remote: Compressing objects: 7% (110/1561) remote: Compressing objects: 8% (125/1561) remote: Compressing objects: 9% (141/1561) remote: Compressing objects: 10% (157/1561) remote: Compressing objects: 11% (172/1561) remote: Compressing objects: 12% (188/1561) remote: Compressing objects: 13% (203/1561) remote: Compressing objects: 14% (219/1561) remote: Compressing objects: 15% (235/1561) remote: Compressing objects: 15% (242/1561) remote: Compressing objects: 16% (250/1561) remote: Compressing objects: 17% (266/1561) remote: Compressing objects: 18% (281/1561) remote: Compressing objects: 19% (297/1561) remote: Compressing objects: 20% (313/1561) remote: Compressing objects: 21% (328/1561) remote: Compressing objects: 22% (344/1561) remote: Compressing objects: 23% (360/1561) remote: Compressing objects: 24% (375/1561) remote: Compressing objects: 25% (391/1561) remote: Compressing objects: 26% (406/1561) remote: Compressing objects: 27% (422/1561) remote: Compressing objects: 28% (438/1561) remote: Compressing objects: 29% (453/1561) remote: Compressing objects: 30% (469/1561) remote: Compressing objects: 31% (484/1561) remote: Compressing objects: 32% (500/1561) remote: Compressing objects: 33% (516/1561) remote: Compressing objects: 34% (531/1561) remote: Compressing objects: 35% (547/1561) remote: Compressing objects: 36% (562/1561) remote: Compressing objects: 37% (578/1561) remote: Compressing objects: 38% (594/1561) remote: Compressing objects: 39% (609/1561) remote: Compressing objects: 40% (625/1561) remote: Compressing objects: 41% (641/1561) remote: Compressing objects: 42% (656/1561) remote: Compressing objects: 43% (672/1561) remote: Compressing objects: 44% (687/1561) remote: Compressing objects: 45% (703/1561) remote: Compressing objects: 46% (719/1561) remote: Compressing objects: 47% (734/1561) remote: Compressing objects: 48% (750/1561) remote: Compressing objects: 49% (765/1561) remote: Compressing objects: 50% (781/1561) remote: Compressing objects: 51% (797/1561) remote: Compressing objects: 52% (812/1561) remote: Compressing objects: 53% (828/1561) remote: Compressing objects: 54% (843/1561) remote: Compressing objects: 55% (859/1561) remote: Compressing objects: 56% (875/1561) remote: Compressing objects: 57% (890/1561) remote: Compressing objects: 58% (906/1561) remote: Compressing objects: 59% (921/1561) remote: Compressing objects: 60% (937/1561) remote: Compressing objects: 61% (953/1561) remote: Compressing objects: 62% (968/1561) remote: Compressing objects: 63% (984/1561) remote: Compressing objects: 64% (1000/1561) remote: Compressing objects: 65% (1015/1561) remote: Compressing objects: 66% (1031/1561) remote: Compressing objects: 67% (1046/1561) remote: Compressing objects: 68% (1062/1561) remote: Compressing objects: 69% (1078/1561) remote: Compressing objects: 70% (1093/1561) remote: Compressing objects: 71% (1109/1561) remote: Compressing objects: 72% (1124/1561) remote: Compressing objects: 73% (1140/1561) remote: Compressing objects: 74% (1156/1561) remote: Compressing objects: 75% (1171/1561) remote: Compressing objects: 76% (1187/1561) remote: Compressing objects: 77% (1202/1561) remote: Compressing objects: 78% (1218/1561) remote: Compressing objects: 79% (1234/1561) remote: Compressing objects: 80% (1249/1561) remote: Compressing objects: 81% (1265/1561) remote: Compressing objects: 82% (1281/1561) remote: Compressing objects: 83% (1296/1561) remote: Compressing objects: 84% (1312/1561) remote: Compressing objects: 85% (1327/1561) remote: Compressing objects: 86% (1343/1561) remote: Compressing objects: 87% (1359/1561) remote: Compressing objects: 88% (1374/1561) remote: Compressing objects: 89% (1390/1561) remote: Compressing objects: 90% (1405/1561) remote: Compressing objects: 91% (1421/1561) remote: Compressing objects: 92% (1437/1561) remote: Compressing objects: 93% (1452/1561) remote: Compressing objects: 94% (1468/1561) remote: Compressing objects: 95% (1483/1561) remote: Compressing objects: 96% (1499/1561) remote: Compressing objects: 97% (1515/1561) remote: Compressing objects: 98% (1530/1561) remote: Compressing objects: 99% (1546/1561) remote: Compressing objects: 100% (1561/1561) remote: Compressing objects: 100% (1561/1561), done.
  6. 5.18 s Receiving objects: 0% (1/65231) Receiving objects: 1% (653/65231) Receiving objects: 2% (1305/65231) Receiving objects: 3% (1957/65231) Receiving objects: 4% (2610/65231) Receiving objects: 5% (3262/65231) Receiving objects: 6% (3914/65231) Receiving objects: 7% (4567/65231) Receiving objects: 8% (5219/65231) Receiving objects: 9% (5871/65231) Receiving objects: 10% (6524/65231) Receiving objects: 11% (7176/65231), 11.09 MiB | 22.16 MiB/s Receiving objects: 12% (7828/65231), 11.09 MiB | 22.16 MiB/s Receiving objects: 13% (8481/65231), 11.09 MiB | 22.16 MiB/s Receiving objects: 14% (9133/65231), 11.09 MiB | 22.16 MiB/s Receiving objects: 15% (9785/65231), 11.09 MiB | 22.16 MiB/s Receiving objects: 16% (10437/65231), 11.09 MiB | 22.16 MiB/s Receiving objects: 17% (11090/65231), 11.09 MiB | 22.16 MiB/s Receiving objects: 18% (11742/65231), 11.09 MiB | 22.16 MiB/s Receiving objects: 19% (12394/65231), 11.09 MiB | 22.16 MiB/s Receiving objects: 20% (13047/65231), 11.09 MiB | 22.16 MiB/s Receiving objects: 21% (13699/65231), 11.09 MiB | 22.16 MiB/s Receiving objects: 22% (14351/65231), 11.09 MiB | 22.16 MiB/s Receiving objects: 23% (15004/65231), 11.09 MiB | 22.16 MiB/s Receiving objects: 24% (15656/65231), 11.09 MiB | 22.16 MiB/s Receiving objects: 25% (16308/65231), 11.09 MiB | 22.16 MiB/s Receiving objects: 26% (16961/65231), 11.09 MiB | 22.16 MiB/s Receiving objects: 27% (17613/65231), 11.09 MiB | 22.16 MiB/s Receiving objects: 28% (18265/65231), 11.09 MiB | 22.16 MiB/s Receiving objects: 29% (18917/65231), 11.09 MiB | 22.16 MiB/s Receiving objects: 30% (19570/65231), 11.09 MiB | 22.16 MiB/s Receiving objects: 31% (20222/65231), 11.09 MiB | 22.16 MiB/s Receiving objects: 32% (20874/65231), 11.09 MiB | 22.16 MiB/s Receiving objects: 33% (21527/65231), 11.09 MiB | 22.16 MiB/s Receiving objects: 34% (22179/65231), 11.09 MiB | 22.16 MiB/s Receiving objects: 35% (22831/65231), 11.09 MiB | 22.16 MiB/s Receiving objects: 36% (23484/65231), 11.09 MiB | 22.16 MiB/s Receiving objects: 37% (24136/65231), 11.09 MiB | 22.16 MiB/s Receiving objects: 38% (24788/65231), 11.09 MiB | 22.16 MiB/s Receiving objects: 39% (25441/65231), 11.09 MiB | 22.16 MiB/s Receiving objects: 40% (26093/65231), 11.09 MiB | 22.16 MiB/s Receiving objects: 41% (26745/65231), 11.09 MiB | 22.16 MiB/s Receiving objects: 42% (27398/65231), 11.09 MiB | 22.16 MiB/s Receiving objects: 43% (28050/65231), 11.09 MiB | 22.16 MiB/s Receiving objects: 44% (28702/65231), 11.09 MiB | 22.16 MiB/s Receiving objects: 45% (29354/65231), 11.09 MiB | 22.16 MiB/s Receiving objects: 46% (30007/65231), 11.09 MiB | 22.16 MiB/s Receiving objects: 47% (30659/65231), 11.09 MiB | 22.16 MiB/s Receiving objects: 48% (31311/65231), 11.09 MiB | 22.16 MiB/s Receiving objects: 48% (31549/65231), 29.39 MiB | 29.24 MiB/s Receiving objects: 49% (31964/65231), 29.39 MiB | 29.24 MiB/s Receiving objects: 50% (32616/65231), 29.39 MiB | 29.24 MiB/s Receiving objects: 51% (33268/65231), 29.39 MiB | 29.24 MiB/s Receiving objects: 52% (33921/65231), 29.39 MiB | 29.24 MiB/s Receiving objects: 53% (34573/65231), 29.39 MiB | 29.24 MiB/s Receiving objects: 54% (35225/65231), 29.39 MiB | 29.24 MiB/s Receiving objects: 55% (35878/65231), 29.39 MiB | 29.24 MiB/s Receiving objects: 56% (36530/65231), 29.39 MiB | 29.24 MiB/s Receiving objects: 57% (37182/65231), 29.39 MiB | 29.24 MiB/s Receiving objects: 58% (37834/65231), 29.39 MiB | 29.24 MiB/s Receiving objects: 59% (38487/65231), 29.39 MiB | 29.24 MiB/s Receiving objects: 60% (39139/65231), 44.53 MiB | 29.53 MiB/s Receiving objects: 61% (39791/65231), 44.53 MiB | 29.53 MiB/s Receiving objects: 62% (40444/65231), 44.53 MiB | 29.53 MiB/s Receiving objects: 63% (41096/65231), 44.53 MiB | 29.53 MiB/s Receiving objects: 64% (41748/65231), 44.53 MiB | 29.53 MiB/s Receiving objects: 65% (42401/65231), 44.53 MiB | 29.53 MiB/s Receiving objects: 66% (43053/65231), 44.53 MiB | 29.53 MiB/s Receiving objects: 67% (43705/65231), 44.53 MiB | 29.53 MiB/s Receiving objects: 68% (44358/65231), 44.53 MiB | 29.53 MiB/s Receiving objects: 69% (45010/65231), 44.53 MiB | 29.53 MiB/s Receiving objects: 70% (45662/65231), 44.53 MiB | 29.53 MiB/s Receiving objects: 71% (46315/65231), 44.53 MiB | 29.53 MiB/s Receiving objects: 72% (46967/65231), 44.53 MiB | 29.53 MiB/s Receiving objects: 73% (47619/65231), 44.53 MiB | 29.53 MiB/s Receiving objects: 73% (47638/65231), 60.15 MiB | 29.88 MiB/s Receiving objects: 74% (48271/65231), 60.15 MiB | 29.88 MiB/s Receiving objects: 75% (48924/65231), 60.15 MiB | 29.88 MiB/s Receiving objects: 76% (49576/65231), 60.15 MiB | 29.88 MiB/s Receiving objects: 77% (50228/65231), 60.15 MiB | 29.88 MiB/s Receiving objects: 78% (50881/65231), 60.15 MiB | 29.88 MiB/s Receiving objects: 79% (51533/65231), 60.15 MiB | 29.88 MiB/s Receiving objects: 80% (52185/65231), 60.15 MiB | 29.88 MiB/s Receiving objects: 81% (52838/65231), 60.15 MiB | 29.88 MiB/s Receiving objects: 82% (53490/65231), 60.15 MiB | 29.88 MiB/s Receiving objects: 83% (54142/65231), 77.63 MiB | 30.67 MiB/s Receiving objects: 84% (54795/65231), 77.63 MiB | 30.67 MiB/s Receiving objects: 85% (55447/65231), 77.63 MiB | 30.67 MiB/s Receiving objects: 86% (56099/65231), 77.63 MiB | 30.67 MiB/s Receiving objects: 87% (56751/65231), 77.63 MiB | 30.67 MiB/s Receiving objects: 88% (57404/65231), 77.63 MiB | 30.67 MiB/s Receiving objects: 89% (58056/65231), 77.63 MiB | 30.67 MiB/s Receiving objects: 90% (58708/65231), 77.63 MiB | 30.67 MiB/s Receiving objects: 91% (59361/65231), 77.63 MiB | 30.67 MiB/s Receiving objects: 92% (60013/65231), 77.63 MiB | 30.67 MiB/s Receiving objects: 93% (60665/65231), 77.63 MiB | 30.67 MiB/s Receiving objects: 94% (61318/65231), 77.63 MiB | 30.67 MiB/s Receiving objects: 95% (61970/65231), 77.63 MiB | 30.67 MiB/s Receiving objects: 96% (62622/65231), 77.63 MiB | 30.67 MiB/s Receiving objects: 97% (63275/65231), 77.63 MiB | 30.67 MiB/s Receiving objects: 98% (63927/65231), 77.63 MiB | 30.67 MiB/s Receiving objects: 99% (64579/65231), 77.63 MiB | 30.67 MiB/s remote: Total 65231 (delta 6868), reused 6407 (delta 6335), pack-reused 57328 (from 1)
  7. 5.19 s Receiving objects: 100% (65231/65231), 77.63 MiB | 30.67 MiB/s Receiving objects: 100% (65231/65231), 87.56 MiB | 30.64 MiB/s, done.
  8. 5.96 s Resolving deltas: 0% (0/45965) Resolving deltas: 1% (460/45965) Resolving deltas: 2% (924/45965) Resolving deltas: 3% (1379/45965) Resolving deltas: 4% (1839/45965) Resolving deltas: 5% (2299/45965) Resolving deltas: 6% (2758/45965) Resolving deltas: 7% (3218/45965) Resolving deltas: 8% (3680/45965) Resolving deltas: 9% (4138/45965) Resolving deltas: 10% (4597/45965) Resolving deltas: 11% (5060/45965) Resolving deltas: 12% (5516/45965) Resolving deltas: 13% (5976/45965) Resolving deltas: 14% (6436/45965) Resolving deltas: 15% (6895/45965) Resolving deltas: 16% (7355/45965) Resolving deltas: 17% (7815/45965) Resolving deltas: 18% (8274/45965) Resolving deltas: 19% (8734/45965) Resolving deltas: 20% (9196/45965) Resolving deltas: 21% (9653/45965) Resolving deltas: 22% (10114/45965) Resolving deltas: 23% (10574/45965) Resolving deltas: 24% (11032/45965) Resolving deltas: 25% (11492/45965) Resolving deltas: 26% (11951/45965) Resolving deltas: 27% (12411/45965) Resolving deltas: 28% (12871/45965) Resolving deltas: 29% (13330/45965) Resolving deltas: 30% (13790/45965) Resolving deltas: 31% (14250/45965) Resolving deltas: 32% (14709/45965) Resolving deltas: 33% (15169/45965) Resolving deltas: 34% (15629/45965) Resolving deltas: 35% (16088/45965) Resolving deltas: 36% (16548/45965) Resolving deltas: 37% (17008/45965) Resolving deltas: 38% (17467/45965) Resolving deltas: 39% (17927/45965) Resolving deltas: 40% (18386/45965) Resolving deltas: 41% (18847/45965) Resolving deltas: 42% (19306/45965) Resolving deltas: 43% (19765/45965) Resolving deltas: 44% (20225/45965) Resolving deltas: 45% (20685/45965) Resolving deltas: 46% (21144/45965) Resolving deltas: 47% (21605/45965) Resolving deltas: 48% (22064/45965) Resolving deltas: 49% (22524/45965) Resolving deltas: 50% (22985/45965) Resolving deltas: 51% (23443/45965) Resolving deltas: 52% (23902/45965) Resolving deltas: 53% (24362/45965) Resolving deltas: 54% (24822/45965) Resolving deltas: 55% (25281/45965) Resolving deltas: 56% (25741/45965) Resolving deltas: 57% (26201/45965) Resolving deltas: 58% (26660/45965) Resolving deltas: 59% (27120/45965) Resolving deltas: 60% (27579/45965) Resolving deltas: 61% (28039/45965) Resolving deltas: 62% (28499/45965) Resolving deltas: 63% (28958/45965) Resolving deltas: 64% (29418/45965) Resolving deltas: 65% (29881/45965) Resolving deltas: 66% (30337/45965) Resolving deltas: 67% (30797/45965) Resolving deltas: 68% (31257/45965) Resolving deltas: 69% (31716/45965) Resolving deltas: 70% (32176/45965) Resolving deltas: 71% (32636/45965) Resolving deltas: 72% (33095/45965) Resolving deltas: 73% (33556/45965) Resolving deltas: 74% (34015/45965) Resolving deltas: 75% (34474/45965) Resolving deltas: 76% (34934/45965) Resolving deltas: 77% (35394/45965) Resolving deltas: 78% (35853/45965) Resolving deltas: 79% (36313/45965) Resolving deltas: 80% (36773/45965) Resolving deltas: 81% (37232/45965) Resolving deltas: 82% (37692/45965) Resolving deltas: 83% (38151/45965) Resolving deltas: 84% (38613/45965) Resolving deltas: 85% (39071/45965) Resolving deltas: 86% (39530/45965) Resolving deltas: 87% (39991/45965) Resolving deltas: 88% (40450/45965) Resolving deltas: 89% (40909/45965) Resolving deltas: 90% (41369/45965) Resolving deltas: 91% (41829/45965) Resolving deltas: 92% (42288/45965) Resolving deltas: 93% (42748/45965) Resolving deltas: 94% (43208/45965) Resolving deltas: 95% (43667/45965) Resolving deltas: 96% (44127/45965) Resolving deltas: 97% (44587/45965) Resolving deltas: 98% (45046/45965) Resolving deltas: 99% (45506/45965) Resolving deltas: 100% (45965/45965) Resolving deltas: 100% (45965/45965), done.
  9. 6.30 s Fetching commit 4b6103034e4ab9883c27f48dea568f6b265d3b05 for vakint_rustred ...
  10. 6.30 s $ /nix/store/bcnisk3ydfgv26v2gw3zlky24g00yww2-git-2.54.0/bin/git fetch origin 4b6103034e4ab9883c27f48dea568f6b265d3b05
  11. 6.70 s From https://github.com/alphal00p/gammaloop
  12. 6.70 s * branch 4b6103034e4ab9883c27f48dea568f6b265d3b05 -> FETCH_HEAD
  13. 6.71 s $ /nix/store/9ypz3flqsrl5xl495mm8h645gadjsxi1-coreutils-9.11/bin/timeout --kill-after=15s 7200s /nix/store/bcnisk3ydfgv26v2gw3zlky24g00yww2-git-2.54.0/bin/git -c advice.detachedHead=false checkout 4b6103034e4ab9883c27f48dea568f6b265d3b05
  14. 6.88 s HEAD is now at 4b610303 Reserve RustRed scalar evaluation boundary
  15. 6.88 s $ /nix/store/9ypz3flqsrl5xl495mm8h645gadjsxi1-coreutils-9.11/bin/timeout --kill-after=15s 7200s /nix/store/23zk8sgzamrbmj1fday15szf7f2279s8-nix-2.34.7/bin/nix --extra-experimental-features nix-command --extra-experimental-features flakes --log-format internal-json run .#packages.x86_64-linux.nix-ci-check-gammaloop-nextest-spenso --print-build-logs
  16. 10.94 s
  17. 11.61 s Downloading cached gammaloop-ci-test-binary-dependencies-326651bd60141f1c-Cargo.toml from https://cache.nix-ci.com
  18. 11.62 s Downloading cached gammaloop-ci-test-binary-dependencies-2487cdc24b69b833-Cargo.toml from https://cache.nix-ci.com
  19. 11.62 s Downloading cached gammaloop-ci-test-binary-dependencies-91f21e5f130440bb-Cargo.toml from https://cache.nix-ci.com
  20. 11.62 s Downloaded cached gammaloop-ci-test-binary-dependencies-326651bd60141f1c-Cargo.toml (936 B) in 12ms
  21. 11.62 s Downloaded cached gammaloop-ci-test-binary-dependencies-2487cdc24b69b833-Cargo.toml (424 B) in 3ms
  22. 11.62 s Downloaded cached gammaloop-ci-test-binary-dependencies-91f21e5f130440bb-Cargo.toml (928 B) in 4ms
  23. 11.65 s Downloading cached gammaloop-crate-test-binaries-symbolica-utils-2487cdc24b69b833-inputs from https://cache.nix-ci.com
  24. 11.65 s Downloading cached gammaloop-crate-test-binaries-spenso-b6a0734be42e3503-inputs from https://cache.nix-ci.com
  25. 12.01 s Building /nix/store/820jmhzjmh0bbvm3pvavb9ahmah2r9ij-gammaloop-nextest-binaries-spenso-spenso-macros-0.1.0.drv
  26. 12.06 s Building /nix/store/45r9ijk0crbwxp2g4vbw1fcbq7r8w7m1-gammaloop-ci-test-binary-dependencies-2487cdc24b69b833-symbolica-utils-dev-dependency.toml.drv
  27. 12.12 s Building /nix/store/m16zw91a6zcvaqp8m97gz7qc8f7xrl2h-gammaloop-ci-test-binary-dependencies-326651bd60141f1c-spenso-hep-lib-dev-dependency.toml.drv
  28. 12.17 s Building /nix/store/p5qnmqw7ls4qscv7v835w9jih3sw3g7f-gammaloop-ci-test-binary-dependencies-91f21e5f130440bb-idenso-dev-dependency.toml.drv
  29. 12.21 s Building /nix/store/81bfr8nx0jrjd51nhvg2s4d615nmji71-gammaloop-ci-test-binary-dependencies-b6a0734be42e3503-spenso-dev-dependency.toml.drv
  30. 12.22 s Progress: 0 of 16 built (5 building), 1 of 7 downloaded from cache (4 downloading)
  31. 12.22 s Progress: 0 of 16 built (5 building), 2 of 7 downloaded from cache (3 downloading)
  32. 12.22 s Progress: 0 of 16 built (5 building), 3 of 7 downloaded from cache (2 downloading)
  33. 12.25 s [gammaloop-ci-test-binary-dependencies-2487cdc24b69b833-symbolica-utils-dev-dependency.toml:post-build] Uploading to the NixCI cache: /nix/store/kfn110ilds3cbbdx18i4lh2spq59nwrd-gammaloop-ci-test-binary-dependencies-2487cdc24b69b833-symbolica-utils-dev-dependency.toml
  34. 12.46 s [gammaloop-ci-test-binary-dependencies-2487cdc24b69b833-symbolica-utils-dev-dependency.toml:post-build] warning: 'warn-short-path-literals' is deprecated, use 'lint-short-path-literals = ignore' instead
  35. 12.55 s [gammaloop-ci-test-binary-dependencies-2487cdc24b69b833-symbolica-utils-dev-dependency.toml:post-build] copying 0 paths...
  36. 12.99 s [gammaloop-ci-test-binary-dependencies-2487cdc24b69b833-symbolica-utils-dev-dependency.toml:post-build] warning: 'warn-short-path-literals' is deprecated, use 'lint-short-path-literals = ignore' instead
  37. 13.13 s [gammaloop-ci-test-binary-dependencies-2487cdc24b69b833-symbolica-utils-dev-dependency.toml:post-build] copying 0 paths...
  38. 13.20 s Uploaded gammaloop-ci-test-binary-dependencies-2487cdc24b69b833-symbolica-utils-dev-dependency.toml in 974ms
  39. 13.20 s Progress: 1 of 17 built (4 building), 3 of 7 downloaded from cache (2 downloading)
  40. 13.20 s Built gammaloop-ci-test-binary-dependencies-2487cdc24b69b833-symbolica-utils-dev-dependency.toml in 1.1s
  41. 13.27 s [gammaloop-ci-test-binary-dependencies-326651bd60141f1c-spenso-hep-lib-dev-dependency.toml:post-build] Uploading to the NixCI cache: /nix/store/3nb8val67xq77wf9fjsfj0w8dkg4q96d-gammaloop-ci-test-binary-dependencies-326651bd60141f1c-spenso-hep-lib-dev-dependency.toml
  42. 13.39 s [gammaloop-ci-test-binary-dependencies-326651bd60141f1c-spenso-hep-lib-dev-dependency.toml:post-build] warning: 'warn-short-path-literals' is deprecated, use 'lint-short-path-literals = ignore' instead
  43. 13.49 s [gammaloop-ci-test-binary-dependencies-326651bd60141f1c-spenso-hep-lib-dev-dependency.toml:post-build] copying 0 paths...
  44. 13.67 s [gammaloop-ci-test-binary-dependencies-326651bd60141f1c-spenso-hep-lib-dev-dependency.toml:post-build] warning: 'warn-short-path-literals' is deprecated, use 'lint-short-path-literals = ignore' instead
  45. 13.77 s [gammaloop-ci-test-binary-dependencies-326651bd60141f1c-spenso-hep-lib-dev-dependency.toml:post-build] copying 0 paths...
  46. 13.80 s Uploaded gammaloop-ci-test-binary-dependencies-326651bd60141f1c-spenso-hep-lib-dev-dependency.toml in 588ms
  47. 13.80 s Progress: 2 of 18 built (3 building), 3 of 7 downloaded from cache (2 downloading)
  48. 13.80 s Built gammaloop-ci-test-binary-dependencies-326651bd60141f1c-spenso-hep-lib-dev-dependency.toml in 1.6s
  49. 13.80 s [gammaloop-nextest-binaries-spenso-spenso-macros] Phase: unpackPhase
  50. 13.80 s [gammaloop-nextest-binaries-spenso-spenso-macros] unpacking source archive /nix/store/gbk0v4824fd1hq0w7ccchvs66985sv4q-source
  51. 13.80 s [gammaloop-nextest-binaries-spenso-spenso-macros] source root is source
  52. 13.96 s Building /nix/store/s0k5qa7mrj8qy8m18iaaxdhlq535mm2j-gammaloop-nextest-binaries-spenso-spenso-hep-lib-0.1.0.drv
  53. 14.07 s [gammaloop-ci-test-binary-dependencies-91f21e5f130440bb-idenso-dev-dependency.toml:post-build] Uploading to the NixCI cache: /nix/store/k0s6fgxca9aibrb7bwf903mlwcya0ibh-gammaloop-ci-test-binary-dependencies-91f21e5f130440bb-idenso-dev-dependency.toml
  54. 14.26 s [gammaloop-ci-test-binary-dependencies-91f21e5f130440bb-idenso-dev-dependency.toml:post-build] warning: 'warn-short-path-literals' is deprecated, use 'lint-short-path-literals = ignore' instead
  55. 14.36 s [gammaloop-ci-test-binary-dependencies-91f21e5f130440bb-idenso-dev-dependency.toml:post-build] copying 0 paths...
  56. 14.87 s [gammaloop-ci-test-binary-dependencies-91f21e5f130440bb-idenso-dev-dependency.toml:post-build] warning: 'warn-short-path-literals' is deprecated, use 'lint-short-path-literals = ignore' instead
  57. 14.99 s [gammaloop-ci-test-binary-dependencies-91f21e5f130440bb-idenso-dev-dependency.toml:post-build] copying 0 paths...
  58. 15.11 s Uploaded gammaloop-ci-test-binary-dependencies-91f21e5f130440bb-idenso-dev-dependency.toml in 1.1s
  59. 15.11 s Progress: 3 of 14 built (3 building), 3 of 7 downloaded from cache (2 downloading)
  60. 15.12 s Built gammaloop-ci-test-binary-dependencies-91f21e5f130440bb-idenso-dev-dependency.toml in 2.9s
  61. 15.25 s [gammaloop-ci-test-binary-dependencies-b6a0734be42e3503-spenso-dev-dependency.toml:post-build] Uploading to the NixCI cache: /nix/store/8fa169jir0fwpxd5h2c4qwl6gsvnw0m6-gammaloop-ci-test-binary-dependencies-b6a0734be42e3503-spenso-dev-dependency.toml
  62. 15.49 s [gammaloop-ci-test-binary-dependencies-b6a0734be42e3503-spenso-dev-dependency.toml:post-build] warning: 'warn-short-path-literals' is deprecated, use 'lint-short-path-literals = ignore' instead
  63. 15.67 s [gammaloop-ci-test-binary-dependencies-b6a0734be42e3503-spenso-dev-dependency.toml:post-build] copying 1 paths...
  64. 15.67 s [gammaloop-ci-test-binary-dependencies-b6a0734be42e3503-spenso-dev-dependency.toml:post-build] copying path '/nix/store/8fa169jir0fwpxd5h2c4qwl6gsvnw0m6-gammaloop-ci-test-binary-dependencies-b6a0734be42e3503-spenso-dev-dependency.toml' to 'https://cache.nix-ci.com'...
  65. 16.27 s [gammaloop-ci-test-binary-dependencies-b6a0734be42e3503-spenso-dev-dependency.toml:post-build] warning: 'warn-short-path-literals' is deprecated, use 'lint-short-path-literals = ignore' instead
  66. 16.63 s [gammaloop-ci-test-binary-dependencies-b6a0734be42e3503-spenso-dev-dependency.toml:post-build] copying 0 paths...
  67. 16.79 s Uploaded gammaloop-ci-test-binary-dependencies-b6a0734be42e3503-spenso-dev-dependency.toml in 1.6s
  68. 16.79 s Progress: 4 of 15 built (2 building), 3 of 7 downloaded from cache (2 downloading)
  69. 16.79 s Built gammaloop-ci-test-binary-dependencies-b6a0734be42e3503-spenso-dev-dependency.toml in 4.5s
  70. 16.79 s [gammaloop-nextest-binaries-spenso-spenso-macros] Phase: patchPhase
  71. 16.79 s [gammaloop-nextest-binaries-spenso-spenso-macros] copying cargo artifacts from /nix/store/8y66d08g5al17xfdnjqq8x09ix37mjjx-gammaloop-crate-test-binaries-spenso-macros-b6a0734be42e3503-inputs/target to target
  72. 16.94 s Building /nix/store/2cvycn3x4yxmkw7ngxyp5v88xfccvb10-gammaloop-nextest-binaries-spenso-idenso-0.1.0.drv
  73. 16.94 s [gammaloop-nextest-binaries-spenso-spenso-hep-lib] Phase: unpackPhase
  74. 16.94 s [gammaloop-nextest-binaries-spenso-spenso-hep-lib] unpacking source archive /nix/store/7i60zcir57vbwlznn6qjydphr6n9y8v3-source
  75. 16.94 s [gammaloop-nextest-binaries-spenso-spenso-hep-lib] source root is source
  76. 16.94 s [gammaloop-nextest-binaries-spenso-spenso-hep-lib] Phase: patchPhase
  77. 16.94 s [gammaloop-nextest-binaries-spenso-spenso-hep-lib] copying cargo artifacts from /nix/store/3brjavxv6hdp2h7zsq0z9r7wjsnbbms3-gammaloop-crate-test-binaries-spenso-hep-lib-326651bd60141f1c-inputs/target to target
  78. 17.10 s [gammaloop-nextest-binaries-spenso-idenso] Phase: unpackPhase
  79. 17.11 s [gammaloop-nextest-binaries-spenso-idenso] unpacking source archive /nix/store/2h21kf5rpfmqn8di7vd4wzlv3frhv1my-source
  80. 17.14 s [gammaloop-nextest-binaries-spenso-idenso] source root is source
  81. 17.17 s [gammaloop-nextest-binaries-spenso-idenso] Phase: patchPhase
  82. 17.49 s [gammaloop-nextest-binaries-spenso-idenso] copying cargo artifacts from /nix/store/9951hwxh0ngy87gfb4l5m21zmwf2dirl-gammaloop-crate-test-binaries-idenso-91f21e5f130440bb-inputs/target to target
  83. 18.29 s [gammaloop-nextest-binaries-spenso-spenso-macros] Executing configureCargoCommonVars
  84. 18.30 s [gammaloop-nextest-binaries-spenso-spenso-macros] decompressing cargo artifacts from /nix/store/9kwaz7w5y0w70f9b157lvd6gf027byax-gammaloop-crate-test-binaries-spenso-macros-b6a0734be42e3503-deps-0.1.0/target.tar.zst to target
  85. 18.35 s [gammaloop-nextest-binaries-spenso-spenso-macros] Phase: updateAutotoolsGnuConfigScriptsPhase
  86. 18.43 s [gammaloop-nextest-binaries-spenso-spenso-macros] Phase: configurePhase
  87. 18.94 s [gammaloop-nextest-binaries-spenso-spenso-macros] will append /build/source/.cargo-home/config.toml with contents of /nix/store/30svmzr0z0zpcqjyynjn7w21wgx18y4b-vendor-cargo-deps/config.toml
  88. 18.95 s [gammaloop-nextest-binaries-spenso-spenso-macros] default configurePhase, nothing to do
  89. 18.96 s [gammaloop-nextest-binaries-spenso-spenso-macros] Phase: buildPhase
  90. 18.97 s [gammaloop-nextest-binaries-spenso-spenso-macros] +++ command cargo --version
  91. 18.97 s [gammaloop-nextest-binaries-spenso-spenso-macros] cargo 1.97.0 (c980f4866 2026-06-30)
  92. 19.05 s [gammaloop-nextest-binaries-spenso-spenso-macros] +++ command cargo nextest --version
  93. 19.08 s [gammaloop-nextest-binaries-spenso-spenso-macros] cargo-nextest 0.9.140
  94. 19.08 s [gammaloop-nextest-binaries-spenso-spenso-macros] release: 0.9.140
  95. 19.08 s [gammaloop-nextest-binaries-spenso-spenso-macros] host: x86_64-unknown-linux-gnu
  96. 19.08 s [gammaloop-nextest-binaries-spenso-spenso-macros] +++ command cargo nextest archive --cargo-profile ci-optim --offline -p spenso-macros --features spenso-macros/shadowing,spenso/shadowing -E 'package(spenso-macros)' --profile ci_gammaloop --archive-file /nix/store/wh7vl863r308r62nwnwm9ydajh3061pw-gammaloop-nextest-binaries-spenso-spenso-macros-0.1.0/gammaloop-nextest-spenso-spenso-macros.tar.zst
  97. 20.99 s [gammaloop-nextest-binaries-spenso-spenso-macros] Finished `ci-optim` profile [optimized] target(s) in 0.39s
  98. 21.14 s [gammaloop-nextest-binaries-spenso-spenso-macros] warning: the following packages contain code that will be rejected by a future version of Rust: proc-macro-error2 v2.0.1
  99. 21.14 s [gammaloop-nextest-binaries-spenso-spenso-macros] note: to see what the problems were, use the option `--future-incompat-report`, or run `cargo report future-incompatibilities --id 1`
  100. 21.19 s [gammaloop-nextest-binaries-spenso-spenso-macros] Archiving 2 binaries, 1 linked path, and 1 standard library to /nix/store/wh7vl863r308r62nwnwm9ydajh3061pw-gammaloop-nextest-binaries-spenso-spenso-macros-0.1.0/gammaloop-nextest-spenso-spenso-macros.tar.zst
  101. 21.20 s [gammaloop-nextest-binaries-spenso-spenso-hep-lib] Executing configureCargoCommonVars
  102. 21.21 s [gammaloop-nextest-binaries-spenso-spenso-hep-lib] decompressing cargo artifacts from /nix/store/bfk3m0pcwa32zs8m8lscp4zsnrxfwm6w-gammaloop-crate-test-binaries-spenso-hep-lib-326651bd60141f1c-deps-0.1.0/target.tar.zst to target
  103. 21.50 s [gammaloop-nextest-binaries-spenso-spenso-hep-lib] Phase: updateAutotoolsGnuConfigScriptsPhase
  104. 21.55 s [gammaloop-nextest-binaries-spenso-spenso-hep-lib] Phase: configurePhase
  105. 21.56 s [gammaloop-nextest-binaries-spenso-spenso-hep-lib] will append /build/source/.cargo-home/config.toml with contents of /nix/store/30svmzr0z0zpcqjyynjn7w21wgx18y4b-vendor-cargo-deps/config.toml
  106. 21.56 s [gammaloop-nextest-binaries-spenso-spenso-hep-lib] default configurePhase, nothing to do
  107. 21.56 s [gammaloop-nextest-binaries-spenso-spenso-hep-lib] Phase: buildPhase
  108. 21.61 s [gammaloop-nextest-binaries-spenso-spenso-hep-lib] +++ command cargo --version
  109. 21.61 s [gammaloop-nextest-binaries-spenso-spenso-macros] Archived 8 files to /nix/store/wh7vl863r308r62nwnwm9ydajh3061pw-gammaloop-nextest-binaries-spenso-spenso-macros-0.1.0/gammaloop-nextest-spenso-spenso-macros.tar.zst in 0.42s
  110. 21.61 s [gammaloop-nextest-binaries-spenso-spenso-hep-lib] cargo 1.97.0 (c980f4866 2026-06-30)
  111. 21.62 s [gammaloop-nextest-binaries-spenso-spenso-macros] Phase: installPhase
  112. 21.63 s [gammaloop-nextest-binaries-spenso-spenso-macros] Phase: fixupPhase
  113. 21.69 s [gammaloop-nextest-binaries-spenso-spenso-hep-lib] +++ command cargo nextest --version
  114. 21.69 s [gammaloop-nextest-binaries-spenso-spenso-hep-lib] cargo-nextest 0.9.140
  115. 21.69 s [gammaloop-nextest-binaries-spenso-spenso-hep-lib] release: 0.9.140
  116. 21.69 s [gammaloop-nextest-binaries-spenso-spenso-hep-lib] host: x86_64-unknown-linux-gnu
  117. 21.69 s [gammaloop-nextest-binaries-spenso-spenso-hep-lib] +++ command cargo nextest archive --cargo-profile ci-optim --offline -p spenso-hep-lib -E 'package(spenso-hep-lib)' --profile ci_gammaloop --archive-file /nix/store/38klkc27qpxwfan64g8h4g5b1lpw8s7z-gammaloop-nextest-binaries-spenso-spenso-hep-lib-0.1.0/gammaloop-nextest-spenso-spenso-hep-lib.tar.zst
  118. 21.69 s [gammaloop-nextest-binaries-spenso-spenso-macros] shrinking RPATHs of ELF executables and libraries in /nix/store/wh7vl863r308r62nwnwm9ydajh3061pw-gammaloop-nextest-binaries-spenso-spenso-macros-0.1.0
  119. 21.69 s [gammaloop-nextest-binaries-spenso-spenso-macros] checking for references to /build/ in /nix/store/wh7vl863r308r62nwnwm9ydajh3061pw-gammaloop-nextest-binaries-spenso-spenso-macros-0.1.0...
  120. 21.71 s [gammaloop-nextest-binaries-spenso-spenso-macros] patching script interpreter paths in /nix/store/wh7vl863r308r62nwnwm9ydajh3061pw-gammaloop-nextest-binaries-spenso-spenso-macros-0.1.0
  121. 22.05 s [gammaloop-nextest-binaries-spenso-spenso-macros:post-build] Uploading to the NixCI cache: /nix/store/wh7vl863r308r62nwnwm9ydajh3061pw-gammaloop-nextest-binaries-spenso-spenso-macros-0.1.0
  122. 22.50 s [gammaloop-nextest-binaries-spenso-spenso-macros:post-build] warning: 'warn-short-path-literals' is deprecated, use 'lint-short-path-literals = ignore' instead
  123. 22.53 s [gammaloop-nextest-binaries-spenso-spenso-macros:post-build] copying 1 paths...
  124. 22.53 s [gammaloop-nextest-binaries-spenso-spenso-macros:post-build] copying path '/nix/store/wh7vl863r308r62nwnwm9ydajh3061pw-gammaloop-nextest-binaries-spenso-spenso-macros-0.1.0' to 'https://cache.nix-ci.com'...
  125. 26.37 s [gammaloop-nextest-binaries-spenso-spenso-macros:post-build] warning: 'warn-short-path-literals' is deprecated, use 'lint-short-path-literals = ignore' instead
  126. 26.76 s [gammaloop-nextest-binaries-spenso-spenso-macros:post-build] copying 2 paths...
  127. 26.77 s [gammaloop-nextest-binaries-spenso-spenso-macros:post-build] copying path '/nix/store/gbk0v4824fd1hq0w7ccchvs66985sv4q-source' to 'https://cache.nix-ci.com'...
  128. 27.29 s Downloaded cached gammaloop-crate-test-binaries-symbolica-utils-2487cdc24b69b833-inputs (1.2 GiB) in 15.6s
  129. 28.06 s [gammaloop-nextest-binaries-spenso-spenso-macros:post-build] copying path '/nix/store/820jmhzjmh0bbvm3pvavb9ahmah2r9ij-gammaloop-nextest-binaries-spenso-spenso-macros-0.1.0.drv' to 'https://cache.nix-ci.com'...
  130. 28.39 s Uploaded gammaloop-nextest-binaries-spenso-spenso-macros in 6.4s
  131. 28.40 s Progress: 5 of 14 built (2 building), 3 of 7 downloaded from cache (2 downloading)
  132. 28.40 s Built gammaloop-nextest-binaries-spenso-spenso-macros in 16.3s
  133. 28.40 s Progress: 5 of 13 built (2 building), 4 of 7 downloaded from cache (1 downloading)
  134. 28.40 s [gammaloop-nextest-binaries-spenso-idenso] Executing configureCargoCommonVars
  135. 28.40 s [gammaloop-nextest-binaries-spenso-idenso] decompressing cargo artifacts from /nix/store/n9l4z9h7kz5h8svnl8ljv9yf4fr2xn4h-gammaloop-crate-test-binaries-idenso-91f21e5f130440bb-deps-0.1.0/target.tar.zst to target
  136. 28.40 s [gammaloop-nextest-binaries-spenso-idenso] Phase: updateAutotoolsGnuConfigScriptsPhase
  137. 28.40 s [gammaloop-nextest-binaries-spenso-idenso] Phase: configurePhase
  138. 28.40 s [gammaloop-nextest-binaries-spenso-idenso] will append /build/source/.cargo-home/config.toml with contents of /nix/store/30svmzr0z0zpcqjyynjn7w21wgx18y4b-vendor-cargo-deps/config.toml
  139. 28.40 s [gammaloop-nextest-binaries-spenso-idenso] default configurePhase, nothing to do
  140. 28.40 s [gammaloop-nextest-binaries-spenso-idenso] Phase: buildPhase
  141. 28.40 s [gammaloop-nextest-binaries-spenso-idenso] +++ command cargo --version
  142. 28.40 s [gammaloop-nextest-binaries-spenso-idenso] cargo 1.97.0 (c980f4866 2026-06-30)
  143. 28.40 s [gammaloop-nextest-binaries-spenso-idenso] +++ command cargo nextest --version
  144. 28.40 s [gammaloop-nextest-binaries-spenso-idenso] cargo-nextest 0.9.140
  145. 28.40 s [gammaloop-nextest-binaries-spenso-idenso] release: 0.9.140
  146. 28.40 s [gammaloop-nextest-binaries-spenso-idenso] host: x86_64-unknown-linux-gnu
  147. 28.40 s [gammaloop-nextest-binaries-spenso-idenso] +++ command cargo nextest archive --cargo-profile ci-optim --offline -p idenso --features idenso/bincode,idenso/reference-cases -E 'package(idenso)' --profile ci_gammaloop --archive-file /nix/store/qb3ahxx8lfv9yhgkn0gpfhn00kcf5rl7-gammaloop-nextest-binaries-spenso-idenso-0.1.0/gammaloop-nextest-spenso-idenso.tar.zst
  148. 28.40 s [gammaloop-nextest-binaries-spenso-idenso] Finished `ci-optim` profile [optimized] target(s) in 0.27s
  149. 28.40 s [gammaloop-nextest-binaries-spenso-idenso] warning: the following packages contain code that will be rejected by a future version of Rust: proc-macro-error2 v2.0.1
  150. 28.40 s [gammaloop-nextest-binaries-spenso-idenso] note: to see what the problems were, use the option `--future-incompat-report`, or run `cargo report future-incompatibilities --id 1`
  151. 28.40 s [gammaloop-nextest-binaries-spenso-idenso] Archiving 5 binaries, 2 linked paths, and 1 standard library to /nix/store/qb3ahxx8lfv9yhgkn0gpfhn00kcf5rl7-gammaloop-nextest-binaries-spenso-idenso-0.1.0/gammaloop-nextest-spenso-idenso.tar.zst
  152. 28.40 s [gammaloop-nextest-binaries-spenso-idenso] Archived 19 files to /nix/store/qb3ahxx8lfv9yhgkn0gpfhn00kcf5rl7-gammaloop-nextest-binaries-spenso-idenso-0.1.0/gammaloop-nextest-spenso-idenso.tar.zst in 0.43s
  153. 28.40 s [gammaloop-nextest-binaries-spenso-idenso] Phase: installPhase
  154. 28.40 s [gammaloop-nextest-binaries-spenso-idenso] Phase: fixupPhase
  155. 28.40 s [gammaloop-nextest-binaries-spenso-idenso] shrinking RPATHs of ELF executables and libraries in /nix/store/qb3ahxx8lfv9yhgkn0gpfhn00kcf5rl7-gammaloop-nextest-binaries-spenso-idenso-0.1.0
  156. 28.40 s [gammaloop-nextest-binaries-spenso-idenso] checking for references to /build/ in /nix/store/qb3ahxx8lfv9yhgkn0gpfhn00kcf5rl7-gammaloop-nextest-binaries-spenso-idenso-0.1.0...
  157. 28.40 s [gammaloop-nextest-binaries-spenso-idenso] patching script interpreter paths in /nix/store/qb3ahxx8lfv9yhgkn0gpfhn00kcf5rl7-gammaloop-nextest-binaries-spenso-idenso-0.1.0
  158. 28.40 s [gammaloop-nextest-binaries-spenso-spenso-hep-lib] Finished `ci-optim` profile [optimized] target(s) in 0.48s
  159. 28.40 s [gammaloop-nextest-binaries-spenso-spenso-hep-lib] warning: the following packages contain code that will be rejected by a future version of Rust: proc-macro-error2 v2.0.1
  160. 28.40 s [gammaloop-nextest-binaries-spenso-spenso-hep-lib] note: to see what the problems were, use the option `--future-incompat-report`, or run `cargo report future-incompatibilities --id 1`
  161. 28.40 s [gammaloop-nextest-binaries-spenso-spenso-hep-lib] Archiving 5 binaries, 2 linked paths, and 1 standard library to /nix/store/38klkc27qpxwfan64g8h4g5b1lpw8s7z-gammaloop-nextest-binaries-spenso-spenso-hep-lib-0.1.0/gammaloop-nextest-spenso-spenso-hep-lib.tar.zst
  162. 28.40 s [gammaloop-nextest-binaries-spenso-spenso-hep-lib] Archived 19 files to /nix/store/38klkc27qpxwfan64g8h4g5b1lpw8s7z-gammaloop-nextest-binaries-spenso-spenso-hep-lib-0.1.0/gammaloop-nextest-spenso-spenso-hep-lib.tar.zst in 0.64s
  163. 28.40 s [gammaloop-nextest-binaries-spenso-spenso-hep-lib] Phase: installPhase
  164. 28.40 s [gammaloop-nextest-binaries-spenso-spenso-hep-lib] Phase: fixupPhase
  165. 28.40 s [gammaloop-nextest-binaries-spenso-spenso-hep-lib] shrinking RPATHs of ELF executables and libraries in /nix/store/38klkc27qpxwfan64g8h4g5b1lpw8s7z-gammaloop-nextest-binaries-spenso-spenso-hep-lib-0.1.0
  166. 28.40 s [gammaloop-nextest-binaries-spenso-spenso-hep-lib] checking for references to /build/ in /nix/store/38klkc27qpxwfan64g8h4g5b1lpw8s7z-gammaloop-nextest-binaries-spenso-spenso-hep-lib-0.1.0...
  167. 28.40 s [gammaloop-nextest-binaries-spenso-spenso-hep-lib] patching script interpreter paths in /nix/store/38klkc27qpxwfan64g8h4g5b1lpw8s7z-gammaloop-nextest-binaries-spenso-spenso-hep-lib-0.1.0
  168. 28.40 s Downloading cached gammaloop-crate-test-binaries-symbolica-utils-2487cdc24b69b833-deps from https://cache.nix-ci.com
  169. 28.48 s Downloaded cached gammaloop-crate-test-binaries-symbolica-utils-2487cdc24b69b833-deps (4 MiB) in 85ms
  170. 28.69 s [gammaloop-nextest-binaries-spenso-idenso:post-build] Uploading to the NixCI cache: /nix/store/qb3ahxx8lfv9yhgkn0gpfhn00kcf5rl7-gammaloop-nextest-binaries-spenso-idenso-0.1.0
  171. 29.21 s [gammaloop-nextest-binaries-spenso-idenso:post-build] warning: 'warn-short-path-literals' is deprecated, use 'lint-short-path-literals = ignore' instead
  172. 29.25 s [gammaloop-nextest-binaries-spenso-idenso:post-build] copying 1 paths...
  173. 29.25 s [gammaloop-nextest-binaries-spenso-idenso:post-build] copying path '/nix/store/qb3ahxx8lfv9yhgkn0gpfhn00kcf5rl7-gammaloop-nextest-binaries-spenso-idenso-0.1.0' to 'https://cache.nix-ci.com'...
  174. 31.43 s Downloaded cached gammaloop-crate-test-binaries-spenso-b6a0734be42e3503-inputs (1.5 GiB) in 19.7s
  175. 40.68 s [gammaloop-nextest-binaries-spenso-idenso:post-build] warning: 'warn-short-path-literals' is deprecated, use 'lint-short-path-literals = ignore' instead
  176. 40.87 s [gammaloop-nextest-binaries-spenso-idenso:post-build] copying 2 paths...
  177. 40.87 s [gammaloop-nextest-binaries-spenso-idenso:post-build] copying path '/nix/store/2h21kf5rpfmqn8di7vd4wzlv3frhv1my-source' to 'https://cache.nix-ci.com'...
  178. 41.94 s [gammaloop-nextest-binaries-spenso-idenso:post-build] copying path '/nix/store/2cvycn3x4yxmkw7ngxyp5v88xfccvb10-gammaloop-nextest-binaries-spenso-idenso-0.1.0.drv' to 'https://cache.nix-ci.com'...
  179. 42.10 s Uploaded gammaloop-nextest-binaries-spenso-idenso in 13.4s
  180. 42.10 s Progress: 6 of 14 built (1 building), 4 of 7 downloaded from cache (2 downloading)
  181. 42.10 s Built gammaloop-nextest-binaries-spenso-idenso in 25.1s
  182. 42.30 s [gammaloop-nextest-binaries-spenso-spenso-hep-lib:post-build] Uploading to the NixCI cache: /nix/store/38klkc27qpxwfan64g8h4g5b1lpw8s7z-gammaloop-nextest-binaries-spenso-spenso-hep-lib-0.1.0
  183. 42.34 s [gammaloop-nextest-binaries-spenso-spenso-hep-lib:post-build] warning: 'warn-short-path-literals' is deprecated, use 'lint-short-path-literals = ignore' instead
  184. 42.35 s [gammaloop-nextest-binaries-spenso-spenso-hep-lib:post-build] copying 1 paths...
  185. 42.35 s [gammaloop-nextest-binaries-spenso-spenso-hep-lib:post-build] copying path '/nix/store/38klkc27qpxwfan64g8h4g5b1lpw8s7z-gammaloop-nextest-binaries-spenso-spenso-hep-lib-0.1.0' to 'https://cache.nix-ci.com'...
  186. 55.31 s [gammaloop-nextest-binaries-spenso-spenso-hep-lib:post-build] warning: 'warn-short-path-literals' is deprecated, use 'lint-short-path-literals = ignore' instead
  187. 55.57 s [gammaloop-nextest-binaries-spenso-spenso-hep-lib:post-build] copying 2 paths...
  188. 55.57 s [gammaloop-nextest-binaries-spenso-spenso-hep-lib:post-build] copying path '/nix/store/7i60zcir57vbwlznn6qjydphr6n9y8v3-source' to 'https://cache.nix-ci.com'...
  189. 56.59 s [gammaloop-nextest-binaries-spenso-spenso-hep-lib:post-build] copying path '/nix/store/s0k5qa7mrj8qy8m18iaaxdhlq535mm2j-gammaloop-nextest-binaries-spenso-spenso-hep-lib-0.1.0.drv' to 'https://cache.nix-ci.com'...
  190. 56.75 s Uploaded gammaloop-nextest-binaries-spenso-spenso-hep-lib in 14.4s
  191. 56.75 s Progress: 7 of 15 built, 4 of 7 downloaded from cache (2 downloading)
  192. 56.75 s Built gammaloop-nextest-binaries-spenso-spenso-hep-lib in 42.7s
  193. 56.75 s Progress: 7 of 13 built, 5 of 7 downloaded from cache (1 downloading)
  194. 56.75 s Progress: 7 of 13 built, 6 of 7 downloaded from cache
  195. 56.75 s Downloading cached gammaloop-crate-test-binaries-spenso-b6a0734be42e3503-deps from https://cache.nix-ci.com
  196. 56.82 s Building /nix/store/g4bf9v1qp7liidhy4hj72ci8xh56g4p2-gammaloop-nextest-binaries-spenso-symbolica-utils-0.1.0.drv
  197. 56.89 s [gammaloop-nextest-binaries-spenso-symbolica-utils] Phase: unpackPhase
  198. 56.90 s [gammaloop-nextest-binaries-spenso-symbolica-utils] unpacking source archive /nix/store/bj0h7glmn3zz657d2c6xr9lvhg2lzn49-source
  199. 56.90 s [gammaloop-nextest-binaries-spenso-symbolica-utils] source root is source
  200. 56.92 s [gammaloop-nextest-binaries-spenso-symbolica-utils] Phase: patchPhase
  201. 57.00 s Downloaded cached gammaloop-crate-test-binaries-spenso-b6a0734be42e3503-deps (29.1 MiB) in 248ms
  202. 57.00 s Progress: 7 of 12 built (1 building), 7 of 7 downloaded from cache
  203. 57.07 s Building /nix/store/f1y4bl7v67vwxkx1f9mjwmvglg6354c0-gammaloop-nextest-binaries-spenso-spenso-0.1.0.drv
  204. 57.07 s [gammaloop-nextest-binaries-spenso-symbolica-utils] copying cargo artifacts from /nix/store/l4bfkglx8q2syschqr54q3v98j7rl50h-gammaloop-crate-test-binaries-symbolica-utils-2487cdc24b69b833-inputs/target to target
  205. 57.14 s [gammaloop-nextest-binaries-spenso-spenso] Phase: unpackPhase
  206. 57.15 s [gammaloop-nextest-binaries-spenso-spenso] unpacking source archive /nix/store/2d05h64ls0qdpw1dpp4zbkvjlg8srxdv-source
  207. 57.17 s [gammaloop-nextest-binaries-spenso-spenso] source root is source
  208. 57.18 s [gammaloop-nextest-binaries-spenso-spenso] Phase: patchPhase
  209. 57.28 s [gammaloop-nextest-binaries-spenso-spenso] copying cargo artifacts from /nix/store/zvgjjs16mjrv1lj1hgl7z4m2c3wakwwv-gammaloop-crate-test-binaries-spenso-b6a0734be42e3503-inputs/target to target
  210. 58.52 s [gammaloop-nextest-binaries-spenso-symbolica-utils] Executing configureCargoCommonVars
  211. 58.52 s [gammaloop-nextest-binaries-spenso-symbolica-utils] decompressing cargo artifacts from /nix/store/lnfgndhawrxscm0x2r946njn2h36xjb0-gammaloop-crate-test-binaries-symbolica-utils-2487cdc24b69b833-deps-0.1.0/target.tar.zst to target
  212. 58.55 s [gammaloop-nextest-binaries-spenso-symbolica-utils] Phase: updateAutotoolsGnuConfigScriptsPhase
  213. 58.57 s [gammaloop-nextest-binaries-spenso-symbolica-utils] Phase: configurePhase
  214. 58.58 s [gammaloop-nextest-binaries-spenso-symbolica-utils] will append /build/source/.cargo-home/config.toml with contents of /nix/store/30svmzr0z0zpcqjyynjn7w21wgx18y4b-vendor-cargo-deps/config.toml
  215. 58.58 s [gammaloop-nextest-binaries-spenso-symbolica-utils] default configurePhase, nothing to do
  216. 58.58 s [gammaloop-nextest-binaries-spenso-symbolica-utils] Phase: buildPhase
  217. 58.58 s [gammaloop-nextest-binaries-spenso-symbolica-utils] +++ command cargo --version
  218. 58.59 s [gammaloop-nextest-binaries-spenso-symbolica-utils] cargo 1.97.0 (c980f4866 2026-06-30)
  219. 58.62 s [gammaloop-nextest-binaries-spenso-symbolica-utils] +++ command cargo nextest --version
  220. 58.63 s [gammaloop-nextest-binaries-spenso-symbolica-utils] cargo-nextest 0.9.140
  221. 58.63 s [gammaloop-nextest-binaries-spenso-symbolica-utils] release: 0.9.140
  222. 58.63 s [gammaloop-nextest-binaries-spenso-symbolica-utils] host: x86_64-unknown-linux-gnu
  223. 58.63 s [gammaloop-nextest-binaries-spenso-symbolica-utils] +++ command cargo nextest archive --cargo-profile ci-optim --offline -p symbolica-utils -E 'package(symbolica-utils)' --profile ci_gammaloop --archive-file /nix/store/z646ib4lq95cg0iw9rrvfi0668vhc3za-gammaloop-nextest-binaries-spenso-symbolica-utils-0.1.0/gammaloop-nextest-spenso-symbolica-utils.tar.zst
  224. 58.98 s [gammaloop-nextest-binaries-spenso-spenso] Executing configureCargoCommonVars
  225. 58.98 s [gammaloop-nextest-binaries-spenso-spenso] decompressing cargo artifacts from /nix/store/dhpha9v61sr1mr6c65y50g0bmgrpz8ah-gammaloop-crate-test-binaries-spenso-b6a0734be42e3503-deps-0.1.0/target.tar.zst to target
  226. 59.10 s [gammaloop-nextest-binaries-spenso-spenso] Phase: updateAutotoolsGnuConfigScriptsPhase
  227. 59.13 s [gammaloop-nextest-binaries-spenso-spenso] Phase: configurePhase
  228. 59.13 s [gammaloop-nextest-binaries-spenso-spenso] will append /build/source/.cargo-home/config.toml with contents of /nix/store/30svmzr0z0zpcqjyynjn7w21wgx18y4b-vendor-cargo-deps/config.toml
  229. 59.14 s [gammaloop-nextest-binaries-spenso-spenso] default configurePhase, nothing to do
  230. 59.14 s [gammaloop-nextest-binaries-spenso-spenso] Phase: buildPhase
  231. 59.14 s [gammaloop-nextest-binaries-spenso-spenso] +++ command cargo --version
  232. 59.14 s [gammaloop-nextest-binaries-spenso-spenso] cargo 1.97.0 (c980f4866 2026-06-30)
  233. 59.19 s [gammaloop-nextest-binaries-spenso-spenso] +++ command cargo nextest --version
  234. 59.19 s [gammaloop-nextest-binaries-spenso-spenso] cargo-nextest 0.9.140
  235. 59.19 s [gammaloop-nextest-binaries-spenso-spenso] release: 0.9.140
  236. 59.19 s [gammaloop-nextest-binaries-spenso-spenso] host: x86_64-unknown-linux-gnu
  237. 59.19 s [gammaloop-nextest-binaries-spenso-spenso] +++ command cargo nextest archive --cargo-profile ci-optim --offline -p spenso --features spenso/shadowing -E 'package(spenso)' --profile ci_gammaloop --archive-file /nix/store/749vrv77dw56x48zqa10iixr2vdsp2rc-gammaloop-nextest-binaries-spenso-spenso-0.1.0/gammaloop-nextest-spenso-spenso.tar.zst
  238. 59.34 s [gammaloop-nextest-binaries-spenso-symbolica-utils] Finished `ci-optim` profile [optimized] target(s) in 0.24s
  239. 59.48 s [gammaloop-nextest-binaries-spenso-symbolica-utils] warning: the following packages contain code that will be rejected by a future version of Rust: proc-macro-error2 v2.0.1
  240. 59.48 s [gammaloop-nextest-binaries-spenso-symbolica-utils] note: to see what the problems were, use the option `--future-incompat-report`, or run `cargo report future-incompatibilities --id 1`
  241. 59.51 s [gammaloop-nextest-binaries-spenso-symbolica-utils] Archiving 1 binary, 1 linked path, and 1 standard library to /nix/store/z646ib4lq95cg0iw9rrvfi0668vhc3za-gammaloop-nextest-binaries-spenso-symbolica-utils-0.1.0/gammaloop-nextest-spenso-symbolica-utils.tar.zst
  242. 59.57 s [gammaloop-nextest-binaries-spenso-symbolica-utils] Archived 7 files to /nix/store/z646ib4lq95cg0iw9rrvfi0668vhc3za-gammaloop-nextest-binaries-spenso-symbolica-utils-0.1.0/gammaloop-nextest-spenso-symbolica-utils.tar.zst in 0.06s
  243. 59.58 s [gammaloop-nextest-binaries-spenso-symbolica-utils] Phase: installPhase
  244. 59.59 s [gammaloop-nextest-binaries-spenso-symbolica-utils] Phase: fixupPhase
  245. 59.60 s [gammaloop-nextest-binaries-spenso-symbolica-utils] shrinking RPATHs of ELF executables and libraries in /nix/store/z646ib4lq95cg0iw9rrvfi0668vhc3za-gammaloop-nextest-binaries-spenso-symbolica-utils-0.1.0
  246. 59.60 s [gammaloop-nextest-binaries-spenso-symbolica-utils] checking for references to /build/ in /nix/store/z646ib4lq95cg0iw9rrvfi0668vhc3za-gammaloop-nextest-binaries-spenso-symbolica-utils-0.1.0...
  247. 59.61 s [gammaloop-nextest-binaries-spenso-symbolica-utils] patching script interpreter paths in /nix/store/z646ib4lq95cg0iw9rrvfi0668vhc3za-gammaloop-nextest-binaries-spenso-symbolica-utils-0.1.0
  248. 59.77 s [gammaloop-nextest-binaries-spenso-symbolica-utils:post-build] Uploading to the NixCI cache: /nix/store/z646ib4lq95cg0iw9rrvfi0668vhc3za-gammaloop-nextest-binaries-spenso-symbolica-utils-0.1.0
  249. 59.82 s [gammaloop-nextest-binaries-spenso-symbolica-utils:post-build] warning: 'warn-short-path-literals' is deprecated, use 'lint-short-path-literals = ignore' instead
  250. 59.83 s [gammaloop-nextest-binaries-spenso-symbolica-utils:post-build] copying 1 paths...
  251. 59.83 s [gammaloop-nextest-binaries-spenso-symbolica-utils:post-build] copying path '/nix/store/z646ib4lq95cg0iw9rrvfi0668vhc3za-gammaloop-nextest-binaries-spenso-symbolica-utils-0.1.0' to 'https://cache.nix-ci.com'...
  252. 62.31 s [gammaloop-nextest-binaries-spenso-symbolica-utils:post-build] warning: 'warn-short-path-literals' is deprecated, use 'lint-short-path-literals = ignore' instead
  253. 62.55 s [gammaloop-nextest-binaries-spenso-symbolica-utils:post-build] copying 2 paths...
  254. 62.55 s [gammaloop-nextest-binaries-spenso-symbolica-utils:post-build] copying path '/nix/store/bj0h7glmn3zz657d2c6xr9lvhg2lzn49-source' to 'https://cache.nix-ci.com'...
  255. 62.72 s [gammaloop-nextest-binaries-spenso-symbolica-utils:post-build] copying path '/nix/store/g4bf9v1qp7liidhy4hj72ci8xh56g4p2-gammaloop-nextest-binaries-spenso-symbolica-utils-0.1.0.drv' to 'https://cache.nix-ci.com'...
  256. 62.88 s Uploaded gammaloop-nextest-binaries-spenso-symbolica-utils in 3.1s
  257. 62.88 s Progress: 8 of 12 built (1 building), 7 of 7 downloaded from cache
  258. 62.88 s Built gammaloop-nextest-binaries-spenso-symbolica-utils in 6.0s
  259. 62.89 s [gammaloop-nextest-binaries-spenso-spenso] Finished `ci-optim` profile [optimized] target(s) in 0.24s
  260. 62.89 s [gammaloop-nextest-binaries-spenso-spenso] warning: the following packages contain code that will be rejected by a future version of Rust: proc-macro-error2 v2.0.1
  261. 62.89 s [gammaloop-nextest-binaries-spenso-spenso] note: to see what the problems were, use the option `--future-incompat-report`, or run `cargo report future-incompatibilities --id 1`
  262. 62.89 s [gammaloop-nextest-binaries-spenso-spenso] Archiving 2 binaries, 1 linked path, and 1 standard library to /nix/store/749vrv77dw56x48zqa10iixr2vdsp2rc-gammaloop-nextest-binaries-spenso-spenso-0.1.0/gammaloop-nextest-spenso-spenso.tar.zst
  263. 62.89 s [gammaloop-nextest-binaries-spenso-spenso] Archived 8 files to /nix/store/749vrv77dw56x48zqa10iixr2vdsp2rc-gammaloop-nextest-binaries-spenso-spenso-0.1.0/gammaloop-nextest-spenso-spenso.tar.zst in 0.08s
  264. 62.89 s [gammaloop-nextest-binaries-spenso-spenso] Phase: installPhase
  265. 62.89 s [gammaloop-nextest-binaries-spenso-spenso] Phase: fixupPhase
  266. 62.89 s [gammaloop-nextest-binaries-spenso-spenso] shrinking RPATHs of ELF executables and libraries in /nix/store/749vrv77dw56x48zqa10iixr2vdsp2rc-gammaloop-nextest-binaries-spenso-spenso-0.1.0
  267. 62.89 s [gammaloop-nextest-binaries-spenso-spenso] checking for references to /build/ in /nix/store/749vrv77dw56x48zqa10iixr2vdsp2rc-gammaloop-nextest-binaries-spenso-spenso-0.1.0...
  268. 62.89 s [gammaloop-nextest-binaries-spenso-spenso] patching script interpreter paths in /nix/store/749vrv77dw56x48zqa10iixr2vdsp2rc-gammaloop-nextest-binaries-spenso-spenso-0.1.0
  269. 63.08 s [gammaloop-nextest-binaries-spenso-spenso:post-build] Uploading to the NixCI cache: /nix/store/749vrv77dw56x48zqa10iixr2vdsp2rc-gammaloop-nextest-binaries-spenso-spenso-0.1.0
  270. 63.13 s [gammaloop-nextest-binaries-spenso-spenso:post-build] warning: 'warn-short-path-literals' is deprecated, use 'lint-short-path-literals = ignore' instead
  271. 63.14 s [gammaloop-nextest-binaries-spenso-spenso:post-build] copying 1 paths...
  272. 63.14 s [gammaloop-nextest-binaries-spenso-spenso:post-build] copying path '/nix/store/749vrv77dw56x48zqa10iixr2vdsp2rc-gammaloop-nextest-binaries-spenso-spenso-0.1.0' to 'https://cache.nix-ci.com'...
  273. 67.69 s [gammaloop-nextest-binaries-spenso-spenso:post-build] warning: 'warn-short-path-literals' is deprecated, use 'lint-short-path-literals = ignore' instead
  274. 67.90 s [gammaloop-nextest-binaries-spenso-spenso:post-build] copying 2 paths...
  275. 67.90 s [gammaloop-nextest-binaries-spenso-spenso:post-build] copying path '/nix/store/2d05h64ls0qdpw1dpp4zbkvjlg8srxdv-source' to 'https://cache.nix-ci.com'...
  276. 68.78 s [gammaloop-nextest-binaries-spenso-spenso:post-build] copying path '/nix/store/f1y4bl7v67vwxkx1f9mjwmvglg6354c0-gammaloop-nextest-binaries-spenso-spenso-0.1.0.drv' to 'https://cache.nix-ci.com'...
  277. 68.94 s Uploaded gammaloop-nextest-binaries-spenso-spenso in 5.8s
  278. 68.94 s Progress: 9 of 12 built, 7 of 7 downloaded from cache
  279. 68.94 s Built gammaloop-nextest-binaries-spenso-spenso in 11.8s
  280. 68.96 s Building /nix/store/mdd46ys7gy7lhjn9hmmr0v5hr38hjrgz-gammaloop-nextest-binaries-spenso.drv
  281. 69.03 s [gammaloop-nextest-binaries-spenso:post-build] Uploading to the NixCI cache: /nix/store/rdblln805h0hw5gppgi6lrl6ybwgdhy8-gammaloop-nextest-binaries-spenso
  282. 69.08 s [gammaloop-nextest-binaries-spenso:post-build] warning: 'warn-short-path-literals' is deprecated, use 'lint-short-path-literals = ignore' instead
  283. 69.22 s [gammaloop-nextest-binaries-spenso:post-build] copying 1 paths...
  284. 69.22 s [gammaloop-nextest-binaries-spenso:post-build] copying path '/nix/store/rdblln805h0hw5gppgi6lrl6ybwgdhy8-gammaloop-nextest-binaries-spenso' to 'https://cache.nix-ci.com'...
  285. 69.41 s [gammaloop-nextest-binaries-spenso:post-build] warning: 'warn-short-path-literals' is deprecated, use 'lint-short-path-literals = ignore' instead
  286. 69.64 s [gammaloop-nextest-binaries-spenso:post-build] copying 1 paths...
  287. 69.64 s [gammaloop-nextest-binaries-spenso:post-build] copying path '/nix/store/mdd46ys7gy7lhjn9hmmr0v5hr38hjrgz-gammaloop-nextest-binaries-spenso.drv' to 'https://cache.nix-ci.com'...
  288. 69.81 s Uploaded gammaloop-nextest-binaries-spenso in 787ms
  289. 69.81 s Progress: 10 of 12 built, 7 of 7 downloaded from cache
  290. 69.81 s Built gammaloop-nextest-binaries-spenso in 844ms
  291. 69.84 s Building /nix/store/4iwv7hpmd7rkk7v54vfa0f9jxq05d7qf-nix-ci-check-gammaloop-nextest-spenso.drv
  292. 69.92 s [nix-ci-check-gammaloop-nextest-spenso:post-build] Uploading to the NixCI cache: /nix/store/idb0f7r79pjdaf2hqknps41kx4xbywcb-nix-ci-check-gammaloop-nextest-spenso
  293. 69.96 s [nix-ci-check-gammaloop-nextest-spenso:post-build] warning: 'warn-short-path-literals' is deprecated, use 'lint-short-path-literals = ignore' instead
  294. 69.97 s [nix-ci-check-gammaloop-nextest-spenso:post-build] copying 1 paths...
  295. 69.97 s [nix-ci-check-gammaloop-nextest-spenso:post-build] copying path '/nix/store/idb0f7r79pjdaf2hqknps41kx4xbywcb-nix-ci-check-gammaloop-nextest-spenso' to 'https://cache.nix-ci.com'...
  296. 70.17 s [nix-ci-check-gammaloop-nextest-spenso:post-build] warning: 'warn-short-path-literals' is deprecated, use 'lint-short-path-literals = ignore' instead
  297. 70.41 s [nix-ci-check-gammaloop-nextest-spenso:post-build] copying 1 paths...
  298. 70.41 s [nix-ci-check-gammaloop-nextest-spenso:post-build] copying path '/nix/store/4iwv7hpmd7rkk7v54vfa0f9jxq05d7qf-nix-ci-check-gammaloop-nextest-spenso.drv' to 'https://cache.nix-ci.com'...
  299. 70.58 s Uploaded nix-ci-check-gammaloop-nextest-spenso in 673ms
  300. 70.58 s Progress: 11 of 12 built, 7 of 7 downloaded from cache
  301. 70.58 s Built nix-ci-check-gammaloop-nextest-spenso in 738ms
  302. 70.58 s Progress: 12 of 12 built, 7 of 7 downloaded from cache
  303. 74.92 s evaluating derivation 'g copying '/nix/store/n2q0 evaluating derivation 'g querying gammaloop-nexte [0/1 built, 0.0 KiB DL] [1/0/1 built, 0.0 KiB DLgammaloop-nextest-spenso> Extracting 5 binaries and 2 linked paths to /build/nextest-archive-5FQq2a
  304. 75.14 s gammaloop-nextest-spenso> Extracted 19 files to /build/nextest-archive-5FQq2a in 0.22s
  305. 75.15 s gammaloop-nextest-spenso> ------------
  306. 75.15 s gammaloop-nextest-spenso> Nextest run ID c452a77e-cec7-43df-872b-228f1405beaa with nextest profile: ci_gammaloop
  307. 75.15 s gammaloop-nextest-spenso> Starting 224 tests across 5 binaries (26 tests skipped, including 2 tests via profile.ci_gammaloop.default-filter)
  308. 75.29 s gammaloop-nextest-spenso> FAIL [ 0.011s] ( 41/224) idenso color::test::form_reference::metric_contraction_respects_antisymmetric_normalization
  309. 75.29 s gammaloop-nextest-spenso> stdout ---
  310. 75.29 s gammaloop-nextest-spenso>
  311. 75.29 s gammaloop-nextest-spenso> running 1 test
  312. 75.29 s gammaloop-nextest-spenso> test color::test::form_reference::metric_contraction_respects_antisymmetric_normalization ... FAILED
  313. 75.29 s gammaloop-nextest-spenso>
  314. 75.29 s gammaloop-nextest-spenso> failures:
  315. 75.29 s gammaloop-nextest-spenso>
  316. 75.29 s gammaloop-nextest-spenso> failures:
  317. 75.29 s gammaloop-nextest-spenso> color::test::form_reference::metric_contraction_respects_antisymmetric_normalization
  318. 75.29 s gammaloop-nextest-spenso>
  319. 75.29 s gammaloop-nextest-spenso> test result: FAILED. 0 passed; 1 failed; 0 ignored; 0 measured; 240 filtered out; finished in 0.00s
  320. 75.29 s gammaloop-nextest-spenso>
  321. 75.29 s gammaloop-nextest-spenso> stderr ---
  322. 75.29 s gammaloop-nextest-spenso>
  323. 75.29 s gammaloop-nextest-spenso> thread 'color::test::form_reference::metric_contraction_respects_antisymmetric_normalization' (330) panicked at crates/idenso/src/color/test/form_reference.rs:171:5:
  324. 75.29 s gammaloop-nextest-spenso> assertion `left == right` failed
  325. 75.29 s gammaloop-nextest-spenso> left: "-1*f(coad(8,standalone_metric_j),coad(8,standalone_metric_s),coad(8,standalone_metric_u))"
  326. 75.29 s gammaloop-nextest-spenso> right: "f(coad(8,standalone_metric_j),coad(8,standalone_metric_s),coad(8,standalone_metric_u))"
  327. 75.29 s gammaloop-nextest-spenso> stack backtrace:
  328. 75.29 s gammaloop-nextest-spenso> 0: __rustc::rust_begin_unwind
  329. 75.29 s gammaloop-nextest-spenso> 1: core::panicking::panic_fmt
  330. 75.29 s gammaloop-nextest-spenso> 2: core::panicking::assert_failed_inner
  331. 75.29 s gammaloop-nextest-spenso> 3: core::panicking::assert_failed::<alloc::string::String, alloc::string::String>
  332. 75.29 s gammaloop-nextest-spenso> 4: idenso::color::test::form_reference::metric_contraction_respects_antisymmetric_normalization
  333. 75.29 s gammaloop-nextest-spenso> 5: <idenso::color::test::form_reference::metric_contraction_respects_antisymmetric_normalization::{closure#0} as core::ops::function::FnOnce<()>>::call_once
  334. 75.29 s gammaloop-nextest-spenso> note: Some details are omitted, run with `RUST_BACKTRACE=full` for a verbose backtrace.
  335. 75.29 s gammaloop-nextest-spenso>
  336. 75.78 s gammaloop-nextest-spenso> FAIL [ 0.073s] (215/224) idenso tensor::tests::parsing::infinite_execution
  337. 75.78 s gammaloop-nextest-spenso> stdout ---
  338. 75.78 s gammaloop-nextest-spenso>
  339. 75.78 s gammaloop-nextest-spenso> running 1 test
  340. 75.78 s gammaloop-nextest-spenso> ━━━━━━━━━━━━━━━━━━━━━━━━━━━━━━━ Snapshot Summary ━━━━━━━━━━━━━━━━━━━━━━━━━━━━━━━
  341. 75.78 s gammaloop-nextest-spenso> Snapshot: infinite_execution
  342. 75.78 s gammaloop-nextest-spenso> Source: crates/idenso/src/tensor/tests/parsing.rs:910
  343. 75.78 s gammaloop-nextest-spenso> ────────────────────────────────────────────────────────────────────────────────
  344. 75.78 s gammaloop-nextest-spenso> Expression: net_iter.snapshot_dot()
  345. 75.78 s gammaloop-nextest-spenso> ────────────────────────────────────────────────────────────────────────────────
  346. 75.78 s gammaloop-nextest-spenso> -old snapshot
  347. 75.78 s gammaloop-nextest-spenso> +new results
  348. 75.78 s gammaloop-nextest-spenso> ────────────┬───────────────────────────────────────────────────────────────────
  349. 75.78 s gammaloop-nextest-spenso> 8 8 │ 0:0:s -> ext0 [id=0 color="red"];
  350. 75.78 s gammaloop-nextest-spenso> 9 9 │ ext1 [style=invis];
  351. 75.78 s gammaloop-nextest-spenso> 10 10 │ 0:5:s -> ext1 [id=1 dir=none color="red" label="mink4|l_0"];
  352. 75.78 s gammaloop-nextest-spenso> 11 11 │ ext2 [style=invis];
  353. 75.78 s gammaloop-nextest-spenso> 12 │- 0:4:s -> ext2 [id=2 dir=none color="red" label="bis4|l_2"];
  354. 75.78 s gammaloop-nextest-spenso> 12 │+ 0:3:s -> ext2 [id=2 dir=none color="red" label="mink4|l_1"];
  355. 75.78 s gammaloop-nextest-spenso> 13 13 │ ext3 [style=invis];
  356. 75.78 s gammaloop-nextest-spenso> 14 │- 0:3:s -> ext3 [id=3 dir=none color="red" label="bis4|l_3"];
  357. 75.78 s gammaloop-nextest-spenso> 14 │+ 0:1:s -> ext3 [id=3 dir=none color="red" label="bis4|l_2"];
  358. 75.78 s gammaloop-nextest-spenso> 15 15 │ ext4 [style=invis];
  359. 75.78 s gammaloop-nextest-spenso> 16 │- 0:1:s -> ext4 [id=4 dir=none color="red" label="mink4|l_1"];
  360. 75.78 s gammaloop-nextest-spenso> 16 │+ 0:2:s -> ext4 [id=4 dir=none color="red" label="mink4|l_4"];
  361. 75.78 s gammaloop-nextest-spenso> 17 17 │ ext5 [style=invis];
  362. 75.78 s gammaloop-nextest-spenso> 18 │- 0:2:s -> ext5 [id=5 dir=none color="red" label="mink4|l_4"];
  363. 75.78 s gammaloop-nextest-spenso> 18 │+ 0:4:s -> ext5 [id=5 dir=none color="red" label="bis4|l_3"];
  364. 75.78 s gammaloop-nextest-spenso> 19 19 │ }
  365. 75.78 s gammaloop-nextest-spenso> ────────────┴───────────────────────────────────────────────────────────────────
  366. 75.78 s gammaloop-nextest-spenso> To update snapshots run `cargo insta review`
  367. 75.78 s gammaloop-nextest-spenso> Stopped on the first failure. Run `cargo insta test` to run all snapshots.
  368. 75.78 s gammaloop-nextest-spenso> test tensor::tests::parsing::infinite_execution ... FAILED
  369. 75.78 s gammaloop-nextest-spenso>
  370. 75.78 s gammaloop-nextest-spenso> failures:
  371. 75.78 s gammaloop-nextest-spenso>
  372. 75.78 s gammaloop-nextest-spenso> failures:
  373. 75.78 s gammaloop-nextest-spenso> tensor::tests::parsing::infinite_execution
  374. 75.78 s gammaloop-nextest-spenso>
  375. 75.78 s gammaloop-nextest-spenso> test result: FAILED. 0 passed; 1 failed; 0 ignored; 0 measured; 240 filtered out; finished in 0.06s
  376. 75.78 s gammaloop-nextest-spenso>
  377. 75.78 s gammaloop-nextest-spenso> stderr ---
  378. 75.78 s gammaloop-nextest-spenso>
  379. 75.78 s gammaloop-nextest-spenso> thread 'tensor::tests::parsing::infinite_execution' (842) panicked at /nix/store/30svmzr0z0zpcqjyynjn7w21wgx18y4b-vendor-cargo-deps/c19b7c6f923b580ac259164a89f2577984ad5ab09ee9d583b888f934adbbe8d0/insta-1.47.2/src/runtime.rs:719:13:
  380. 75.78 s gammaloop-nextest-spenso> snapshot assertion for 'infinite_execution' failed in line 910
  381. 75.78 s gammaloop-nextest-spenso> stack backtrace:
  382. 75.78 s gammaloop-nextest-spenso> 0: __rustc::rust_begin_unwind
  383. 75.78 s gammaloop-nextest-spenso> 1: core::panicking::panic_fmt
  384. 75.78 s gammaloop-nextest-spenso> 2: insta::runtime::assert_snapshot
  385. 75.78 s gammaloop-nextest-spenso> 3: idenso::tensor::tests::parsing::infinite_execution
  386. 75.78 s gammaloop-nextest-spenso> 4: <idenso::tensor::tests::parsing::infinite_execution::{closure#0} as core::ops::function::FnOnce<()>>::call_once
  387. 75.78 s gammaloop-nextest-spenso> note: Some details are omitted, run with `RUST_BACKTRACE=full` for a verbose backtrace.
  388. 75.78 s gammaloop-nextest-spenso>
  389. 77.36 s gammaloop-nextest-spenso> ------------
  390. 77.36 s gammaloop-nextest-spenso> Summary [ 2.201s] 224 tests run: 222 passed, 2 failed, 26 skipped
  391. 77.36 s gammaloop-nextest-spenso> FAIL [ 0.011s] ( 41/224) idenso color::test::form_reference::metric_contraction_respects_antisymmetric_normalization
  392. 77.36 s gammaloop-nextest-spenso> stdout ---
  393. 77.36 s gammaloop-nextest-spenso>
  394. 77.36 s gammaloop-nextest-spenso> running 1 test
  395. 77.36 s gammaloop-nextest-spenso> test color::test::form_reference::metric_contraction_respects_antisymmetric_normalization ... FAILED
  396. 77.36 s gammaloop-nextest-spenso>
  397. 77.36 s gammaloop-nextest-spenso> failures:
  398. 77.36 s gammaloop-nextest-spenso>
  399. 77.36 s gammaloop-nextest-spenso> failures:
  400. 77.36 s gammaloop-nextest-spenso> color::test::form_reference::metric_contraction_respects_antisymmetric_normalization
  401. 77.36 s gammaloop-nextest-spenso>
  402. 77.36 s gammaloop-nextest-spenso> test result: FAILED. 0 passed; 1 failed; 0 ignored; 0 measured; 240 filtered out; finished in 0.00s
  403. 77.36 s gammaloop-nextest-spenso>
  404. 77.36 s gammaloop-nextest-spenso> stderr ---
  405. 77.36 s gammaloop-nextest-spenso>
  406. 77.36 s gammaloop-nextest-spenso> thread 'color::test::form_reference::metric_contraction_respects_antisymmetric_normalization' (330) panicked at crates/idenso/src/color/test/form_reference.rs:171:5:
  407. 77.36 s gammaloop-nextest-spenso> assertion `left == right` failed
  408. 77.36 s gammaloop-nextest-spenso> left: "-1*f(coad(8,standalone_metric_j),coad(8,standalone_metric_s),coad(8,standalone_metric_u))"
  409. 77.36 s gammaloop-nextest-spenso> right: "f(coad(8,standalone_metric_j),coad(8,standalone_metric_s),coad(8,standalone_metric_u))"
  410. 77.36 s gammaloop-nextest-spenso> stack backtrace:
  411. 77.36 s gammaloop-nextest-spenso> 0: __rustc::rust_begin_unwind
  412. 77.36 s gammaloop-nextest-spenso> 1: core::panicking::panic_fmt
  413. 77.36 s gammaloop-nextest-spenso> 2: core::panicking::assert_failed_inner
  414. 77.36 s gammaloop-nextest-spenso> 3: core::panicking::assert_failed::<alloc::string::String, alloc::string::String>
  415. 77.36 s gammaloop-nextest-spenso> 4: idenso::color::test::form_reference::metric_contraction_respects_antisymmetric_normalization
  416. 77.36 s gammaloop-nextest-spenso> 5: <idenso::color::test::form_reference::metric_contraction_respects_antisymmetric_normalization::{closure#0} as core::ops::function::FnOnce<()>>::call_once
  417. 77.36 s gammaloop-nextest-spenso> note: Some details are omitted, run with `RUST_BACKTRACE=full` for a verbose backtrace.
  418. 77.36 s gammaloop-nextest-spenso>
  419. 77.36 s gammaloop-nextest-spenso> FAIL [ 0.073s] (215/224) idenso tensor::tests::parsing::infinite_execution
  420. 77.36 s gammaloop-nextest-spenso> stdout ---
  421. 77.36 s gammaloop-nextest-spenso>
  422. 77.36 s gammaloop-nextest-spenso> running 1 test
  423. 77.36 s gammaloop-nextest-spenso> ━━━━━━━━━━━━━━━━━━━━━━━━━━━━━━━ Snapshot Summary ━━━━━━━━━━━━━━━━━━━━━━━━━━━━━━━
  424. 77.36 s gammaloop-nextest-spenso> Snapshot: infinite_execution
  425. 77.36 s gammaloop-nextest-spenso> Source: crates/idenso/src/tensor/tests/parsing.rs:910
  426. 77.36 s gammaloop-nextest-spenso> ────────────────────────────────────────────────────────────────────────────────
  427. 77.36 s gammaloop-nextest-spenso> Expression: net_iter.snapshot_dot()
  428. 77.36 s gammaloop-nextest-spenso> ────────────────────────────────────────────────────────────────────────────────
  429. 77.36 s gammaloop-nextest-spenso> -old snapshot
  430. 77.36 s gammaloop-nextest-spenso> +new results
  431. 77.36 s gammaloop-nextest-spenso> ────────────┬───────────────────────────────────────────────────────────────────
  432. 77.36 s gammaloop-nextest-spenso> 8 8 │ 0:0:s -> ext0 [id=0 color="red"];
  433. 77.36 s gammaloop-nextest-spenso> 9 9 │ ext1 [style=invis];
  434. 77.36 s gammaloop-nextest-spenso> 10 10 │ 0:5:s -> ext1 [id=1 dir=none color="red" label="mink4|l_0"];
  435. 77.36 s gammaloop-nextest-spenso> 11 11 │ ext2 [style=invis];
  436. 77.36 s gammaloop-nextest-spenso> 12 │- 0:4:s -> ext2 [id=2 dir=none color="red" label="bis4|l_2"];
  437. 77.36 s gammaloop-nextest-spenso> 12 │+ 0:3:s -> ext2 [id=2 dir=none color="red" label="mink4|l_1"];
  438. 77.36 s gammaloop-nextest-spenso> 13 13 │ ext3 [style=invis];
  439. 77.36 s gammaloop-nextest-spenso> 14 │- 0:3:s -> ext3 [id=3 dir=none color="red" label="bis4|l_3"];
  440. 77.36 s gammaloop-nextest-spenso> 14 │+ 0:1:s -> ext3 [id=3 dir=none color="red" label="bis4|l_2"];
  441. 77.36 s gammaloop-nextest-spenso> 15 15 │ ext4 [style=invis];
  442. 77.36 s gammaloop-nextest-spenso> 16 │- 0:1:s -> ext4 [id=4 dir=none color="red" label="mink4|l_1"];
  443. 77.36 s gammaloop-nextest-spenso> 16 │+ 0:2:s -> ext4 [id=4 dir=none color="red" label="mink4|l_4"];
  444. 77.36 s gammaloop-nextest-spenso> 17 17 │ ext5 [style=invis];
  445. 77.36 s gammaloop-nextest-spenso> 18 │- 0:2:s -> ext5 [id=5 dir=none color="red" label="mink4|l_4"];
  446. 77.36 s gammaloop-nextest-spenso> 18 │+ 0:4:s -> ext5 [id=5 dir=none color="red" label="bis4|l_3"];
  447. 77.36 s gammaloop-nextest-spenso> 19 19 │ }
  448. 77.36 s gammaloop-nextest-spenso> ────────────┴───────────────────────────────────────────────────────────────────
  449. 77.36 s gammaloop-nextest-spenso> To update snapshots run `cargo insta review`
  450. 77.36 s gammaloop-nextest-spenso> Stopped on the first failure. Run `cargo insta test` to run all snapshots.
  451. 77.36 s gammaloop-nextest-spenso> test tensor::tests::parsing::infinite_execution ... FAILED
  452. 77.36 s gammaloop-nextest-spenso>
  453. 77.36 s gammaloop-nextest-spenso> failures:
  454. 77.36 s gammaloop-nextest-spenso>
  455. 77.36 s gammaloop-nextest-spenso> failures:
  456. 77.36 s gammaloop-nextest-spenso> tensor::tests::parsing::infinite_execution
  457. 77.36 s gammaloop-nextest-spenso>
  458. 77.36 s gammaloop-nextest-spenso> test result: FAILED. 0 passed; 1 failed; 0 ignored; 0 measured; 240 filtered out; finished in 0.06s
  459. 77.36 s gammaloop-nextest-spenso>
  460. 77.36 s gammaloop-nextest-spenso> stderr ---
  461. 77.36 s gammaloop-nextest-spenso>
  462. 77.36 s gammaloop-nextest-spenso> thread 'tensor::tests::parsing::infinite_execution' (842) panicked at /nix/store/30svmzr0z0zpcqjyynjn7w21wgx18y4b-vendor-cargo-deps/c19b7c6f923b580ac259164a89f2577984ad5ab09ee9d583b888f934adbbe8d0/insta-1.47.2/src/runtime.rs:719:13:
  463. 77.36 s gammaloop-nextest-spenso> snapshot assertion for 'infinite_execution' failed in line 910
  464. 77.36 s gammaloop-nextest-spenso> stack backtrace:
  465. 77.36 s gammaloop-nextest-spenso> 0: __rustc::rust_begin_unwind
  466. 77.36 s gammaloop-nextest-spenso> 1: core::panicking::panic_fmt
  467. 77.36 s gammaloop-nextest-spenso> 2: insta::runtime::assert_snapshot
  468. 77.36 s gammaloop-nextest-spenso> 3: idenso::tensor::tests::parsing::infinite_execution
  469. 77.36 s gammaloop-nextest-spenso> 4: <idenso::tensor::tests::parsing::infinite_execution::{closure#0} as core::ops::function::FnOnce<()>>::call_once
  470. 77.36 s gammaloop-nextest-spenso> note: Some details are omitted, run with `RUST_BACKTRACE=full` for a verbose backtrace.
  471. 77.36 s gammaloop-nextest-spenso>
  472. 77.38 s gammaloop-nextest-spenso> error: test run failed
  473. 77.43 s gammaloop-nextest-spenso>
  474. 77.43 s gammaloop-nextest-spenso> ========== nextest test summary ==========
  475. 77.43 s gammaloop-nextest-spenso> report: target/nextest/ci_gammaloop/junit.xml
  476. 77.43 s gammaloop-nextest-spenso> tests: 224, failures: 2, errors: 0
  477. 77.43 s gammaloop-nextest-spenso>
  478. 77.43 s gammaloop-nextest-spenso> 1. idenso::color::test::form_reference::metric_contraction_respects_antisymmetric_normalization
  479. 77.43 s gammaloop-nextest-spenso> failure: test failure with exit code 101
  480. 77.43 s gammaloop-nextest-spenso> thread 'color::test::form_reference::metric_contraction_respects_antisymmetric_normalization' (330) panicked at crates/idenso/src/color/test/form_reference.rs:171:5:
  481. 77.43 s gammaloop-nextest-spenso> assertion `left == right` failed
  482. 77.43 s gammaloop-nextest-spenso> left: "-1*f(coad(8,standalone_metric_j),coad(8,standalone_metric_s),coad(8,standalone_metric_u))"
  483. 77.43 s gammaloop-nextest-spenso> right: "f(coad(8,standalone_metric_j),coad(8,standalone_metric_s),coad(8,standalone_metric_u))"
  484. 77.43 s gammaloop-nextest-spenso> stack backtrace:
  485. 77.43 s gammaloop-nextest-spenso> 0: __rustc::rust_begin_unwind
  486. 77.43 s gammaloop-nextest-spenso> 1: core::panicking::panic_fmt
  487. 77.43 s gammaloop-nextest-spenso> 2: core::panicking::assert_failed_inner
  488. 77.43 s gammaloop-nextest-spenso> 3: core::panicking::assert_failed::<alloc::string::String, alloc::string::String>
  489. 77.43 s gammaloop-nextest-spenso> 4: idenso::color::test::form_reference::metric_contraction_respects_antisymmetric_normalization
  490. 77.43 s gammaloop-nextest-spenso> 5: <idenso::color::test::form_reference::metric_contraction_respects_antisymmetric_normalization::{closure#0} as core::ops::function::FnOnce<()>>::call_once
  491. 77.43 s gammaloop-nextest-spenso> note: Some details are omitted, run with `RUST_BACKTRACE=full` for a verbose backtrace.
  492. 77.43 s gammaloop-nextest-spenso> system-out
  493. 77.43 s gammaloop-nextest-spenso> running 1 test
  494. 77.43 s gammaloop-nextest-spenso> test color::test::form_reference::metric_contraction_respects_antisymmetric_normalization ... FAILED
  495. 77.43 s gammaloop-nextest-spenso>
  496. 77.43 s gammaloop-nextest-spenso> failures:
  497. 77.43 s gammaloop-nextest-spenso>
  498. 77.43 s gammaloop-nextest-spenso> failures:
  499. 77.43 s gammaloop-nextest-spenso> color::test::form_reference::metric_contraction_respects_antisymmetric_normalization
  500. 77.43 s gammaloop-nextest-spenso>
  501. 77.43 s gammaloop-nextest-spenso> test result: FAILED. 0 passed; 1 failed; 0 ignored; 0 measured; 240 filtered out; finished in 0.00s
  502. 77.43 s gammaloop-nextest-spenso> system-err
  503. 77.43 s gammaloop-nextest-spenso> thread 'color::test::form_reference::metric_contraction_respects_antisymmetric_normalization' (330) panicked at crates/idenso/src/color/test/form_reference.rs:171:5:
  504. 77.43 s gammaloop-nextest-spenso> assertion `left == right` failed
  505. 77.43 s gammaloop-nextest-spenso> left: "-1*f(coad(8,standalone_metric_j),coad(8,standalone_metric_s),coad(8,standalone_metric_u))"
  506. 77.43 s gammaloop-nextest-spenso> right: "f(coad(8,standalone_metric_j),coad(8,standalone_metric_s),coad(8,standalone_metric_u))"
  507. 77.43 s gammaloop-nextest-spenso> stack backtrace:
  508. 77.43 s gammaloop-nextest-spenso> 0: __rustc::rust_begin_unwind
  509. 77.43 s gammaloop-nextest-spenso> 1: core::panicking::panic_fmt
  510. 77.43 s gammaloop-nextest-spenso> 2: core::panicking::assert_failed_inner
  511. 77.43 s gammaloop-nextest-spenso> 3: core::panicking::assert_failed::<alloc::string::String, alloc::string::String>
  512. 77.43 s gammaloop-nextest-spenso> 4: idenso::color::test::form_reference::metric_contraction_respects_antisymmetric_normalization
  513. 77.43 s gammaloop-nextest-spenso> 5: <idenso::color::test::form_reference::metric_contraction_respects_antisymmetric_normalization::{closure#0} as core::ops::function::FnOnce<()>>::call_once
  514. 77.43 s gammaloop-nextest-spenso> note: Some details are omitted, run with `RUST_BACKTRACE=full` for a verbose backtrace.
  515. 77.43 s gammaloop-nextest-spenso>
  516. 77.43 s gammaloop-nextest-spenso> 2. idenso::tensor::tests::parsing::infinite_execution
  517. 77.43 s gammaloop-nextest-spenso> failure: test failure with exit code 101
  518. 77.43 s gammaloop-nextest-spenso> thread 'tensor::tests::parsing::infinite_execution' (842) panicked at /nix/store/30svmzr0z0zpcqjyynjn7w21wgx18y4b-vendor-cargo-deps/c19b7c6f923b580ac259164a89f2577984ad5ab09ee9d583b888f934adbbe8d0/insta-1.47.2/src/runtime.rs:719:13:
  519. 77.43 s gammaloop-nextest-spenso> snapshot assertion for 'infinite_execution' failed in line 910
  520. 77.43 s gammaloop-nextest-spenso> stack backtrace:
  521. 77.43 s gammaloop-nextest-spenso> 0: __rustc::rust_begin_unwind
  522. 77.43 s gammaloop-nextest-spenso> 1: core::panicking::panic_fmt
  523. 77.43 s gammaloop-nextest-spenso> 2: insta::runtime::assert_snapshot
  524. 77.43 s gammaloop-nextest-spenso> 3: idenso::tensor::tests::parsing::infinite_execution
  525. 77.43 s gammaloop-nextest-spenso> 4: <idenso::tensor::tests::parsing::infinite_execution::{closure#0} as core::ops::function::FnOnce<()>>::call_once
  526. 77.43 s gammaloop-nextest-spenso> note: Some details are omitted, run with `RUST_BACKTRACE=full` for a verbose backtrace.
  527. 77.43 s gammaloop-nextest-spenso> system-out
  528. 77.43 s gammaloop-nextest-spenso> running 1 test
  529. 77.43 s gammaloop-nextest-spenso> ━━━━━━━━━━━━━━━━━━━━━━━━━━━━━━━ Snapshot Summary ━━━━━━━━━━━━━━━━━━━━━━━━━━━━━━━
  530. 77.43 s gammaloop-nextest-spenso> Snapshot: infinite_execution
  531. 77.43 s gammaloop-nextest-spenso> Source: crates/idenso/src/tensor/tests/parsing.rs:910
  532. 77.43 s gammaloop-nextest-spenso> ────────────────────────────────────────────────────────────────────────────────
  533. 77.43 s gammaloop-nextest-spenso> Expression: net_iter.snapshot_dot()
  534. 77.43 s gammaloop-nextest-spenso> ────────────────────────────────────────────────────────────────────────────────
  535. 77.43 s gammaloop-nextest-spenso> -old snapshot
  536. 77.43 s gammaloop-nextest-spenso> +new results
  537. 77.43 s gammaloop-nextest-spenso> ────────────┬───────────────────────────────────────────────────────────────────
  538. 77.43 s gammaloop-nextest-spenso> 8 8 │ 0:0:s-> ext0 [id=0 color="red"];
  539. 77.43 s gammaloop-nextest-spenso> 9 9 │ ext1 [style=invis];
  540. 77.43 s gammaloop-nextest-spenso> 10 10 │ 0:5:s-> ext1 [id=1 dir=none color="red" label="mink4|l_0"];
  541. 77.43 s gammaloop-nextest-spenso> 11 11 │ ext2 [style=invis];
  542. 77.43 s gammaloop-nextest-spenso> 12 │- 0:4:s-> ext2 [id=2 dir=none color="red" label="bis4|l_2"];
  543. 77.43 s gammaloop-nextest-spenso> 12 │+ 0:3:s-> ext2 [id=2 dir=none color="red" label="mink4|l_1"];
  544. 77.43 s gammaloop-nextest-spenso> 13 13 │ ext3 [style=invis];
  545. 77.43 s gammaloop-nextest-spenso> 14 │- 0:3:s-> ext3 [id=3 dir=none color="red" label="bis4|l_3"];
  546. 77.43 s gammaloop-nextest-spenso> 14 │+ 0:1:s-> ext3 [id=3 dir=none color="red" label="bis4|l_2"];
  547. 77.43 s gammaloop-nextest-spenso> 15 15 │ ext4 [style=invis];
  548. 77.43 s gammaloop-nextest-spenso> 16 │- 0:1:s-> ext4 [id=4 dir=none color="red" label="mink4|l_1"];
  549. 77.43 s gammaloop-nextest-spenso> 16 │+ 0:2:s-> ext4 [id=4 dir=none color="red" label="mink4|l_4"];
  550. 77.43 s gammaloop-nextest-spenso> 17 17 │ ext5 [style=invis];
  551. 77.43 s gammaloop-nextest-spenso> 18 │- 0:2:s-> ext5 [id=5 dir=none color="red" label="mink4|l_4"];
  552. 77.43 s gammaloop-nextest-spenso> 18 │+ 0:4:s-> ext5 [id=5 dir=none color="red" label="bis4|l_3"];
  553. 77.43 s gammaloop-nextest-spenso> 19 19 │ }
  554. 77.43 s gammaloop-nextest-spenso> ────────────┴───────────────────────────────────────────────────────────────────
  555. 77.43 s gammaloop-nextest-spenso> To update snapshots run `cargo insta review`
  556. 77.43 s gammaloop-nextest-spenso> Stopped on the first failure. Run `cargo insta test` to run all snapshots.
  557. 77.43 s gammaloop-nextest-spenso> test tensor::tests::parsing::infinite_execution ... FAILED
  558. 77.43 s gammaloop-nextest-spenso>
  559. 77.43 s gammaloop-nextest-spenso> failures:
  560. 77.43 s gammaloop-nextest-spenso>
  561. 77.43 s gammaloop-nextest-spenso> failures:
  562. 77.43 s gammaloop-nextest-spenso> tensor::tests::parsing::infinite_execution
  563. 77.43 s gammaloop-nextest-spenso>
  564. 77.43 s gammaloop-nextest-spenso> test result: FAILED. 0 passed; 1 failed; 0 ignored; 0 measured; 240 filtered out; finished in 0.06s
  565. 77.43 s gammaloop-nextest-spenso> system-err
  566. 77.43 s gammaloop-nextest-spenso> thread 'tensor::tests::parsing::infinite_execution' (842) panicked at /nix/store/30svmzr0z0zpcqjyynjn7w21wgx18y4b-vendor-cargo-deps/c19b7c6f923b580ac259164a89f2577984ad5ab09ee9d583b888f934adbbe8d0/insta-1.47.2/src/runtime.rs:719:13:
  567. 77.43 s gammaloop-nextest-spenso> snapshot assertion for 'infinite_execution' failed in line 910
  568. 77.43 s gammaloop-nextest-spenso> stack backtrace:
  569. 77.43 s gammaloop-nextest-spenso> 0: __rustc::rust_begin_unwind
  570. 77.43 s gammaloop-nextest-spenso> 1: core::panicking::panic_fmt
  571. 77.43 s gammaloop-nextest-spenso> 2: insta::runtime::assert_snapshot
  572. 77.43 s gammaloop-nextest-spenso> 3: idenso::tensor::tests::parsing::infinite_execution
  573. 77.43 s gammaloop-nextest-spenso> 4: <idenso::tensor::tests::parsing::infinite_execution::{closure#0} as core::ops::function::FnOnce<()>>::call_once
  574. 77.43 s gammaloop-nextest-spenso> note: Some details are omitted, run with `RUST_BACKTRACE=full` for a verbose backtrace.
  575. 77.43 s gammaloop-nextest-spenso> =========================================
  576. 77.46 s gammaloop-nextest-spenso> Extracting 2 binaries and 1 linked path to /build/nextest-archive-yIvfgp
  577. 77.54 s gammaloop-nextest-spenso> Extracted 8 files to /build/nextest-archive-yIvfgp in 0.08s
  578. 77.57 s gammaloop-nextest-spenso> ------------
  579. 77.57 s gammaloop-nextest-spenso> Nextest run ID a5c93319-a856-42df-ac25-8ac415bed22a with nextest profile: ci_gammaloop
  580. 77.57 s gammaloop-nextest-spenso> Starting 135 tests across 2 binaries
  581. 77.78 s gammaloop-nextest-spenso> ------------
  582. 77.78 s gammaloop-nextest-spenso> Summary [ 0.206s] 135 tests run: 135 passed, 0 skipped
  583. 77.83 s gammaloop-nextest-spenso>
  584. 77.83 s gammaloop-nextest-spenso> ========== nextest test summary ==========
  585. 77.83 s gammaloop-nextest-spenso> report: target/nextest/ci_gammaloop/junit.xml
  586. 77.83 s gammaloop-nextest-spenso> tests: 135, failures: 0, errors: 0
  587. 77.83 s gammaloop-nextest-spenso> No failing testcases found.
  588. 77.83 s gammaloop-nextest-spenso> =========================================
  589. 77.85 s gammaloop-nextest-spenso> Extracting 5 binaries and 2 linked paths to /build/nextest-archive-RpUdkm
  590. 78.10 s gammaloop-nextest-spenso> Extracted 19 files to /build/nextest-archive-RpUdkm in 0.25s
  591. 78.14 s gammaloop-nextest-spenso> ------------
  592. 78.14 s gammaloop-nextest-spenso> Nextest run ID b48bb28a-1fb9-4be1-a1b9-2f0859e3a7c1 with nextest profile: ci_gammaloop
  593. 78.14 s gammaloop-nextest-spenso> Starting 25 tests across 5 binaries (1 test skipped via profile.ci_gammaloop.default-filter)
  594. 78.44 s gammaloop-nextest-spenso> ------------
  595. 78.44 s gammaloop-nextest-spenso> Summary [ 0.299s] 25 tests run: 25 passed, 1 skipped
  596. 78.51 s gammaloop-nextest-spenso>
  597. 78.51 s gammaloop-nextest-spenso> ========== nextest test summary ==========
  598. 78.51 s gammaloop-nextest-spenso> report: target/nextest/ci_gammaloop/junit.xml
  599. 78.51 s gammaloop-nextest-spenso> tests: 25, failures: 0, errors: 0
  600. 78.51 s gammaloop-nextest-spenso> No failing testcases found.
  601. 78.51 s gammaloop-nextest-spenso> =========================================
  602. 78.54 s gammaloop-nextest-spenso> Extracting 2 binaries and 1 linked path to /build/nextest-archive-07AYbh
  603. 78.60 s gammaloop-nextest-spenso> Extracted 8 files to /build/nextest-archive-07AYbh in 0.07s
  604. 78.64 s gammaloop-nextest-spenso> ------------
  605. 78.64 s gammaloop-nextest-spenso> Nextest run ID f3f19451-eace-4f10-adbb-e3298a804db9 with nextest profile: ci_gammaloop
  606. 78.64 s gammaloop-nextest-spenso> Starting 1 test across 2 binaries
  607. 78.66 s gammaloop-nextest-spenso> ------------
  608. 78.66 s gammaloop-nextest-spenso> Summary [ 0.019s] 1 test run: 1 passed, 0 skipped
  609. 78.72 s gammaloop-nextest-spenso>
  610. 78.72 s gammaloop-nextest-spenso> ========== nextest test summary ==========
  611. 78.72 s gammaloop-nextest-spenso> report: target/nextest/ci_gammaloop/junit.xml
  612. 78.72 s gammaloop-nextest-spenso> tests: 1, failures: 0, errors: 0
  613. 78.72 s gammaloop-nextest-spenso> No failing testcases found.
  614. 78.72 s gammaloop-nextest-spenso> =========================================
  615. 78.75 s gammaloop-nextest-spenso> Extracting 1 binary and 1 linked path to /build/nextest-archive-QR4JEP
  616. 78.83 s gammaloop-nextest-spenso> Extracted 7 files to /build/nextest-archive-QR4JEP in 0.08s
  617. 78.85 s gammaloop-nextest-spenso> ------------
  618. 78.85 s gammaloop-nextest-spenso> Nextest run ID 5029fd47-6f0c-4028-ba04-e6a936bb61ce with nextest profile: ci_gammaloop
  619. 78.85 s gammaloop-nextest-spenso> Starting 0 tests across 1 binary
  620. 78.86 s gammaloop-nextest-spenso> ------------
  621. 78.86 s gammaloop-nextest-spenso> Summary [ 0.002s] 0 tests run: 0 passed, 0 skipped
  622. 78.92 s gammaloop-nextest-spenso>
  623. 78.92 s gammaloop-nextest-spenso> ========== nextest test summary ==========
  624. 78.92 s gammaloop-nextest-spenso> report: target/nextest/ci_gammaloop/junit.xml
  625. 78.92 s gammaloop-nextest-spenso> tests: 0, failures: 0, errors: 0
  626. 78.92 s gammaloop-nextest-spenso> No failing testcases found.
  627. 78.92 s gammaloop-nextest-spenso> =========================================
  628. 78.99 s error: Cannot build '/nix/store/wg9z1d6ybvc8xl844i0n0mklxxwi1328-gammaloop-nextest-spenso.drv'.
  629. 78.99 s Reason: builder failed with exit code 100.
  630. 78.99 s Output paths:
  631. 78.99 s /nix/store/lllalkgcfjij64ixlnv0xp0j8dfki7lv-gammaloop-nextest-spenso
  632. 78.99 s Last 325 log lines:
  633. 78.99 s > Extracting 5 binaries and 2 linked paths to /build/nextest-archive-5FQq2a
  634. 78.99 s > Extracted 19 files to /build/nextest-archive-5FQq2a in 0.22s
  635. 78.99 s > ------------
  636. 78.99 s > Nextest run ID c452a77e-cec7-43df-872b-228f1405beaa with nextest profile: ci_gammaloop
  637. 78.99 s > Starting 224 tests across 5 binaries (26 tests skipped, including 2 tests via profile.ci_gammaloop.default-filter)
  638. 78.99 s > FAIL [ 0.011s] ( 41/224) idenso color::test::form_reference::metric_contraction_respects_antisymmetric_normalization
  639. 78.99 s > stdout ---
  640. 78.99 s >
  641. 78.99 s > running 1 test
  642. 78.99 s > test color::test::form_reference::metric_contraction_respects_antisymmetric_normalization ... FAILED
  643. 78.99 s >
  644. 78.99 s > failures:
  645. 78.99 s >
  646. 78.99 s > failures:
  647. 78.99 s > color::test::form_reference::metric_contraction_respects_antisymmetric_normalization
  648. 78.99 s >
  649. 78.99 s > test result: FAILED. 0 passed; 1 failed; 0 ignored; 0 measured; 240 filtered out; finished in 0.00s
  650. 78.99 s >
  651. 78.99 s > stderr ---
  652. 78.99 s >
  653. 78.99 s > thread 'color::test::form_reference::metric_contraction_respects_antisymmetric_normalization' (330) panicked at crates/idenso/src/color/test/form_reference.rs:171:5:
  654. 78.99 s > assertion `left == right` failed
  655. 78.99 s > left: "-1*f(coad(8,standalone_metric_j),coad(8,standalone_metric_s),coad(8,standalone_metric_u))"
  656. 78.99 s > right: "f(coad(8,standalone_metric_j),coad(8,standalone_metric_s),coad(8,standalone_metric_u))"
  657. 78.99 s > stack backtrace:
  658. 78.99 s > 0: __rustc::rust_begin_unwind
  659. 78.99 s > 1: core::panicking::panic_fmt
  660. 78.99 s > 2: core::panicking::assert_failed_inner
  661. 78.99 s > 3: core::panicking::assert_failed::<alloc::string::String, alloc::string::String>
  662. 78.99 s > 4: idenso::color::test::form_reference::metric_contraction_respects_antisymmetric_normalization
  663. 78.99 s > 5: <idenso::color::test::form_reference::metric_contraction_respects_antisymmetric_normalization::{closure#0} as core::ops::function::FnOnce<()>>::call_once
  664. 78.99 s > note: Some details are omitted, run with `RUST_BACKTRACE=full` for a verbose backtrace.
  665. 78.99 s >
  666. 78.99 s > FAIL [ 0.073s] (215/224) idenso tensor::tests::parsing::infinite_execution
  667. 78.99 s > stdout ---
  668. 78.99 s >
  669. 78.99 s > running 1 test
  670. 78.99 s > ━━━━━━━━━━━━━━━━━━━━━━━━━━━━━━━ Snapshot Summary ━━━━━━━━━━━━━━━━━━━━━━━━━━━━━━━
  671. 78.99 s > Snapshot: infinite_execution
  672. 78.99 s > Source: crates/idenso/src/tensor/tests/parsing.rs:910
  673. 78.99 s > ────────────────────────────────────────────────────────────────────────────────
  674. 78.99 s > Expression: net_iter.snapshot_dot()
  675. 78.99 s > ────────────────────────────────────────────────────────────────────────────────
  676. 78.99 s > -old snapshot
  677. 78.99 s > +new results
  678. 78.99 s > ────────────┬───────────────────────────────────────────────────────────────────
  679. 78.99 s > 8 8 │ 0:0:s -> ext0 [id=0 color="red"];
  680. 78.99 s > 9 9 │ ext1 [style=invis];
  681. 78.99 s > 10 10 │ 0:5:s -> ext1 [id=1 dir=none color="red" label="mink4|l_0"];
  682. 78.99 s > 11 11 │ ext2 [style=invis];
  683. 78.99 s > 12 │- 0:4:s -> ext2 [id=2 dir=none color="red" label="bis4|l_2"];
  684. 78.99 s > 12 │+ 0:3:s -> ext2 [id=2 dir=none color="red" label="mink4|l_1"];
  685. 78.99 s > 13 13 │ ext3 [style=invis];
  686. 78.99 s > 14 │- 0:3:s -> ext3 [id=3 dir=none color="red" label="bis4|l_3"];
  687. 78.99 s > 14 │+ 0:1:s -> ext3 [id=3 dir=none color="red" label="bis4|l_2"];
  688. 78.99 s > 15 15 │ ext4 [style=invis];
  689. 78.99 s > 16 │- 0:1:s -> ext4 [id=4 dir=none color="red" label="mink4|l_1"];
  690. 78.99 s > 16 │+ 0:2:s -> ext4 [id=4 dir=none color="red" label="mink4|l_4"];
  691. 78.99 s > 17 17 │ ext5 [style=invis];
  692. 78.99 s > 18 │- 0:2:s -> ext5 [id=5 dir=none color="red" label="mink4|l_4"];
  693. 78.99 s > 18 │+ 0:4:s -> ext5 [id=5 dir=none color="red" label="bis4|l_3"];
  694. 78.99 s > 19 19 │ }
  695. 78.99 s > ────────────┴───────────────────────────────────────────────────────────────────
  696. 78.99 s > To update snapshots run `cargo insta review`
  697. 78.99 s > Stopped on the first failure. Run `cargo insta test` to run all snapshots.
  698. 78.99 s > test tensor::tests::parsing::infinite_execution ... FAILED
  699. 78.99 s >
  700. 78.99 s > failures:
  701. 78.99 s >
  702. 78.99 s > failures:
  703. 78.99 s > tensor::tests::parsing::infinite_execution
  704. 78.99 s >
  705. 78.99 s > test result: FAILED. 0 passed; 1 failed; 0 ignored; 0 measured; 240 filtered out; finished in 0.06s
  706. 78.99 s >
  707. 78.99 s > stderr ---
  708. 78.99 s >
  709. 78.99 s > thread 'tensor::tests::parsing::infinite_execution' (842) panicked at /nix/store/30svmzr0z0zpcqjyynjn7w21wgx18y4b-vendor-cargo-deps/c19b7c6f923b580ac259164a89f2577984ad5ab09ee9d583b888f934adbbe8d0/insta-1.47.2/src/runtime.rs:719:13:
  710. 78.99 s > snapshot assertion for 'infinite_execution' failed in line 910
  711. 78.99 s > stack backtrace:
  712. 78.99 s > 0: __rustc::rust_begin_unwind
  713. 78.99 s > 1: core::panicking::panic_fmt
  714. 78.99 s > 2: insta::runtime::assert_snapshot
  715. 78.99 s > 3: idenso::tensor::tests::parsing::infinite_execution
  716. 78.99 s > 4: <idenso::tensor::tests::parsing::infinite_execution::{closure#0} as core::ops::function::FnOnce<()>>::call_once
  717. 78.99 s > note: Some details are omitted, run with `RUST_BACKTRACE=full` for a verbose backtrace.
  718. 78.99 s >
  719. 78.99 s > ------------
  720. 78.99 s > Summary [ 2.201s] 224 tests run: 222 passed, 2 failed, 26 skipped
  721. 78.99 s > FAIL [ 0.011s] ( 41/224) idenso color::test::form_reference::metric_contraction_respects_antisymmetric_normalization
  722. 78.99 s > stdout ---
  723. 78.99 s >
  724. 78.99 s > running 1 test
  725. 78.99 s > test color::test::form_reference::metric_contraction_respects_antisymmetric_normalization ... FAILED
  726. 78.99 s >
  727. 78.99 s > failures:
  728. 78.99 s >
  729. 78.99 s > failures:
  730. 78.99 s > color::test::form_reference::metric_contraction_respects_antisymmetric_normalization
  731. 78.99 s >
  732. 78.99 s > test result: FAILED. 0 passed; 1 failed; 0 ignored; 0 measured; 240 filtered out; finished in 0.00s
  733. 78.99 s >
  734. 78.99 s > stderr ---
  735. 78.99 s >
  736. 78.99 s > thread 'color::test::form_reference::metric_contraction_respects_antisymmetric_normalization' (330) panicked at crates/idenso/src/color/test/form_reference.rs:171:5:
  737. 78.99 s > assertion `left == right` failed
  738. 78.99 s > left: "-1*f(coad(8,standalone_metric_j),coad(8,standalone_metric_s),coad(8,standalone_metric_u))"
  739. 78.99 s > right: "f(coad(8,standalone_metric_j),coad(8,standalone_metric_s),coad(8,standalone_metric_u))"
  740. 78.99 s > stack backtrace:
  741. 78.99 s > 0: __rustc::rust_begin_unwind
  742. 78.99 s > 1: core::panicking::panic_fmt
  743. 78.99 s > 2: core::panicking::assert_failed_inner
  744. 78.99 s > 3: core::panicking::assert_failed::<alloc::string::String, alloc::string::String>
  745. 78.99 s > 4: idenso::color::test::form_reference::metric_contraction_respects_antisymmetric_normalization
  746. 78.99 s > 5: <idenso::color::test::form_reference::metric_contraction_respects_antisymmetric_normalization::{closure#0} as core::ops::function::FnOnce<()>>::call_once
  747. 78.99 s > note: Some details are omitted, run with `RUST_BACKTRACE=full` for a verbose backtrace.
  748. 78.99 s >
  749. 78.99 s > FAIL [ 0.073s] (215/224) idenso tensor::tests::parsing::infinite_execution
  750. 78.99 s > stdout ---
  751. 78.99 s >
  752. 78.99 s > running 1 test
  753. 78.99 s > ━━━━━━━━━━━━━━━━━━━━━━━━━━━━━━━ Snapshot Summary ━━━━━━━━━━━━━━━━━━━━━━━━━━━━━━━
  754. 78.99 s > Snapshot: infinite_execution
  755. 78.99 s > Source: crates/idenso/src/tensor/tests/parsing.rs:910
  756. 78.99 s > ────────────────────────────────────────────────────────────────────────────────
  757. 78.99 s > Expression: net_iter.snapshot_dot()
  758. 78.99 s > ────────────────────────────────────────────────────────────────────────────────
  759. 78.99 s > -old snapshot
  760. 78.99 s > +new results
  761. 78.99 s > ────────────┬───────────────────────────────────────────────────────────────────
  762. 78.99 s > 8 8 │ 0:0:s -> ext0 [id=0 color="red"];
  763. 78.99 s > 9 9 │ ext1 [style=invis];
  764. 78.99 s > 10 10 │ 0:5:s -> ext1 [id=1 dir=none color="red" label="mink4|l_0"];
  765. 78.99 s > 11 11 │ ext2 [style=invis];
  766. 78.99 s > 12 │- 0:4:s -> ext2 [id=2 dir=none color="red" label="bis4|l_2"];
  767. 78.99 s > 12 │+ 0:3:s -> ext2 [id=2 dir=none color="red" label="mink4|l_1"];
  768. 78.99 s > 13 13 │ ext3 [style=invis];
  769. 78.99 s > 14 │- 0:3:s -> ext3 [id=3 dir=none color="red" label="bis4|l_3"];
  770. 78.99 s > 14 │+ 0:1:s -> ext3 [id=3 dir=none color="red" label="bis4|l_2"];
  771. 78.99 s > 15 15 │ ext4 [style=invis];
  772. 78.99 s > 16 │- 0:1:s -> ext4 [id=4 dir=none color="red" label="mink4|l_1"];
  773. 78.99 s > 16 │+ 0:2:s -> ext4 [id=4 dir=none color="red" label="mink4|l_4"];
  774. 78.99 s > 17 17 │ ext5 [style=invis];
  775. 78.99 s > 18 │- 0:2:s -> ext5 [id=5 dir=none color="red" label="mink4|l_4"];
  776. 78.99 s > 18 │+ 0:4:s -> ext5 [id=5 dir=none color="red" label="bis4|l_3"];
  777. 78.99 s > 19 19 │ }
  778. 78.99 s > ────────────┴───────────────────────────────────────────────────────────────────
  779. 78.99 s > To update snapshots run `cargo insta review`
  780. 78.99 s > Stopped on the first failure. Run `cargo insta test` to run all snapshots.
  781. 78.99 s > test tensor::tests::parsing::infinite_execution ... FAILED
  782. 78.99 s >
  783. 78.99 s > failures:
  784. 78.99 s >
  785. 78.99 s > failures:
  786. 78.99 s > tensor::tests::parsing::infinite_execution
  787. 78.99 s >
  788. 78.99 s > test result: FAILED. 0 passed; 1 failed; 0 ignored; 0 measured; 240 filtered out; finished in 0.06s
  789. 78.99 s >
  790. 78.99 s > stderr ---
  791. 78.99 s >
  792. 78.99 s > thread 'tensor::tests::parsing::infinite_execution' (842) panicked at /nix/store/30svmzr0z0zpcqjyynjn7w21wgx18y4b-vendor-cargo-deps/c19b7c6f923b580ac259164a89f2577984ad5ab09ee9d583b888f934adbbe8d0/insta-1.47.2/src/runtime.rs:719:13:
  793. 78.99 s > snapshot assertion for 'infinite_execution' failed in line 910
  794. 78.99 s > stack backtrace:
  795. 78.99 s > 0: __rustc::rust_begin_unwind
  796. 78.99 s > 1: core::panicking::panic_fmt
  797. 78.99 s > 2: insta::runtime::assert_snapshot
  798. 78.99 s > 3: idenso::tensor::tests::parsing::infinite_execution
  799. 78.99 s > 4: <idenso::tensor::tests::parsing::infinite_execution::{closure#0} as core::ops::function::FnOnce<()>>::call_once
  800. 78.99 s > note: Some details are omitted, run with `RUST_BACKTRACE=full` for a verbose backtrace.
  801. 78.99 s >
  802. 78.99 s > error: test run failed
  803. 78.99 s >
  804. 78.99 s > ========== nextest test summary ==========
  805. 78.99 s > report: target/nextest/ci_gammaloop/junit.xml
  806. 78.99 s > tests: 224, failures: 2, errors: 0
  807. 78.99 s >
  808. 78.99 s > 1. idenso::color::test::form_reference::metric_contraction_respects_antisymmetric_normalization
  809. 78.99 s > failure: test failure with exit code 101
  810. 78.99 s > thread 'color::test::form_reference::metric_contraction_respects_antisymmetric_normalization' (330) panicked at crates/idenso/src/color/test/form_reference.rs:171:5:
  811. 78.99 s > assertion `left == right` failed
  812. 78.99 s > left: "-1*f(coad(8,standalone_metric_j),coad(8,standalone_metric_s),coad(8,standalone_metric_u))"
  813. 78.99 s > right: "f(coad(8,standalone_metric_j),coad(8,standalone_metric_s),coad(8,standalone_metric_u))"
  814. 78.99 s > stack backtrace:
  815. 78.99 s > 0: __rustc::rust_begin_unwind
  816. 78.99 s > 1: core::panicking::panic_fmt
  817. 78.99 s > 2: core::panicking::assert_failed_inner
  818. 78.99 s > 3: core::panicking::assert_failed::<alloc::string::String, alloc::string::String>
  819. 78.99 s > 4: idenso::color::test::form_reference::metric_contraction_respects_antisymmetric_normalization
  820. 78.99 s > 5: <idenso::color::test::form_reference::metric_contraction_respects_antisymmetric_normalization::{closure#0} as core::ops::function::FnOnce<()>>::call_once
  821. 78.99 s > note: Some details are omitted, run with `RUST_BACKTRACE=full` for a verbose backtrace.
  822. 78.99 s > system-out
  823. 78.99 s > running 1 test
  824. 78.99 s > test color::test::form_reference::metric_contraction_respects_antisymmetric_normalization ... FAILED
  825. 78.99 s >
  826. 78.99 s > failures:
  827. 78.99 s >
  828. 78.99 s > failures:
  829. 78.99 s > color::test::form_reference::metric_contraction_respects_antisymmetric_normalization
  830. 78.99 s >
  831. 78.99 s > test result: FAILED. 0 passed; 1 failed; 0 ignored; 0 measured; 240 filtered out; finished in 0.00s
  832. 78.99 s > system-err
  833. 78.99 s > thread 'color::test::form_reference::metric_contraction_respects_antisymmetric_normalization' (330) panicked at crates/idenso/src/color/test/form_reference.rs:171:5:
  834. 78.99 s > assertion `left == right` failed
  835. 78.99 s > left: "-1*f(coad(8,standalone_metric_j),coad(8,standalone_metric_s),coad(8,standalone_metric_u))"
  836. 78.99 s > right: "f(coad(8,standalone_metric_j),coad(8,standalone_metric_s),coad(8,standalone_metric_u))"
  837. 78.99 s > stack backtrace:
  838. 78.99 s > 0: __rustc::rust_begin_unwind
  839. 78.99 s > 1: core::panicking::panic_fmt
  840. 78.99 s > 2: core::panicking::assert_failed_inner
  841. 78.99 s > 3: core::panicking::assert_failed::<alloc::string::String, alloc::string::String>
  842. 78.99 s > 4: idenso::color::test::form_reference::metric_contraction_respects_antisymmetric_normalization
  843. 78.99 s > 5: <idenso::color::test::form_reference::metric_contraction_respects_antisymmetric_normalization::{closure#0} as core::ops::function::FnOnce<()>>::call_once
  844. 78.99 s > note: Some details are omitted, run with `RUST_BACKTRACE=full` for a verbose backtrace.
  845. 78.99 s >
  846. 78.99 s > 2. idenso::tensor::tests::parsing::infinite_execution
  847. 78.99 s > failure: test failure with exit code 101
  848. 78.99 s > thread 'tensor::tests::parsing::infinite_execution' (842) panicked at /nix/store/30svmzr0z0zpcqjyynjn7w21wgx18y4b-vendor-cargo-deps/c19b7c6f923b580ac259164a89f2577984ad5ab09ee9d583b888f934adbbe8d0/insta-1.47.2/src/runtime.rs:719:13:
  849. 78.99 s > snapshot assertion for 'infinite_execution' failed in line 910
  850. 78.99 s > stack backtrace:
  851. 78.99 s > 0: __rustc::rust_begin_unwind
  852. 78.99 s > 1: core::panicking::panic_fmt
  853. 78.99 s > 2: insta::runtime::assert_snapshot
  854. 78.99 s > 3: idenso::tensor::tests::parsing::infinite_execution
  855. 78.99 s > 4: <idenso::tensor::tests::parsing::infinite_execution::{closure#0} as core::ops::function::FnOnce<()>>::call_once
  856. 78.99 s > note: Some details are omitted, run with `RUST_BACKTRACE=full` for a verbose backtrace.
  857. 78.99 s > system-out
  858. 78.99 s > running 1 test
  859. 78.99 s > ━━━━━━━━━━━━━━━━━━━━━━━━━━━━━━━ Snapshot Summary ━━━━━━━━━━━━━━━━━━━━━━━━━━━━━━━
  860. 78.99 s > Snapshot: infinite_execution
  861. 78.99 s > Source: crates/idenso/src/tensor/tests/parsing.rs:910
  862. 78.99 s > ────────────────────────────────────────────────────────────────────────────────
  863. 78.99 s > Expression: net_iter.snapshot_dot()
  864. 78.99 s > ────────────────────────────────────────────────────────────────────────────────
  865. 78.99 s > -old snapshot
  866. 78.99 s > +new results
  867. 78.99 s > ────────────┬───────────────────────────────────────────────────────────────────
  868. 78.99 s > 8 8 │ 0:0:s-> ext0 [id=0 color="red"];
  869. 78.99 s > 9 9 │ ext1 [style=invis];
  870. 78.99 s > 10 10 │ 0:5:s-> ext1 [id=1 dir=none color="red" label="mink4|l_0"];
  871. 78.99 s > 11 11 │ ext2 [style=invis];
  872. 78.99 s > 12 │- 0:4:s-> ext2 [id=2 dir=none color="red" label="bis4|l_2"];
  873. 78.99 s > 12 │+ 0:3:s-> ext2 [id=2 dir=none color="red" label="mink4|l_1"];
  874. 78.99 s > 13 13 │ ext3 [style=invis];
  875. 78.99 s > 14 │- 0:3:s-> ext3 [id=3 dir=none color="red" label="bis4|l_3"];
  876. 78.99 s > 14 │+ 0:1:s-> ext3 [id=3 dir=none color="red" label="bis4|l_2"];
  877. 78.99 s > 15 15 │ ext4 [style=invis];
  878. 78.99 s > 16 │- 0:1:s-> ext4 [id=4 dir=none color="red" label="mink4|l_1"];
  879. 78.99 s > 16 │+ 0:2:s-> ext4 [id=4 dir=none color="red" label="mink4|l_4"];
  880. 78.99 s > 17 17 │ ext5 [style=invis];
  881. 78.99 s > 18 │- 0:2:s-> ext5 [id=5 dir=none color="red" label="mink4|l_4"];
  882. 78.99 s > 18 │+ 0:4:s-> ext5 [id=5 dir=none color="red" label="bis4|l_3"];
  883. 78.99 s > 19 19 │ }
  884. 78.99 s > ────────────┴───────────────────────────────────────────────────────────────────
  885. 78.99 s > To update snapshots run `cargo insta review`
  886. 78.99 s > Stopped on the first failure. Run `cargo insta test` to run all snapshots.
  887. 78.99 s > test tensor::tests::parsing::infinite_execution ... FAILED
  888. 78.99 s >
  889. 78.99 s > failures:
  890. 78.99 s >
  891. 78.99 s > failures:
  892. 78.99 s > tensor::tests::parsing::infinite_execution
  893. 78.99 s >
  894. 78.99 s > test result: FAILED. 0 passed; 1 failed; 0 ignored; 0 measured; 240 filtered out; finished in 0.06s
  895. 78.99 s > system-err
  896. 78.99 s > thread 'tensor::tests::parsing::infinite_execution' (842) panicked at /nix/store/30svmzr0z0zpcqjyynjn7w21wgx18y4b-vendor-cargo-deps/c19b7c6f923b580ac259164a89f2577984ad5ab09ee9d583b888f934adbbe8d0/insta-1.47.2/src/runtime.rs:719:13:
  897. 78.99 s > snapshot assertion for 'infinite_execution' failed in line 910
  898. 78.99 s > stack backtrace:
  899. 78.99 s > 0: __rustc::rust_begin_unwind
  900. 78.99 s > 1: core::panicking::panic_fmt
  901. 78.99 s > 2: insta::runtime::assert_snapshot
  902. 78.99 s > 3: idenso::tensor::tests::parsing::infinite_execution
  903. 78.99 s > 4: <idenso::tensor::tests::parsing::infinite_execution::{closure#0} as core::ops::function::FnOnce<()>>::call_once
  904. 78.99 s > note: Some details are omitted, run with `RUST_BACKTRACE=full` for a verbose backtrace.
  905. 78.99 s > =========================================
  906. 78.99 s > Extracting 2 binaries and 1 linked path to /build/nextest-archive-yIvfgp
  907. 78.99 s > Extracted 8 files to /build/nextest-archive-yIvfgp in 0.08s
  908. 78.99 s > ------------
  909. 78.99 s > Nextest run ID a5c93319-a856-42df-ac25-8ac415bed22a with nextest profile: ci_gammaloop
  910. 78.99 s > Starting 135 tests across 2 binaries
  911. 78.99 s > ------------
  912. 78.99 s > Summary [ 0.206s] 135 tests run: 135 passed, 0 skipped
  913. 78.99 s >
  914. 78.99 s > ========== nextest test summary ==========
  915. 78.99 s > report: target/nextest/ci_gammaloop/junit.xml
  916. 78.99 s > tests: 135, failures: 0, errors: 0
  917. 78.99 s > No failing testcases found.
  918. 78.99 s > =========================================
  919. 78.99 s > Extracting 5 binaries and 2 linked paths to /build/nextest-archive-RpUdkm
  920. 78.99 s > Extracted 19 files to /build/nextest-archive-RpUdkm in 0.25s
  921. 78.99 s > ------------
  922. 78.99 s > Nextest run ID b48bb28a-1fb9-4be1-a1b9-2f0859e3a7c1 with nextest profile: ci_gammaloop
  923. 78.99 s > Starting 25 tests across 5 binaries (1 test skipped via profile.ci_gammaloop.default-filter)
  924. 78.99 s > ------------
  925. 78.99 s > Summary [ 0.299s] 25 tests run: 25 passed, 1 skipped
  926. 78.99 s >
  927. 78.99 s > ========== nextest test summary ==========
  928. 78.99 s > report: target/nextest/ci_gammaloop/junit.xml
  929. 78.99 s > tests: 25, failures: 0, errors: 0
  930. 78.99 s > No failing testcases found.
  931. 78.99 s > =========================================
  932. 78.99 s > Extracting 2 binaries and 1 linked path to /build/nextest-archive-07AYbh
  933. 78.99 s > Extracted 8 files to /build/nextest-archive-07AYbh in 0.07s
  934. 78.99 s > ------------
  935. 78.99 s > Nextest run ID f3f19451-eace-4f10-adbb-e3298a804db9 with nextest profile: ci_gammaloop
  936. 78.99 s > Starting 1 test across 2 binaries
  937. 78.99 s > ------------
  938. 78.99 s > Summary [ 0.019s] 1 test run: 1 passed, 0 skipped
  939. 78.99 s >
  940. 78.99 s > ========== nextest test summary ==========
  941. 78.99 s > report: target/nextest/ci_gammaloop/junit.xml
  942. 78.99 s > tests: 1, failures: 0, errors: 0
  943. 78.99 s > No failing testcases found.
  944. 78.99 s > =========================================
  945. 78.99 s > Extracting 1 binary and 1 linked path to /build/nextest-archive-QR4JEP
  946. 78.99 s > Extracted 7 files to /build/nextest-archive-QR4JEP in 0.08s
  947. 78.99 s > ------------
  948. 78.99 s > Nextest run ID 5029fd47-6f0c-4028-ba04-e6a936bb61ce with nextest profile: ci_gammaloop
  949. 78.99 s > Starting 0 tests across 1 binary
  950. 78.99 s > ------------
  951. 78.99 s > Summary [ 0.002s] 0 tests run: 0 passed, 0 skipped
  952. 78.99 s >
  953. 78.99 s > ========== nextest test summary ==========
  954. 78.99 s > report: target/nextest/ci_gammaloop/junit.xml
  955. 78.99 s > tests: 0, failures: 0, errors: 0
  956. 78.99 s > No failing testcases found.
  957. 78.99 s > =========================================
  958. 78.99 s For full logs, run:
  959. 78.99 s nix log /nix/store/wg9z1d6ybvc8xl844i0n0mklxxwi1328-gammaloop-nextest-spenso.drv
  960. 79.11 s [0 built (1 failed), 0.0Run failed.