1.05 s
$ /nix/store/9ypz3flqsrl5xl495mm8h645gadjsxi1-coreutils-9.11/bin/timeout --kill-after=15s 7200s /nix/store/23zk8sgzamrbmj1fday15szf7f2279s8-nix-2.34.7/bin/nix --extra-experimental-features nix-command --extra-experimental-features flakes flake clone git+https://github.com/alphal00p/gammaloop --dest /tmp/nix-ci-worker/stable-pwd/repo/
1.09 s
Cloning into '/tmp/nix-ci-worker/stable-pwd/repo'...
1.31 s
remote: Enumerating objects: 65231, done.
1.42 s
remote: Counting objects: 0% (1/7903)
remote: Counting objects: 1% (80/7903)
remote: Counting objects: 2% (159/7903)
remote: Counting objects: 3% (238/7903)
remote: Counting objects: 4% (317/7903)
remote: Counting objects: 5% (396/7903)
remote: Counting objects: 6% (475/7903)
remote: Counting objects: 7% (554/7903)
remote: Counting objects: 8% (633/7903)
remote: Counting objects: 9% (712/7903)
remote: Counting objects: 10% (791/7903)
remote: Counting objects: 11% (870/7903)
remote: Counting objects: 12% (949/7903)
remote: Counting objects: 13% (1028/7903)
remote: Counting objects: 14% (1107/7903)
remote: Counting objects: 15% (1186/7903)
remote: Counting objects: 16% (1265/7903)
remote: Counting objects: 17% (1344/7903)
remote: Counting objects: 18% (1423/7903)
remote: Counting objects: 19% (1502/7903)
remote: Counting objects: 20% (1581/7903)
remote: Counting objects: 21% (1660/7903)
remote: Counting objects: 22% (1739/7903)
remote: Counting objects: 23% (1818/7903)
remote: Counting objects: 24% (1897/7903)
remote: Counting objects: 25% (1976/7903)
remote: Counting objects: 26% (2055/7903)
remote: Counting objects: 27% (2134/7903)
remote: Counting objects: 28% (2213/7903)
remote: Counting objects: 29% (2292/7903)
remote: Counting objects: 30% (2371/7903)
remote: Counting objects: 31% (2450/7903)
remote: Counting objects: 32% (2529/7903)
remote: Counting objects: 33% (2608/7903)
remote: Counting objects: 34% (2688/7903)
remote: Counting objects: 35% (2767/7903)
remote: Counting objects: 36% (2846/7903)
remote: Counting objects: 37% (2925/7903)
remote: Counting objects: 38% (3004/7903)
remote: Counting objects: 39% (3083/7903)
remote: Counting objects: 40% (3162/7903)
remote: Counting objects: 41% (3241/7903)
remote: Counting objects: 42% (3320/7903)
remote: Counting objects: 43% (3399/7903)
remote: Counting objects: 44% (3478/7903)
remote: Counting objects: 45% (3557/7903)
remote: Counting objects: 46% (3636/7903)
remote: Counting objects: 47% (3715/7903)
remote: Counting objects: 48% (3794/7903)
remote: Counting objects: 49% (3873/7903)
remote: Counting objects: 50% (3952/7903)
remote: Counting objects: 51% (4031/7903)
remote: Counting objects: 52% (4110/7903)
remote: Counting objects: 53% (4189/7903)
remote: Counting objects: 54% (4268/7903)
remote: Counting objects: 55% (4347/7903)
remote: Counting objects: 56% (4426/7903)
remote: Counting objects: 57% (4505/7903)
remote: Counting objects: 58% (4584/7903)
remote: Counting objects: 59% (4663/7903)
remote: Counting objects: 60% (4742/7903)
remote: Counting objects: 61% (4821/7903)
remote: Counting objects: 62% (4900/7903)
remote: Counting objects: 63% (4979/7903)
remote: Counting objects: 64% (5058/7903)
remote: Counting objects: 65% (5137/7903)
remote: Counting objects: 66% (5216/7903)
remote: Counting objects: 67% (5296/7903)
remote: Counting objects: 68% (5375/7903)
remote: Counting objects: 69% (5454/7903)
remote: Counting objects: 70% (5533/7903)
remote: Counting objects: 71% (5612/7903)
remote: Counting objects: 72% (5691/7903)
remote: Counting objects: 73% (5770/7903)
remote: Counting objects: 74% (5849/7903)
remote: Counting objects: 75% (5928/7903)
remote: Counting objects: 76% (6007/7903)
remote: Counting objects: 77% (6086/7903)
remote: Counting objects: 78% (6165/7903)
remote: Counting objects: 79% (6244/7903)
remote: Counting objects: 80% (6323/7903)
remote: Counting objects: 81% (6402/7903)
remote: Counting objects: 82% (6481/7903)
remote: Counting objects: 83% (6560/7903)
remote: Counting objects: 84% (6639/7903)
remote: Counting objects: 85% (6718/7903)
remote: Counting objects: 86% (6797/7903)
remote: Counting objects: 87% (6876/7903)
remote: Counting objects: 88% (6955/7903)
remote: Counting objects: 89% (7034/7903)
remote: Counting objects: 90% (7113/7903)
remote: Counting objects: 91% (7192/7903)
remote: Counting objects: 92% (7271/7903)
remote: Counting objects: 93% (7350/7903)
remote: Counting objects: 94% (7429/7903)
remote: Counting objects: 95% (7508/7903)
remote: Counting objects: 96% (7587/7903)
remote: Counting objects: 97% (7666/7903)
remote: Counting objects: 98% (7745/7903)
remote: Counting objects: 99% (7824/7903)
remote: Counting objects: 100% (7903/7903)
remote: Counting objects: 100% (7903/7903), done.
2.90 s
remote: Compressing objects: 0% (1/1561)
remote: Compressing objects: 1% (16/1561)
remote: Compressing objects: 2% (32/1561)
remote: Compressing objects: 3% (47/1561)
remote: Compressing objects: 4% (63/1561)
remote: Compressing objects: 5% (79/1561)
remote: Compressing objects: 6% (94/1561)
remote: Compressing objects: 7% (110/1561)
remote: Compressing objects: 8% (125/1561)
remote: Compressing objects: 9% (141/1561)
remote: Compressing objects: 10% (157/1561)
remote: Compressing objects: 11% (172/1561)
remote: Compressing objects: 12% (188/1561)
remote: Compressing objects: 13% (203/1561)
remote: Compressing objects: 14% (219/1561)
remote: Compressing objects: 15% (235/1561)
remote: Compressing objects: 15% (243/1561)
remote: Compressing objects: 16% (250/1561)
remote: Compressing objects: 17% (266/1561)
remote: Compressing objects: 18% (281/1561)
remote: Compressing objects: 19% (297/1561)
remote: Compressing objects: 20% (313/1561)
remote: Compressing objects: 21% (328/1561)
remote: Compressing objects: 22% (344/1561)
remote: Compressing objects: 23% (360/1561)
remote: Compressing objects: 24% (375/1561)
remote: Compressing objects: 25% (391/1561)
remote: Compressing objects: 26% (406/1561)
remote: Compressing objects: 27% (422/1561)
remote: Compressing objects: 28% (438/1561)
remote: Compressing objects: 29% (453/1561)
remote: Compressing objects: 30% (469/1561)
remote: Compressing objects: 31% (484/1561)
remote: Compressing objects: 32% (500/1561)
remote: Compressing objects: 33% (516/1561)
remote: Compressing objects: 34% (531/1561)
remote: Compressing objects: 35% (547/1561)
remote: Compressing objects: 36% (562/1561)
remote: Compressing objects: 37% (578/1561)
remote: Compressing objects: 38% (594/1561)
remote: Compressing objects: 39% (609/1561)
remote: Compressing objects: 40% (625/1561)
remote: Compressing objects: 41% (641/1561)
remote: Compressing objects: 42% (656/1561)
remote: Compressing objects: 43% (672/1561)
remote: Compressing objects: 44% (687/1561)
remote: Compressing objects: 45% (703/1561)
remote: Compressing objects: 46% (719/1561)
remote: Compressing objects: 47% (734/1561)
remote: Compressing objects: 48% (750/1561)
remote: Compressing objects: 49% (765/1561)
remote: Compressing objects: 50% (781/1561)
remote: Compressing objects: 51% (797/1561)
remote: Compressing objects: 52% (812/1561)
remote: Compressing objects: 53% (828/1561)
remote: Compressing objects: 54% (843/1561)
remote: Compressing objects: 55% (859/1561)
remote: Compressing objects: 56% (875/1561)
remote: Compressing objects: 57% (890/1561)
remote: Compressing objects: 58% (906/1561)
remote: Compressing objects: 59% (921/1561)
remote: Compressing objects: 60% (937/1561)
remote: Compressing objects: 61% (953/1561)
remote: Compressing objects: 62% (968/1561)
remote: Compressing objects: 63% (984/1561)
remote: Compressing objects: 64% (1000/1561)
remote: Compressing objects: 65% (1015/1561)
remote: Compressing objects: 66% (1031/1561)
remote: Compressing objects: 67% (1046/1561)
remote: Compressing objects: 68% (1062/1561)
remote: Compressing objects: 69% (1078/1561)
remote: Compressing objects: 70% (1093/1561)
remote: Compressing objects: 71% (1109/1561)
remote: Compressing objects: 72% (1124/1561)
remote: Compressing objects: 73% (1140/1561)
remote: Compressing objects: 74% (1156/1561)
remote: Compressing objects: 75% (1171/1561)
remote: Compressing objects: 76% (1187/1561)
remote: Compressing objects: 77% (1202/1561)
remote: Compressing objects: 78% (1218/1561)
remote: Compressing objects: 79% (1234/1561)
remote: Compressing objects: 80% (1249/1561)
remote: Compressing objects: 81% (1265/1561)
remote: Compressing objects: 82% (1281/1561)
remote: Compressing objects: 83% (1296/1561)
remote: Compressing objects: 84% (1312/1561)
remote: Compressing objects: 85% (1327/1561)
remote: Compressing objects: 86% (1343/1561)
remote: Compressing objects: 87% (1359/1561)
remote: Compressing objects: 88% (1374/1561)
remote: Compressing objects: 89% (1390/1561)
remote: Compressing objects: 90% (1405/1561)
remote: Compressing objects: 91% (1421/1561)
remote: Compressing objects: 92% (1437/1561)
remote: Compressing objects: 93% (1452/1561)
remote: Compressing objects: 94% (1468/1561)
remote: Compressing objects: 95% (1483/1561)
remote: Compressing objects: 96% (1499/1561)
remote: Compressing objects: 97% (1515/1561)
remote: Compressing objects: 98% (1530/1561)
remote: Compressing objects: 99% (1546/1561)
remote: Compressing objects: 100% (1561/1561)
remote: Compressing objects: 100% (1561/1561), done.
5.61 s
Receiving objects: 0% (1/65231)
Receiving objects: 1% (653/65231)
Receiving objects: 2% (1305/65231)
Receiving objects: 3% (1957/65231)
Receiving objects: 4% (2610/65231)
Receiving objects: 5% (3262/65231)
Receiving objects: 6% (3914/65231)
Receiving objects: 7% (4567/65231)
Receiving objects: 8% (5219/65231)
Receiving objects: 9% (5871/65231)
Receiving objects: 10% (6524/65231)
Receiving objects: 11% (7176/65231), 10.98 MiB | 21.94 MiB/s
Receiving objects: 12% (7828/65231), 10.98 MiB | 21.94 MiB/s
Receiving objects: 13% (8481/65231), 10.98 MiB | 21.94 MiB/s
Receiving objects: 14% (9133/65231), 10.98 MiB | 21.94 MiB/s
Receiving objects: 15% (9785/65231), 10.98 MiB | 21.94 MiB/s
Receiving objects: 16% (10437/65231), 10.98 MiB | 21.94 MiB/s
Receiving objects: 17% (11090/65231), 10.98 MiB | 21.94 MiB/s
Receiving objects: 18% (11742/65231), 10.98 MiB | 21.94 MiB/s
Receiving objects: 19% (12394/65231), 10.98 MiB | 21.94 MiB/s
Receiving objects: 20% (13047/65231), 10.98 MiB | 21.94 MiB/s
Receiving objects: 21% (13699/65231), 10.98 MiB | 21.94 MiB/s
Receiving objects: 22% (14351/65231), 10.98 MiB | 21.94 MiB/s
Receiving objects: 23% (15004/65231), 10.98 MiB | 21.94 MiB/s
Receiving objects: 24% (15656/65231), 10.98 MiB | 21.94 MiB/s
Receiving objects: 25% (16308/65231), 10.98 MiB | 21.94 MiB/s
Receiving objects: 26% (16961/65231), 10.98 MiB | 21.94 MiB/s
Receiving objects: 27% (17613/65231), 10.98 MiB | 21.94 MiB/s
Receiving objects: 28% (18265/65231), 10.98 MiB | 21.94 MiB/s
Receiving objects: 29% (18917/65231), 10.98 MiB | 21.94 MiB/s
Receiving objects: 30% (19570/65231), 10.98 MiB | 21.94 MiB/s
Receiving objects: 31% (20222/65231), 10.98 MiB | 21.94 MiB/s
Receiving objects: 32% (20874/65231), 10.98 MiB | 21.94 MiB/s
Receiving objects: 33% (21527/65231), 10.98 MiB | 21.94 MiB/s
Receiving objects: 34% (22179/65231), 10.98 MiB | 21.94 MiB/s
Receiving objects: 35% (22831/65231), 10.98 MiB | 21.94 MiB/s
Receiving objects: 36% (23484/65231), 10.98 MiB | 21.94 MiB/s
Receiving objects: 37% (24136/65231), 10.98 MiB | 21.94 MiB/s
Receiving objects: 38% (24788/65231), 10.98 MiB | 21.94 MiB/s
Receiving objects: 39% (25441/65231), 10.98 MiB | 21.94 MiB/s
Receiving objects: 40% (26093/65231), 10.98 MiB | 21.94 MiB/s
Receiving objects: 41% (26745/65231), 10.98 MiB | 21.94 MiB/s
Receiving objects: 42% (27398/65231), 10.98 MiB | 21.94 MiB/s
Receiving objects: 43% (28050/65231), 10.98 MiB | 21.94 MiB/s
Receiving objects: 44% (28702/65231), 10.98 MiB | 21.94 MiB/s
Receiving objects: 45% (29354/65231), 10.98 MiB | 21.94 MiB/s
Receiving objects: 46% (30007/65231), 10.98 MiB | 21.94 MiB/s
Receiving objects: 47% (30659/65231), 10.98 MiB | 21.94 MiB/s
Receiving objects: 48% (31311/65231), 10.98 MiB | 21.94 MiB/s
Receiving objects: 49% (31964/65231), 10.98 MiB | 21.94 MiB/s
Receiving objects: 50% (32616/65231), 10.98 MiB | 21.94 MiB/s
Receiving objects: 50% (33179/65231), 31.04 MiB | 31.03 MiB/s
Receiving objects: 51% (33268/65231), 31.04 MiB | 31.03 MiB/s
Receiving objects: 52% (33921/65231), 31.04 MiB | 31.03 MiB/s
Receiving objects: 53% (34573/65231), 31.04 MiB | 31.03 MiB/s
Receiving objects: 54% (35225/65231), 31.04 MiB | 31.03 MiB/s
Receiving objects: 55% (35878/65231), 31.04 MiB | 31.03 MiB/s
Receiving objects: 56% (36530/65231), 31.04 MiB | 31.03 MiB/s
Receiving objects: 57% (37182/65231), 31.04 MiB | 31.03 MiB/s
Receiving objects: 58% (37834/65231), 31.04 MiB | 31.03 MiB/s
Receiving objects: 59% (38487/65231), 31.04 MiB | 31.03 MiB/s
Receiving objects: 60% (39139/65231), 31.04 MiB | 31.03 MiB/s
Receiving objects: 61% (39791/65231), 31.04 MiB | 31.03 MiB/s
Receiving objects: 62% (40444/65231), 31.04 MiB | 31.03 MiB/s
Receiving objects: 63% (41096/65231), 48.07 MiB | 32.04 MiB/s
Receiving objects: 64% (41748/65231), 48.07 MiB | 32.04 MiB/s
Receiving objects: 65% (42401/65231), 48.07 MiB | 32.04 MiB/s
Receiving objects: 66% (43053/65231), 48.07 MiB | 32.04 MiB/s
Receiving objects: 67% (43705/65231), 48.07 MiB | 32.04 MiB/s
Receiving objects: 68% (44358/65231), 48.07 MiB | 32.04 MiB/s
Receiving objects: 69% (45010/65231), 48.07 MiB | 32.04 MiB/s
Receiving objects: 70% (45662/65231), 48.07 MiB | 32.04 MiB/s
Receiving objects: 71% (46315/65231), 48.07 MiB | 32.04 MiB/s
Receiving objects: 72% (46967/65231), 48.07 MiB | 32.04 MiB/s
Receiving objects: 73% (47619/65231), 48.07 MiB | 32.04 MiB/s
Receiving objects: 74% (48271/65231), 48.07 MiB | 32.04 MiB/s
Receiving objects: 74% (48902/65231), 64.70 MiB | 32.34 MiB/s
Receiving objects: 75% (48924/65231), 64.70 MiB | 32.34 MiB/s
Receiving objects: 76% (49576/65231), 64.70 MiB | 32.34 MiB/s
Receiving objects: 77% (50228/65231), 64.70 MiB | 32.34 MiB/s
Receiving objects: 78% (50881/65231), 64.70 MiB | 32.34 MiB/s
Receiving objects: 79% (51533/65231), 64.70 MiB | 32.34 MiB/s
Receiving objects: 80% (52185/65231), 64.70 MiB | 32.34 MiB/s
Receiving objects: 81% (52838/65231), 64.70 MiB | 32.34 MiB/s
Receiving objects: 82% (53490/65231), 64.70 MiB | 32.34 MiB/s
Receiving objects: 83% (54142/65231), 64.70 MiB | 32.34 MiB/s
Receiving objects: 84% (54795/65231), 64.70 MiB | 32.34 MiB/s
Receiving objects: 85% (55447/65231), 64.70 MiB | 32.34 MiB/s
Receiving objects: 86% (56099/65231), 64.70 MiB | 32.34 MiB/s
Receiving objects: 87% (56751/65231), 64.70 MiB | 32.34 MiB/s
Receiving objects: 88% (57404/65231), 81.92 MiB | 32.76 MiB/s
Receiving objects: 89% (58056/65231), 81.92 MiB | 32.76 MiB/s
Receiving objects: 90% (58708/65231), 81.92 MiB | 32.76 MiB/s
Receiving objects: 91% (59361/65231), 81.92 MiB | 32.76 MiB/s
Receiving objects: 92% (60013/65231), 81.92 MiB | 32.76 MiB/s
Receiving objects: 93% (60665/65231), 81.92 MiB | 32.76 MiB/s
Receiving objects: 94% (61318/65231), 81.92 MiB | 32.76 MiB/s
Receiving objects: 95% (61970/65231), 81.92 MiB | 32.76 MiB/s
Receiving objects: 96% (62622/65231), 81.92 MiB | 32.76 MiB/s
Receiving objects: 97% (63275/65231), 81.92 MiB | 32.76 MiB/s
Receiving objects: 98% (63927/65231), 81.92 MiB | 32.76 MiB/s
Receiving objects: 99% (64579/65231), 81.92 MiB | 32.76 MiB/s
remote: Total 65231 (delta 6868), reused 6407 (delta 6335), pack-reused 57328 (from 1)
5.61 s
Receiving objects: 100% (65231/65231), 81.92 MiB | 32.76 MiB/s
Receiving objects: 100% (65231/65231), 87.56 MiB | 32.52 MiB/s, done.
7.40 s
Resolving deltas: 0% (0/45965)
Resolving deltas: 1% (460/45965)
Resolving deltas: 2% (920/45965)
Resolving deltas: 3% (1379/45965)
Resolving deltas: 4% (1839/45965)
Resolving deltas: 5% (2300/45965)
Resolving deltas: 6% (2758/45965)
Resolving deltas: 7% (3218/45965)
Resolving deltas: 8% (3678/45965)
Resolving deltas: 9% (4137/45965)
Resolving deltas: 10% (4597/45965)
Resolving deltas: 11% (5057/45965)
Resolving deltas: 12% (5516/45965)
Resolving deltas: 13% (5976/45965)
Resolving deltas: 14% (6436/45965)
Resolving deltas: 15% (6895/45965)
Resolving deltas: 16% (7355/45965)
Resolving deltas: 17% (7815/45965)
Resolving deltas: 18% (8274/45965)
Resolving deltas: 19% (8734/45965)
Resolving deltas: 20% (9193/45965)
Resolving deltas: 21% (9653/45965)
Resolving deltas: 22% (10115/45965)
Resolving deltas: 23% (10572/45965)
Resolving deltas: 24% (11032/45965)
Resolving deltas: 25% (11492/45965)
Resolving deltas: 26% (11951/45965)
Resolving deltas: 27% (12411/45965)
Resolving deltas: 28% (12871/45965)
Resolving deltas: 29% (13330/45965)
Resolving deltas: 30% (13790/45965)
Resolving deltas: 31% (14250/45965)
Resolving deltas: 32% (14709/45965)
Resolving deltas: 33% (15169/45965)
Resolving deltas: 34% (15629/45965)
Resolving deltas: 35% (16088/45965)
Resolving deltas: 36% (16548/45965)
Resolving deltas: 37% (17008/45965)
Resolving deltas: 38% (17467/45965)
Resolving deltas: 39% (17927/45965)
Resolving deltas: 40% (18386/45965)
Resolving deltas: 41% (18846/45965)
Resolving deltas: 42% (19306/45965)
Resolving deltas: 43% (19765/45965)
Resolving deltas: 44% (20225/45965)
Resolving deltas: 45% (20685/45965)
Resolving deltas: 46% (21144/45965)
Resolving deltas: 47% (21604/45965)
Resolving deltas: 48% (22064/45965)
Resolving deltas: 49% (22523/45965)
Resolving deltas: 50% (22983/45965)
Resolving deltas: 51% (23443/45965)
Resolving deltas: 52% (23902/45965)
Resolving deltas: 53% (24362/45965)
Resolving deltas: 54% (24822/45965)
Resolving deltas: 55% (25281/45965)
Resolving deltas: 56% (25741/45965)
Resolving deltas: 57% (26201/45965)
Resolving deltas: 58% (26660/45965)
Resolving deltas: 59% (27120/45965)
Resolving deltas: 60% (27579/45965)
Resolving deltas: 61% (28039/45965)
Resolving deltas: 62% (28499/45965)
Resolving deltas: 63% (28958/45965)
Resolving deltas: 64% (29418/45965)
Resolving deltas: 65% (29878/45965)
Resolving deltas: 66% (30337/45965)
Resolving deltas: 67% (30797/45965)
Resolving deltas: 68% (31257/45965)
Resolving deltas: 68% (31705/45965)
Resolving deltas: 69% (31716/45965)
Resolving deltas: 70% (32176/45965)
Resolving deltas: 71% (32636/45965)
Resolving deltas: 72% (33095/45965)
Resolving deltas: 73% (33555/45965)
Resolving deltas: 74% (34015/45965)
Resolving deltas: 75% (34474/45965)
Resolving deltas: 76% (34934/45965)
Resolving deltas: 77% (35394/45965)
Resolving deltas: 78% (35853/45965)
Resolving deltas: 79% (36313/45965)
Resolving deltas: 80% (36772/45965)
Resolving deltas: 81% (37232/45965)
Resolving deltas: 82% (37692/45965)
Resolving deltas: 83% (38151/45965)
Resolving deltas: 84% (38611/45965)
Resolving deltas: 85% (39071/45965)
Resolving deltas: 86% (39530/45965)
Resolving deltas: 87% (39990/45965)
Resolving deltas: 88% (40450/45965)
Resolving deltas: 89% (40909/45965)
Resolving deltas: 90% (41369/45965)
Resolving deltas: 91% (41829/45965)
Resolving deltas: 92% (42288/45965)
Resolving deltas: 93% (42748/45965)
Resolving deltas: 94% (43208/45965)
Resolving deltas: 95% (43667/45965)
Resolving deltas: 96% (44127/45965)
Resolving deltas: 97% (44587/45965)
Resolving deltas: 98% (45046/45965)
Resolving deltas: 99% (45506/45965)
Resolving deltas: 100% (45965/45965)
Resolving deltas: 100% (45965/45965), done.
7.92 s
Fetching commit 4b6103034e4ab9883c27f48dea568f6b265d3b05 for vakint_rustred ...
7.92 s
$ /nix/store/bcnisk3ydfgv26v2gw3zlky24g00yww2-git-2.54.0/bin/git fetch origin 4b6103034e4ab9883c27f48dea568f6b265d3b05
8.60 s
From https://github.com/alphal00p/gammaloop
8.60 s
* branch 4b6103034e4ab9883c27f48dea568f6b265d3b05 -> FETCH_HEAD
8.68 s
$ /nix/store/9ypz3flqsrl5xl495mm8h645gadjsxi1-coreutils-9.11/bin/timeout --kill-after=15s 7200s /nix/store/bcnisk3ydfgv26v2gw3zlky24g00yww2-git-2.54.0/bin/git -c advice.detachedHead=false checkout 4b6103034e4ab9883c27f48dea568f6b265d3b05
8.92 s
HEAD is now at 4b610303 Reserve RustRed scalar evaluation boundary
8.94 s
$ /nix/store/9ypz3flqsrl5xl495mm8h645gadjsxi1-coreutils-9.11/bin/timeout --kill-after=15s 7200s /nix/store/23zk8sgzamrbmj1fday15szf7f2279s8-nix-2.34.7/bin/nix --extra-experimental-features nix-command --extra-experimental-features flakes --log-format internal-json run .#packages.x86_64-linux.nix-ci-check-gammaloop-nextest-spenso --print-build-logs
22.33 s
22.69 s
Downloading cached gammaloop-nextest-binaries-spenso-idenso from https://cache.nix-ci.com
22.73 s
Downloading cached gammaloop-nextest-binaries-spenso-spenso from https://cache.nix-ci.com
22.73 s
Downloading cached gammaloop-nextest-binaries-spenso-spenso-hep-lib from https://cache.nix-ci.com
22.73 s
Downloading cached gammaloop-nextest-binaries-spenso-spenso-macros from https://cache.nix-ci.com
22.73 s
Downloading cached gammaloop-nextest-binaries-spenso-symbolica-utils from https://cache.nix-ci.com
22.74 s
Downloading cached boehm-gc from https://cache.nix-ci.com
22.74 s
Downloading cached busybox from https://cache.nix-ci.com
22.74 s
Downloading cached aws-c-common from https://cache.nix-ci.com
22.74 s
Downloading cached brotli-1.2.0-lib from https://cache.nix-ci.com
22.74 s
Downloading cached editline-1.17.1-unstable-2025-05 from https://cache.nix-ci.com
22.74 s
Downloading cached libcpuid from https://cache.nix-ci.com
22.74 s
Downloading cached libseccomp-2.6.0-lib from https://cache.nix-ci.com
22.74 s
Downloading cached libsodium-1.0.22-unstable-2026-04 from https://cache.nix-ci.com
22.74 s
Downloading cached lowdown-3.0.1-lib from https://cache.nix-ci.com
22.74 s
Downloading cached publicsuffix-list-0-unstable-2026-05 from https://cache.nix-ci.com
22.74 s
Downloading cached icu4c from https://cache.nix-ci.com
22.89 s
Downloaded cached editline-1.17.1-unstable-2025-05 (58 KiB) in 153ms
22.89 s
Progress: 0 of 1 built, 1 of 56 downloaded from cache (15 downloading)
22.89 s
Downloading cached hwloc-2.14.0-lib from https://cache.nix-ci.com
22.89 s
Downloaded cached publicsuffix-list-0-unstable-2026-05 (329 KiB) in 158ms
22.89 s
Progress: 0 of 1 built, 2 of 56 downloaded from cache (15 downloading)
22.90 s
Downloading cached keyutils-1.6.3-lib from https://cache.nix-ci.com
22.90 s
Downloaded cached busybox (230 KiB) in 161ms
22.90 s
Progress: 0 of 1 built, 3 of 56 downloaded from cache (15 downloading)
22.90 s
Downloading cached libpsl from https://cache.nix-ci.com
22.90 s
Downloaded cached boehm-gc (312 KiB) in 163ms
22.90 s
Progress: 0 of 1 built, 4 of 56 downloaded from cache (15 downloading)
22.90 s
Downloading cached libssh2 from https://cache.nix-ci.com
22.90 s
Downloaded cached lowdown-3.0.1-lib (341 KiB) in 166ms
22.90 s
Progress: 0 of 1 built, 5 of 56 downloaded from cache (15 downloading)
22.90 s
Downloading cached libxml2 from https://cache.nix-ci.com
22.94 s
Downloaded cached libsodium-1.0.22-unstable-2026-04 (666 KiB) in 199ms
22.94 s
Downloaded cached aws-c-common (1.1 MiB) in 200ms
22.94 s
Progress: 0 of 1 built, 6 of 56 downloaded from cache (15 downloading)
22.94 s
Downloaded cached brotli-1.2.0-lib (961 KiB) in 201ms
22.94 s
Downloading cached llhttp from https://cache.nix-ci.com
22.94 s
Progress: 0 of 1 built, 7 of 56 downloaded from cache (15 downloading)
22.94 s
Downloading cached nghttp2-1.69.0-lib from https://cache.nix-ci.com
22.94 s
Progress: 0 of 1 built, 8 of 56 downloaded from cache (15 downloading)
22.94 s
Downloading cached aws-c-cal from https://cache.nix-ci.com
22.97 s
Downloaded cached libseccomp-2.6.0-lib (193 KiB) in 234ms
22.97 s
Progress: 0 of 1 built, 9 of 56 downloaded from cache (15 downloading)
22.97 s
Downloading cached aws-c-compression from https://cache.nix-ci.com
22.98 s
Downloaded cached libcpuid (326 KiB) in 243ms
22.98 s
Progress: 0 of 1 built, 10 of 56 downloaded from cache (15 downloading)
22.98 s
Downloading cached aws-c-sdkutils from https://cache.nix-ci.com
23.00 s
Downloaded cached libpsl (114 KiB) in 98ms
23.00 s
Progress: 0 of 1 built, 11 of 56 downloaded from cache (15 downloading)
23.00 s
Downloading cached aws-checksums from https://cache.nix-ci.com
23.00 s
Downloaded cached libxml2 (1.4 MiB) in 100ms
23.01 s
Progress: 0 of 1 built, 12 of 56 downloaded from cache (15 downloading)
23.01 s
Downloading cached nghttp3 from https://cache.nix-ci.com
23.07 s
Downloaded cached llhttp (89 KiB) in 134ms
23.07 s
Progress: 0 of 1 built, 13 of 56 downloaded from cache (15 downloading)
23.07 s
Downloading cached libarchive-3.8.8-lib from https://cache.nix-ci.com
23.08 s
Downloaded cached aws-c-cal (158 KiB) in 139ms
23.08 s
Progress: 0 of 1 built, 14 of 56 downloaded from cache (15 downloading)
23.08 s
Downloading cached ngtcp2 from https://cache.nix-ci.com
23.08 s
Downloaded cached nghttp2-1.69.0-lib (225 KiB) in 141ms
23.08 s
Progress: 0 of 1 built, 15 of 56 downloaded from cache (15 downloading)
23.08 s
Downloading cached s2n-tls from https://cache.nix-ci.com
23.09 s
Downloaded cached gammaloop-nextest-binaries-spenso-symbolica-utils (6.3 MiB) in 354ms
23.09 s
Progress: 0 of 1 built, 16 of 56 downloaded from cache (15 downloading)
23.09 s
Downloaded cached aws-c-compression (31 KiB) in 122ms
23.09 s
Progress: 0 of 1 built, 17 of 56 downloaded from cache (14 downloading)
23.09 s
Downloaded cached keyutils-1.6.3-lib (41 KiB) in 198ms
23.09 s
Progress: 0 of 1 built, 18 of 56 downloaded from cache (13 downloading)
23.09 s
Downloading cached krb5-1.22.2-lib from https://cache.nix-ci.com
23.10 s
Downloaded cached aws-c-sdkutils (155 KiB) in 119ms
23.10 s
Progress: 0 of 1 built, 19 of 56 downloaded from cache (13 downloading)
23.10 s
Downloaded cached nghttp3 (228 KiB) in 94ms
23.10 s
Progress: 0 of 1 built, 20 of 56 downloaded from cache (12 downloading)
23.10 s
Downloaded cached hwloc-2.14.0-lib (459 KiB) in 212ms
23.10 s
Progress: 0 of 1 built, 21 of 56 downloaded from cache (11 downloading)
23.10 s
Downloading cached onetbb from https://cache.nix-ci.com
23.10 s
Downloaded cached libssh2 (330 KiB) in 204ms
23.10 s
Progress: 0 of 1 built, 22 of 56 downloaded from cache (11 downloading)
23.10 s
Downloading cached libgit2-1.9.4-lib from https://cache.nix-ci.com
23.12 s
Downloaded cached aws-checksums (86 KiB) in 125ms
23.12 s
Progress: 0 of 1 built, 23 of 56 downloaded from cache (11 downloading)
23.20 s
Downloaded cached ngtcp2 (515 KiB) in 122ms
23.20 s
Progress: 0 of 1 built, 24 of 56 downloaded from cache (10 downloading)
23.22 s
Downloaded cached s2n-tls (1.3 MiB) in 140ms
23.22 s
Progress: 0 of 1 built, 25 of 56 downloaded from cache (9 downloading)
23.22 s
Downloading cached aws-c-io from https://cache.nix-ci.com
23.23 s
Downloaded cached krb5-1.22.2-lib (2.7 MiB) in 131ms
23.23 s
Progress: 0 of 1 built, 26 of 56 downloaded from cache (9 downloading)
23.23 s
Downloading cached curl from https://cache.nix-ci.com
23.25 s
Downloaded cached libgit2-1.9.4-lib (1.6 MiB) in 141ms
23.25 s
Progress: 0 of 1 built, 27 of 56 downloaded from cache (9 downloading)
23.30 s
Downloaded cached libarchive-3.8.8-lib (953 KiB) in 228ms
23.30 s
Progress: 0 of 1 built, 28 of 56 downloaded from cache (8 downloading)
23.34 s
Downloaded cached aws-c-io (648 KiB) in 116ms
23.34 s
Progress: 0 of 1 built, 29 of 56 downloaded from cache (7 downloading)
23.34 s
Downloading cached aws-c-event-stream from https://cache.nix-ci.com
23.34 s
Downloading cached aws-c-http from https://cache.nix-ci.com
23.34 s
Downloaded cached curl (1.2 MiB) in 114ms
23.34 s
Progress: 0 of 1 built, 30 of 56 downloaded from cache (8 downloading)
23.35 s
Downloaded cached onetbb (626 KiB) in 243ms
23.35 s
Progress: 0 of 1 built, 31 of 56 downloaded from cache (7 downloading)
23.35 s
Downloading cached libblake3 from https://cache.nix-ci.com
23.45 s
Downloaded cached aws-c-event-stream (176 KiB) in 108ms
23.45 s
Progress: 0 of 1 built, 32 of 56 downloaded from cache (7 downloading)
23.45 s
Downloaded cached aws-c-http (641 KiB) in 109ms
23.45 s
Progress: 0 of 1 built, 33 of 56 downloaded from cache (6 downloading)
23.45 s
Downloading cached aws-c-auth from https://cache.nix-ci.com
23.45 s
Downloading cached aws-c-mqtt from https://cache.nix-ci.com
23.55 s
Downloaded cached aws-c-mqtt (557 KiB) in 102ms
23.55 s
Progress: 0 of 1 built, 34 of 56 downloaded from cache (7 downloading)
23.55 s
Downloaded cached aws-c-auth (387 KiB) in 106ms
23.55 s
Progress: 0 of 1 built, 35 of 56 downloaded from cache (6 downloading)
23.55 s
Downloading cached aws-c-s3 from https://cache.nix-ci.com
23.58 s
Downloaded cached libblake3 (117 KiB) in 232ms
23.58 s
Progress: 0 of 1 built, 36 of 56 downloaded from cache (6 downloading)
23.65 s
Downloaded cached aws-c-s3 (384 KiB) in 97ms
23.65 s
Progress: 0 of 1 built, 37 of 56 downloaded from cache (5 downloading)
23.65 s
Downloading cached aws-crt-cpp from https://cache.nix-ci.com
23.77 s
Downloaded cached aws-crt-cpp (979 KiB) in 118ms
23.77 s
Progress: 0 of 1 built, 38 of 56 downloaded from cache (5 downloading)
23.89 s
Downloaded cached icu4c (38.2 MiB) in 1.1s
23.89 s
Progress: 0 of 1 built, 39 of 56 downloaded from cache (4 downloading)
23.89 s
Downloading cached boost from https://cache.nix-ci.com
24.00 s
Downloaded cached gammaloop-nextest-binaries-spenso-spenso-macros (6.5 MiB) in 1.2s
24.00 s
Progress: 0 of 1 built, 40 of 56 downloaded from cache (4 downloading)
24.09 s
Downloaded cached boost (14.5 MiB) in 195ms
24.09 s
Progress: 0 of 1 built, 41 of 56 downloaded from cache (3 downloading)
24.09 s
Downloading cached nix-util from https://cache.nix-ci.com
24.18 s
Downloaded cached gammaloop-nextest-binaries-spenso-spenso (10.2 MiB) in 1.4s
24.18 s
Progress: 0 of 1 built, 42 of 56 downloaded from cache (3 downloading)
24.21 s
Downloaded cached nix-util (2.4 MiB) in 119ms
24.21 s
Progress: 0 of 1 built, 43 of 56 downloaded from cache (2 downloading)
24.21 s
Downloading cached nix-nswrapper from https://cache.nix-ci.com
24.21 s
Downloading cached nix-store from https://cache.nix-ci.com
24.29 s
Downloaded cached nix-nswrapper (131 KiB) in 84ms
24.29 s
Progress: 0 of 1 built, 44 of 56 downloaded from cache (3 downloading)
24.43 s
Downloaded cached nix-store (5.8 MiB) in 225ms
24.43 s
Progress: 0 of 1 built, 45 of 56 downloaded from cache (2 downloading)
24.43 s
Downloading cached nix-fetchers from https://cache.nix-ci.com
24.43 s
Downloading cached nix-main from https://cache.nix-ci.com
24.54 s
Downloaded cached gammaloop-nextest-binaries-spenso-spenso-hep-lib (34 MiB) in 1.8s
24.54 s
Progress: 0 of 1 built, 46 of 56 downloaded from cache (3 downloading)
24.55 s
Downloaded cached nix-main (393 KiB) in 115ms
24.55 s
Progress: 0 of 1 built, 47 of 56 downloaded from cache (2 downloading)
24.56 s
Downloaded cached nix-fetchers (1.5 MiB) in 125ms
24.56 s
Progress: 0 of 1 built, 48 of 56 downloaded from cache (1 downloading)
24.56 s
Downloading cached nix-expr from https://cache.nix-ci.com
24.66 s
Downloaded cached nix-expr (3.3 MiB) in 101ms
24.66 s
Progress: 0 of 1 built, 49 of 56 downloaded from cache (1 downloading)
24.66 s
Downloading cached nix-flake from https://cache.nix-ci.com
24.74 s
Downloaded cached gammaloop-nextest-binaries-spenso-idenso (29.3 MiB) in 2.0s
24.74 s
Progress: 0 of 1 built, 50 of 56 downloaded from cache (1 downloading)
24.74 s
Downloading cached gammaloop-nextest-binaries-spenso from https://cache.nix-ci.com
24.76 s
Downloaded cached nix-flake (956 KiB) in 98ms
24.76 s
Progress: 0 of 1 built, 51 of 56 downloaded from cache (1 downloading)
24.76 s
Downloading cached nix-cmd from https://cache.nix-ci.com
24.77 s
Downloaded cached gammaloop-nextest-binaries-spenso (1920 B) in 29ms
24.77 s
Progress: 0 of 1 built, 52 of 56 downloaded from cache (1 downloading)
24.80 s
Downloaded cached nix-cmd (1 MiB) in 43ms
24.80 s
Progress: 0 of 1 built, 53 of 56 downloaded from cache
24.80 s
Downloading cached nix from https://cache.nix-ci.com
24.86 s
Downloaded cached nix (3.9 MiB) in 58ms
24.86 s
Progress: 0 of 1 built, 54 of 56 downloaded from cache
24.86 s
Downloading cached nix from https://cache.nix-ci.com
24.90 s
Downloaded cached nix (8848 B) in 39ms
24.90 s
Progress: 0 of 1 built, 55 of 56 downloaded from cache
24.90 s
Downloading cached nix-ci-check-gammaloop-nextest-spenso from https://cache.nix-ci.com
24.93 s
Downloaded cached nix-ci-check-gammaloop-nextest-spenso (1016 B) in 29ms
24.93 s
Progress: 0 of 1 built, 56 of 56 downloaded from cache
31.36 s
evaluating derivation 'g
copying '/nix/store/n2q0
evaluating derivation 'g
copying '/nix/store/n2q0
evaluating derivation 'g
copying '/nix/store/n2q0
evaluating derivation 'g
copying '/nix/store/n2q0
evaluating derivation 'g
querying gammaloop-nexte
[0.0 KiB DL] querying ne
[2.2 KiB DL] querying fl
[4.8 KiB DL] querying in
[5.4 KiB DL] querying gf
[6.2 KiB DL] querying gf
[0 /4 built, 0 /3 copied (
[0 /3 built, 3 /1 /9 copied
[0 /3 built, 3 /2 /9 copied
[0 /3 built, 3 /3 /9 copied
[0 /3 built, 2 /4 /9 copied
[0 /3 built, 2 /5 /9 copied
[0 /2 built, 1 /6 /9 copied
[0 /2 built, 1 /7 /9 copied
[0 /2 built, 1 /8 /9 copied
[0 /1 built, 9 copied (10
[1 /0 /1 built, 9 copied (gammaloop-nextest-spenso> Extracting 5 binaries and 2 linked paths to /build/nextest-archive-rSHIHf
31.54 s
gammaloop-nextest-spenso> Extracted 19 files to /build/nextest-archive-rSHIHf in 0.18s
31.55 s
gammaloop-nextest-spenso> ------------
31.55 s
gammaloop-nextest-spenso> Nextest run ID ac68fe3c-2eb4-442c-9772-476a27ea7e99 with nextest profile: ci_gammaloop
31.55 s
gammaloop-nextest-spenso> Starting 224 tests across 5 binaries (26 tests skipped , including 2 tests via profile.ci_gammaloop.default-filter )
31.65 s
gammaloop-nextest-spenso> FAIL [ 0.014s] ( 48/224) idenso color::test::form_reference :: metric_contraction_respects_antisymmetric_normalization
31.65 s
gammaloop-nextest-spenso> stdout ---
31.65 s
gammaloop-nextest-spenso>
31.65 s
gammaloop-nextest-spenso> running 1 test
31.65 s
gammaloop-nextest-spenso> test color::test::form_reference::metric_contraction_respects_antisymmetric_normalization ... FAILED
31.65 s
gammaloop-nextest-spenso>
31.65 s
gammaloop-nextest-spenso> failures:
31.65 s
gammaloop-nextest-spenso>
31.65 s
gammaloop-nextest-spenso> failures:
31.65 s
gammaloop-nextest-spenso> color::test::form_reference::metric_contraction_respects_antisymmetric_normalization
31.65 s
gammaloop-nextest-spenso>
31.65 s
gammaloop-nextest-spenso> test result: FAILED. 0 passed; 1 failed; 0 ignored; 0 measured; 240 filtered out; finished in 0.01s
31.65 s
gammaloop-nextest-spenso>
31.65 s
gammaloop-nextest-spenso> stderr ---
31.65 s
gammaloop-nextest-spenso>
31.65 s
gammaloop-nextest-spenso> thread 'color::test::form_reference::metric_contraction_respects_antisymmetric_normalization' (336) panicked at crates/idenso/src/color/test/form_reference.rs:171:5:
31.65 s
gammaloop-nextest-spenso> assertion `left == right` failed
31.65 s
gammaloop-nextest-spenso> left: "-1*f(coad(8,standalone_metric_j),coad(8,standalone_metric_s),coad(8,standalone_metric_u))"
31.65 s
gammaloop-nextest-spenso> right: "f(coad(8,standalone_metric_j),coad(8,standalone_metric_s),coad(8,standalone_metric_u))"
31.65 s
gammaloop-nextest-spenso> stack backtrace:
31.65 s
gammaloop-nextest-spenso> 0: __rustc::rust_begin_unwind
31.65 s
gammaloop-nextest-spenso> 1: core::panicking::panic_fmt
31.65 s
gammaloop-nextest-spenso> 2: core::panicking::assert_failed_inner
31.65 s
gammaloop-nextest-spenso> 3: core::panicking::assert_failed::<alloc::string::String, alloc::string::String>
31.65 s
gammaloop-nextest-spenso> 4: idenso::color::test::form_reference::metric_contraction_respects_antisymmetric_normalization
31.65 s
gammaloop-nextest-spenso> 5: <idenso::color::test::form_reference::metric_contraction_respects_antisymmetric_normalization::{closure#0} as core::ops::function::FnOnce<()>>::call_once
31.65 s
gammaloop-nextest-spenso> note: Some details are omitted, run with `RUST_BACKTRACE=full` for a verbose backtrace.
31.65 s
gammaloop-nextest-spenso>
31.92 s
gammaloop-nextest-spenso> FAIL [ 0.045s] (218/224) idenso tensor::tests::parsing :: infinite_execution
31.92 s
gammaloop-nextest-spenso> stdout ---
31.92 s
gammaloop-nextest-spenso>
31.92 s
gammaloop-nextest-spenso> running 1 test
31.92 s
gammaloop-nextest-spenso> ━━━━━━━━━━━━━━━━━━━━━━━━━━━━━━━ Snapshot Summary ━━━━━━━━━━━━━━━━━━━━━━━━━━━━━━━
31.92 s
gammaloop-nextest-spenso> Snapshot: infinite_execution
31.92 s
gammaloop-nextest-spenso> Source: crates/idenso/src/tensor/tests/parsing.rs:910
31.92 s
gammaloop-nextest-spenso> ────────────────────────────────────────────────────────────────────────────────
31.92 s
gammaloop-nextest-spenso> Expression: net_iter.snapshot_dot()
31.92 s
gammaloop-nextest-spenso> ────────────────────────────────────────────────────────────────────────────────
31.92 s
gammaloop-nextest-spenso> -old snapshot
31.92 s
gammaloop-nextest-spenso> +new results
31.92 s
gammaloop-nextest-spenso> ────────────┬───────────────────────────────────────────────────────────────────
31.92 s
gammaloop-nextest-spenso> 8 8 │ 0:0:s -> ext0 [id=0 color="red"];
31.92 s
gammaloop-nextest-spenso> 9 9 │ ext1 [style=invis];
31.92 s
gammaloop-nextest-spenso> 10 10 │ 0:5:s -> ext1 [id=1 dir=none color="red" label="mink4|l_0"];
31.92 s
gammaloop-nextest-spenso> 11 11 │ ext2 [style=invis];
31.92 s
gammaloop-nextest-spenso> 12 │- 0:4:s -> ext2 [id=2 dir=none color="red" label="bis4|l_2"];
31.92 s
gammaloop-nextest-spenso> 12 │+ 0:3:s -> ext2 [id=2 dir=none color="red" label="mink4|l_1"];
31.92 s
gammaloop-nextest-spenso> 13 13 │ ext3 [style=invis];
31.92 s
gammaloop-nextest-spenso> 14 │- 0:3:s -> ext3 [id=3 dir=none color="red" label="bis4|l_3"];
31.92 s
gammaloop-nextest-spenso> 14 │+ 0:1:s -> ext3 [id=3 dir=none color="red" label="bis4|l_2"];
31.92 s
gammaloop-nextest-spenso> 15 15 │ ext4 [style=invis];
31.92 s
gammaloop-nextest-spenso> 16 │- 0:1:s -> ext4 [id=4 dir=none color="red" label="mink4|l_1"];
31.92 s
gammaloop-nextest-spenso> 16 │+ 0:2:s -> ext4 [id=4 dir=none color="red" label="mink4|l_4"];
31.92 s
gammaloop-nextest-spenso> 17 17 │ ext5 [style=invis];
31.92 s
gammaloop-nextest-spenso> 18 │- 0:2:s -> ext5 [id=5 dir=none color="red" label="mink4|l_4"];
31.92 s
gammaloop-nextest-spenso> 18 │+ 0:4:s -> ext5 [id=5 dir=none color="red" label="bis4|l_3"];
31.92 s
gammaloop-nextest-spenso> 19 19 │ }
31.92 s
gammaloop-nextest-spenso> ────────────┴───────────────────────────────────────────────────────────────────
31.92 s
gammaloop-nextest-spenso> To update snapshots run `cargo insta review`
31.92 s
gammaloop-nextest-spenso> Stopped on the first failure. Run `cargo insta test` to run all snapshots.
31.92 s
gammaloop-nextest-spenso> test tensor::tests::parsing::infinite_execution ... FAILED
31.92 s
gammaloop-nextest-spenso>
31.92 s
gammaloop-nextest-spenso> failures:
31.92 s
gammaloop-nextest-spenso>
31.92 s
gammaloop-nextest-spenso> failures:
31.92 s
gammaloop-nextest-spenso> tensor::tests::parsing::infinite_execution
31.92 s
gammaloop-nextest-spenso>
31.92 s
gammaloop-nextest-spenso> test result: FAILED. 0 passed; 1 failed; 0 ignored; 0 measured; 240 filtered out; finished in 0.03s
31.92 s
gammaloop-nextest-spenso>
31.92 s
gammaloop-nextest-spenso> stderr ---
31.92 s
gammaloop-nextest-spenso>
31.92 s
gammaloop-nextest-spenso> thread 'tensor::tests::parsing::infinite_execution' (875) panicked at /nix/store/30svmzr0z0zpcqjyynjn7w21wgx18y4b-vendor-cargo-deps/c19b7c6f923b580ac259164a89f2577984ad5ab09ee9d583b888f934adbbe8d0/insta-1.47.2/src/runtime.rs:719:13:
31.92 s
gammaloop-nextest-spenso> snapshot assertion for 'infinite_execution' failed in line 910
31.92 s
gammaloop-nextest-spenso> stack backtrace:
31.92 s
gammaloop-nextest-spenso> 0: __rustc::rust_begin_unwind
31.92 s
gammaloop-nextest-spenso> 1: core::panicking::panic_fmt
31.92 s
gammaloop-nextest-spenso> 2: insta::runtime::assert_snapshot
31.92 s
gammaloop-nextest-spenso> 3: idenso::tensor::tests::parsing::infinite_execution
31.92 s
gammaloop-nextest-spenso> 4: <idenso::tensor::tests::parsing::infinite_execution::{closure#0} as core::ops::function::FnOnce<()>>::call_once
31.92 s
gammaloop-nextest-spenso> note: Some details are omitted, run with `RUST_BACKTRACE=full` for a verbose backtrace.
31.92 s
gammaloop-nextest-spenso>
33.37 s
gammaloop-nextest-spenso> ------------
33.37 s
gammaloop-nextest-spenso> Summary [ 1.815s] 224 tests run: 222 passed , 2 failed , 26 skipped
33.37 s
gammaloop-nextest-spenso> FAIL [ 0.014s] ( 48/224) idenso color::test::form_reference :: metric_contraction_respects_antisymmetric_normalization
33.37 s
gammaloop-nextest-spenso> stdout ---
33.37 s
gammaloop-nextest-spenso>
33.37 s
gammaloop-nextest-spenso> running 1 test
33.37 s
gammaloop-nextest-spenso> test color::test::form_reference::metric_contraction_respects_antisymmetric_normalization ... FAILED
33.37 s
gammaloop-nextest-spenso>
33.37 s
gammaloop-nextest-spenso> failures:
33.37 s
gammaloop-nextest-spenso>
33.37 s
gammaloop-nextest-spenso> failures:
33.37 s
gammaloop-nextest-spenso> color::test::form_reference::metric_contraction_respects_antisymmetric_normalization
33.37 s
gammaloop-nextest-spenso>
33.37 s
gammaloop-nextest-spenso> test result: FAILED. 0 passed; 1 failed; 0 ignored; 0 measured; 240 filtered out; finished in 0.01s
33.37 s
gammaloop-nextest-spenso>
33.37 s
gammaloop-nextest-spenso> stderr ---
33.37 s
gammaloop-nextest-spenso>
33.37 s
gammaloop-nextest-spenso> thread 'color::test::form_reference::metric_contraction_respects_antisymmetric_normalization' (336) panicked at crates/idenso/src/color/test/form_reference.rs:171:5:
33.37 s
gammaloop-nextest-spenso> assertion `left == right` failed
33.37 s
gammaloop-nextest-spenso> left: "-1*f(coad(8,standalone_metric_j),coad(8,standalone_metric_s),coad(8,standalone_metric_u))"
33.37 s
gammaloop-nextest-spenso> right: "f(coad(8,standalone_metric_j),coad(8,standalone_metric_s),coad(8,standalone_metric_u))"
33.37 s
gammaloop-nextest-spenso> stack backtrace:
33.37 s
gammaloop-nextest-spenso> 0: __rustc::rust_begin_unwind
33.37 s
gammaloop-nextest-spenso> 1: core::panicking::panic_fmt
33.37 s
gammaloop-nextest-spenso> 2: core::panicking::assert_failed_inner
33.37 s
gammaloop-nextest-spenso> 3: core::panicking::assert_failed::<alloc::string::String, alloc::string::String>
33.37 s
gammaloop-nextest-spenso> 4: idenso::color::test::form_reference::metric_contraction_respects_antisymmetric_normalization
33.37 s
gammaloop-nextest-spenso> 5: <idenso::color::test::form_reference::metric_contraction_respects_antisymmetric_normalization::{closure#0} as core::ops::function::FnOnce<()>>::call_once
33.37 s
gammaloop-nextest-spenso> note: Some details are omitted, run with `RUST_BACKTRACE=full` for a verbose backtrace.
33.37 s
gammaloop-nextest-spenso>
33.37 s
gammaloop-nextest-spenso> FAIL [ 0.045s] (218/224) idenso tensor::tests::parsing :: infinite_execution
33.37 s
gammaloop-nextest-spenso> stdout ---
33.37 s
gammaloop-nextest-spenso>
33.37 s
gammaloop-nextest-spenso> running 1 test
33.37 s
gammaloop-nextest-spenso> ━━━━━━━━━━━━━━━━━━━━━━━━━━━━━━━ Snapshot Summary ━━━━━━━━━━━━━━━━━━━━━━━━━━━━━━━
33.37 s
gammaloop-nextest-spenso> Snapshot: infinite_execution
33.37 s
gammaloop-nextest-spenso> Source: crates/idenso/src/tensor/tests/parsing.rs:910
33.37 s
gammaloop-nextest-spenso> ────────────────────────────────────────────────────────────────────────────────
33.37 s
gammaloop-nextest-spenso> Expression: net_iter.snapshot_dot()
33.37 s
gammaloop-nextest-spenso> ────────────────────────────────────────────────────────────────────────────────
33.37 s
gammaloop-nextest-spenso> -old snapshot
33.37 s
gammaloop-nextest-spenso> +new results
33.37 s
gammaloop-nextest-spenso> ────────────┬───────────────────────────────────────────────────────────────────
33.37 s
gammaloop-nextest-spenso> 8 8 │ 0:0:s -> ext0 [id=0 color="red"];
33.37 s
gammaloop-nextest-spenso> 9 9 │ ext1 [style=invis];
33.37 s
gammaloop-nextest-spenso> 10 10 │ 0:5:s -> ext1 [id=1 dir=none color="red" label="mink4|l_0"];
33.37 s
gammaloop-nextest-spenso> 11 11 │ ext2 [style=invis];
33.37 s
gammaloop-nextest-spenso> 12 │- 0:4:s -> ext2 [id=2 dir=none color="red" label="bis4|l_2"];
33.37 s
gammaloop-nextest-spenso> 12 │+ 0:3:s -> ext2 [id=2 dir=none color="red" label="mink4|l_1"];
33.37 s
gammaloop-nextest-spenso> 13 13 │ ext3 [style=invis];
33.37 s
gammaloop-nextest-spenso> 14 │- 0:3:s -> ext3 [id=3 dir=none color="red" label="bis4|l_3"];
33.37 s
gammaloop-nextest-spenso> 14 │+ 0:1:s -> ext3 [id=3 dir=none color="red" label="bis4|l_2"];
33.37 s
gammaloop-nextest-spenso> 15 15 │ ext4 [style=invis];
33.37 s
gammaloop-nextest-spenso> 16 │- 0:1:s -> ext4 [id=4 dir=none color="red" label="mink4|l_1"];
33.37 s
gammaloop-nextest-spenso> 16 │+ 0:2:s -> ext4 [id=4 dir=none color="red" label="mink4|l_4"];
33.37 s
gammaloop-nextest-spenso> 17 17 │ ext5 [style=invis];
33.37 s
gammaloop-nextest-spenso> 18 │- 0:2:s -> ext5 [id=5 dir=none color="red" label="mink4|l_4"];
33.37 s
gammaloop-nextest-spenso> 18 │+ 0:4:s -> ext5 [id=5 dir=none color="red" label="bis4|l_3"];
33.37 s
gammaloop-nextest-spenso> 19 19 │ }
33.37 s
gammaloop-nextest-spenso> ────────────┴───────────────────────────────────────────────────────────────────
33.37 s
gammaloop-nextest-spenso> To update snapshots run `cargo insta review`
33.37 s
gammaloop-nextest-spenso> Stopped on the first failure. Run `cargo insta test` to run all snapshots.
33.37 s
gammaloop-nextest-spenso> test tensor::tests::parsing::infinite_execution ... FAILED
33.37 s
gammaloop-nextest-spenso>
33.37 s
gammaloop-nextest-spenso> failures:
33.37 s
gammaloop-nextest-spenso>
33.37 s
gammaloop-nextest-spenso> failures:
33.37 s
gammaloop-nextest-spenso> tensor::tests::parsing::infinite_execution
33.37 s
gammaloop-nextest-spenso>
33.37 s
gammaloop-nextest-spenso> test result: FAILED. 0 passed; 1 failed; 0 ignored; 0 measured; 240 filtered out; finished in 0.03s
33.37 s
gammaloop-nextest-spenso>
33.37 s
gammaloop-nextest-spenso> stderr ---
33.37 s
gammaloop-nextest-spenso>
33.37 s
gammaloop-nextest-spenso> thread 'tensor::tests::parsing::infinite_execution' (875) panicked at /nix/store/30svmzr0z0zpcqjyynjn7w21wgx18y4b-vendor-cargo-deps/c19b7c6f923b580ac259164a89f2577984ad5ab09ee9d583b888f934adbbe8d0/insta-1.47.2/src/runtime.rs:719:13:
33.37 s
gammaloop-nextest-spenso> snapshot assertion for 'infinite_execution' failed in line 910
33.37 s
gammaloop-nextest-spenso> stack backtrace:
33.37 s
gammaloop-nextest-spenso> 0: __rustc::rust_begin_unwind
33.37 s
gammaloop-nextest-spenso> 1: core::panicking::panic_fmt
33.37 s
gammaloop-nextest-spenso> 2: insta::runtime::assert_snapshot
33.37 s
gammaloop-nextest-spenso> 3: idenso::tensor::tests::parsing::infinite_execution
33.37 s
gammaloop-nextest-spenso> 4: <idenso::tensor::tests::parsing::infinite_execution::{closure#0} as core::ops::function::FnOnce<()>>::call_once
33.37 s
gammaloop-nextest-spenso> note: Some details are omitted, run with `RUST_BACKTRACE=full` for a verbose backtrace.
33.37 s
gammaloop-nextest-spenso>
33.40 s
gammaloop-nextest-spenso> error : test run failed
33.44 s
gammaloop-nextest-spenso>
33.44 s
gammaloop-nextest-spenso> ========== nextest test summary ==========
33.44 s
gammaloop-nextest-spenso> report: target/nextest/ci_gammaloop/junit.xml
33.44 s
gammaloop-nextest-spenso> tests: 224, failures: 2, errors: 0
33.44 s
gammaloop-nextest-spenso>
33.44 s
gammaloop-nextest-spenso> 1. idenso::color::test::form_reference::metric_contraction_respects_antisymmetric_normalization
33.44 s
gammaloop-nextest-spenso> failure: test failure with exit code 101
33.44 s
gammaloop-nextest-spenso> thread 'color::test::form_reference::metric_contraction_respects_antisymmetric_normalization' (336) panicked at crates/idenso/src/color/test/form_reference.rs:171:5:
33.44 s
gammaloop-nextest-spenso> assertion `left == right` failed
33.44 s
gammaloop-nextest-spenso> left: "-1*f(coad(8,standalone_metric_j),coad(8,standalone_metric_s),coad(8,standalone_metric_u))"
33.44 s
gammaloop-nextest-spenso> right: "f(coad(8,standalone_metric_j),coad(8,standalone_metric_s),coad(8,standalone_metric_u))"
33.44 s
gammaloop-nextest-spenso> stack backtrace:
33.44 s
gammaloop-nextest-spenso> 0: __rustc::rust_begin_unwind
33.44 s
gammaloop-nextest-spenso> 1: core::panicking::panic_fmt
33.44 s
gammaloop-nextest-spenso> 2: core::panicking::assert_failed_inner
33.44 s
gammaloop-nextest-spenso> 3: core::panicking::assert_failed::<alloc::string::String, alloc::string::String>
33.44 s
gammaloop-nextest-spenso> 4: idenso::color::test::form_reference::metric_contraction_respects_antisymmetric_normalization
33.44 s
gammaloop-nextest-spenso> 5: <idenso::color::test::form_reference::metric_contraction_respects_antisymmetric_normalization::{closure#0} as core::ops::function::FnOnce<()>>::call_once
33.44 s
gammaloop-nextest-spenso> note: Some details are omitted, run with `RUST_BACKTRACE=full` for a verbose backtrace.
33.44 s
gammaloop-nextest-spenso> system-out
33.44 s
gammaloop-nextest-spenso> running 1 test
33.44 s
gammaloop-nextest-spenso> test color::test::form_reference::metric_contraction_respects_antisymmetric_normalization ... FAILED
33.44 s
gammaloop-nextest-spenso>
33.44 s
gammaloop-nextest-spenso> failures:
33.44 s
gammaloop-nextest-spenso>
33.44 s
gammaloop-nextest-spenso> failures:
33.44 s
gammaloop-nextest-spenso> color::test::form_reference::metric_contraction_respects_antisymmetric_normalization
33.44 s
gammaloop-nextest-spenso>
33.44 s
gammaloop-nextest-spenso> test result: FAILED. 0 passed; 1 failed; 0 ignored; 0 measured; 240 filtered out; finished in 0.01s
33.44 s
gammaloop-nextest-spenso> system-err
33.44 s
gammaloop-nextest-spenso> thread 'color::test::form_reference::metric_contraction_respects_antisymmetric_normalization' (336) panicked at crates/idenso/src/color/test/form_reference.rs:171:5:
33.44 s
gammaloop-nextest-spenso> assertion `left == right` failed
33.44 s
gammaloop-nextest-spenso> left: "-1*f(coad(8,standalone_metric_j),coad(8,standalone_metric_s),coad(8,standalone_metric_u))"
33.44 s
gammaloop-nextest-spenso> right: "f(coad(8,standalone_metric_j),coad(8,standalone_metric_s),coad(8,standalone_metric_u))"
33.44 s
gammaloop-nextest-spenso> stack backtrace:
33.44 s
gammaloop-nextest-spenso> 0: __rustc::rust_begin_unwind
33.44 s
gammaloop-nextest-spenso> 1: core::panicking::panic_fmt
33.44 s
gammaloop-nextest-spenso> 2: core::panicking::assert_failed_inner
33.44 s
gammaloop-nextest-spenso> 3: core::panicking::assert_failed::<alloc::string::String, alloc::string::String>
33.44 s
gammaloop-nextest-spenso> 4: idenso::color::test::form_reference::metric_contraction_respects_antisymmetric_normalization
33.44 s
gammaloop-nextest-spenso> 5: <idenso::color::test::form_reference::metric_contraction_respects_antisymmetric_normalization::{closure#0} as core::ops::function::FnOnce<()>>::call_once
33.44 s
gammaloop-nextest-spenso> note: Some details are omitted, run with `RUST_BACKTRACE=full` for a verbose backtrace.
33.44 s
gammaloop-nextest-spenso>
33.44 s
gammaloop-nextest-spenso> 2. idenso::tensor::tests::parsing::infinite_execution
33.44 s
gammaloop-nextest-spenso> failure: test failure with exit code 101
33.44 s
gammaloop-nextest-spenso> thread 'tensor::tests::parsing::infinite_execution' (875) panicked at /nix/store/30svmzr0z0zpcqjyynjn7w21wgx18y4b-vendor-cargo-deps/c19b7c6f923b580ac259164a89f2577984ad5ab09ee9d583b888f934adbbe8d0/insta-1.47.2/src/runtime.rs:719:13:
33.44 s
gammaloop-nextest-spenso> snapshot assertion for 'infinite_execution' failed in line 910
33.44 s
gammaloop-nextest-spenso> stack backtrace:
33.44 s
gammaloop-nextest-spenso> 0: __rustc::rust_begin_unwind
33.44 s
gammaloop-nextest-spenso> 1: core::panicking::panic_fmt
33.44 s
gammaloop-nextest-spenso> 2: insta::runtime::assert_snapshot
33.44 s
gammaloop-nextest-spenso> 3: idenso::tensor::tests::parsing::infinite_execution
33.44 s
gammaloop-nextest-spenso> 4: <idenso::tensor::tests::parsing::infinite_execution::{closure#0} as core::ops::function::FnOnce<()>>::call_once
33.44 s
gammaloop-nextest-spenso> note: Some details are omitted, run with `RUST_BACKTRACE=full` for a verbose backtrace.
33.44 s
gammaloop-nextest-spenso> system-out
33.44 s
gammaloop-nextest-spenso> running 1 test
33.44 s
gammaloop-nextest-spenso> ━━━━━━━━━━━━━━━━━━━━━━━━━━━━━━━ Snapshot Summary ━━━━━━━━━━━━━━━━━━━━━━━━━━━━━━━
33.44 s
gammaloop-nextest-spenso> Snapshot: infinite_execution
33.44 s
gammaloop-nextest-spenso> Source: crates/idenso/src/tensor/tests/parsing.rs:910
33.44 s
gammaloop-nextest-spenso> ────────────────────────────────────────────────────────────────────────────────
33.44 s
gammaloop-nextest-spenso> Expression: net_iter.snapshot_dot()
33.44 s
gammaloop-nextest-spenso> ────────────────────────────────────────────────────────────────────────────────
33.44 s
gammaloop-nextest-spenso> -old snapshot
33.44 s
gammaloop-nextest-spenso> +new results
33.44 s
gammaloop-nextest-spenso> ────────────┬───────────────────────────────────────────────────────────────────
33.44 s
gammaloop-nextest-spenso> 8 8 │ 0:0:s-> ext0 [id=0 color="red"];
33.44 s
gammaloop-nextest-spenso> 9 9 │ ext1 [style=invis];
33.44 s
gammaloop-nextest-spenso> 10 10 │ 0:5:s-> ext1 [id=1 dir=none color="red" label="mink4|l_0"];
33.44 s
gammaloop-nextest-spenso> 11 11 │ ext2 [style=invis];
33.44 s
gammaloop-nextest-spenso> 12 │- 0:4:s-> ext2 [id=2 dir=none color="red" label="bis4|l_2"];
33.44 s
gammaloop-nextest-spenso> 12 │+ 0:3:s-> ext2 [id=2 dir=none color="red" label="mink4|l_1"];
33.44 s
gammaloop-nextest-spenso> 13 13 │ ext3 [style=invis];
33.44 s
gammaloop-nextest-spenso> 14 │- 0:3:s-> ext3 [id=3 dir=none color="red" label="bis4|l_3"];
33.44 s
gammaloop-nextest-spenso> 14 │+ 0:1:s-> ext3 [id=3 dir=none color="red" label="bis4|l_2"];
33.44 s
gammaloop-nextest-spenso> 15 15 │ ext4 [style=invis];
33.44 s
gammaloop-nextest-spenso> 16 │- 0:1:s-> ext4 [id=4 dir=none color="red" label="mink4|l_1"];
33.44 s
gammaloop-nextest-spenso> 16 │+ 0:2:s-> ext4 [id=4 dir=none color="red" label="mink4|l_4"];
33.44 s
gammaloop-nextest-spenso> 17 17 │ ext5 [style=invis];
33.44 s
gammaloop-nextest-spenso> 18 │- 0:2:s-> ext5 [id=5 dir=none color="red" label="mink4|l_4"];
33.44 s
gammaloop-nextest-spenso> 18 │+ 0:4:s-> ext5 [id=5 dir=none color="red" label="bis4|l_3"];
33.44 s
gammaloop-nextest-spenso> 19 19 │ }
33.44 s
gammaloop-nextest-spenso> ────────────┴───────────────────────────────────────────────────────────────────
33.44 s
gammaloop-nextest-spenso> To update snapshots run `cargo insta review`
33.44 s
gammaloop-nextest-spenso> Stopped on the first failure. Run `cargo insta test` to run all snapshots.
33.44 s
gammaloop-nextest-spenso> test tensor::tests::parsing::infinite_execution ... FAILED
33.44 s
gammaloop-nextest-spenso>
33.44 s
gammaloop-nextest-spenso> failures:
33.44 s
gammaloop-nextest-spenso>
33.44 s
gammaloop-nextest-spenso> failures:
33.44 s
gammaloop-nextest-spenso> tensor::tests::parsing::infinite_execution
33.44 s
gammaloop-nextest-spenso>
33.44 s
gammaloop-nextest-spenso> test result: FAILED. 0 passed; 1 failed; 0 ignored; 0 measured; 240 filtered out; finished in 0.03s
33.44 s
gammaloop-nextest-spenso> system-err
33.44 s
gammaloop-nextest-spenso> thread 'tensor::tests::parsing::infinite_execution' (875) panicked at /nix/store/30svmzr0z0zpcqjyynjn7w21wgx18y4b-vendor-cargo-deps/c19b7c6f923b580ac259164a89f2577984ad5ab09ee9d583b888f934adbbe8d0/insta-1.47.2/src/runtime.rs:719:13:
33.44 s
gammaloop-nextest-spenso> snapshot assertion for 'infinite_execution' failed in line 910
33.44 s
gammaloop-nextest-spenso> stack backtrace:
33.44 s
gammaloop-nextest-spenso> 0: __rustc::rust_begin_unwind
33.44 s
gammaloop-nextest-spenso> 1: core::panicking::panic_fmt
33.44 s
gammaloop-nextest-spenso> 2: insta::runtime::assert_snapshot
33.44 s
gammaloop-nextest-spenso> 3: idenso::tensor::tests::parsing::infinite_execution
33.44 s
gammaloop-nextest-spenso> 4: <idenso::tensor::tests::parsing::infinite_execution::{closure#0} as core::ops::function::FnOnce<()>>::call_once
33.44 s
gammaloop-nextest-spenso> note: Some details are omitted, run with `RUST_BACKTRACE=full` for a verbose backtrace.
33.44 s
gammaloop-nextest-spenso> =========================================
33.46 s
gammaloop-nextest-spenso> Extracting 2 binaries and 1 linked path to /build/nextest-archive-H3oFDx
33.55 s
gammaloop-nextest-spenso> Extracted 8 files to /build/nextest-archive-H3oFDx in 0.09s
33.59 s
gammaloop-nextest-spenso> ------------
33.59 s
gammaloop-nextest-spenso> Nextest run ID 9c34f6ee-d4b4-457c-a723-efd416524e70 with nextest profile: ci_gammaloop
33.59 s
gammaloop-nextest-spenso> Starting 135 tests across 2 binaries
33.80 s
gammaloop-nextest-spenso> ------------
33.80 s
gammaloop-nextest-spenso> Summary [ 0.219s] 135 tests run: 135 passed , 0 skipped
33.85 s
gammaloop-nextest-spenso>
33.85 s
gammaloop-nextest-spenso> ========== nextest test summary ==========
33.85 s
gammaloop-nextest-spenso> report: target/nextest/ci_gammaloop/junit.xml
33.85 s
gammaloop-nextest-spenso> tests: 135, failures: 0, errors: 0
33.85 s
gammaloop-nextest-spenso> No failing testcases found.
33.85 s
gammaloop-nextest-spenso> =========================================
33.88 s
gammaloop-nextest-spenso> Extracting 5 binaries and 2 linked paths to /build/nextest-archive-NbLrkT
34.12 s
gammaloop-nextest-spenso> Extracted 19 files to /build/nextest-archive-NbLrkT in 0.24s
34.18 s
gammaloop-nextest-spenso> ------------
34.18 s
gammaloop-nextest-spenso> Nextest run ID b2c7d328-2363-4588-93f9-2984c1c8283f with nextest profile: ci_gammaloop
34.18 s
gammaloop-nextest-spenso> Starting 25 tests across 5 binaries (1 test skipped via profile.ci_gammaloop.default-filter )
34.42 s
gammaloop-nextest-spenso> ------------
34.42 s
gammaloop-nextest-spenso> Summary [ 0.246s] 25 tests run: 25 passed , 1 skipped
34.49 s
gammaloop-nextest-spenso>
34.49 s
gammaloop-nextest-spenso> ========== nextest test summary ==========
34.49 s
gammaloop-nextest-spenso> report: target/nextest/ci_gammaloop/junit.xml
34.49 s
gammaloop-nextest-spenso> tests: 25, failures: 0, errors: 0
34.49 s
gammaloop-nextest-spenso> No failing testcases found.
34.49 s
gammaloop-nextest-spenso> =========================================
34.51 s
gammaloop-nextest-spenso> Extracting 2 binaries and 1 linked path to /build/nextest-archive-skKIOs
34.59 s
gammaloop-nextest-spenso> Extracted 8 files to /build/nextest-archive-skKIOs in 0.08s
34.63 s
gammaloop-nextest-spenso> ------------
34.63 s
gammaloop-nextest-spenso> Nextest run ID 9fc8b2c6-f518-4248-bf85-96de619fe251 with nextest profile: ci_gammaloop
34.63 s
gammaloop-nextest-spenso> Starting 1 test across 2 binaries
34.64 s
gammaloop-nextest-spenso> ------------
34.64 s
gammaloop-nextest-spenso> Summary [ 0.010s] 1 test run: 1 passed , 0 skipped
34.68 s
gammaloop-nextest-spenso>
34.68 s
gammaloop-nextest-spenso> ========== nextest test summary ==========
34.68 s
gammaloop-nextest-spenso> report: target/nextest/ci_gammaloop/junit.xml
34.68 s
gammaloop-nextest-spenso> tests: 1, failures: 0, errors: 0
34.68 s
gammaloop-nextest-spenso> No failing testcases found.
34.68 s
gammaloop-nextest-spenso> =========================================
34.71 s
gammaloop-nextest-spenso> Extracting 1 binary and 1 linked path to /build/nextest-archive-zghgWZ
34.79 s
gammaloop-nextest-spenso> Extracted 7 files to /build/nextest-archive-zghgWZ in 0.08s
34.80 s
gammaloop-nextest-spenso> ------------
34.80 s
gammaloop-nextest-spenso> Nextest run ID d27d0a7b-a333-4baa-8e41-2d662ea62e0e with nextest profile: ci_gammaloop
34.80 s
gammaloop-nextest-spenso> Starting 0 tests across 1 binary
34.80 s
gammaloop-nextest-spenso> ------------
34.80 s
gammaloop-nextest-spenso> Summary [ 0.000s] 0 tests run: 0 passed , 0 skipped
34.86 s
gammaloop-nextest-spenso>
34.86 s
gammaloop-nextest-spenso> ========== nextest test summary ==========
34.86 s
gammaloop-nextest-spenso> report: target/nextest/ci_gammaloop/junit.xml
34.86 s
gammaloop-nextest-spenso> tests: 0, failures: 0, errors: 0
34.86 s
gammaloop-nextest-spenso> No failing testcases found.
34.86 s
gammaloop-nextest-spenso> =========================================
34.93 s
error: Cannot build '/nix/store/wg9z1d6ybvc8xl844i0n0mklxxwi1328-gammaloop-nextest-spenso.drv '.
34.93 s
Reason: builder failed with exit code 100 .
34.93 s
Output paths:
34.93 s
/nix/store/lllalkgcfjij64ixlnv0xp0j8dfki7lv-gammaloop-nextest-spenso
34.93 s
Last 325 log lines:
34.93 s
> Extracting 5 binaries and 2 linked paths to /build/nextest-archive-rSHIHf
34.93 s
> Extracted 19 files to /build/nextest-archive-rSHIHf in 0.18s
34.93 s
> ------------
34.93 s
> Nextest run ID ac68fe3c-2eb4-442c-9772-476a27ea7e99 with nextest profile: ci_gammaloop
34.93 s
> Starting 224 tests across 5 binaries (26 tests skipped , including 2 tests via profile.ci_gammaloop.default-filter )
34.93 s
> FAIL [ 0.014s] ( 48/224) idenso color::test::form_reference :: metric_contraction_respects_antisymmetric_normalization
34.93 s
> stdout ---
34.93 s
>
34.93 s
> running 1 test
34.93 s
> test color::test::form_reference::metric_contraction_respects_antisymmetric_normalization ... FAILED
34.93 s
>
34.93 s
> failures:
34.93 s
>
34.93 s
> failures:
34.93 s
> color::test::form_reference::metric_contraction_respects_antisymmetric_normalization
34.93 s
>
34.93 s
> test result: FAILED. 0 passed; 1 failed; 0 ignored; 0 measured; 240 filtered out; finished in 0.01s
34.93 s
>
34.93 s
> stderr ---
34.93 s
>
34.93 s
> thread 'color::test::form_reference::metric_contraction_respects_antisymmetric_normalization' (336) panicked at crates/idenso/src/color/test/form_reference.rs:171:5:
34.93 s
> assertion `left == right` failed
34.93 s
> left: "-1*f(coad(8,standalone_metric_j),coad(8,standalone_metric_s),coad(8,standalone_metric_u))"
34.93 s
> right: "f(coad(8,standalone_metric_j),coad(8,standalone_metric_s),coad(8,standalone_metric_u))"
34.93 s
> stack backtrace:
34.93 s
> 0: __rustc::rust_begin_unwind
34.93 s
> 1: core::panicking::panic_fmt
34.93 s
> 2: core::panicking::assert_failed_inner
34.93 s
> 3: core::panicking::assert_failed::<alloc::string::String, alloc::string::String>
34.93 s
> 4: idenso::color::test::form_reference::metric_contraction_respects_antisymmetric_normalization
34.93 s
> 5: <idenso::color::test::form_reference::metric_contraction_respects_antisymmetric_normalization::{closure#0} as core::ops::function::FnOnce<()>>::call_once
34.93 s
> note: Some details are omitted, run with `RUST_BACKTRACE=full` for a verbose backtrace.
34.93 s
>
34.93 s
> FAIL [ 0.045s] (218/224) idenso tensor::tests::parsing :: infinite_execution
34.93 s
> stdout ---
34.93 s
>
34.93 s
> running 1 test
34.93 s
> ━━━━━━━━━━━━━━━━━━━━━━━━━━━━━━━ Snapshot Summary ━━━━━━━━━━━━━━━━━━━━━━━━━━━━━━━
34.93 s
> Snapshot: infinite_execution
34.93 s
> Source: crates/idenso/src/tensor/tests/parsing.rs:910
34.93 s
> ────────────────────────────────────────────────────────────────────────────────
34.93 s
> Expression: net_iter.snapshot_dot()
34.93 s
> ────────────────────────────────────────────────────────────────────────────────
34.93 s
> -old snapshot
34.93 s
> +new results
34.93 s
> ────────────┬───────────────────────────────────────────────────────────────────
34.93 s
> 8 8 │ 0:0:s -> ext0 [id=0 color="red"];
34.93 s
> 9 9 │ ext1 [style=invis];
34.93 s
> 10 10 │ 0:5:s -> ext1 [id=1 dir=none color="red" label="mink4|l_0"];
34.93 s
> 11 11 │ ext2 [style=invis];
34.93 s
> 12 │- 0:4:s -> ext2 [id=2 dir=none color="red" label="bis4|l_2"];
34.93 s
> 12 │+ 0:3:s -> ext2 [id=2 dir=none color="red" label="mink4|l_1"];
34.93 s
> 13 13 │ ext3 [style=invis];
34.93 s
> 14 │- 0:3:s -> ext3 [id=3 dir=none color="red" label="bis4|l_3"];
34.93 s
> 14 │+ 0:1:s -> ext3 [id=3 dir=none color="red" label="bis4|l_2"];
34.93 s
> 15 15 │ ext4 [style=invis];
34.93 s
> 16 │- 0:1:s -> ext4 [id=4 dir=none color="red" label="mink4|l_1"];
34.93 s
> 16 │+ 0:2:s -> ext4 [id=4 dir=none color="red" label="mink4|l_4"];
34.93 s
> 17 17 │ ext5 [style=invis];
34.93 s
> 18 │- 0:2:s -> ext5 [id=5 dir=none color="red" label="mink4|l_4"];
34.93 s
> 18 │+ 0:4:s -> ext5 [id=5 dir=none color="red" label="bis4|l_3"];
34.93 s
> 19 19 │ }
34.93 s
> ────────────┴───────────────────────────────────────────────────────────────────
34.93 s
> To update snapshots run `cargo insta review`
34.93 s
> Stopped on the first failure. Run `cargo insta test` to run all snapshots.
34.93 s
> test tensor::tests::parsing::infinite_execution ... FAILED
34.93 s
>
34.93 s
> failures:
34.93 s
>
34.93 s
> failures:
34.93 s
> tensor::tests::parsing::infinite_execution
34.93 s
>
34.93 s
> test result: FAILED. 0 passed; 1 failed; 0 ignored; 0 measured; 240 filtered out; finished in 0.03s
34.93 s
>
34.93 s
> stderr ---
34.93 s
>
34.93 s
> thread 'tensor::tests::parsing::infinite_execution' (875) panicked at /nix/store/30svmzr0z0zpcqjyynjn7w21wgx18y4b-vendor-cargo-deps/c19b7c6f923b580ac259164a89f2577984ad5ab09ee9d583b888f934adbbe8d0/insta-1.47.2/src/runtime.rs:719:13:
34.93 s
> snapshot assertion for 'infinite_execution' failed in line 910
34.93 s
> stack backtrace:
34.93 s
> 0: __rustc::rust_begin_unwind
34.93 s
> 1: core::panicking::panic_fmt
34.93 s
> 2: insta::runtime::assert_snapshot
34.93 s
> 3: idenso::tensor::tests::parsing::infinite_execution
34.93 s
> 4: <idenso::tensor::tests::parsing::infinite_execution::{closure#0} as core::ops::function::FnOnce<()>>::call_once
34.93 s
> note: Some details are omitted, run with `RUST_BACKTRACE=full` for a verbose backtrace.
34.93 s
>
34.93 s
> ------------
34.93 s
> Summary [ 1.815s] 224 tests run: 222 passed , 2 failed , 26 skipped
34.93 s
> FAIL [ 0.014s] ( 48/224) idenso color::test::form_reference :: metric_contraction_respects_antisymmetric_normalization
34.93 s
> stdout ---
34.93 s
>
34.93 s
> running 1 test
34.93 s
> test color::test::form_reference::metric_contraction_respects_antisymmetric_normalization ... FAILED
34.93 s
>
34.93 s
> failures:
34.93 s
>
34.93 s
> failures:
34.93 s
> color::test::form_reference::metric_contraction_respects_antisymmetric_normalization
34.93 s
>
34.93 s
> test result: FAILED. 0 passed; 1 failed; 0 ignored; 0 measured; 240 filtered out; finished in 0.01s
34.93 s
>
34.93 s
> stderr ---
34.93 s
>
34.93 s
> thread 'color::test::form_reference::metric_contraction_respects_antisymmetric_normalization' (336) panicked at crates/idenso/src/color/test/form_reference.rs:171:5:
34.93 s
> assertion `left == right` failed
34.93 s
> left: "-1*f(coad(8,standalone_metric_j),coad(8,standalone_metric_s),coad(8,standalone_metric_u))"
34.93 s
> right: "f(coad(8,standalone_metric_j),coad(8,standalone_metric_s),coad(8,standalone_metric_u))"
34.93 s
> stack backtrace:
34.93 s
> 0: __rustc::rust_begin_unwind
34.93 s
> 1: core::panicking::panic_fmt
34.93 s
> 2: core::panicking::assert_failed_inner
34.93 s
> 3: core::panicking::assert_failed::<alloc::string::String, alloc::string::String>
34.93 s
> 4: idenso::color::test::form_reference::metric_contraction_respects_antisymmetric_normalization
34.93 s
> 5: <idenso::color::test::form_reference::metric_contraction_respects_antisymmetric_normalization::{closure#0} as core::ops::function::FnOnce<()>>::call_once
34.93 s
> note: Some details are omitted, run with `RUST_BACKTRACE=full` for a verbose backtrace.
34.93 s
>
34.93 s
> FAIL [ 0.045s] (218/224) idenso tensor::tests::parsing :: infinite_execution
34.93 s
> stdout ---
34.93 s
>
34.93 s
> running 1 test
34.93 s
> ━━━━━━━━━━━━━━━━━━━━━━━━━━━━━━━ Snapshot Summary ━━━━━━━━━━━━━━━━━━━━━━━━━━━━━━━
34.93 s
> Snapshot: infinite_execution
34.93 s
> Source: crates/idenso/src/tensor/tests/parsing.rs:910
34.93 s
> ────────────────────────────────────────────────────────────────────────────────
34.93 s
> Expression: net_iter.snapshot_dot()
34.93 s
> ────────────────────────────────────────────────────────────────────────────────
34.93 s
> -old snapshot
34.93 s
> +new results
34.93 s
> ────────────┬───────────────────────────────────────────────────────────────────
34.93 s
> 8 8 │ 0:0:s -> ext0 [id=0 color="red"];
34.93 s
> 9 9 │ ext1 [style=invis];
34.93 s
> 10 10 │ 0:5:s -> ext1 [id=1 dir=none color="red" label="mink4|l_0"];
34.93 s
> 11 11 │ ext2 [style=invis];
34.93 s
> 12 │- 0:4:s -> ext2 [id=2 dir=none color="red" label="bis4|l_2"];
34.93 s
> 12 │+ 0:3:s -> ext2 [id=2 dir=none color="red" label="mink4|l_1"];
34.93 s
> 13 13 │ ext3 [style=invis];
34.93 s
> 14 │- 0:3:s -> ext3 [id=3 dir=none color="red" label="bis4|l_3"];
34.93 s
> 14 │+ 0:1:s -> ext3 [id=3 dir=none color="red" label="bis4|l_2"];
34.93 s
> 15 15 │ ext4 [style=invis];
34.93 s
> 16 │- 0:1:s -> ext4 [id=4 dir=none color="red" label="mink4|l_1"];
34.93 s
> 16 │+ 0:2:s -> ext4 [id=4 dir=none color="red" label="mink4|l_4"];
34.93 s
> 17 17 │ ext5 [style=invis];
34.93 s
> 18 │- 0:2:s -> ext5 [id=5 dir=none color="red" label="mink4|l_4"];
34.93 s
> 18 │+ 0:4:s -> ext5 [id=5 dir=none color="red" label="bis4|l_3"];
34.93 s
> 19 19 │ }
34.93 s
> ────────────┴───────────────────────────────────────────────────────────────────
34.93 s
> To update snapshots run `cargo insta review`
34.93 s
> Stopped on the first failure. Run `cargo insta test` to run all snapshots.
34.93 s
> test tensor::tests::parsing::infinite_execution ... FAILED
34.93 s
>
34.93 s
> failures:
34.93 s
>
34.93 s
> failures:
34.93 s
> tensor::tests::parsing::infinite_execution
34.93 s
>
34.93 s
> test result: FAILED. 0 passed; 1 failed; 0 ignored; 0 measured; 240 filtered out; finished in 0.03s
34.93 s
>
34.93 s
> stderr ---
34.93 s
>
34.93 s
> thread 'tensor::tests::parsing::infinite_execution' (875) panicked at /nix/store/30svmzr0z0zpcqjyynjn7w21wgx18y4b-vendor-cargo-deps/c19b7c6f923b580ac259164a89f2577984ad5ab09ee9d583b888f934adbbe8d0/insta-1.47.2/src/runtime.rs:719:13:
34.93 s
> snapshot assertion for 'infinite_execution' failed in line 910
34.93 s
> stack backtrace:
34.93 s
> 0: __rustc::rust_begin_unwind
34.93 s
> 1: core::panicking::panic_fmt
34.93 s
> 2: insta::runtime::assert_snapshot
34.93 s
> 3: idenso::tensor::tests::parsing::infinite_execution
34.93 s
> 4: <idenso::tensor::tests::parsing::infinite_execution::{closure#0} as core::ops::function::FnOnce<()>>::call_once
34.93 s
> note: Some details are omitted, run with `RUST_BACKTRACE=full` for a verbose backtrace.
34.93 s
>
34.93 s
> error : test run failed
34.93 s
>
34.93 s
> ========== nextest test summary ==========
34.93 s
> report: target/nextest/ci_gammaloop/junit.xml
34.93 s
> tests: 224, failures: 2, errors: 0
34.93 s
>
34.93 s
> 1. idenso::color::test::form_reference::metric_contraction_respects_antisymmetric_normalization
34.93 s
> failure: test failure with exit code 101
34.93 s
> thread 'color::test::form_reference::metric_contraction_respects_antisymmetric_normalization' (336) panicked at crates/idenso/src/color/test/form_reference.rs:171:5:
34.93 s
> assertion `left == right` failed
34.93 s
> left: "-1*f(coad(8,standalone_metric_j),coad(8,standalone_metric_s),coad(8,standalone_metric_u))"
34.93 s
> right: "f(coad(8,standalone_metric_j),coad(8,standalone_metric_s),coad(8,standalone_metric_u))"
34.93 s
> stack backtrace:
34.93 s
> 0: __rustc::rust_begin_unwind
34.93 s
> 1: core::panicking::panic_fmt
34.93 s
> 2: core::panicking::assert_failed_inner
34.93 s
> 3: core::panicking::assert_failed::<alloc::string::String, alloc::string::String>
34.93 s
> 4: idenso::color::test::form_reference::metric_contraction_respects_antisymmetric_normalization
34.93 s
> 5: <idenso::color::test::form_reference::metric_contraction_respects_antisymmetric_normalization::{closure#0} as core::ops::function::FnOnce<()>>::call_once
34.93 s
> note: Some details are omitted, run with `RUST_BACKTRACE=full` for a verbose backtrace.
34.93 s
> system-out
34.93 s
> running 1 test
34.93 s
> test color::test::form_reference::metric_contraction_respects_antisymmetric_normalization ... FAILED
34.93 s
>
34.93 s
> failures:
34.93 s
>
34.93 s
> failures:
34.93 s
> color::test::form_reference::metric_contraction_respects_antisymmetric_normalization
34.93 s
>
34.93 s
> test result: FAILED. 0 passed; 1 failed; 0 ignored; 0 measured; 240 filtered out; finished in 0.01s
34.93 s
> system-err
34.93 s
> thread 'color::test::form_reference::metric_contraction_respects_antisymmetric_normalization' (336) panicked at crates/idenso/src/color/test/form_reference.rs:171:5:
34.93 s
> assertion `left == right` failed
34.93 s
> left: "-1*f(coad(8,standalone_metric_j),coad(8,standalone_metric_s),coad(8,standalone_metric_u))"
34.93 s
> right: "f(coad(8,standalone_metric_j),coad(8,standalone_metric_s),coad(8,standalone_metric_u))"
34.93 s
> stack backtrace:
34.93 s
> 0: __rustc::rust_begin_unwind
34.93 s
> 1: core::panicking::panic_fmt
34.93 s
> 2: core::panicking::assert_failed_inner
34.93 s
> 3: core::panicking::assert_failed::<alloc::string::String, alloc::string::String>
34.93 s
> 4: idenso::color::test::form_reference::metric_contraction_respects_antisymmetric_normalization
34.93 s
> 5: <idenso::color::test::form_reference::metric_contraction_respects_antisymmetric_normalization::{closure#0} as core::ops::function::FnOnce<()>>::call_once
34.93 s
> note: Some details are omitted, run with `RUST_BACKTRACE=full` for a verbose backtrace.
34.93 s
>
34.93 s
> 2. idenso::tensor::tests::parsing::infinite_execution
34.93 s
> failure: test failure with exit code 101
34.93 s
> thread 'tensor::tests::parsing::infinite_execution' (875) panicked at /nix/store/30svmzr0z0zpcqjyynjn7w21wgx18y4b-vendor-cargo-deps/c19b7c6f923b580ac259164a89f2577984ad5ab09ee9d583b888f934adbbe8d0/insta-1.47.2/src/runtime.rs:719:13:
34.93 s
> snapshot assertion for 'infinite_execution' failed in line 910
34.93 s
> stack backtrace:
34.93 s
> 0: __rustc::rust_begin_unwind
34.93 s
> 1: core::panicking::panic_fmt
34.93 s
> 2: insta::runtime::assert_snapshot
34.93 s
> 3: idenso::tensor::tests::parsing::infinite_execution
34.93 s
> 4: <idenso::tensor::tests::parsing::infinite_execution::{closure#0} as core::ops::function::FnOnce<()>>::call_once
34.93 s
> note: Some details are omitted, run with `RUST_BACKTRACE=full` for a verbose backtrace.
34.93 s
> system-out
34.93 s
> running 1 test
34.93 s
> ━━━━━━━━━━━━━━━━━━━━━━━━━━━━━━━ Snapshot Summary ━━━━━━━━━━━━━━━━━━━━━━━━━━━━━━━
34.93 s
> Snapshot: infinite_execution
34.93 s
> Source: crates/idenso/src/tensor/tests/parsing.rs:910
34.93 s
> ────────────────────────────────────────────────────────────────────────────────
34.93 s
> Expression: net_iter.snapshot_dot()
34.93 s
> ────────────────────────────────────────────────────────────────────────────────
34.93 s
> -old snapshot
34.93 s
> +new results
34.93 s
> ────────────┬───────────────────────────────────────────────────────────────────
34.93 s
> 8 8 │ 0:0:s-> ext0 [id=0 color="red"];
34.93 s
> 9 9 │ ext1 [style=invis];
34.93 s
> 10 10 │ 0:5:s-> ext1 [id=1 dir=none color="red" label="mink4|l_0"];
34.93 s
> 11 11 │ ext2 [style=invis];
34.93 s
> 12 │- 0:4:s-> ext2 [id=2 dir=none color="red" label="bis4|l_2"];
34.93 s
> 12 │+ 0:3:s-> ext2 [id=2 dir=none color="red" label="mink4|l_1"];
34.93 s
> 13 13 │ ext3 [style=invis];
34.93 s
> 14 │- 0:3:s-> ext3 [id=3 dir=none color="red" label="bis4|l_3"];
34.93 s
> 14 │+ 0:1:s-> ext3 [id=3 dir=none color="red" label="bis4|l_2"];
34.93 s
> 15 15 │ ext4 [style=invis];
34.93 s
> 16 │- 0:1:s-> ext4 [id=4 dir=none color="red" label="mink4|l_1"];
34.93 s
> 16 │+ 0:2:s-> ext4 [id=4 dir=none color="red" label="mink4|l_4"];
34.93 s
> 17 17 │ ext5 [style=invis];
34.94 s
> 18 │- 0:2:s-> ext5 [id=5 dir=none color="red" label="mink4|l_4"];
34.94 s
> 18 │+ 0:4:s-> ext5 [id=5 dir=none color="red" label="bis4|l_3"];
34.94 s
> 19 19 │ }
34.94 s
> ────────────┴───────────────────────────────────────────────────────────────────
34.94 s
> To update snapshots run `cargo insta review`
34.94 s
> Stopped on the first failure. Run `cargo insta test` to run all snapshots.
34.94 s
> test tensor::tests::parsing::infinite_execution ... FAILED
34.94 s
>
34.94 s
> failures:
34.94 s
>
34.94 s
> failures:
34.94 s
> tensor::tests::parsing::infinite_execution
34.94 s
>
34.94 s
> test result: FAILED. 0 passed; 1 failed; 0 ignored; 0 measured; 240 filtered out; finished in 0.03s
34.94 s
> system-err
34.94 s
> thread 'tensor::tests::parsing::infinite_execution' (875) panicked at /nix/store/30svmzr0z0zpcqjyynjn7w21wgx18y4b-vendor-cargo-deps/c19b7c6f923b580ac259164a89f2577984ad5ab09ee9d583b888f934adbbe8d0/insta-1.47.2/src/runtime.rs:719:13:
34.94 s
> snapshot assertion for 'infinite_execution' failed in line 910
34.94 s
> stack backtrace:
34.94 s
> 0: __rustc::rust_begin_unwind
34.94 s
> 1: core::panicking::panic_fmt
34.94 s
> 2: insta::runtime::assert_snapshot
34.94 s
> 3: idenso::tensor::tests::parsing::infinite_execution
34.94 s
> 4: <idenso::tensor::tests::parsing::infinite_execution::{closure#0} as core::ops::function::FnOnce<()>>::call_once
34.94 s
> note: Some details are omitted, run with `RUST_BACKTRACE=full` for a verbose backtrace.
34.94 s
> =========================================
34.94 s
> Extracting 2 binaries and 1 linked path to /build/nextest-archive-H3oFDx
34.94 s
> Extracted 8 files to /build/nextest-archive-H3oFDx in 0.09s
34.94 s
> ------------
34.94 s
> Nextest run ID 9c34f6ee-d4b4-457c-a723-efd416524e70 with nextest profile: ci_gammaloop
34.94 s
> Starting 135 tests across 2 binaries
34.94 s
> ------------
34.94 s
> Summary [ 0.219s] 135 tests run: 135 passed , 0 skipped
34.94 s
>
34.94 s
> ========== nextest test summary ==========
34.94 s
> report: target/nextest/ci_gammaloop/junit.xml
34.94 s
> tests: 135, failures: 0, errors: 0
34.94 s
> No failing testcases found.
34.94 s
> =========================================
34.94 s
> Extracting 5 binaries and 2 linked paths to /build/nextest-archive-NbLrkT
34.94 s
> Extracted 19 files to /build/nextest-archive-NbLrkT in 0.24s
34.94 s
> ------------
34.94 s
> Nextest run ID b2c7d328-2363-4588-93f9-2984c1c8283f with nextest profile: ci_gammaloop
34.94 s
> Starting 25 tests across 5 binaries (1 test skipped via profile.ci_gammaloop.default-filter )
34.94 s
> ------------
34.94 s
> Summary [ 0.246s] 25 tests run: 25 passed , 1 skipped
34.94 s
>
34.94 s
> ========== nextest test summary ==========
34.94 s
> report: target/nextest/ci_gammaloop/junit.xml
34.94 s
> tests: 25, failures: 0, errors: 0
34.94 s
> No failing testcases found.
34.94 s
> =========================================
34.94 s
> Extracting 2 binaries and 1 linked path to /build/nextest-archive-skKIOs
34.94 s
> Extracted 8 files to /build/nextest-archive-skKIOs in 0.08s
34.94 s
> ------------
34.94 s
> Nextest run ID 9fc8b2c6-f518-4248-bf85-96de619fe251 with nextest profile: ci_gammaloop
34.94 s
> Starting 1 test across 2 binaries
34.94 s
> ------------
34.94 s
> Summary [ 0.010s] 1 test run: 1 passed , 0 skipped
34.94 s
>
34.94 s
> ========== nextest test summary ==========
34.94 s
> report: target/nextest/ci_gammaloop/junit.xml
34.94 s
> tests: 1, failures: 0, errors: 0
34.94 s
> No failing testcases found.
34.94 s
> =========================================
34.94 s
> Extracting 1 binary and 1 linked path to /build/nextest-archive-zghgWZ
34.94 s
> Extracted 7 files to /build/nextest-archive-zghgWZ in 0.08s
34.94 s
> ------------
34.94 s
> Nextest run ID d27d0a7b-a333-4baa-8e41-2d662ea62e0e with nextest profile: ci_gammaloop
34.94 s
> Starting 0 tests across 1 binary
34.94 s
> ------------
34.94 s
> Summary [ 0.000s] 0 tests run: 0 passed , 0 skipped
34.94 s
>
34.94 s
> ========== nextest test summary ==========
34.94 s
> report: target/nextest/ci_gammaloop/junit.xml
34.94 s
> tests: 0, failures: 0, errors: 0
34.94 s
> No failing testcases found.
34.94 s
> =========================================
34.94 s
For full logs, run:
34.94 s
nix log /nix/store/wg9z1d6ybvc8xl844i0n0mklxxwi1328-gammaloop-nextest-spenso.drv
35.05 s
[0 built (1 failed ), 9 cRun failed.