1. 1.57 s $ /nix/store/9ypz3flqsrl5xl495mm8h645gadjsxi1-coreutils-9.11/bin/timeout --kill-after=15s 7200s /nix/store/23zk8sgzamrbmj1fday15szf7f2279s8-nix-2.34.7/bin/nix --extra-experimental-features nix-command --extra-experimental-features flakes flake clone git+https://github.com/alphal00p/gammaloop --dest /tmp/nix-ci-worker/stable-pwd/repo/
  2. 1.88 s Cloning into '/tmp/nix-ci-worker/stable-pwd/repo'...
  3. 1.88 s remote: Enumerating objects: 65231, done.
  4. 1.88 s remote: Counting objects: 0% (1/7903) remote: Counting objects: 1% (80/7903) remote: Counting objects: 2% (159/7903) remote: Counting objects: 3% (238/7903) remote: Counting objects: 4% (317/7903) remote: Counting objects: 5% (396/7903) remote: Counting objects: 6% (475/7903) remote: Counting objects: 7% (554/7903) remote: Counting objects: 8% (633/7903) remote: Counting objects: 9% (712/7903) remote: Counting objects: 10% (791/7903) remote: Counting objects: 11% (870/7903) remote: Counting objects: 12% (949/7903) remote: Counting objects: 13% (1028/7903) remote: Counting objects: 14% (1107/7903) remote: Counting objects: 15% (1186/7903) remote: Counting objects: 16% (1265/7903) remote: Counting objects: 17% (1344/7903) remote: Counting objects: 18% (1423/7903) remote: Counting objects: 19% (1502/7903) remote: Counting objects: 20% (1581/7903) remote: Counting objects: 21% (1660/7903) remote: Counting objects: 22% (1739/7903) remote: Counting objects: 23% (1818/7903) remote: Counting objects: 24% (1897/7903) remote: Counting objects: 25% (1976/7903) remote: Counting objects: 26% (2055/7903) remote: Counting objects: 27% (2134/7903) remote: Counting objects: 28% (2213/7903) remote: Counting objects: 29% (2292/7903) remote: Counting objects: 30% (2371/7903) remote: Counting objects: 31% (2450/7903) remote: Counting objects: 32% (2529/7903) remote: Counting objects: 33% (2608/7903) remote: Counting objects: 34% (2688/7903) remote: Counting objects: 35% (2767/7903) remote: Counting objects: 36% (2846/7903) remote: Counting objects: 37% (2925/7903) remote: Counting objects: 38% (3004/7903) remote: Counting objects: 39% (3083/7903) remote: Counting objects: 40% (3162/7903) remote: Counting objects: 41% (3241/7903) remote: Counting objects: 42% (3320/7903) remote: Counting objects: 43% (3399/7903) remote: Counting objects: 44% (3478/7903) remote: Counting objects: 45% (3557/7903) remote: Counting objects: 46% (3636/7903) remote: Counting objects: 47% (3715/7903) remote: Counting objects: 48% (3794/7903) remote: Counting objects: 49% (3873/7903) remote: Counting objects: 50% (3952/7903) remote: Counting objects: 51% (4031/7903) remote: Counting objects: 52% (4110/7903) remote: Counting objects: 53% (4189/7903) remote: Counting objects: 54% (4268/7903) remote: Counting objects: 55% (4347/7903) remote: Counting objects: 56% (4426/7903) remote: Counting objects: 57% (4505/7903) remote: Counting objects: 58% (4584/7903) remote: Counting objects: 59% (4663/7903) remote: Counting objects: 60% (4742/7903) remote: Counting objects: 61% (4821/7903) remote: Counting objects: 62% (4900/7903) remote: Counting objects: 63% (4979/7903) remote: Counting objects: 64% (5058/7903) remote: Counting objects: 65% (5137/7903) remote: Counting objects: 66% (5216/7903) remote: Counting objects: 67% (5296/7903) remote: Counting objects: 68% (5375/7903) remote: Counting objects: 69% (5454/7903) remote: Counting objects: 70% (5533/7903) remote: Counting objects: 71% (5612/7903) remote: Counting objects: 72% (5691/7903) remote: Counting objects: 73% (5770/7903) remote: Counting objects: 74% (5849/7903) remote: Counting objects: 75% (5928/7903) remote: Counting objects: 76% (6007/7903) remote: Counting objects: 77% (6086/7903) remote: Counting objects: 78% (6165/7903) remote: Counting objects: 79% (6244/7903) remote: Counting objects: 80% (6323/7903) remote: Counting objects: 81% (6402/7903) remote: Counting objects: 82% (6481/7903) remote: Counting objects: 83% (6560/7903) remote: Counting objects: 84% (6639/7903) remote: Counting objects: 85% (6718/7903) remote: Counting objects: 86% (6797/7903) remote: Counting objects: 87% (6876/7903) remote: Counting objects: 88% (6955/7903) remote: Counting objects: 89% (7034/7903) remote: Counting objects: 90% (7113/7903) remote: Counting objects: 91% (7192/7903) remote: Counting objects: 92% (7271/7903) remote: Counting objects: 93% (7350/7903) remote: Counting objects: 94% (7429/7903) remote: Counting objects: 95% (7508/7903) remote: Counting objects: 96% (7587/7903) remote: Counting objects: 97% (7666/7903) remote: Counting objects: 98% (7745/7903) remote: Counting objects: 99% (7824/7903) remote: Counting objects: 100% (7903/7903) remote: Counting objects: 100% (7903/7903), done.
  5. 2.51 s remote: Compressing objects: 0% (1/1561) remote: Compressing objects: 1% (16/1561) remote: Compressing objects: 2% (32/1561) remote: Compressing objects: 3% (47/1561) remote: Compressing objects: 4% (63/1561) remote: Compressing objects: 5% (79/1561) remote: Compressing objects: 6% (94/1561) remote: Compressing objects: 7% (110/1561) remote: Compressing objects: 8% (125/1561) remote: Compressing objects: 9% (141/1561) remote: Compressing objects: 10% (157/1561) remote: Compressing objects: 11% (172/1561) remote: Compressing objects: 12% (188/1561) remote: Compressing objects: 13% (203/1561) remote: Compressing objects: 14% (219/1561) remote: Compressing objects: 14% (228/1561) remote: Compressing objects: 15% (235/1561) remote: Compressing objects: 16% (250/1561) remote: Compressing objects: 17% (266/1561) remote: Compressing objects: 18% (281/1561) remote: Compressing objects: 19% (297/1561) remote: Compressing objects: 20% (313/1561) remote: Compressing objects: 21% (328/1561) remote: Compressing objects: 22% (344/1561) remote: Compressing objects: 23% (360/1561) remote: Compressing objects: 24% (375/1561) remote: Compressing objects: 25% (391/1561) remote: Compressing objects: 26% (406/1561) remote: Compressing objects: 27% (422/1561) remote: Compressing objects: 28% (438/1561) remote: Compressing objects: 29% (453/1561) remote: Compressing objects: 30% (469/1561) remote: Compressing objects: 31% (484/1561) remote: Compressing objects: 32% (500/1561) remote: Compressing objects: 33% (516/1561) remote: Compressing objects: 34% (531/1561) remote: Compressing objects: 35% (547/1561) remote: Compressing objects: 36% (562/1561) remote: Compressing objects: 37% (578/1561) remote: Compressing objects: 38% (594/1561) remote: Compressing objects: 39% (609/1561) remote: Compressing objects: 40% (625/1561) remote: Compressing objects: 41% (641/1561) remote: Compressing objects: 42% (656/1561) remote: Compressing objects: 43% (672/1561) remote: Compressing objects: 44% (687/1561) remote: Compressing objects: 45% (703/1561) remote: Compressing objects: 46% (719/1561) remote: Compressing objects: 47% (734/1561) remote: Compressing objects: 48% (750/1561) remote: Compressing objects: 49% (765/1561) remote: Compressing objects: 50% (781/1561) remote: Compressing objects: 51% (797/1561) remote: Compressing objects: 52% (812/1561) remote: Compressing objects: 53% (828/1561) remote: Compressing objects: 54% (843/1561) remote: Compressing objects: 55% (859/1561) remote: Compressing objects: 56% (875/1561) remote: Compressing objects: 57% (890/1561) remote: Compressing objects: 58% (906/1561) remote: Compressing objects: 59% (921/1561) remote: Compressing objects: 60% (937/1561) remote: Compressing objects: 61% (953/1561) remote: Compressing objects: 62% (968/1561) remote: Compressing objects: 63% (984/1561) remote: Compressing objects: 64% (1000/1561) remote: Compressing objects: 65% (1015/1561) remote: Compressing objects: 66% (1031/1561) remote: Compressing objects: 67% (1046/1561) remote: Compressing objects: 68% (1062/1561) remote: Compressing objects: 69% (1078/1561) remote: Compressing objects: 70% (1093/1561) remote: Compressing objects: 71% (1109/1561) remote: Compressing objects: 72% (1124/1561) remote: Compressing objects: 73% (1140/1561) remote: Compressing objects: 74% (1156/1561) remote: Compressing objects: 75% (1171/1561) remote: Compressing objects: 76% (1187/1561) remote: Compressing objects: 77% (1202/1561) remote: Compressing objects: 78% (1218/1561) remote: Compressing objects: 79% (1234/1561) remote: Compressing objects: 80% (1249/1561) remote: Compressing objects: 81% (1265/1561) remote: Compressing objects: 82% (1281/1561) remote: Compressing objects: 83% (1296/1561) remote: Compressing objects: 84% (1312/1561) remote: Compressing objects: 85% (1327/1561) remote: Compressing objects: 86% (1343/1561) remote: Compressing objects: 87% (1359/1561) remote: Compressing objects: 88% (1374/1561) remote: Compressing objects: 89% (1390/1561) remote: Compressing objects: 90% (1405/1561) remote: Compressing objects: 91% (1421/1561) remote: Compressing objects: 92% (1437/1561) remote: Compressing objects: 93% (1452/1561) remote: Compressing objects: 94% (1468/1561) remote: Compressing objects: 95% (1483/1561) remote: Compressing objects: 96% (1499/1561) remote: Compressing objects: 97% (1515/1561) remote: Compressing objects: 98% (1530/1561) remote: Compressing objects: 99% (1546/1561) remote: Compressing objects: 100% (1561/1561) remote: Compressing objects: 100% (1561/1561), done.
  6. 5.17 s Receiving objects: 0% (1/65231) Receiving objects: 1% (653/65231) Receiving objects: 2% (1305/65231) Receiving objects: 3% (1957/65231) Receiving objects: 4% (2610/65231) Receiving objects: 5% (3262/65231) Receiving objects: 6% (3914/65231) Receiving objects: 7% (4567/65231) Receiving objects: 8% (5219/65231), 9.32 MiB | 18.44 MiB/s Receiving objects: 9% (5871/65231), 9.32 MiB | 18.44 MiB/s Receiving objects: 10% (6524/65231), 9.32 MiB | 18.44 MiB/s Receiving objects: 11% (7176/65231), 9.32 MiB | 18.44 MiB/s Receiving objects: 12% (7828/65231), 9.32 MiB | 18.44 MiB/s Receiving objects: 13% (8481/65231), 9.32 MiB | 18.44 MiB/s Receiving objects: 14% (9133/65231), 9.32 MiB | 18.44 MiB/s Receiving objects: 15% (9785/65231), 9.32 MiB | 18.44 MiB/s Receiving objects: 16% (10437/65231), 9.32 MiB | 18.44 MiB/s Receiving objects: 17% (11090/65231), 9.32 MiB | 18.44 MiB/s Receiving objects: 18% (11742/65231), 9.32 MiB | 18.44 MiB/s Receiving objects: 19% (12394/65231), 9.32 MiB | 18.44 MiB/s Receiving objects: 20% (13047/65231), 9.32 MiB | 18.44 MiB/s Receiving objects: 21% (13699/65231), 9.32 MiB | 18.44 MiB/s Receiving objects: 22% (14351/65231), 9.32 MiB | 18.44 MiB/s Receiving objects: 23% (15004/65231), 9.32 MiB | 18.44 MiB/s Receiving objects: 24% (15656/65231), 9.32 MiB | 18.44 MiB/s Receiving objects: 25% (16308/65231), 9.32 MiB | 18.44 MiB/s Receiving objects: 26% (16961/65231), 9.32 MiB | 18.44 MiB/s Receiving objects: 27% (17613/65231), 9.32 MiB | 18.44 MiB/s Receiving objects: 28% (18265/65231), 9.32 MiB | 18.44 MiB/s Receiving objects: 29% (18917/65231), 9.32 MiB | 18.44 MiB/s Receiving objects: 30% (19570/65231), 9.32 MiB | 18.44 MiB/s Receiving objects: 31% (20222/65231), 9.32 MiB | 18.44 MiB/s Receiving objects: 32% (20874/65231), 9.32 MiB | 18.44 MiB/s Receiving objects: 33% (21527/65231), 9.32 MiB | 18.44 MiB/s Receiving objects: 34% (22179/65231), 9.32 MiB | 18.44 MiB/s Receiving objects: 35% (22831/65231), 9.32 MiB | 18.44 MiB/s Receiving objects: 36% (23484/65231), 9.32 MiB | 18.44 MiB/s Receiving objects: 37% (24136/65231), 9.32 MiB | 18.44 MiB/s Receiving objects: 38% (24788/65231), 9.32 MiB | 18.44 MiB/s Receiving objects: 39% (25441/65231), 9.32 MiB | 18.44 MiB/s Receiving objects: 40% (26093/65231), 9.32 MiB | 18.44 MiB/s Receiving objects: 41% (26745/65231), 9.32 MiB | 18.44 MiB/s Receiving objects: 42% (27398/65231), 9.32 MiB | 18.44 MiB/s Receiving objects: 43% (28050/65231), 9.32 MiB | 18.44 MiB/s Receiving objects: 44% (28702/65231), 9.32 MiB | 18.44 MiB/s Receiving objects: 45% (29354/65231), 9.32 MiB | 18.44 MiB/s Receiving objects: 46% (30007/65231), 9.32 MiB | 18.44 MiB/s Receiving objects: 47% (30659/65231), 9.32 MiB | 18.44 MiB/s Receiving objects: 48% (31311/65231), 9.32 MiB | 18.44 MiB/s Receiving objects: 49% (31964/65231), 9.32 MiB | 18.44 MiB/s Receiving objects: 50% (32616/65231), 9.32 MiB | 18.44 MiB/s Receiving objects: 51% (33268/65231), 9.32 MiB | 18.44 MiB/s Receiving objects: 51% (33604/65231), 9.32 MiB | 18.44 MiB/s Receiving objects: 52% (33921/65231), 32.22 MiB | 32.06 MiB/s Receiving objects: 53% (34573/65231), 32.22 MiB | 32.06 MiB/s Receiving objects: 54% (35225/65231), 32.22 MiB | 32.06 MiB/s Receiving objects: 55% (35878/65231), 32.22 MiB | 32.06 MiB/s Receiving objects: 56% (36530/65231), 32.22 MiB | 32.06 MiB/s Receiving objects: 57% (37182/65231), 32.22 MiB | 32.06 MiB/s Receiving objects: 58% (37834/65231), 32.22 MiB | 32.06 MiB/s Receiving objects: 59% (38487/65231), 32.22 MiB | 32.06 MiB/s Receiving objects: 60% (39139/65231), 32.22 MiB | 32.06 MiB/s Receiving objects: 61% (39791/65231), 32.22 MiB | 32.06 MiB/s Receiving objects: 62% (40444/65231), 32.22 MiB | 32.06 MiB/s Receiving objects: 63% (41096/65231), 49.70 MiB | 33.02 MiB/s Receiving objects: 64% (41748/65231), 49.70 MiB | 33.02 MiB/s Receiving objects: 65% (42401/65231), 49.70 MiB | 33.02 MiB/s Receiving objects: 66% (43053/65231), 49.70 MiB | 33.02 MiB/s Receiving objects: 67% (43705/65231), 49.70 MiB | 33.02 MiB/s Receiving objects: 68% (44358/65231), 49.70 MiB | 33.02 MiB/s Receiving objects: 69% (45010/65231), 49.70 MiB | 33.02 MiB/s Receiving objects: 70% (45662/65231), 49.70 MiB | 33.02 MiB/s Receiving objects: 71% (46315/65231), 49.70 MiB | 33.02 MiB/s Receiving objects: 72% (46967/65231), 49.70 MiB | 33.02 MiB/s Receiving objects: 73% (47619/65231), 49.70 MiB | 33.02 MiB/s Receiving objects: 74% (48271/65231), 49.70 MiB | 33.02 MiB/s Receiving objects: 74% (48902/65231), 66.28 MiB | 33.06 MiB/s Receiving objects: 75% (48924/65231), 66.28 MiB | 33.06 MiB/s Receiving objects: 76% (49576/65231), 66.28 MiB | 33.06 MiB/s Receiving objects: 77% (50228/65231), 66.28 MiB | 33.06 MiB/s Receiving objects: 78% (50881/65231), 66.28 MiB | 33.06 MiB/s Receiving objects: 79% (51533/65231), 66.28 MiB | 33.06 MiB/s Receiving objects: 80% (52185/65231), 66.28 MiB | 33.06 MiB/s Receiving objects: 81% (52838/65231), 66.28 MiB | 33.06 MiB/s Receiving objects: 82% (53490/65231), 66.28 MiB | 33.06 MiB/s Receiving objects: 83% (54142/65231), 66.28 MiB | 33.06 MiB/s Receiving objects: 84% (54795/65231), 66.28 MiB | 33.06 MiB/s Receiving objects: 85% (55447/65231), 66.28 MiB | 33.06 MiB/s Receiving objects: 86% (56099/65231), 66.28 MiB | 33.06 MiB/s Receiving objects: 87% (56751/65231), 66.28 MiB | 33.06 MiB/s Receiving objects: 88% (57404/65231), 66.28 MiB | 33.06 MiB/s Receiving objects: 89% (58056/65231), 66.28 MiB | 33.06 MiB/s Receiving objects: 90% (58708/65231), 66.28 MiB | 33.06 MiB/s Receiving objects: 91% (59361/65231), 66.28 MiB | 33.06 MiB/s Receiving objects: 92% (60013/65231), 66.28 MiB | 33.06 MiB/s Receiving objects: 93% (60665/65231), 83.21 MiB | 33.22 MiB/s Receiving objects: 94% (61318/65231), 83.21 MiB | 33.22 MiB/s Receiving objects: 95% (61970/65231), 83.21 MiB | 33.22 MiB/s Receiving objects: 96% (62622/65231), 83.21 MiB | 33.22 MiB/s Receiving objects: 97% (63275/65231), 83.21 MiB | 33.22 MiB/s Receiving objects: 98% (63927/65231), 83.21 MiB | 33.22 MiB/s Receiving objects: 99% (64579/65231), 83.21 MiB | 33.22 MiB/s remote: Total 65231 (delta 6868), reused 6407 (delta 6335), pack-reused 57328 (from 1)
  7. 5.18 s Receiving objects: 100% (65231/65231), 83.21 MiB | 33.22 MiB/s Receiving objects: 100% (65231/65231), 87.56 MiB | 32.89 MiB/s, done.
  8. 6.36 s Resolving deltas: 0% (0/45965) Resolving deltas: 1% (460/45965) Resolving deltas: 2% (920/45965) Resolving deltas: 3% (1379/45965) Resolving deltas: 4% (1839/45965) Resolving deltas: 5% (2299/45965) Resolving deltas: 6% (2758/45965) Resolving deltas: 7% (3218/45965) Resolving deltas: 8% (3678/45965) Resolving deltas: 9% (4137/45965) Resolving deltas: 10% (4597/45965) Resolving deltas: 11% (5057/45965) Resolving deltas: 12% (5516/45965) Resolving deltas: 13% (5976/45965) Resolving deltas: 14% (6436/45965) Resolving deltas: 15% (6895/45965) Resolving deltas: 16% (7355/45965) Resolving deltas: 17% (7815/45965) Resolving deltas: 18% (8274/45965) Resolving deltas: 19% (8735/45965) Resolving deltas: 20% (9195/45965) Resolving deltas: 21% (9653/45965) Resolving deltas: 22% (10114/45965) Resolving deltas: 23% (10573/45965) Resolving deltas: 24% (11033/45965) Resolving deltas: 25% (11492/45965) Resolving deltas: 26% (11951/45965) Resolving deltas: 27% (12411/45965) Resolving deltas: 28% (12871/45965) Resolving deltas: 29% (13330/45965) Resolving deltas: 30% (13791/45965) Resolving deltas: 31% (14250/45965) Resolving deltas: 32% (14709/45965) Resolving deltas: 33% (15170/45965) Resolving deltas: 34% (15629/45965) Resolving deltas: 35% (16088/45965) Resolving deltas: 36% (16548/45965) Resolving deltas: 37% (17008/45965) Resolving deltas: 38% (17467/45965) Resolving deltas: 39% (17927/45965) Resolving deltas: 40% (18386/45965) Resolving deltas: 41% (18846/45965) Resolving deltas: 42% (19306/45965) Resolving deltas: 43% (19765/45965) Resolving deltas: 44% (20225/45965) Resolving deltas: 45% (20685/45965) Resolving deltas: 46% (21144/45965) Resolving deltas: 47% (21604/45965) Resolving deltas: 48% (22064/45965) Resolving deltas: 49% (22523/45965) Resolving deltas: 50% (22987/45965) Resolving deltas: 51% (23443/45965) Resolving deltas: 52% (23906/45965) Resolving deltas: 53% (24362/45965) Resolving deltas: 54% (24824/45965) Resolving deltas: 55% (25281/45965) Resolving deltas: 56% (25741/45965) Resolving deltas: 57% (26201/45965) Resolving deltas: 58% (26660/45965) Resolving deltas: 59% (27120/45965) Resolving deltas: 60% (27579/45965) Resolving deltas: 61% (28039/45965) Resolving deltas: 62% (28499/45965) Resolving deltas: 63% (28959/45965) Resolving deltas: 64% (29418/45965) Resolving deltas: 65% (29878/45965) Resolving deltas: 66% (30337/45965) Resolving deltas: 67% (30797/45965) Resolving deltas: 68% (31257/45965) Resolving deltas: 69% (31716/45965) Resolving deltas: 70% (32176/45965) Resolving deltas: 71% (32638/45965) Resolving deltas: 72% (33095/45965) Resolving deltas: 73% (33559/45965) Resolving deltas: 74% (34015/45965) Resolving deltas: 75% (34475/45965) Resolving deltas: 76% (34934/45965) Resolving deltas: 77% (35394/45965) Resolving deltas: 78% (35853/45965) Resolving deltas: 79% (36313/45965) Resolving deltas: 80% (36774/45965) Resolving deltas: 81% (37232/45965) Resolving deltas: 82% (37692/45965) Resolving deltas: 83% (38151/45965) Resolving deltas: 84% (38611/45965) Resolving deltas: 84% (38972/45965) Resolving deltas: 85% (39071/45965) Resolving deltas: 86% (39530/45965) Resolving deltas: 87% (39990/45965) Resolving deltas: 88% (40450/45965) Resolving deltas: 89% (40909/45965) Resolving deltas: 90% (41369/45965) Resolving deltas: 91% (41829/45965) Resolving deltas: 92% (42288/45965) Resolving deltas: 93% (42748/45965) Resolving deltas: 94% (43208/45965) Resolving deltas: 95% (43667/45965) Resolving deltas: 96% (44127/45965) Resolving deltas: 97% (44589/45965) Resolving deltas: 98% (45046/45965) Resolving deltas: 99% (45508/45965) Resolving deltas: 100% (45965/45965) Resolving deltas: 100% (45965/45965), done.
  9. 6.85 s Fetching commit 4b6103034e4ab9883c27f48dea568f6b265d3b05 for vakint_rustred ...
  10. 6.86 s $ /nix/store/bcnisk3ydfgv26v2gw3zlky24g00yww2-git-2.54.0/bin/git fetch origin 4b6103034e4ab9883c27f48dea568f6b265d3b05
  11. 7.32 s From https://github.com/alphal00p/gammaloop
  12. 7.32 s * branch 4b6103034e4ab9883c27f48dea568f6b265d3b05 -> FETCH_HEAD
  13. 7.34 s $ /nix/store/9ypz3flqsrl5xl495mm8h645gadjsxi1-coreutils-9.11/bin/timeout --kill-after=15s 7200s /nix/store/bcnisk3ydfgv26v2gw3zlky24g00yww2-git-2.54.0/bin/git -c advice.detachedHead=false checkout 4b6103034e4ab9883c27f48dea568f6b265d3b05
  14. 7.57 s HEAD is now at 4b610303 Reserve RustRed scalar evaluation boundary
  15. 7.57 s $ /nix/store/9ypz3flqsrl5xl495mm8h645gadjsxi1-coreutils-9.11/bin/timeout --kill-after=15s 7200s /nix/store/23zk8sgzamrbmj1fday15szf7f2279s8-nix-2.34.7/bin/nix --extra-experimental-features nix-command --extra-experimental-features flakes --log-format internal-json run .#packages.x86_64-linux.nix-ci-check-gammaloop-nextest-core --print-build-logs
  16. 14.77 s
  17. 14.99 s Downloading cached gammaloop-nextest-binaries-core-gammaloop-api from https://cache.nix-ci.com
  18. 15.01 s Downloading cached gammaloop-nextest-binaries-core-gammaloop-tracing-filter from https://cache.nix-ci.com
  19. 15.01 s Downloading cached gammaloop-nextest-binaries-core-gammaloop-tracing-filter-macros from https://cache.nix-ci.com
  20. 15.01 s Downloading cached gammaloop-nextest-binaries-core-gammalooprs from https://cache.nix-ci.com
  21. 16.24 s Downloaded cached gammaloop-nextest-binaries-core-gammaloop-tracing-filter-macros (1.7 MiB) in 1.2s
  22. 16.24 s Progress: 0 of 1 built, 1 of 6 downloaded from cache (3 downloading)
  23. 16.93 s Downloaded cached gammaloop-nextest-binaries-core-gammaloop-tracing-filter (6.6 MiB) in 1.9s
  24. 16.93 s Progress: 0 of 1 built, 2 of 6 downloaded from cache (2 downloading)
  25. 27.60 s Downloaded cached gammaloop-nextest-binaries-core-gammaloop-api (66.7 MiB) in 12.6s
  26. 27.61 s Progress: 0 of 1 built, 3 of 6 downloaded from cache (1 downloading)
  27. 30.03 s Downloaded cached gammaloop-nextest-binaries-core-gammalooprs (76.8 MiB) in 15.0s
  28. 30.03 s Progress: 0 of 1 built, 4 of 6 downloaded from cache
  29. 30.03 s Downloading cached gammaloop-nextest-binaries-core from https://cache.nix-ci.com
  30. 30.49 s Downloaded cached gammaloop-nextest-binaries-core (1640 B) in 461ms
  31. 30.49 s Progress: 0 of 1 built, 5 of 6 downloaded from cache
  32. 30.49 s Downloading cached nix-ci-check-gammaloop-nextest-core from https://cache.nix-ci.com
  33. 31.00 s Downloaded cached nix-ci-check-gammaloop-nextest-core (1016 B) in 506ms
  34. 31.00 s Progress: 0 of 1 built, 6 of 6 downloaded from cache
  35. 39.71 s evaluating derivation 'g copying '/nix/store/n2q0 evaluating derivation 'g copying '/nix/store/n2q0 evaluating derivation 'g copying '/nix/store/n2q0 evaluating derivation 'g copying '/nix/store/n2q0 evaluating derivation 'g copying '/nix/store/n2q0 evaluating derivation 'g copying '/nix/store/n2q0 evaluating derivation 'g copying '/nix/store/n2q0 evaluating derivation 'g copying '/nix/store/n2q0 evaluating derivation 'g copying '/nix/store/n2q0 evaluating derivation 'g copying '/nix/store/n2q0 evaluating derivation 'g querying gammaloop-nexte [0/2 built, 0.0 KiB DL] [0/1 built, 0.0 KiB DL] [1/0/1 built, 0.0 KiB DLgammaloop-nextest-core> Extracting 3 binaries (including 1 non-test binary), 1 build script output directory, and 2 linked paths to /build/nextest-archive-EVcebZ
  36. 40.82 s gammaloop-nextest-core> Extracted 18 files to /build/nextest-archive-EVcebZ in 1.11s
  37. 40.86 s gammaloop-nextest-core> ------------
  38. 40.86 s gammaloop-nextest-core> Nextest run ID a0a5519c-3cae-46d6-bde4-ce8c95a58635 with nextest profile: ci_gammaloop
  39. 40.86 s gammaloop-nextest-core> Starting 339 tests across 2 binaries
  40. 41.96 s gammaloop-nextest-core> ------------
  41. 41.96 s gammaloop-nextest-core> Summary [ 1.095s] 339 tests run: 339 passed, 0 skipped
  42. 42.10 s gammaloop-nextest-core>
  43. 42.10 s gammaloop-nextest-core> ========== nextest test summary ==========
  44. 42.10 s gammaloop-nextest-core> report: target/nextest/ci_gammaloop/junit.xml
  45. 42.10 s gammaloop-nextest-core> tests: 339, failures: 0, errors: 0
  46. 42.10 s gammaloop-nextest-core> No failing testcases found.
  47. 42.10 s gammaloop-nextest-core> =========================================
  48. 42.13 s gammaloop-nextest-core> Extracting 1 binary and 1 linked path to /build/nextest-archive-2PuJq8
  49. 42.22 s gammaloop-nextest-core> Extracted 7 files to /build/nextest-archive-2PuJq8 in 0.09s
  50. 42.26 s gammaloop-nextest-core> ------------
  51. 42.26 s gammaloop-nextest-core> Nextest run ID b68b6938-b744-4fd0-8e5b-bd1805bc2308 with nextest profile: ci_gammaloop
  52. 42.26 s gammaloop-nextest-core> Starting 19 tests across 1 binary
  53. 42.32 s gammaloop-nextest-core> ------------
  54. 42.32 s gammaloop-nextest-core> Summary [ 0.060s] 19 tests run: 19 passed, 0 skipped
  55. 42.38 s gammaloop-nextest-core>
  56. 42.38 s gammaloop-nextest-core> ========== nextest test summary ==========
  57. 42.38 s gammaloop-nextest-core> report: target/nextest/ci_gammaloop/junit.xml
  58. 42.38 s gammaloop-nextest-core> tests: 19, failures: 0, errors: 0
  59. 42.38 s gammaloop-nextest-core> No failing testcases found.
  60. 42.38 s gammaloop-nextest-core> =========================================
  61. 42.41 s gammaloop-nextest-core> Extracting 1 binary to /build/nextest-archive-nxpVvu
  62. 42.47 s gammaloop-nextest-core> Extracted 4 files to /build/nextest-archive-nxpVvu in 0.06s
  63. 42.52 s gammaloop-nextest-core> ------------
  64. 42.52 s gammaloop-nextest-core> Nextest run ID dc4202d2-3f51-42ed-bd33-d635654bb692 with nextest profile: ci_gammaloop
  65. 42.52 s gammaloop-nextest-core> Starting 0 tests across 1 binary
  66. 42.52 s gammaloop-nextest-core> ------------
  67. 42.52 s gammaloop-nextest-core> Summary [ 0.000s] 0 tests run: 0 passed, 0 skipped
  68. 42.58 s gammaloop-nextest-core>
  69. 42.58 s gammaloop-nextest-core> ========== nextest test summary ==========
  70. 42.58 s gammaloop-nextest-core> report: target/nextest/ci_gammaloop/junit.xml
  71. 42.58 s gammaloop-nextest-core> tests: 0, failures: 0, errors: 0
  72. 42.58 s gammaloop-nextest-core> No failing testcases found.
  73. 42.58 s gammaloop-nextest-core> =========================================
  74. 42.61 s gammaloop-nextest-core> Extracting 4 binaries, 1 build script output directory, and 2 linked paths to /build/nextest-archive-XHL0J8
  75. 43.12 s gammaloop-nextest-core> Extracted 18 files to /build/nextest-archive-XHL0J8 in 0.52s
  76. 43.16 s gammaloop-nextest-core> ------------
  77. 43.16 s gammaloop-nextest-core> Nextest run ID c0efbd82-d904-496e-af49-114c5b144efd with nextest profile: ci_gammaloop
  78. 43.16 s gammaloop-nextest-core> Starting 456 tests across 4 binaries (61 tests skipped, including 60 tests via profile.ci_gammaloop.default-filter)
  79. 45.19 s gammaloop-nextest-core> FAIL [ 0.388s] (442/456) gammalooprs::test_renormalization finit_part_ghlo
  80. 45.21 s gammaloop-nextest-core> stdout ---
  81. 45.21 s gammaloop-nextest-core>
  82. 45.21 s gammaloop-nextest-core> running 1 test
  83. 45.21 s gammaloop-nextest-core> ren part: 1/2*GC_10^2*dot(P(0,mink(dim)),P(0,mink(dim)))*cas(2,coad(8))/ε
  84. 45.21 s gammaloop-nextest-core> ━━━━━━━━━━━━━━━━━━━━━━━━━━━━━━━ Snapshot Summary ━━━━━━━━━━━━━━━━━━━━━━━━━━━━━━━
  85. 45.21 s gammaloop-nextest-core> Snapshot: finit_part_ghlo
  86. 45.21 s gammaloop-nextest-core> Source: crates/gammalooprs/tests/test_renormalization.rs:557
  87. 45.21 s gammaloop-nextest-core> ────────────────────────────────────────────────────────────────────────────────
  88. 45.21 s gammaloop-nextest-core> Expression: align_to_rqft(&a, &model).to_bare_ordered_string()
  89. 45.21 s gammaloop-nextest-core> ────────────────────────────────────────────────────────────────────────────────
  90. 45.21 s gammaloop-nextest-core> -old snapshot
  91. 45.21 s gammaloop-nextest-core> +new results
  92. 45.21 s gammaloop-nextest-core> ────────────┬───────────────────────────────────────────────────────────────────
  93. 45.21 s gammaloop-nextest-core> 1 │--1/2*cas(2,coad(8))*dot(P(0,mink(4)),P(0,mink(4)))*gs^2*ε^(-1)
  94. 45.21 s gammaloop-nextest-core> 1 │+1/2*cas(2,coad(8))*dot(P(0,mink(4)),P(0,mink(4)))*gs^2*ε^(-1)
  95. 45.21 s gammaloop-nextest-core> ────────────┴───────────────────────────────────────────────────────────────────
  96. 45.21 s gammaloop-nextest-core> To update snapshots run `cargo insta review`
  97. 45.21 s gammaloop-nextest-core> Stopped on the first failure. Run `cargo insta test` to run all snapshots.
  98. 45.21 s gammaloop-nextest-core> test finit_part_ghlo ... FAILED
  99. 45.21 s gammaloop-nextest-core>
  100. 45.21 s gammaloop-nextest-core> failures:
  101. 45.21 s gammaloop-nextest-core>
  102. 45.21 s gammaloop-nextest-core> failures:
  103. 45.21 s gammaloop-nextest-core> finit_part_ghlo
  104. 45.21 s gammaloop-nextest-core>
  105. 45.21 s gammaloop-nextest-core> test result: FAILED. 0 passed; 1 failed; 0 ignored; 0 measured; 5 filtered out; finished in 0.36s
  106. 45.21 s gammaloop-nextest-core>
  107. 45.21 s gammaloop-nextest-core> stderr ---
  108. 45.21 s gammaloop-nextest-core> The application panicked (crashed).
  109. 45.21 s gammaloop-nextest-core> Message: snapshot assertion for 'finit_part_ghlo' failed in line 557
  110. 45.21 s gammaloop-nextest-core> Location: /nix/store/30svmzr0z0zpcqjyynjn7w21wgx18y4b-vendor-cargo-deps/c19b7c6f923b580ac259164a89f2577984ad5ab09ee9d583b888f934adbbe8d0/insta-1.47.2/src/runtime.rs:719
  111. 45.21 s gammaloop-nextest-core>
  112. 45.21 s gammaloop-nextest-core> ━━━━━━━━━━━━━━━━━━━━━━━━━━━━━━━━━━ BACKTRACE ━━━━━━━━━━━━━━━━━━━━━━━━━━━━━━━━━━━
  113. 45.21 s gammaloop-nextest-core> 1: <color_eyre[51793ea62743adbd]::config::PanicHook>::panic_report<unknown>
  114. 45.21 s gammaloop-nextest-core> at <unknown source file>:<unknown line>
  115. 45.21 s gammaloop-nextest-core> 2: <color_eyre[51793ea62743adbd]::config::PanicHook>::into_panic_hook::{closure#0}<unknown>
  116. 45.21 s gammaloop-nextest-core> at <unknown source file>:<unknown line>
  117. 45.21 s gammaloop-nextest-core> 3: std[bcb96dfbba0ab899]::panicking::panic_with_hook<unknown>
  118. 45.21 s gammaloop-nextest-core> at <unknown source file>:<unknown line>
  119. 45.21 s gammaloop-nextest-core> 4: std[bcb96dfbba0ab899]::panicking::panic_handler::{closure#0}<unknown>
  120. 45.21 s gammaloop-nextest-core> at <unknown source file>:<unknown line>
  121. 45.21 s gammaloop-nextest-core> 5: std[bcb96dfbba0ab899]::sys::backtrace::__rust_end_short_backtrace::<std[bcb96dfbba0ab899]::panicking::panic_handler::{closure#0}, !><unknown>
  122. 45.21 s gammaloop-nextest-core> at <unknown source file>:<unknown line>
  123. 45.21 s gammaloop-nextest-core> 6: __rustc[6c289b9f9c454d21]::rust_begin_unwind<unknown>
  124. 45.21 s gammaloop-nextest-core> at <unknown source file>:<unknown line>
  125. 45.21 s gammaloop-nextest-core> 7: core[940e698046960fd5]::panicking::panic_fmt<unknown>
  126. 45.21 s gammaloop-nextest-core> at <unknown source file>:<unknown line>
  127. 45.21 s gammaloop-nextest-core> 8: insta[307a548ac79ef4d9]::runtime::assert_snapshot<unknown>
  128. 45.21 s gammaloop-nextest-core> at <unknown source file>:<unknown line>
  129. 45.21 s gammaloop-nextest-core> 9: <test_renormalization[9b33d9b78f5a79c8]::finit_part_ghlo::{closure#0} as core[940e698046960fd5]::ops::function::FnOnce<()>>::call_once<unknown>
  130. 45.21 s gammaloop-nextest-core> at <unknown source file>:<unknown line>
  131. 45.21 s gammaloop-nextest-core> 10: test[75d6903177b1d7e9]::__rust_begin_short_backtrace::<core[940e698046960fd5]::result::Result<(), alloc[2ea6bcb46fca0c42]::string::String>, fn() -> core[940e698046960fd5]::result::Result<(), alloc[2ea6bcb46fca0c42]::string::String>><unknown>
  132. 45.21 s gammaloop-nextest-core> at <unknown source file>:<unknown line>
  133. 45.21 s gammaloop-nextest-core> 11: test[75d6903177b1d7e9]::run_test::{closure#0}<unknown>
  134. 45.21 s gammaloop-nextest-core> at <unknown source file>:<unknown line>
  135. 45.21 s gammaloop-nextest-core> 12: std[bcb96dfbba0ab899]::sys::backtrace::__rust_begin_short_backtrace::<test[75d6903177b1d7e9]::run_test::{closure#1}, ()><unknown>
  136. 45.21 s gammaloop-nextest-core> at <unknown source file>:<unknown line>
  137. 45.21 s gammaloop-nextest-core> 13: <std[bcb96dfbba0ab899]::thread::lifecycle::spawn_unchecked<test[75d6903177b1d7e9]::run_test::{closure#1}, ()>::{closure#1} as core[940e698046960fd5]::ops::function::FnOnce<()>>::call_once::{shim:vtable#0}<unknown>
  138. 45.21 s gammaloop-nextest-core> at <unknown source file>:<unknown line>
  139. 45.21 s gammaloop-nextest-core> 14: <std[bcb96dfbba0ab899]::sys::thread::unix::Thread>::new::thread_start<unknown>
  140. 45.21 s gammaloop-nextest-core> at <unknown source file>:<unknown line>
  141. 45.21 s gammaloop-nextest-core> 15: start_thread<unknown>
  142. 45.21 s gammaloop-nextest-core> at <unknown source file>:<unknown line>
  143. 45.21 s gammaloop-nextest-core> 16: __clone3<unknown>
  144. 45.21 s gammaloop-nextest-core> at <unknown source file>:<unknown line>
  145. 45.21 s gammaloop-nextest-core>
  146. 45.21 s gammaloop-nextest-core> Run with COLORBT_SHOW_HIDDEN=1 environment variable to disable frame filtering.
  147. 45.21 s gammaloop-nextest-core> Run with RUST_BACKTRACE=full to include source snippets.
  148. 45.21 s gammaloop-nextest-core>
  149. 48.23 s gammaloop-nextest-core> FAIL [ 3.380s] (451/456) gammalooprs::test_renormalization finite_part_ghost_2loop
  150. 48.23 s gammaloop-nextest-core> stdout ---
  151. 48.23 s gammaloop-nextest-core>
  152. 48.23 s gammaloop-nextest-core> running 1 test
  153. 48.23 s gammaloop-nextest-core> ━━━━━━━━━━━━━━━━━━━━━━━━━━━━━━━ Snapshot Summary ━━━━━━━━━━━━━━━━━━━━━━━━━━━━━━━
  154. 48.23 s gammaloop-nextest-core> Snapshot: finite_part_ghost_2loop-3
  155. 48.23 s gammaloop-nextest-core> Source: crates/gammalooprs/tests/test_renormalization.rs:464
  156. 48.23 s gammaloop-nextest-core> ────────────────────────────────────────────────────────────────────────────────
  157. 48.23 s gammaloop-nextest-core> Expression: align_to_rqft(&a, &model).to_bare_ordered_string()
  158. 48.23 s gammaloop-nextest-core> ────────────────────────────────────────────────────────────────────────────────
  159. 48.23 s gammaloop-nextest-core> -old snapshot
  160. 48.23 s gammaloop-nextest-core> +new results
  161. 48.23 s gammaloop-nextest-core> ────────────┬───────────────────────────────────────────────────────────────────
  162. 48.23 s gammaloop-nextest-core> 1 │-(-1𝑖/32*ε+1𝑖/16)*(cas(2,coad(8)))^2*dot(P(0,mink(4)),P(0,mink(4)))*gs^4*ε^(-2)
  163. 48.23 s gammaloop-nextest-core> 1 │+(-1𝑖/16+1𝑖/32*ε)*(cas(2,coad(8)))^2*dot(P(0,mink(4)),P(0,mink(4)))*gs^4*ε^(-2)
  164. 48.23 s gammaloop-nextest-core> ────────────┴───────────────────────────────────────────────────────────────────
  165. 48.23 s gammaloop-nextest-core> To update snapshots run `cargo insta review`
  166. 48.23 s gammaloop-nextest-core> Stopped on the first failure. Run `cargo insta test` to run all snapshots.
  167. 48.23 s gammaloop-nextest-core> test finite_part_ghost_2loop ... FAILED
  168. 48.23 s gammaloop-nextest-core>
  169. 48.23 s gammaloop-nextest-core> failures:
  170. 48.23 s gammaloop-nextest-core>
  171. 48.23 s gammaloop-nextest-core> failures:
  172. 48.23 s gammaloop-nextest-core> finite_part_ghost_2loop
  173. 48.23 s gammaloop-nextest-core>
  174. 48.23 s gammaloop-nextest-core> test result: FAILED. 0 passed; 1 failed; 0 ignored; 0 measured; 5 filtered out; finished in 3.37s
  175. 48.23 s gammaloop-nextest-core>
  176. 48.23 s gammaloop-nextest-core> stderr ---
  177. 48.23 s gammaloop-nextest-core> The application panicked (crashed).
  178. 48.23 s gammaloop-nextest-core> Message: snapshot assertion for 'finite_part_ghost_2loop-3' failed in line 464
  179. 48.23 s gammaloop-nextest-core> Location: /nix/store/30svmzr0z0zpcqjyynjn7w21wgx18y4b-vendor-cargo-deps/c19b7c6f923b580ac259164a89f2577984ad5ab09ee9d583b888f934adbbe8d0/insta-1.47.2/src/runtime.rs:719
  180. 48.23 s gammaloop-nextest-core>
  181. 48.23 s gammaloop-nextest-core> ━━━━━━━━━━━━━━━━━━━━━━━━━━━━━━━━━━ BACKTRACE ━━━━━━━━━━━━━━━━━━━━━━━━━━━━━━━━━━━
  182. 48.23 s gammaloop-nextest-core> 1: <color_eyre[51793ea62743adbd]::config::PanicHook>::panic_report<unknown>
  183. 48.23 s gammaloop-nextest-core> at <unknown source file>:<unknown line>
  184. 48.23 s gammaloop-nextest-core> 2: <color_eyre[51793ea62743adbd]::config::PanicHook>::into_panic_hook::{closure#0}<unknown>
  185. 48.23 s gammaloop-nextest-core> at <unknown source file>:<unknown line>
  186. 48.23 s gammaloop-nextest-core> 3: std[bcb96dfbba0ab899]::panicking::panic_with_hook<unknown>
  187. 48.23 s gammaloop-nextest-core> at <unknown source file>:<unknown line>
  188. 48.23 s gammaloop-nextest-core> 4: std[bcb96dfbba0ab899]::panicking::panic_handler::{closure#0}<unknown>
  189. 48.23 s gammaloop-nextest-core> at <unknown source file>:<unknown line>
  190. 48.23 s gammaloop-nextest-core> 5: std[bcb96dfbba0ab899]::sys::backtrace::__rust_end_short_backtrace::<std[bcb96dfbba0ab899]::panicking::panic_handler::{closure#0}, !><unknown>
  191. 48.23 s gammaloop-nextest-core> at <unknown source file>:<unknown line>
  192. 48.23 s gammaloop-nextest-core> 6: __rustc[6c289b9f9c454d21]::rust_begin_unwind<unknown>
  193. 48.23 s gammaloop-nextest-core> at <unknown source file>:<unknown line>
  194. 48.23 s gammaloop-nextest-core> 7: core[940e698046960fd5]::panicking::panic_fmt<unknown>
  195. 48.23 s gammaloop-nextest-core> at <unknown source file>:<unknown line>
  196. 48.23 s gammaloop-nextest-core> 8: insta[307a548ac79ef4d9]::runtime::assert_snapshot<unknown>
  197. 48.23 s gammaloop-nextest-core> at <unknown source file>:<unknown line>
  198. 48.23 s gammaloop-nextest-core> 9: test_renormalization[9b33d9b78f5a79c8]::finite_part_ghost_2loop<unknown>
  199. 48.23 s gammaloop-nextest-core> at <unknown source file>:<unknown line>
  200. 48.23 s gammaloop-nextest-core> 10: <test_renormalization[9b33d9b78f5a79c8]::finite_part_ghost_2loop::{closure#0} as core[940e698046960fd5]::ops::function::FnOnce<()>>::call_once<unknown>
  201. 48.23 s gammaloop-nextest-core> at <unknown source file>:<unknown line>
  202. 48.23 s gammaloop-nextest-core> 11: test[75d6903177b1d7e9]::__rust_begin_short_backtrace::<core[940e698046960fd5]::result::Result<(), alloc[2ea6bcb46fca0c42]::string::String>, fn() -> core[940e698046960fd5]::result::Result<(), alloc[2ea6bcb46fca0c42]::string::String>><unknown>
  203. 48.23 s gammaloop-nextest-core> at <unknown source file>:<unknown line>
  204. 48.23 s gammaloop-nextest-core> 12: test[75d6903177b1d7e9]::run_test::{closure#0}<unknown>
  205. 48.23 s gammaloop-nextest-core> at <unknown source file>:<unknown line>
  206. 48.23 s gammaloop-nextest-core> 13: std[bcb96dfbba0ab899]::sys::backtrace::__rust_begin_short_backtrace::<test[75d6903177b1d7e9]::run_test::{closure#1}, ()><unknown>
  207. 48.23 s gammaloop-nextest-core> at <unknown source file>:<unknown line>
  208. 48.23 s gammaloop-nextest-core> 14: <std[bcb96dfbba0ab899]::thread::lifecycle::spawn_unchecked<test[75d6903177b1d7e9]::run_test::{closure#1}, ()>::{closure#1} as core[940e698046960fd5]::ops::function::FnOnce<()>>::call_once::{shim:vtable#0}<unknown>
  209. 48.23 s gammaloop-nextest-core> at <unknown source file>:<unknown line>
  210. 48.23 s gammaloop-nextest-core> 15: <std[bcb96dfbba0ab899]::sys::thread::unix::Thread>::new::thread_start<unknown>
  211. 48.23 s gammaloop-nextest-core> at <unknown source file>:<unknown line>
  212. 48.23 s gammaloop-nextest-core> 16: start_thread<unknown>
  213. 48.23 s gammaloop-nextest-core> at <unknown source file>:<unknown line>
  214. 48.23 s gammaloop-nextest-core> 17: __clone3<unknown>
  215. 48.23 s gammaloop-nextest-core> at <unknown source file>:<unknown line>
  216. 48.23 s gammaloop-nextest-core>
  217. 48.23 s gammaloop-nextest-core> Run with COLORBT_SHOW_HIDDEN=1 environment variable to disable frame filtering.
  218. 48.23 s gammaloop-nextest-core> Run with RUST_BACKTRACE=full to include source snippets.
  219. 48.23 s gammaloop-nextest-core>
  220. 55.52 s gammaloop-nextest-core> ------------
  221. 55.53 s gammaloop-nextest-core> Summary [ 12.363s] 456 tests run: 454 passed, 2 failed, 61 skipped
  222. 55.53 s gammaloop-nextest-core> FAIL [ 0.388s] (442/456) gammalooprs::test_renormalization finit_part_ghlo
  223. 55.53 s gammaloop-nextest-core> stdout ---
  224. 55.53 s gammaloop-nextest-core>
  225. 55.53 s gammaloop-nextest-core> running 1 test
  226. 55.53 s gammaloop-nextest-core> ren part: 1/2*GC_10^2*dot(P(0,mink(dim)),P(0,mink(dim)))*cas(2,coad(8))/ε
  227. 55.53 s gammaloop-nextest-core> ━━━━━━━━━━━━━━━━━━━━━━━━━━━━━━━ Snapshot Summary ━━━━━━━━━━━━━━━━━━━━━━━━━━━━━━━
  228. 55.53 s gammaloop-nextest-core> Snapshot: finit_part_ghlo
  229. 55.53 s gammaloop-nextest-core> Source: crates/gammalooprs/tests/test_renormalization.rs:557
  230. 55.53 s gammaloop-nextest-core> ────────────────────────────────────────────────────────────────────────────────
  231. 55.53 s gammaloop-nextest-core> Expression: align_to_rqft(&a, &model).to_bare_ordered_string()
  232. 55.53 s gammaloop-nextest-core> ────────────────────────────────────────────────────────────────────────────────
  233. 55.53 s gammaloop-nextest-core> -old snapshot
  234. 55.53 s gammaloop-nextest-core> +new results
  235. 55.53 s gammaloop-nextest-core> ────────────┬───────────────────────────────────────────────────────────────────
  236. 55.53 s gammaloop-nextest-core> 1 │--1/2*cas(2,coad(8))*dot(P(0,mink(4)),P(0,mink(4)))*gs^2*ε^(-1)
  237. 55.53 s gammaloop-nextest-core> 1 │+1/2*cas(2,coad(8))*dot(P(0,mink(4)),P(0,mink(4)))*gs^2*ε^(-1)
  238. 55.53 s gammaloop-nextest-core> ────────────┴───────────────────────────────────────────────────────────────────
  239. 55.53 s gammaloop-nextest-core> To update snapshots run `cargo insta review`
  240. 55.53 s gammaloop-nextest-core> Stopped on the first failure. Run `cargo insta test` to run all snapshots.
  241. 55.53 s gammaloop-nextest-core> test finit_part_ghlo ... FAILED
  242. 55.53 s gammaloop-nextest-core>
  243. 55.53 s gammaloop-nextest-core> failures:
  244. 55.53 s gammaloop-nextest-core>
  245. 55.53 s gammaloop-nextest-core> failures:
  246. 55.53 s gammaloop-nextest-core> finit_part_ghlo
  247. 55.53 s gammaloop-nextest-core>
  248. 55.53 s gammaloop-nextest-core> test result: FAILED. 0 passed; 1 failed; 0 ignored; 0 measured; 5 filtered out; finished in 0.36s
  249. 55.53 s gammaloop-nextest-core>
  250. 55.53 s gammaloop-nextest-core> stderr ---
  251. 55.53 s gammaloop-nextest-core> The application panicked (crashed).
  252. 55.53 s gammaloop-nextest-core> Message: snapshot assertion for 'finit_part_ghlo' failed in line 557
  253. 55.53 s gammaloop-nextest-core> Location: /nix/store/30svmzr0z0zpcqjyynjn7w21wgx18y4b-vendor-cargo-deps/c19b7c6f923b580ac259164a89f2577984ad5ab09ee9d583b888f934adbbe8d0/insta-1.47.2/src/runtime.rs:719
  254. 55.53 s gammaloop-nextest-core>
  255. 55.53 s gammaloop-nextest-core> ━━━━━━━━━━━━━━━━━━━━━━━━━━━━━━━━━━ BACKTRACE ━━━━━━━━━━━━━━━━━━━━━━━━━━━━━━━━━━━
  256. 55.53 s gammaloop-nextest-core> 1: <color_eyre[51793ea62743adbd]::config::PanicHook>::panic_report<unknown>
  257. 55.53 s gammaloop-nextest-core> at <unknown source file>:<unknown line>
  258. 55.53 s gammaloop-nextest-core> 2: <color_eyre[51793ea62743adbd]::config::PanicHook>::into_panic_hook::{closure#0}<unknown>
  259. 55.53 s gammaloop-nextest-core> at <unknown source file>:<unknown line>
  260. 55.53 s gammaloop-nextest-core> 3: std[bcb96dfbba0ab899]::panicking::panic_with_hook<unknown>
  261. 55.53 s gammaloop-nextest-core> at <unknown source file>:<unknown line>
  262. 55.53 s gammaloop-nextest-core> 4: std[bcb96dfbba0ab899]::panicking::panic_handler::{closure#0}<unknown>
  263. 55.53 s gammaloop-nextest-core> at <unknown source file>:<unknown line>
  264. 55.53 s gammaloop-nextest-core> 5: std[bcb96dfbba0ab899]::sys::backtrace::__rust_end_short_backtrace::<std[bcb96dfbba0ab899]::panicking::panic_handler::{closure#0}, !><unknown>
  265. 55.53 s gammaloop-nextest-core> at <unknown source file>:<unknown line>
  266. 55.53 s gammaloop-nextest-core> 6: __rustc[6c289b9f9c454d21]::rust_begin_unwind<unknown>
  267. 55.53 s gammaloop-nextest-core> at <unknown source file>:<unknown line>
  268. 55.53 s gammaloop-nextest-core> 7: core[940e698046960fd5]::panicking::panic_fmt<unknown>
  269. 55.53 s gammaloop-nextest-core> at <unknown source file>:<unknown line>
  270. 55.53 s gammaloop-nextest-core> 8: insta[307a548ac79ef4d9]::runtime::assert_snapshot<unknown>
  271. 55.53 s gammaloop-nextest-core> at <unknown source file>:<unknown line>
  272. 55.53 s gammaloop-nextest-core> 9: <test_renormalization[9b33d9b78f5a79c8]::finit_part_ghlo::{closure#0} as core[940e698046960fd5]::ops::function::FnOnce<()>>::call_once<unknown>
  273. 55.53 s gammaloop-nextest-core> at <unknown source file>:<unknown line>
  274. 55.53 s gammaloop-nextest-core> 10: test[75d6903177b1d7e9]::__rust_begin_short_backtrace::<core[940e698046960fd5]::result::Result<(), alloc[2ea6bcb46fca0c42]::string::String>, fn() -> core[940e698046960fd5]::result::Result<(), alloc[2ea6bcb46fca0c42]::string::String>><unknown>
  275. 55.53 s gammaloop-nextest-core> at <unknown source file>:<unknown line>
  276. 55.53 s gammaloop-nextest-core> 11: test[75d6903177b1d7e9]::run_test::{closure#0}<unknown>
  277. 55.53 s gammaloop-nextest-core> at <unknown source file>:<unknown line>
  278. 55.53 s gammaloop-nextest-core> 12: std[bcb96dfbba0ab899]::sys::backtrace::__rust_begin_short_backtrace::<test[75d6903177b1d7e9]::run_test::{closure#1}, ()><unknown>
  279. 55.53 s gammaloop-nextest-core> at <unknown source file>:<unknown line>
  280. 55.53 s gammaloop-nextest-core> 13: <std[bcb96dfbba0ab899]::thread::lifecycle::spawn_unchecked<test[75d6903177b1d7e9]::run_test::{closure#1}, ()>::{closure#1} as core[940e698046960fd5]::ops::function::FnOnce<()>>::call_once::{shim:vtable#0}<unknown>
  281. 55.53 s gammaloop-nextest-core> at <unknown source file>:<unknown line>
  282. 55.53 s gammaloop-nextest-core> 14: <std[bcb96dfbba0ab899]::sys::thread::unix::Thread>::new::thread_start<unknown>
  283. 55.53 s gammaloop-nextest-core> at <unknown source file>:<unknown line>
  284. 55.53 s gammaloop-nextest-core> 15: start_thread<unknown>
  285. 55.53 s gammaloop-nextest-core> at <unknown source file>:<unknown line>
  286. 55.53 s gammaloop-nextest-core> 16: __clone3<unknown>
  287. 55.53 s gammaloop-nextest-core> at <unknown source file>:<unknown line>
  288. 55.53 s gammaloop-nextest-core>
  289. 55.53 s gammaloop-nextest-core> Run with COLORBT_SHOW_HIDDEN=1 environment variable to disable frame filtering.
  290. 55.53 s gammaloop-nextest-core> Run with RUST_BACKTRACE=full to include source snippets.
  291. 55.53 s gammaloop-nextest-core>
  292. 55.53 s gammaloop-nextest-core> FAIL [ 3.380s] (451/456) gammalooprs::test_renormalization finite_part_ghost_2loop
  293. 55.53 s gammaloop-nextest-core> stdout ---
  294. 55.53 s gammaloop-nextest-core>
  295. 55.53 s gammaloop-nextest-core> running 1 test
  296. 55.53 s gammaloop-nextest-core> ━━━━━━━━━━━━━━━━━━━━━━━━━━━━━━━ Snapshot Summary ━━━━━━━━━━━━━━━━━━━━━━━━━━━━━━━
  297. 55.53 s gammaloop-nextest-core> Snapshot: finite_part_ghost_2loop-3
  298. 55.53 s gammaloop-nextest-core> Source: crates/gammalooprs/tests/test_renormalization.rs:464
  299. 55.53 s gammaloop-nextest-core> ────────────────────────────────────────────────────────────────────────────────
  300. 55.53 s gammaloop-nextest-core> Expression: align_to_rqft(&a, &model).to_bare_ordered_string()
  301. 55.53 s gammaloop-nextest-core> ────────────────────────────────────────────────────────────────────────────────
  302. 55.53 s gammaloop-nextest-core> -old snapshot
  303. 55.53 s gammaloop-nextest-core> +new results
  304. 55.53 s gammaloop-nextest-core> ────────────┬───────────────────────────────────────────────────────────────────
  305. 55.53 s gammaloop-nextest-core> 1 │-(-1𝑖/32*ε+1𝑖/16)*(cas(2,coad(8)))^2*dot(P(0,mink(4)),P(0,mink(4)))*gs^4*ε^(-2)
  306. 55.53 s gammaloop-nextest-core> 1 │+(-1𝑖/16+1𝑖/32*ε)*(cas(2,coad(8)))^2*dot(P(0,mink(4)),P(0,mink(4)))*gs^4*ε^(-2)
  307. 55.53 s gammaloop-nextest-core> ────────────┴───────────────────────────────────────────────────────────────────
  308. 55.53 s gammaloop-nextest-core> To update snapshots run `cargo insta review`
  309. 55.53 s gammaloop-nextest-core> Stopped on the first failure. Run `cargo insta test` to run all snapshots.
  310. 55.53 s gammaloop-nextest-core> test finite_part_ghost_2loop ... FAILED
  311. 55.53 s gammaloop-nextest-core>
  312. 55.53 s gammaloop-nextest-core> failures:
  313. 55.53 s gammaloop-nextest-core>
  314. 55.53 s gammaloop-nextest-core> failures:
  315. 55.53 s gammaloop-nextest-core> finite_part_ghost_2loop
  316. 55.53 s gammaloop-nextest-core>
  317. 55.53 s gammaloop-nextest-core> test result: FAILED. 0 passed; 1 failed; 0 ignored; 0 measured; 5 filtered out; finished in 3.37s
  318. 55.53 s gammaloop-nextest-core>
  319. 55.53 s gammaloop-nextest-core> stderr ---
  320. 55.53 s gammaloop-nextest-core> The application panicked (crashed).
  321. 55.53 s gammaloop-nextest-core> Message: snapshot assertion for 'finite_part_ghost_2loop-3' failed in line 464
  322. 55.53 s gammaloop-nextest-core> Location: /nix/store/30svmzr0z0zpcqjyynjn7w21wgx18y4b-vendor-cargo-deps/c19b7c6f923b580ac259164a89f2577984ad5ab09ee9d583b888f934adbbe8d0/insta-1.47.2/src/runtime.rs:719
  323. 55.53 s gammaloop-nextest-core>
  324. 55.53 s gammaloop-nextest-core> ━━━━━━━━━━━━━━━━━━━━━━━━━━━━━━━━━━ BACKTRACE ━━━━━━━━━━━━━━━━━━━━━━━━━━━━━━━━━━━
  325. 55.53 s gammaloop-nextest-core> 1: <color_eyre[51793ea62743adbd]::config::PanicHook>::panic_report<unknown>
  326. 55.53 s gammaloop-nextest-core> at <unknown source file>:<unknown line>
  327. 55.53 s gammaloop-nextest-core> 2: <color_eyre[51793ea62743adbd]::config::PanicHook>::into_panic_hook::{closure#0}<unknown>
  328. 55.53 s gammaloop-nextest-core> at <unknown source file>:<unknown line>
  329. 55.53 s gammaloop-nextest-core> 3: std[bcb96dfbba0ab899]::panicking::panic_with_hook<unknown>
  330. 55.53 s gammaloop-nextest-core> at <unknown source file>:<unknown line>
  331. 55.53 s gammaloop-nextest-core> 4: std[bcb96dfbba0ab899]::panicking::panic_handler::{closure#0}<unknown>
  332. 55.53 s gammaloop-nextest-core> at <unknown source file>:<unknown line>
  333. 55.53 s gammaloop-nextest-core> 5: std[bcb96dfbba0ab899]::sys::backtrace::__rust_end_short_backtrace::<std[bcb96dfbba0ab899]::panicking::panic_handler::{closure#0}, !><unknown>
  334. 55.53 s gammaloop-nextest-core> at <unknown source file>:<unknown line>
  335. 55.53 s gammaloop-nextest-core> 6: __rustc[6c289b9f9c454d21]::rust_begin_unwind<unknown>
  336. 55.53 s gammaloop-nextest-core> at <unknown source file>:<unknown line>
  337. 55.53 s gammaloop-nextest-core> 7: core[940e698046960fd5]::panicking::panic_fmt<unknown>
  338. 55.53 s gammaloop-nextest-core> at <unknown source file>:<unknown line>
  339. 55.53 s gammaloop-nextest-core> 8: insta[307a548ac79ef4d9]::runtime::assert_snapshot<unknown>
  340. 55.53 s gammaloop-nextest-core> at <unknown source file>:<unknown line>
  341. 55.53 s gammaloop-nextest-core> 9: test_renormalization[9b33d9b78f5a79c8]::finite_part_ghost_2loop<unknown>
  342. 55.53 s gammaloop-nextest-core> at <unknown source file>:<unknown line>
  343. 55.53 s gammaloop-nextest-core> 10: <test_renormalization[9b33d9b78f5a79c8]::finite_part_ghost_2loop::{closure#0} as core[940e698046960fd5]::ops::function::FnOnce<()>>::call_once<unknown>
  344. 55.53 s gammaloop-nextest-core> at <unknown source file>:<unknown line>
  345. 55.53 s gammaloop-nextest-core> 11: test[75d6903177b1d7e9]::__rust_begin_short_backtrace::<core[940e698046960fd5]::result::Result<(), alloc[2ea6bcb46fca0c42]::string::String>, fn() -> core[940e698046960fd5]::result::Result<(), alloc[2ea6bcb46fca0c42]::string::String>><unknown>
  346. 55.53 s gammaloop-nextest-core> at <unknown source file>:<unknown line>
  347. 55.53 s gammaloop-nextest-core> 12: test[75d6903177b1d7e9]::run_test::{closure#0}<unknown>
  348. 55.53 s gammaloop-nextest-core> at <unknown source file>:<unknown line>
  349. 55.53 s gammaloop-nextest-core> 13: std[bcb96dfbba0ab899]::sys::backtrace::__rust_begin_short_backtrace::<test[75d6903177b1d7e9]::run_test::{closure#1}, ()><unknown>
  350. 55.53 s gammaloop-nextest-core> at <unknown source file>:<unknown line>
  351. 55.53 s gammaloop-nextest-core> 14: <std[bcb96dfbba0ab899]::thread::lifecycle::spawn_unchecked<test[75d6903177b1d7e9]::run_test::{closure#1}, ()>::{closure#1} as core[940e698046960fd5]::ops::function::FnOnce<()>>::call_once::{shim:vtable#0}<unknown>
  352. 55.53 s gammaloop-nextest-core> at <unknown source file>:<unknown line>
  353. 55.53 s gammaloop-nextest-core> 15: <std[bcb96dfbba0ab899]::sys::thread::unix::Thread>::new::thread_start<unknown>
  354. 55.53 s gammaloop-nextest-core> at <unknown source file>:<unknown line>
  355. 55.53 s gammaloop-nextest-core> 16: start_thread<unknown>
  356. 55.53 s gammaloop-nextest-core> at <unknown source file>:<unknown line>
  357. 55.53 s gammaloop-nextest-core> 17: __clone3<unknown>
  358. 55.53 s gammaloop-nextest-core> at <unknown source file>:<unknown line>
  359. 55.53 s gammaloop-nextest-core>
  360. 55.53 s gammaloop-nextest-core> Run with COLORBT_SHOW_HIDDEN=1 environment variable to disable frame filtering.
  361. 55.53 s gammaloop-nextest-core> Run with RUST_BACKTRACE=full to include source snippets.
  362. 55.53 s gammaloop-nextest-core>
  363. 55.59 s gammaloop-nextest-core> error: test run failed
  364. 55.62 s gammaloop-nextest-core>
  365. 55.62 s gammaloop-nextest-core> ========== nextest test summary ==========
  366. 55.62 s gammaloop-nextest-core> report: target/nextest/ci_gammaloop/junit.xml
  367. 55.62 s gammaloop-nextest-core> tests: 456, failures: 2, errors: 0
  368. 55.62 s gammaloop-nextest-core>
  369. 55.62 s gammaloop-nextest-core> 1. gammalooprs::test_renormalization::finit_part_ghlo
  370. 55.62 s gammaloop-nextest-core> failure: test failure with exit code 101
  371. 55.62 s gammaloop-nextest-core> system-out
  372. 55.62 s gammaloop-nextest-core> running 1 test
  373. 55.62 s gammaloop-nextest-core> ren part: 1/2*GC_10^2*dot(P(0,mink(dim)),P(0,mink(dim)))*cas(2,coad(8))/ε
  374. 55.62 s gammaloop-nextest-core> ━━━━━━━━━━━━━━━━━━━━━━━━━━━━━━━ Snapshot Summary ━━━━━━━━━━━━━━━━━━━━━━━━━━━━━━━
  375. 55.62 s gammaloop-nextest-core> Snapshot: finit_part_ghlo
  376. 55.62 s gammaloop-nextest-core> Source: crates/gammalooprs/tests/test_renormalization.rs:557
  377. 55.62 s gammaloop-nextest-core> ────────────────────────────────────────────────────────────────────────────────
  378. 55.62 s gammaloop-nextest-core> Expression: align_to_rqft(&a, &model).to_bare_ordered_string()
  379. 55.62 s gammaloop-nextest-core> ────────────────────────────────────────────────────────────────────────────────
  380. 55.62 s gammaloop-nextest-core> -old snapshot
  381. 55.62 s gammaloop-nextest-core> +new results
  382. 55.62 s gammaloop-nextest-core> ────────────┬───────────────────────────────────────────────────────────────────
  383. 55.62 s gammaloop-nextest-core> 1 │--1/2*cas(2,coad(8))*dot(P(0,mink(4)),P(0,mink(4)))*gs^2*ε^(-1)
  384. 55.62 s gammaloop-nextest-core> 1 │+1/2*cas(2,coad(8))*dot(P(0,mink(4)),P(0,mink(4)))*gs^2*ε^(-1)
  385. 55.62 s gammaloop-nextest-core> ────────────┴───────────────────────────────────────────────────────────────────
  386. 55.62 s gammaloop-nextest-core> To update snapshots run `cargo insta review`
  387. 55.62 s gammaloop-nextest-core> Stopped on the first failure. Run `cargo insta test` to run all snapshots.
  388. 55.62 s gammaloop-nextest-core> test finit_part_ghlo ... FAILED
  389. 55.62 s gammaloop-nextest-core>
  390. 55.62 s gammaloop-nextest-core> failures:
  391. 55.62 s gammaloop-nextest-core>
  392. 55.62 s gammaloop-nextest-core> failures:
  393. 55.62 s gammaloop-nextest-core> finit_part_ghlo
  394. 55.62 s gammaloop-nextest-core>
  395. 55.62 s gammaloop-nextest-core> test result: FAILED. 0 passed; 1 failed; 0 ignored; 0 measured; 5 filtered out; finished in 0.36s
  396. 55.62 s gammaloop-nextest-core> system-err
  397. 55.62 s gammaloop-nextest-core> The application panicked (crashed).
  398. 55.62 s gammaloop-nextest-core> Message: snapshot assertion for 'finit_part_ghlo' failed in line 557
  399. 55.62 s gammaloop-nextest-core> Location: /nix/store/30svmzr0z0zpcqjyynjn7w21wgx18y4b-vendor-cargo-deps/c19b7c6f923b580ac259164a89f2577984ad5ab09ee9d583b888f934adbbe8d0/insta-1.47.2/src/runtime.rs:719
  400. 55.62 s gammaloop-nextest-core>
  401. 55.62 s gammaloop-nextest-core> ━━━━━━━━━━━━━━━━━━━━━━━━━━━━━━━━━━ BACKTRACE ━━━━━━━━━━━━━━━━━━━━━━━━━━━━━━━━━━━
  402. 55.62 s gammaloop-nextest-core> 1: <color_eyre[51793ea62743adbd]::config::PanicHook>::panic_report<unknown>
  403. 55.62 s gammaloop-nextest-core> at <unknown source file>:<unknown line>
  404. 55.62 s gammaloop-nextest-core> 2: <color_eyre[51793ea62743adbd]::config::PanicHook>::into_panic_hook::{closure#0}<unknown>
  405. 55.62 s gammaloop-nextest-core> at <unknown source file>:<unknown line>
  406. 55.62 s gammaloop-nextest-core> 3: std[bcb96dfbba0ab899]::panicking::panic_with_hook<unknown>
  407. 55.62 s gammaloop-nextest-core> at <unknown source file>:<unknown line>
  408. 55.62 s gammaloop-nextest-core> 4: std[bcb96dfbba0ab899]::panicking::panic_handler::{closure#0}<unknown>
  409. 55.62 s gammaloop-nextest-core> at <unknown source file>:<unknown line>
  410. 55.62 s gammaloop-nextest-core> 5: std[bcb96dfbba0ab899]::sys::backtrace::__rust_end_short_backtrace::<std[bcb96dfbba0ab899]::panicking::panic_handler::{closure#0}, !><unknown>
  411. 55.62 s gammaloop-nextest-core> at <unknown source file>:<unknown line>
  412. 55.62 s gammaloop-nextest-core> 6: __rustc[6c289b9f9c454d21]::rust_begin_unwind<unknown>
  413. 55.62 s gammaloop-nextest-core> at <unknown source file>:<unknown line>
  414. 55.62 s gammaloop-nextest-core> 7: core[940e698046960fd5]::panicking::panic_fmt<unknown>
  415. 55.62 s gammaloop-nextest-core> at <unknown source file>:<unknown line>
  416. 55.62 s gammaloop-nextest-core> 8: insta[307a548ac79ef4d9]::runtime::assert_snapshot<unknown>
  417. 55.62 s gammaloop-nextest-core> at <unknown source file>:<unknown line>
  418. 55.62 s gammaloop-nextest-core> 9: <test_renormalization[9b33d9b78f5a79c8]::finit_part_ghlo::{closure#0} as core[940e698046960fd5]::ops::function::FnOnce<()>>::call_once<unknown>
  419. 55.62 s gammaloop-nextest-core> at <unknown source file>:<unknown line>
  420. 55.62 s gammaloop-nextest-core> 10: test[75d6903177b1d7e9]::__rust_begin_short_backtrace::<core[940e698046960fd5]::result::Result<(), alloc[2ea6bcb46fca0c42]::string::String>, fn() -> core[940e698046960fd5]::result::Result<(), alloc[2ea6bcb46fca0c42]::string::String>><unknown>
  421. 55.62 s gammaloop-nextest-core> at <unknown source file>:<unknown line>
  422. 55.62 s gammaloop-nextest-core> 11: test[75d6903177b1d7e9]::run_test::{closure#0}<unknown>
  423. 55.62 s gammaloop-nextest-core> at <unknown source file>:<unknown line>
  424. 55.62 s gammaloop-nextest-core> 12: std[bcb96dfbba0ab899]::sys::backtrace::__rust_begin_short_backtrace::<test[75d6903177b1d7e9]::run_test::{closure#1}, ()><unknown>
  425. 55.62 s gammaloop-nextest-core> at <unknown source file>:<unknown line>
  426. 55.62 s gammaloop-nextest-core> 13: <std[bcb96dfbba0ab899]::thread::lifecycle::spawn_unchecked<test[75d6903177b1d7e9]::run_test::{closure#1}, ()>::{closure#1} as core[940e698046960fd5]::ops::function::FnOnce<()>>::call_once::{shim:vtable#0}<unknown>
  427. 55.62 s gammaloop-nextest-core> at <unknown source file>:<unknown line>
  428. 55.62 s gammaloop-nextest-core> 14: <std[bcb96dfbba0ab899]::sys::thread::unix::Thread>::new::thread_start<unknown>
  429. 55.62 s gammaloop-nextest-core> at <unknown source file>:<unknown line>
  430. 55.62 s gammaloop-nextest-core> 15: start_thread<unknown>
  431. 55.62 s gammaloop-nextest-core> at <unknown source file>:<unknown line>
  432. 55.62 s gammaloop-nextest-core> 16: __clone3<unknown>
  433. 55.62 s gammaloop-nextest-core> at <unknown source file>:<unknown line>
  434. 55.62 s gammaloop-nextest-core>
  435. 55.62 s gammaloop-nextest-core> Run with COLORBT_SHOW_HIDDEN=1 environment variable to disable frame filtering.
  436. 55.62 s gammaloop-nextest-core> Run with RUST_BACKTRACE=full to include source snippets.
  437. 55.62 s gammaloop-nextest-core>
  438. 55.62 s gammaloop-nextest-core> 2. gammalooprs::test_renormalization::finite_part_ghost_2loop
  439. 55.62 s gammaloop-nextest-core> failure: test failure with exit code 101
  440. 55.62 s gammaloop-nextest-core> system-out
  441. 55.62 s gammaloop-nextest-core> running 1 test
  442. 55.62 s gammaloop-nextest-core> ━━━━━━━━━━━━━━━━━━━━━━━━━━━━━━━ Snapshot Summary ━━━━━━━━━━━━━━━━━━━━━━━━━━━━━━━
  443. 55.62 s gammaloop-nextest-core> Snapshot: finite_part_ghost_2loop-3
  444. 55.62 s gammaloop-nextest-core> Source: crates/gammalooprs/tests/test_renormalization.rs:464
  445. 55.62 s gammaloop-nextest-core> ────────────────────────────────────────────────────────────────────────────────
  446. 55.62 s gammaloop-nextest-core> Expression: align_to_rqft(&a, &model).to_bare_ordered_string()
  447. 55.62 s gammaloop-nextest-core> ────────────────────────────────────────────────────────────────────────────────
  448. 55.62 s gammaloop-nextest-core> -old snapshot
  449. 55.62 s gammaloop-nextest-core> +new results
  450. 55.62 s gammaloop-nextest-core> ────────────┬───────────────────────────────────────────────────────────────────
  451. 55.62 s gammaloop-nextest-core> 1 │-(-1𝑖/32*ε+1𝑖/16)*(cas(2,coad(8)))^2*dot(P(0,mink(4)),P(0,mink(4)))*gs^4*ε^(-2)
  452. 55.62 s gammaloop-nextest-core> 1 │+(-1𝑖/16+1𝑖/32*ε)*(cas(2,coad(8)))^2*dot(P(0,mink(4)),P(0,mink(4)))*gs^4*ε^(-2)
  453. 55.62 s gammaloop-nextest-core> ────────────┴───────────────────────────────────────────────────────────────────
  454. 55.62 s gammaloop-nextest-core> To update snapshots run `cargo insta review`
  455. 55.62 s gammaloop-nextest-core> Stopped on the first failure. Run `cargo insta test` to run all snapshots.
  456. 55.62 s gammaloop-nextest-core> test finite_part_ghost_2loop ... FAILED
  457. 55.62 s gammaloop-nextest-core>
  458. 55.62 s gammaloop-nextest-core> failures:
  459. 55.62 s gammaloop-nextest-core>
  460. 55.62 s gammaloop-nextest-core> failures:
  461. 55.62 s gammaloop-nextest-core> finite_part_ghost_2loop
  462. 55.62 s gammaloop-nextest-core>
  463. 55.62 s gammaloop-nextest-core> test result: FAILED. 0 passed; 1 failed; 0 ignored; 0 measured; 5 filtered out; finished in 3.37s
  464. 55.62 s gammaloop-nextest-core> system-err
  465. 55.62 s gammaloop-nextest-core> The application panicked (crashed).
  466. 55.62 s gammaloop-nextest-core> Message: snapshot assertion for 'finite_part_ghost_2loop-3' failed in line 464
  467. 55.62 s gammaloop-nextest-core> Location: /nix/store/30svmzr0z0zpcqjyynjn7w21wgx18y4b-vendor-cargo-deps/c19b7c6f923b580ac259164a89f2577984ad5ab09ee9d583b888f934adbbe8d0/insta-1.47.2/src/runtime.rs:719
  468. 55.62 s gammaloop-nextest-core>
  469. 55.62 s gammaloop-nextest-core> ━━━━━━━━━━━━━━━━━━━━━━━━━━━━━━━━━━ BACKTRACE ━━━━━━━━━━━━━━━━━━━━━━━━━━━━━━━━━━━
  470. 55.62 s gammaloop-nextest-core> 1: <color_eyre[51793ea62743adbd]::config::PanicHook>::panic_report<unknown>
  471. 55.62 s gammaloop-nextest-core> at <unknown source file>:<unknown line>
  472. 55.62 s gammaloop-nextest-core> 2: <color_eyre[51793ea62743adbd]::config::PanicHook>::into_panic_hook::{closure#0}<unknown>
  473. 55.62 s gammaloop-nextest-core> at <unknown source file>:<unknown line>
  474. 55.62 s gammaloop-nextest-core> 3: std[bcb96dfbba0ab899]::panicking::panic_with_hook<unknown>
  475. 55.62 s gammaloop-nextest-core> at <unknown source file>:<unknown line>
  476. 55.62 s gammaloop-nextest-core> 4: std[bcb96dfbba0ab899]::panicking::panic_handler::{closure#0}<unknown>
  477. 55.62 s gammaloop-nextest-core> at <unknown source file>:<unknown line>
  478. 55.62 s gammaloop-nextest-core> 5: std[bcb96dfbba0ab899]::sys::backtrace::__rust_end_short_backtrace::<std[bcb96dfbba0ab899]::panicking::panic_handler::{closure#0}, !><unknown>
  479. 55.62 s gammaloop-nextest-core> at <unknown source file>:<unknown line>
  480. 55.62 s gammaloop-nextest-core> 6: __rustc[6c289b9f9c454d21]::rust_begin_unwind<unknown>
  481. 55.62 s gammaloop-nextest-core> at <unknown source file>:<unknown line>
  482. 55.62 s gammaloop-nextest-core> 7: core[940e698046960fd5]::panicking::panic_fmt<unknown>
  483. 55.62 s gammaloop-nextest-core> at <unknown source file>:<unknown line>
  484. 55.62 s gammaloop-nextest-core> 8: insta[307a548ac79ef4d9]::runtime::assert_snapshot<unknown>
  485. 55.62 s gammaloop-nextest-core> at <unknown source file>:<unknown line>
  486. 55.62 s gammaloop-nextest-core> 9: test_renormalization[9b33d9b78f5a79c8]::finite_part_ghost_2loop<unknown>
  487. 55.62 s gammaloop-nextest-core> at <unknown source file>:<unknown line>
  488. 55.62 s gammaloop-nextest-core> 10: <test_renormalization[9b33d9b78f5a79c8]::finite_part_ghost_2loop::{closure#0} as core[940e698046960fd5]::ops::function::FnOnce<()>>::call_once<unknown>
  489. 55.62 s gammaloop-nextest-core> at <unknown source file>:<unknown line>
  490. 55.62 s gammaloop-nextest-core> 11: test[75d6903177b1d7e9]::__rust_begin_short_backtrace::<core[940e698046960fd5]::result::Result<(), alloc[2ea6bcb46fca0c42]::string::String>, fn() -> core[940e698046960fd5]::result::Result<(), alloc[2ea6bcb46fca0c42]::string::String>><unknown>
  491. 55.62 s gammaloop-nextest-core> at <unknown source file>:<unknown line>
  492. 55.62 s gammaloop-nextest-core> 12: test[75d6903177b1d7e9]::run_test::{closure#0}<unknown>
  493. 55.62 s gammaloop-nextest-core> at <unknown source file>:<unknown line>
  494. 55.62 s gammaloop-nextest-core> 13: std[bcb96dfbba0ab899]::sys::backtrace::__rust_begin_short_backtrace::<test[75d6903177b1d7e9]::run_test::{closure#1}, ()><unknown>
  495. 55.62 s gammaloop-nextest-core> at <unknown source file>:<unknown line>
  496. 55.62 s gammaloop-nextest-core> 14: <std[bcb96dfbba0ab899]::thread::lifecycle::spawn_unchecked<test[75d6903177b1d7e9]::run_test::{closure#1}, ()>::{closure#1} as core[940e698046960fd5]::ops::function::FnOnce<()>>::call_once::{shim:vtable#0}<unknown>
  497. 55.62 s gammaloop-nextest-core> at <unknown source file>:<unknown line>
  498. 55.62 s gammaloop-nextest-core> 15: <std[bcb96dfbba0ab899]::sys::thread::unix::Thread>::new::thread_start<unknown>
  499. 55.62 s gammaloop-nextest-core> at <unknown source file>:<unknown line>
  500. 55.62 s gammaloop-nextest-core> 16: start_thread<unknown>
  501. 55.62 s gammaloop-nextest-core> at <unknown source file>:<unknown line>
  502. 55.62 s gammaloop-nextest-core> 17: __clone3<unknown>
  503. 55.62 s gammaloop-nextest-core> at <unknown source file>:<unknown line>
  504. 55.62 s gammaloop-nextest-core>
  505. 55.62 s gammaloop-nextest-core> Run with COLORBT_SHOW_HIDDEN=1 environment variable to disable frame filtering.
  506. 55.62 s gammaloop-nextest-core> Run with RUST_BACKTRACE=full to include source snippets.
  507. 55.62 s gammaloop-nextest-core> =========================================
  508. 55.66 s [0 built (1 failed), 0.0error: Cannot build '/nix/store/2iiczbl9qsl0qn3ffghgnz4hx8kjgvcy-gammaloop-nextest-core.drv'.
  509. 55.66 s Reason: builder failed with exit code 100.
  510. 55.66 s Output paths:
  511. 55.66 s /nix/store/clxqbysad7wrdwbk8x5hpaxpm6a25736-gammaloop-nextest-core
  512. 55.66 s Last 473 log lines:
  513. 55.66 s > Extracting 3 binaries (including 1 non-test binary), 1 build script output directory, and 2 linked paths to /build/nextest-archive-EVcebZ
  514. 55.66 s > Extracted 18 files to /build/nextest-archive-EVcebZ in 1.11s
  515. 55.66 s > ------------
  516. 55.66 s > Nextest run ID a0a5519c-3cae-46d6-bde4-ce8c95a58635 with nextest profile: ci_gammaloop
  517. 55.66 s > Starting 339 tests across 2 binaries
  518. 55.66 s > ------------
  519. 55.66 s > Summary [ 1.095s] 339 tests run: 339 passed, 0 skipped
  520. 55.66 s >
  521. 55.66 s > ========== nextest test summary ==========
  522. 55.66 s > report: target/nextest/ci_gammaloop/junit.xml
  523. 55.66 s > tests: 339, failures: 0, errors: 0
  524. 55.66 s > No failing testcases found.
  525. 55.66 s > =========================================
  526. 55.66 s > Extracting 1 binary and 1 linked path to /build/nextest-archive-2PuJq8
  527. 55.66 s > Extracted 7 files to /build/nextest-archive-2PuJq8 in 0.09s
  528. 55.66 s > ------------
  529. 55.66 s > Nextest run ID b68b6938-b744-4fd0-8e5b-bd1805bc2308 with nextest profile: ci_gammaloop
  530. 55.66 s > Starting 19 tests across 1 binary
  531. 55.66 s > ------------
  532. 55.66 s > Summary [ 0.060s] 19 tests run: 19 passed, 0 skipped
  533. 55.66 s >
  534. 55.66 s > ========== nextest test summary ==========
  535. 55.66 s > report: target/nextest/ci_gammaloop/junit.xml
  536. 55.66 s > tests: 19, failures: 0, errors: 0
  537. 55.66 s > No failing testcases found.
  538. 55.66 s > =========================================
  539. 55.66 s > Extracting 1 binary to /build/nextest-archive-nxpVvu
  540. 55.66 s > Extracted 4 files to /build/nextest-archive-nxpVvu in 0.06s
  541. 55.66 s > ------------
  542. 55.66 s > Nextest run ID dc4202d2-3f51-42ed-bd33-d635654bb692 with nextest profile: ci_gammaloop
  543. 55.66 s > Starting 0 tests across 1 binary
  544. 55.66 s > ------------
  545. 55.66 s > Summary [ 0.000s] 0 tests run: 0 passed, 0 skipped
  546. 55.66 s >
  547. 55.66 s > ========== nextest test summary ==========
  548. 55.66 s > report: target/nextest/ci_gammaloop/junit.xml
  549. 55.66 s > tests: 0, failures: 0, errors: 0
  550. 55.66 s > No failing testcases found.
  551. 55.66 s > =========================================
  552. 55.66 s > Extracting 4 binaries, 1 build script output directory, and 2 linked paths to /build/nextest-archive-XHL0J8
  553. 55.66 s > Extracted 18 files to /build/nextest-archive-XHL0J8 in 0.52s
  554. 55.66 s > ------------
  555. 55.66 s > Nextest run ID c0efbd82-d904-496e-af49-114c5b144efd with nextest profile: ci_gammaloop
  556. 55.66 s > Starting 456 tests across 4 binaries (61 tests skipped, including 60 tests via profile.ci_gammaloop.default-filter)
  557. 55.66 s > FAIL [ 0.388s] (442/456) gammalooprs::test_renormalization finit_part_ghlo
  558. 55.66 s > stdout ---
  559. 55.66 s >
  560. 55.66 s > running 1 test
  561. 55.66 s > ren part: 1/2*GC_10^2*dot(P(0,mink(dim)),P(0,mink(dim)))*cas(2,coad(8))/ε
  562. 55.66 s > ━━━━━━━━━━━━━━━━━━━━━━━━━━━━━━━ Snapshot Summary ━━━━━━━━━━━━━━━━━━━━━━━━━━━━━━━
  563. 55.66 s > Snapshot: finit_part_ghlo
  564. 55.66 s > Source: crates/gammalooprs/tests/test_renormalization.rs:557
  565. 55.66 s > ────────────────────────────────────────────────────────────────────────────────
  566. 55.66 s > Expression: align_to_rqft(&a, &model).to_bare_ordered_string()
  567. 55.66 s > ────────────────────────────────────────────────────────────────────────────────
  568. 55.66 s > -old snapshot
  569. 55.66 s > +new results
  570. 55.66 s > ────────────┬───────────────────────────────────────────────────────────────────
  571. 55.66 s > 1 │--1/2*cas(2,coad(8))*dot(P(0,mink(4)),P(0,mink(4)))*gs^2*ε^(-1)
  572. 55.66 s > 1 │+1/2*cas(2,coad(8))*dot(P(0,mink(4)),P(0,mink(4)))*gs^2*ε^(-1)
  573. 55.66 s > ────────────┴───────────────────────────────────────────────────────────────────
  574. 55.66 s > To update snapshots run `cargo insta review`
  575. 55.66 s > Stopped on the first failure. Run `cargo insta test` to run all snapshots.
  576. 55.66 s > test finit_part_ghlo ... FAILED
  577. 55.66 s >
  578. 55.66 s > failures:
  579. 55.66 s >
  580. 55.66 s > failures:
  581. 55.66 s > finit_part_ghlo
  582. 55.66 s >
  583. 55.66 s > test result: FAILED. 0 passed; 1 failed; 0 ignored; 0 measured; 5 filtered out; finished in 0.36s
  584. 55.66 s >
  585. 55.66 s > stderr ---
  586. 55.66 s > The application panicked (crashed).
  587. 55.66 s > Message: snapshot assertion for 'finit_part_ghlo' failed in line 557
  588. 55.66 s > Location: /nix/store/30svmzr0z0zpcqjyynjn7w21wgx18y4b-vendor-cargo-deps/c19b7c6f923b580ac259164a89f2577984ad5ab09ee9d583b888f934adbbe8d0/insta-1.47.2/src/runtime.rs:719
  589. 55.66 s >
  590. 55.66 s > ━━━━━━━━━━━━━━━━━━━━━━━━━━━━━━━━━━ BACKTRACE ━━━━━━━━━━━━━━━━━━━━━━━━━━━━━━━━━━━
  591. 55.66 s > 1: <color_eyre[51793ea62743adbd]::config::PanicHook>::panic_report<unknown>
  592. 55.66 s > at <unknown source file>:<unknown line>
  593. 55.66 s > 2: <color_eyre[51793ea62743adbd]::config::PanicHook>::into_panic_hook::{closure#0}<unknown>
  594. 55.66 s > at <unknown source file>:<unknown line>
  595. 55.66 s > 3: std[bcb96dfbba0ab899]::panicking::panic_with_hook<unknown>
  596. 55.66 s > at <unknown source file>:<unknown line>
  597. 55.66 s > 4: std[bcb96dfbba0ab899]::panicking::panic_handler::{closure#0}<unknown>
  598. 55.66 s > at <unknown source file>:<unknown line>
  599. 55.66 s > 5: std[bcb96dfbba0ab899]::sys::backtrace::__rust_end_short_backtrace::<std[bcb96dfbba0ab899]::panicking::panic_handler::{closure#0}, !><unknown>
  600. 55.66 s > at <unknown source file>:<unknown line>
  601. 55.66 s > 6: __rustc[6c289b9f9c454d21]::rust_begin_unwind<unknown>
  602. 55.66 s > at <unknown source file>:<unknown line>
  603. 55.66 s > 7: core[940e698046960fd5]::panicking::panic_fmt<unknown>
  604. 55.66 s > at <unknown source file>:<unknown line>
  605. 55.66 s > 8: insta[307a548ac79ef4d9]::runtime::assert_snapshot<unknown>
  606. 55.66 s > at <unknown source file>:<unknown line>
  607. 55.66 s > 9: <test_renormalization[9b33d9b78f5a79c8]::finit_part_ghlo::{closure#0} as core[940e698046960fd5]::ops::function::FnOnce<()>>::call_once<unknown>
  608. 55.66 s > at <unknown source file>:<unknown line>
  609. 55.66 s > 10: test[75d6903177b1d7e9]::__rust_begin_short_backtrace::<core[940e698046960fd5]::result::Result<(), alloc[2ea6bcb46fca0c42]::string::String>, fn() -> core[940e698046960fd5]::result::Result<(), alloc[2ea6bcb46fca0c42]::string::String>><unknown>
  610. 55.66 s > at <unknown source file>:<unknown line>
  611. 55.66 s > 11: test[75d6903177b1d7e9]::run_test::{closure#0}<unknown>
  612. 55.66 s > at <unknown source file>:<unknown line>
  613. 55.66 s > 12: std[bcb96dfbba0ab899]::sys::backtrace::__rust_begin_short_backtrace::<test[75d6903177b1d7e9]::run_test::{closure#1}, ()><unknown>
  614. 55.66 s > at <unknown source file>:<unknown line>
  615. 55.66 s > 13: <std[bcb96dfbba0ab899]::thread::lifecycle::spawn_unchecked<test[75d6903177b1d7e9]::run_test::{closure#1}, ()>::{closure#1} as core[940e698046960fd5]::ops::function::FnOnce<()>>::call_once::{shim:vtable#0}<unknown>
  616. 55.66 s > at <unknown source file>:<unknown line>
  617. 55.66 s > 14: <std[bcb96dfbba0ab899]::sys::thread::unix::Thread>::new::thread_start<unknown>
  618. 55.66 s > at <unknown source file>:<unknown line>
  619. 55.66 s > 15: start_thread<unknown>
  620. 55.66 s > at <unknown source file>:<unknown line>
  621. 55.66 s > 16: __clone3<unknown>
  622. 55.66 s > at <unknown source file>:<unknown line>
  623. 55.66 s >
  624. 55.66 s > Run with COLORBT_SHOW_HIDDEN=1 environment variable to disable frame filtering.
  625. 55.66 s > Run with RUST_BACKTRACE=full to include source snippets.
  626. 55.66 s >
  627. 55.66 s > FAIL [ 3.380s] (451/456) gammalooprs::test_renormalization finite_part_ghost_2loop
  628. 55.66 s > stdout ---
  629. 55.66 s >
  630. 55.66 s > running 1 test
  631. 55.66 s > ━━━━━━━━━━━━━━━━━━━━━━━━━━━━━━━ Snapshot Summary ━━━━━━━━━━━━━━━━━━━━━━━━━━━━━━━
  632. 55.66 s > Snapshot: finite_part_ghost_2loop-3
  633. 55.66 s > Source: crates/gammalooprs/tests/test_renormalization.rs:464
  634. 55.66 s > ────────────────────────────────────────────────────────────────────────────────
  635. 55.66 s > Expression: align_to_rqft(&a, &model).to_bare_ordered_string()
  636. 55.66 s > ────────────────────────────────────────────────────────────────────────────────
  637. 55.66 s > -old snapshot
  638. 55.66 s > +new results
  639. 55.66 s > ────────────┬───────────────────────────────────────────────────────────────────
  640. 55.66 s > 1 │-(-1𝑖/32*ε+1𝑖/16)*(cas(2,coad(8)))^2*dot(P(0,mink(4)),P(0,mink(4)))*gs^4*ε^(-2)
  641. 55.66 s > 1 │+(-1𝑖/16+1𝑖/32*ε)*(cas(2,coad(8)))^2*dot(P(0,mink(4)),P(0,mink(4)))*gs^4*ε^(-2)
  642. 55.66 s > ────────────┴───────────────────────────────────────────────────────────────────
  643. 55.66 s > To update snapshots run `cargo insta review`
  644. 55.66 s > Stopped on the first failure. Run `cargo insta test` to run all snapshots.
  645. 55.66 s > test finite_part_ghost_2loop ... FAILED
  646. 55.66 s >
  647. 55.66 s > failures:
  648. 55.66 s >
  649. 55.66 s > failures:
  650. 55.66 s > finite_part_ghost_2loop
  651. 55.66 s >
  652. 55.66 s > test result: FAILED. 0 passed; 1 failed; 0 ignored; 0 measured; 5 filtered out; finished in 3.37s
  653. 55.66 s >
  654. 55.66 s > stderr ---
  655. 55.66 s > The application panicked (crashed).
  656. 55.66 s > Message: snapshot assertion for 'finite_part_ghost_2loop-3' failed in line 464
  657. 55.66 s > Location: /nix/store/30svmzr0z0zpcqjyynjn7w21wgx18y4b-vendor-cargo-deps/c19b7c6f923b580ac259164a89f2577984ad5ab09ee9d583b888f934adbbe8d0/insta-1.47.2/src/runtime.rs:719
  658. 55.66 s >
  659. 55.66 s > ━━━━━━━━━━━━━━━━━━━━━━━━━━━━━━━━━━ BACKTRACE ━━━━━━━━━━━━━━━━━━━━━━━━━━━━━━━━━━━
  660. 55.66 s > 1: <color_eyre[51793ea62743adbd]::config::PanicHook>::panic_report<unknown>
  661. 55.66 s > at <unknown source file>:<unknown line>
  662. 55.66 s > 2: <color_eyre[51793ea62743adbd]::config::PanicHook>::into_panic_hook::{closure#0}<unknown>
  663. 55.66 s > at <unknown source file>:<unknown line>
  664. 55.66 s > 3: std[bcb96dfbba0ab899]::panicking::panic_with_hook<unknown>
  665. 55.66 s > at <unknown source file>:<unknown line>
  666. 55.66 s > 4: std[bcb96dfbba0ab899]::panicking::panic_handler::{closure#0}<unknown>
  667. 55.66 s > at <unknown source file>:<unknown line>
  668. 55.66 s > 5: std[bcb96dfbba0ab899]::sys::backtrace::__rust_end_short_backtrace::<std[bcb96dfbba0ab899]::panicking::panic_handler::{closure#0}, !><unknown>
  669. 55.66 s > at <unknown source file>:<unknown line>
  670. 55.66 s > 6: __rustc[6c289b9f9c454d21]::rust_begin_unwind<unknown>
  671. 55.66 s > at <unknown source file>:<unknown line>
  672. 55.66 s > 7: core[940e698046960fd5]::panicking::panic_fmt<unknown>
  673. 55.66 s > at <unknown source file>:<unknown line>
  674. 55.66 s > 8: insta[307a548ac79ef4d9]::runtime::assert_snapshot<unknown>
  675. 55.66 s > at <unknown source file>:<unknown line>
  676. 55.66 s > 9: test_renormalization[9b33d9b78f5a79c8]::finite_part_ghost_2loop<unknown>
  677. 55.66 s > at <unknown source file>:<unknown line>
  678. 55.66 s > 10: <test_renormalization[9b33d9b78f5a79c8]::finite_part_ghost_2loop::{closure#0} as core[940e698046960fd5]::ops::function::FnOnce<()>>::call_once<unknown>
  679. 55.66 s > at <unknown source file>:<unknown line>
  680. 55.66 s > 11: test[75d6903177b1d7e9]::__rust_begin_short_backtrace::<core[940e698046960fd5]::result::Result<(), alloc[2ea6bcb46fca0c42]::string::String>, fn() -> core[940e698046960fd5]::result::Result<(), alloc[2ea6bcb46fca0c42]::string::String>><unknown>
  681. 55.66 s > at <unknown source file>:<unknown line>
  682. 55.66 s > 12: test[75d6903177b1d7e9]::run_test::{closure#0}<unknown>
  683. 55.66 s > at <unknown source file>:<unknown line>
  684. 55.66 s > 13: std[bcb96dfbba0ab899]::sys::backtrace::__rust_begin_short_backtrace::<test[75d6903177b1d7e9]::run_test::{closure#1}, ()><unknown>
  685. 55.66 s > at <unknown source file>:<unknown line>
  686. 55.66 s > 14: <std[bcb96dfbba0ab899]::thread::lifecycle::spawn_unchecked<test[75d6903177b1d7e9]::run_test::{closure#1}, ()>::{closure#1} as core[940e698046960fd5]::ops::function::FnOnce<()>>::call_once::{shim:vtable#0}<unknown>
  687. 55.66 s > at <unknown source file>:<unknown line>
  688. 55.66 s > 15: <std[bcb96dfbba0ab899]::sys::thread::unix::Thread>::new::thread_start<unknown>
  689. 55.66 s > at <unknown source file>:<unknown line>
  690. 55.66 s > 16: start_thread<unknown>
  691. 55.66 s > at <unknown source file>:<unknown line>
  692. 55.66 s > 17: __clone3<unknown>
  693. 55.66 s > at <unknown source file>:<unknown line>
  694. 55.66 s >
  695. 55.66 s > Run with COLORBT_SHOW_HIDDEN=1 environment variable to disable frame filtering.
  696. 55.66 s > Run with RUST_BACKTRACE=full to include source snippets.
  697. 55.66 s >
  698. 55.66 s > ------------
  699. 55.66 s > Summary [ 12.363s] 456 tests run: 454 passed, 2 failed, 61 skipped
  700. 55.66 s > FAIL [ 0.388s] (442/456) gammalooprs::test_renormalization finit_part_ghlo
  701. 55.66 s > stdout ---
  702. 55.66 s >
  703. 55.66 s > running 1 test
  704. 55.66 s > ren part: 1/2*GC_10^2*dot(P(0,mink(dim)),P(0,mink(dim)))*cas(2,coad(8))/ε
  705. 55.66 s > ━━━━━━━━━━━━━━━━━━━━━━━━━━━━━━━ Snapshot Summary ━━━━━━━━━━━━━━━━━━━━━━━━━━━━━━━
  706. 55.66 s > Snapshot: finit_part_ghlo
  707. 55.66 s > Source: crates/gammalooprs/tests/test_renormalization.rs:557
  708. 55.66 s > ────────────────────────────────────────────────────────────────────────────────
  709. 55.66 s > Expression: align_to_rqft(&a, &model).to_bare_ordered_string()
  710. 55.66 s > ────────────────────────────────────────────────────────────────────────────────
  711. 55.66 s > -old snapshot
  712. 55.66 s > +new results
  713. 55.66 s > ────────────┬───────────────────────────────────────────────────────────────────
  714. 55.66 s > 1 │--1/2*cas(2,coad(8))*dot(P(0,mink(4)),P(0,mink(4)))*gs^2*ε^(-1)
  715. 55.66 s > 1 │+1/2*cas(2,coad(8))*dot(P(0,mink(4)),P(0,mink(4)))*gs^2*ε^(-1)
  716. 55.66 s > ────────────┴───────────────────────────────────────────────────────────────────
  717. 55.66 s > To update snapshots run `cargo insta review`
  718. 55.66 s > Stopped on the first failure. Run `cargo insta test` to run all snapshots.
  719. 55.66 s > test finit_part_ghlo ... FAILED
  720. 55.66 s >
  721. 55.66 s > failures:
  722. 55.66 s >
  723. 55.66 s > failures:
  724. 55.66 s > finit_part_ghlo
  725. 55.66 s >
  726. 55.66 s > test result: FAILED. 0 passed; 1 failed; 0 ignored; 0 measured; 5 filtered out; finished in 0.36s
  727. 55.66 s >
  728. 55.66 s > stderr ---
  729. 55.66 s > The application panicked (crashed).
  730. 55.66 s > Message: snapshot assertion for 'finit_part_ghlo' failed in line 557
  731. 55.66 s > Location: /nix/store/30svmzr0z0zpcqjyynjn7w21wgx18y4b-vendor-cargo-deps/c19b7c6f923b580ac259164a89f2577984ad5ab09ee9d583b888f934adbbe8d0/insta-1.47.2/src/runtime.rs:719
  732. 55.66 s >
  733. 55.66 s > ━━━━━━━━━━━━━━━━━━━━━━━━━━━━━━━━━━ BACKTRACE ━━━━━━━━━━━━━━━━━━━━━━━━━━━━━━━━━━━
  734. 55.66 s > 1: <color_eyre[51793ea62743adbd]::config::PanicHook>::panic_report<unknown>
  735. 55.66 s > at <unknown source file>:<unknown line>
  736. 55.66 s > 2: <color_eyre[51793ea62743adbd]::config::PanicHook>::into_panic_hook::{closure#0}<unknown>
  737. 55.66 s > at <unknown source file>:<unknown line>
  738. 55.66 s > 3: std[bcb96dfbba0ab899]::panicking::panic_with_hook<unknown>
  739. 55.66 s > at <unknown source file>:<unknown line>
  740. 55.66 s > 4: std[bcb96dfbba0ab899]::panicking::panic_handler::{closure#0}<unknown>
  741. 55.66 s > at <unknown source file>:<unknown line>
  742. 55.66 s > 5: std[bcb96dfbba0ab899]::sys::backtrace::__rust_end_short_backtrace::<std[bcb96dfbba0ab899]::panicking::panic_handler::{closure#0}, !><unknown>
  743. 55.66 s > at <unknown source file>:<unknown line>
  744. 55.66 s > 6: __rustc[6c289b9f9c454d21]::rust_begin_unwind<unknown>
  745. 55.66 s > at <unknown source file>:<unknown line>
  746. 55.66 s > 7: core[940e698046960fd5]::panicking::panic_fmt<unknown>
  747. 55.66 s > at <unknown source file>:<unknown line>
  748. 55.66 s > 8: insta[307a548ac79ef4d9]::runtime::assert_snapshot<unknown>
  749. 55.66 s > at <unknown source file>:<unknown line>
  750. 55.66 s > 9: <test_renormalization[9b33d9b78f5a79c8]::finit_part_ghlo::{closure#0} as core[940e698046960fd5]::ops::function::FnOnce<()>>::call_once<unknown>
  751. 55.66 s > at <unknown source file>:<unknown line>
  752. 55.66 s > 10: test[75d6903177b1d7e9]::__rust_begin_short_backtrace::<core[940e698046960fd5]::result::Result<(), alloc[2ea6bcb46fca0c42]::string::String>, fn() -> core[940e698046960fd5]::result::Result<(), alloc[2ea6bcb46fca0c42]::string::String>><unknown>
  753. 55.66 s > at <unknown source file>:<unknown line>
  754. 55.66 s > 11: test[75d6903177b1d7e9]::run_test::{closure#0}<unknown>
  755. 55.66 s > at <unknown source file>:<unknown line>
  756. 55.66 s > 12: std[bcb96dfbba0ab899]::sys::backtrace::__rust_begin_short_backtrace::<test[75d6903177b1d7e9]::run_test::{closure#1}, ()><unknown>
  757. 55.66 s > at <unknown source file>:<unknown line>
  758. 55.66 s > 13: <std[bcb96dfbba0ab899]::thread::lifecycle::spawn_unchecked<test[75d6903177b1d7e9]::run_test::{closure#1}, ()>::{closure#1} as core[940e698046960fd5]::ops::function::FnOnce<()>>::call_once::{shim:vtable#0}<unknown>
  759. 55.66 s > at <unknown source file>:<unknown line>
  760. 55.66 s > 14: <std[bcb96dfbba0ab899]::sys::thread::unix::Thread>::new::thread_start<unknown>
  761. 55.66 s > at <unknown source file>:<unknown line>
  762. 55.66 s > 15: start_thread<unknown>
  763. 55.66 s > at <unknown source file>:<unknown line>
  764. 55.66 s > 16: __clone3<unknown>
  765. 55.66 s > at <unknown source file>:<unknown line>
  766. 55.66 s >
  767. 55.66 s > Run with COLORBT_SHOW_HIDDEN=1 environment variable to disable frame filtering.
  768. 55.66 s > Run with RUST_BACKTRACE=full to include source snippets.
  769. 55.66 s >
  770. 55.66 s > FAIL [ 3.380s] (451/456) gammalooprs::test_renormalization finite_part_ghost_2loop
  771. 55.66 s > stdout ---
  772. 55.66 s >
  773. 55.66 s > running 1 test
  774. 55.66 s > ━━━━━━━━━━━━━━━━━━━━━━━━━━━━━━━ Snapshot Summary ━━━━━━━━━━━━━━━━━━━━━━━━━━━━━━━
  775. 55.66 s > Snapshot: finite_part_ghost_2loop-3
  776. 55.66 s > Source: crates/gammalooprs/tests/test_renormalization.rs:464
  777. 55.66 s > ────────────────────────────────────────────────────────────────────────────────
  778. 55.66 s > Expression: align_to_rqft(&a, &model).to_bare_ordered_string()
  779. 55.66 s > ────────────────────────────────────────────────────────────────────────────────
  780. 55.66 s > -old snapshot
  781. 55.66 s > +new results
  782. 55.66 s > ────────────┬───────────────────────────────────────────────────────────────────
  783. 55.66 s > 1 │-(-1𝑖/32*ε+1𝑖/16)*(cas(2,coad(8)))^2*dot(P(0,mink(4)),P(0,mink(4)))*gs^4*ε^(-2)
  784. 55.66 s > 1 │+(-1𝑖/16+1𝑖/32*ε)*(cas(2,coad(8)))^2*dot(P(0,mink(4)),P(0,mink(4)))*gs^4*ε^(-2)
  785. 55.66 s > ────────────┴───────────────────────────────────────────────────────────────────
  786. 55.66 s > To update snapshots run `cargo insta review`
  787. 55.66 s > Stopped on the first failure. Run `cargo insta test` to run all snapshots.
  788. 55.66 s > test finite_part_ghost_2loop ... FAILED
  789. 55.66 s >
  790. 55.66 s > failures:
  791. 55.66 s >
  792. 55.66 s > failures:
  793. 55.66 s > finite_part_ghost_2loop
  794. 55.66 s >
  795. 55.66 s > test result: FAILED. 0 passed; 1 failed; 0 ignored; 0 measured; 5 filtered out; finished in 3.37s
  796. 55.66 s >
  797. 55.66 s > stderr ---
  798. 55.66 s > The application panicked (crashed).
  799. 55.66 s > Message: snapshot assertion for 'finite_part_ghost_2loop-3' failed in line 464
  800. 55.66 s > Location: /nix/store/30svmzr0z0zpcqjyynjn7w21wgx18y4b-vendor-cargo-deps/c19b7c6f923b580ac259164a89f2577984ad5ab09ee9d583b888f934adbbe8d0/insta-1.47.2/src/runtime.rs:719
  801. 55.66 s >
  802. 55.66 s > ━━━━━━━━━━━━━━━━━━━━━━━━━━━━━━━━━━ BACKTRACE ━━━━━━━━━━━━━━━━━━━━━━━━━━━━━━━━━━━
  803. 55.66 s > 1: <color_eyre[51793ea62743adbd]::config::PanicHook>::panic_report<unknown>
  804. 55.66 s > at <unknown source file>:<unknown line>
  805. 55.66 s > 2: <color_eyre[51793ea62743adbd]::config::PanicHook>::into_panic_hook::{closure#0}<unknown>
  806. 55.66 s > at <unknown source file>:<unknown line>
  807. 55.66 s > 3: std[bcb96dfbba0ab899]::panicking::panic_with_hook<unknown>
  808. 55.66 s > at <unknown source file>:<unknown line>
  809. 55.66 s > 4: std[bcb96dfbba0ab899]::panicking::panic_handler::{closure#0}<unknown>
  810. 55.66 s > at <unknown source file>:<unknown line>
  811. 55.66 s > 5: std[bcb96dfbba0ab899]::sys::backtrace::__rust_end_short_backtrace::<std[bcb96dfbba0ab899]::panicking::panic_handler::{closure#0}, !><unknown>
  812. 55.66 s > at <unknown source file>:<unknown line>
  813. 55.66 s > 6: __rustc[6c289b9f9c454d21]::rust_begin_unwind<unknown>
  814. 55.66 s > at <unknown source file>:<unknown line>
  815. 55.66 s > 7: core[940e698046960fd5]::panicking::panic_fmt<unknown>
  816. 55.66 s > at <unknown source file>:<unknown line>
  817. 55.66 s > 8: insta[307a548ac79ef4d9]::runtime::assert_snapshot<unknown>
  818. 55.66 s > at <unknown source file>:<unknown line>
  819. 55.66 s > 9: test_renormalization[9b33d9b78f5a79c8]::finite_part_ghost_2loop<unknown>
  820. 55.66 s > at <unknown source file>:<unknown line>
  821. 55.66 s > 10: <test_renormalization[9b33d9b78f5a79c8]::finite_part_ghost_2loop::{closure#0} as core[940e698046960fd5]::ops::function::FnOnce<()>>::call_once<unknown>
  822. 55.66 s > at <unknown source file>:<unknown line>
  823. 55.66 s > 11: test[75d6903177b1d7e9]::__rust_begin_short_backtrace::<core[940e698046960fd5]::result::Result<(), alloc[2ea6bcb46fca0c42]::string::String>, fn() -> core[940e698046960fd5]::result::Result<(), alloc[2ea6bcb46fca0c42]::string::String>><unknown>
  824. 55.66 s > at <unknown source file>:<unknown line>
  825. 55.66 s > 12: test[75d6903177b1d7e9]::run_test::{closure#0}<unknown>
  826. 55.66 s > at <unknown source file>:<unknown line>
  827. 55.66 s > 13: std[bcb96dfbba0ab899]::sys::backtrace::__rust_begin_short_backtrace::<test[75d6903177b1d7e9]::run_test::{closure#1}, ()><unknown>
  828. 55.66 s > at <unknown source file>:<unknown line>
  829. 55.66 s > 14: <std[bcb96dfbba0ab899]::thread::lifecycle::spawn_unchecked<test[75d6903177b1d7e9]::run_test::{closure#1}, ()>::{closure#1} as core[940e698046960fd5]::ops::function::FnOnce<()>>::call_once::{shim:vtable#0}<unknown>
  830. 55.66 s > at <unknown source file>:<unknown line>
  831. 55.66 s > 15: <std[bcb96dfbba0ab899]::sys::thread::unix::Thread>::new::thread_start<unknown>
  832. 55.66 s > at <unknown source file>:<unknown line>
  833. 55.66 s > 16: start_thread<unknown>
  834. 55.66 s > at <unknown source file>:<unknown line>
  835. 55.66 s > 17: __clone3<unknown>
  836. 55.66 s > at <unknown source file>:<unknown line>
  837. 55.66 s >
  838. 55.66 s > Run with COLORBT_SHOW_HIDDEN=1 environment variable to disable frame filtering.
  839. 55.66 s > Run with RUST_BACKTRACE=full to include source snippets.
  840. 55.66 s >
  841. 55.66 s > error: test run failed
  842. 55.66 s >
  843. 55.66 s > ========== nextest test summary ==========
  844. 55.66 s > report: target/nextest/ci_gammaloop/junit.xml
  845. 55.66 s > tests: 456, failures: 2, errors: 0
  846. 55.66 s >
  847. 55.66 s > 1. gammalooprs::test_renormalization::finit_part_ghlo
  848. 55.66 s > failure: test failure with exit code 101
  849. 55.66 s > system-out
  850. 55.66 s > running 1 test
  851. 55.66 s > ren part: 1/2*GC_10^2*dot(P(0,mink(dim)),P(0,mink(dim)))*cas(2,coad(8))/ε
  852. 55.66 s > ━━━━━━━━━━━━━━━━━━━━━━━━━━━━━━━ Snapshot Summary ━━━━━━━━━━━━━━━━━━━━━━━━━━━━━━━
  853. 55.66 s > Snapshot: finit_part_ghlo
  854. 55.66 s > Source: crates/gammalooprs/tests/test_renormalization.rs:557
  855. 55.66 s > ────────────────────────────────────────────────────────────────────────────────
  856. 55.66 s > Expression: align_to_rqft(&a, &model).to_bare_ordered_string()
  857. 55.66 s > ────────────────────────────────────────────────────────────────────────────────
  858. 55.66 s > -old snapshot
  859. 55.66 s > +new results
  860. 55.66 s > ────────────┬───────────────────────────────────────────────────────────────────
  861. 55.66 s > 1 │--1/2*cas(2,coad(8))*dot(P(0,mink(4)),P(0,mink(4)))*gs^2*ε^(-1)
  862. 55.66 s > 1 │+1/2*cas(2,coad(8))*dot(P(0,mink(4)),P(0,mink(4)))*gs^2*ε^(-1)
  863. 55.66 s > ────────────┴───────────────────────────────────────────────────────────────────
  864. 55.66 s > To update snapshots run `cargo insta review`
  865. 55.66 s > Stopped on the first failure. Run `cargo insta test` to run all snapshots.
  866. 55.66 s > test finit_part_ghlo ... FAILED
  867. 55.66 s >
  868. 55.66 s > failures:
  869. 55.66 s >
  870. 55.66 s > failures:
  871. 55.66 s > finit_part_ghlo
  872. 55.66 s >
  873. 55.66 s > test result: FAILED. 0 passed; 1 failed; 0 ignored; 0 measured; 5 filtered out; finished in 0.36s
  874. 55.66 s > system-err
  875. 55.66 s > The application panicked (crashed).
  876. 55.66 s > Message: snapshot assertion for 'finit_part_ghlo' failed in line 557
  877. 55.66 s > Location: /nix/store/30svmzr0z0zpcqjyynjn7w21wgx18y4b-vendor-cargo-deps/c19b7c6f923b580ac259164a89f2577984ad5ab09ee9d583b888f934adbbe8d0/insta-1.47.2/src/runtime.rs:719
  878. 55.66 s >
  879. 55.66 s > ━━━━━━━━━━━━━━━━━━━━━━━━━━━━━━━━━━ BACKTRACE ━━━━━━━━━━━━━━━━━━━━━━━━━━━━━━━━━━━
  880. 55.66 s > 1: <color_eyre[51793ea62743adbd]::config::PanicHook>::panic_report<unknown>
  881. 55.66 s > at <unknown source file>:<unknown line>
  882. 55.66 s > 2: <color_eyre[51793ea62743adbd]::config::PanicHook>::into_panic_hook::{closure#0}<unknown>
  883. 55.66 s > at <unknown source file>:<unknown line>
  884. 55.66 s > 3: std[bcb96dfbba0ab899]::panicking::panic_with_hook<unknown>
  885. 55.66 s > at <unknown source file>:<unknown line>
  886. 55.66 s > 4: std[bcb96dfbba0ab899]::panicking::panic_handler::{closure#0}<unknown>
  887. 55.66 s > at <unknown source file>:<unknown line>
  888. 55.66 s > 5: std[bcb96dfbba0ab899]::sys::backtrace::__rust_end_short_backtrace::<std[bcb96dfbba0ab899]::panicking::panic_handler::{closure#0}, !><unknown>
  889. 55.66 s > at <unknown source file>:<unknown line>
  890. 55.66 s > 6: __rustc[6c289b9f9c454d21]::rust_begin_unwind<unknown>
  891. 55.66 s > at <unknown source file>:<unknown line>
  892. 55.66 s > 7: core[940e698046960fd5]::panicking::panic_fmt<unknown>
  893. 55.66 s > at <unknown source file>:<unknown line>
  894. 55.66 s > 8: insta[307a548ac79ef4d9]::runtime::assert_snapshot<unknown>
  895. 55.66 s > at <unknown source file>:<unknown line>
  896. 55.66 s > 9: <test_renormalization[9b33d9b78f5a79c8]::finit_part_ghlo::{closure#0} as core[940e698046960fd5]::ops::function::FnOnce<()>>::call_once<unknown>
  897. 55.66 s > at <unknown source file>:<unknown line>
  898. 55.66 s > 10: test[75d6903177b1d7e9]::__rust_begin_short_backtrace::<core[940e698046960fd5]::result::Result<(), alloc[2ea6bcb46fca0c42]::string::String>, fn() -> core[940e698046960fd5]::result::Result<(), alloc[2ea6bcb46fca0c42]::string::String>><unknown>
  899. 55.66 s > at <unknown source file>:<unknown line>
  900. 55.66 s > 11: test[75d6903177b1d7e9]::run_test::{closure#0}<unknown>
  901. 55.66 s > at <unknown source file>:<unknown line>
  902. 55.66 s > 12: std[bcb96dfbba0ab899]::sys::backtrace::__rust_begin_short_backtrace::<test[75d6903177b1d7e9]::run_test::{closure#1}, ()><unknown>
  903. 55.66 s > at <unknown source file>:<unknown line>
  904. 55.66 s > 13: <std[bcb96dfbba0ab899]::thread::lifecycle::spawn_unchecked<test[75d6903177b1d7e9]::run_test::{closure#1}, ()>::{closure#1} as core[940e698046960fd5]::ops::function::FnOnce<()>>::call_once::{shim:vtable#0}<unknown>
  905. 55.66 s > at <unknown source file>:<unknown line>
  906. 55.66 s > 14: <std[bcb96dfbba0ab899]::sys::thread::unix::Thread>::new::thread_start<unknown>
  907. 55.66 s > at <unknown source file>:<unknown line>
  908. 55.66 s > 15: start_thread<unknown>
  909. 55.66 s > at <unknown source file>:<unknown line>
  910. 55.66 s > 16: __clone3<unknown>
  911. 55.66 s > at <unknown source file>:<unknown line>
  912. 55.66 s >
  913. 55.66 s > Run with COLORBT_SHOW_HIDDEN=1 environment variable to disable frame filtering.
  914. 55.66 s > Run with RUST_BACKTRACE=full to include source snippets.
  915. 55.66 s >
  916. 55.66 s > 2. gammalooprs::test_renormalization::finite_part_ghost_2loop
  917. 55.66 s > failure: test failure with exit code 101
  918. 55.66 s > system-out
  919. 55.66 s > running 1 test
  920. 55.66 s > ━━━━━━━━━━━━━━━━━━━━━━━━━━━━━━━ Snapshot Summary ━━━━━━━━━━━━━━━━━━━━━━━━━━━━━━━
  921. 55.66 s > Snapshot: finite_part_ghost_2loop-3
  922. 55.66 s > Source: crates/gammalooprs/tests/test_renormalization.rs:464
  923. 55.66 s > ────────────────────────────────────────────────────────────────────────────────
  924. 55.66 s > Expression: align_to_rqft(&a, &model).to_bare_ordered_string()
  925. 55.66 s > ────────────────────────────────────────────────────────────────────────────────
  926. 55.66 s > -old snapshot
  927. 55.66 s > +new results
  928. 55.66 s > ────────────┬───────────────────────────────────────────────────────────────────
  929. 55.66 s > 1 │-(-1𝑖/32*ε+1𝑖/16)*(cas(2,coad(8)))^2*dot(P(0,mink(4)),P(0,mink(4)))*gs^4*ε^(-2)
  930. 55.66 s > 1 │+(-1𝑖/16+1𝑖/32*ε)*(cas(2,coad(8)))^2*dot(P(0,mink(4)),P(0,mink(4)))*gs^4*ε^(-2)
  931. 55.66 s > ────────────┴───────────────────────────────────────────────────────────────────
  932. 55.66 s > To update snapshots run `cargo insta review`
  933. 55.66 s > Stopped on the first failure. Run `cargo insta test` to run all snapshots.
  934. 55.66 s > test finite_part_ghost_2loop ... FAILED
  935. 55.66 s >
  936. 55.66 s > failures:
  937. 55.66 s >
  938. 55.66 s > failures:
  939. 55.66 s > finite_part_ghost_2loop
  940. 55.66 s >
  941. 55.66 s > test result: FAILED. 0 passed; 1 failed; 0 ignored; 0 measured; 5 filtered out; finished in 3.37s
  942. 55.66 s > system-err
  943. 55.66 s > The application panicked (crashed).
  944. 55.66 s > Message: snapshot assertion for 'finite_part_ghost_2loop-3' failed in line 464
  945. 55.66 s > Location: /nix/store/30svmzr0z0zpcqjyynjn7w21wgx18y4b-vendor-cargo-deps/c19b7c6f923b580ac259164a89f2577984ad5ab09ee9d583b888f934adbbe8d0/insta-1.47.2/src/runtime.rs:719
  946. 55.66 s >
  947. 55.66 s > ━━━━━━━━━━━━━━━━━━━━━━━━━━━━━━━━━━ BACKTRACE ━━━━━━━━━━━━━━━━━━━━━━━━━━━━━━━━━━━
  948. 55.66 s > 1: <color_eyre[51793ea62743adbd]::config::PanicHook>::panic_report<unknown>
  949. 55.66 s > at <unknown source file>:<unknown line>
  950. 55.66 s > 2: <color_eyre[51793ea62743adbd]::config::PanicHook>::into_panic_hook::{closure#0}<unknown>
  951. 55.66 s > at <unknown source file>:<unknown line>
  952. 55.66 s > 3: std[bcb96dfbba0ab899]::panicking::panic_with_hook<unknown>
  953. 55.66 s > at <unknown source file>:<unknown line>
  954. 55.66 s > 4: std[bcb96dfbba0ab899]::panicking::panic_handler::{closure#0}<unknown>
  955. 55.66 s > at <unknown source file>:<unknown line>
  956. 55.66 s > 5: std[bcb96dfbba0ab899]::sys::backtrace::__rust_end_short_backtrace::<std[bcb96dfbba0ab899]::panicking::panic_handler::{closure#0}, !><unknown>
  957. 55.66 s > at <unknown source file>:<unknown line>
  958. 55.66 s > 6: __rustc[6c289b9f9c454d21]::rust_begin_unwind<unknown>
  959. 55.66 s > at <unknown source file>:<unknown line>
  960. 55.66 s > 7: core[940e698046960fd5]::panicking::panic_fmt<unknown>
  961. 55.66 s > at <unknown source file>:<unknown line>
  962. 55.66 s > 8: insta[307a548ac79ef4d9]::runtime::assert_snapshot<unknown>
  963. 55.66 s > at <unknown source file>:<unknown line>
  964. 55.66 s > 9: test_renormalization[9b33d9b78f5a79c8]::finite_part_ghost_2loop<unknown>
  965. 55.66 s > at <unknown source file>:<unknown line>
  966. 55.66 s > 10: <test_renormalization[9b33d9b78f5a79c8]::finite_part_ghost_2loop::{closure#0} as core[940e698046960fd5]::ops::function::FnOnce<()>>::call_once<unknown>
  967. 55.66 s > at <unknown source file>:<unknown line>
  968. 55.66 s > 11: test[75d6903177b1d7e9]::__rust_begin_short_backtrace::<core[940e698046960fd5]::result::Result<(), alloc[2ea6bcb46fca0c42]::string::String>, fn() -> core[940e698046960fd5]::result::Result<(), alloc[2ea6bcb46fca0c42]::string::String>><unknown>
  969. 55.66 s > at <unknown source file>:<unknown line>
  970. 55.66 s > 12: test[75d6903177b1d7e9]::run_test::{closure#0}<unknown>
  971. 55.66 s > at <unknown source file>:<unknown line>
  972. 55.66 s > 13: std[bcb96dfbba0ab899]::sys::backtrace::__rust_begin_short_backtrace::<test[75d6903177b1d7e9]::run_test::{closure#1}, ()><unknown>
  973. 55.66 s > at <unknown source file>:<unknown line>
  974. 55.66 s > 14: <std[bcb96dfbba0ab899]::thread::lifecycle::spawn_unchecked<test[75d6903177b1d7e9]::run_test::{closure#1}, ()>::{closure#1} as core[940e698046960fd5]::ops::function::FnOnce<()>>::call_once::{shim:vtable#0}<unknown>
  975. 55.66 s > at <unknown source file>:<unknown line>
  976. 55.66 s > 15: <std[bcb96dfbba0ab899]::sys::thread::unix::Thread>::new::thread_start<unknown>
  977. 55.66 s > at <unknown source file>:<unknown line>
  978. 55.66 s > 16: start_thread<unknown>
  979. 55.66 s > at <unknown source file>:<unknown line>
  980. 55.66 s > 17: __clone3<unknown>
  981. 55.66 s > at <unknown source file>:<unknown line>
  982. 55.66 s >
  983. 55.66 s > Run with COLORBT_SHOW_HIDDEN=1 environment variable to disable frame filtering.
  984. 55.66 s > Run with RUST_BACKTRACE=full to include source snippets.
  985. 55.66 s > =========================================
  986. 55.66 s For full logs, run:
  987. 55.66 s nix log /nix/store/2iiczbl9qsl0qn3ffghgnz4hx8kjgvcy-gammaloop-nextest-core.drv
  988. 55.76 s Run failed.