0.64 s
$ /nix/store/9ypz3flqsrl5xl495mm8h645gadjsxi1-coreutils-9.11/bin/timeout --kill-after=15s 7200s /nix/store/23zk8sgzamrbmj1fday15szf7f2279s8-nix-2.34.7/bin/nix --extra-experimental-features nix-command --extra-experimental-features flakes flake clone git+https://github.com/alphal00p/gammaloop --dest /tmp/nix-ci-worker/stable-pwd/repo/
0.65 s
Cloning into '/tmp/nix-ci-worker/stable-pwd/repo'...
0.78 s
remote: Enumerating objects: 65311, done.
0.78 s
remote: Counting objects: 0% (1/7983)
remote: Counting objects: 1% (80/7983)
remote: Counting objects: 2% (160/7983)
remote: Counting objects: 3% (240/7983)
remote: Counting objects: 4% (320/7983)
remote: Counting objects: 5% (400/7983)
remote: Counting objects: 6% (479/7983)
remote: Counting objects: 7% (559/7983)
remote: Counting objects: 8% (639/7983)
remote: Counting objects: 9% (719/7983)
remote: Counting objects: 10% (799/7983)
remote: Counting objects: 11% (879/7983)
remote: Counting objects: 12% (958/7983)
remote: Counting objects: 13% (1038/7983)
remote: Counting objects: 14% (1118/7983)
remote: Counting objects: 15% (1198/7983)
remote: Counting objects: 16% (1278/7983)
remote: Counting objects: 17% (1358/7983)
remote: Counting objects: 18% (1437/7983)
remote: Counting objects: 19% (1517/7983)
remote: Counting objects: 20% (1597/7983)
remote: Counting objects: 21% (1677/7983)
remote: Counting objects: 22% (1757/7983)
remote: Counting objects: 23% (1837/7983)
remote: Counting objects: 24% (1916/7983)
remote: Counting objects: 25% (1996/7983)
remote: Counting objects: 26% (2076/7983)
remote: Counting objects: 27% (2156/7983)
remote: Counting objects: 28% (2236/7983)
remote: Counting objects: 29% (2316/7983)
remote: Counting objects: 30% (2395/7983)
remote: Counting objects: 31% (2475/7983)
remote: Counting objects: 32% (2555/7983)
remote: Counting objects: 33% (2635/7983)
remote: Counting objects: 34% (2715/7983)
remote: Counting objects: 35% (2795/7983)
remote: Counting objects: 36% (2874/7983)
remote: Counting objects: 37% (2954/7983)
remote: Counting objects: 38% (3034/7983)
remote: Counting objects: 39% (3114/7983)
remote: Counting objects: 40% (3194/7983)
remote: Counting objects: 41% (3274/7983)
remote: Counting objects: 42% (3353/7983)
remote: Counting objects: 43% (3433/7983)
remote: Counting objects: 44% (3513/7983)
remote: Counting objects: 45% (3593/7983)
remote: Counting objects: 46% (3673/7983)
remote: Counting objects: 47% (3753/7983)
remote: Counting objects: 48% (3832/7983)
remote: Counting objects: 49% (3912/7983)
remote: Counting objects: 50% (3992/7983)
remote: Counting objects: 51% (4072/7983)
remote: Counting objects: 52% (4152/7983)
remote: Counting objects: 53% (4231/7983)
remote: Counting objects: 54% (4311/7983)
remote: Counting objects: 55% (4391/7983)
remote: Counting objects: 56% (4471/7983)
remote: Counting objects: 57% (4551/7983)
remote: Counting objects: 58% (4631/7983)
remote: Counting objects: 59% (4710/7983)
remote: Counting objects: 60% (4790/7983)
remote: Counting objects: 61% (4870/7983)
remote: Counting objects: 62% (4950/7983)
remote: Counting objects: 63% (5030/7983)
remote: Counting objects: 64% (5110/7983)
remote: Counting objects: 65% (5189/7983)
remote: Counting objects: 66% (5269/7983)
remote: Counting objects: 67% (5349/7983)
remote: Counting objects: 68% (5429/7983)
remote: Counting objects: 69% (5509/7983)
remote: Counting objects: 70% (5589/7983)
remote: Counting objects: 71% (5668/7983)
remote: Counting objects: 72% (5748/7983)
remote: Counting objects: 73% (5828/7983)
remote: Counting objects: 74% (5908/7983)
remote: Counting objects: 75% (5988/7983)
remote: Counting objects: 76% (6068/7983)
remote: Counting objects: 77% (6147/7983)
remote: Counting objects: 78% (6227/7983)
remote: Counting objects: 79% (6307/7983)
remote: Counting objects: 80% (6387/7983)
remote: Counting objects: 81% (6467/7983)
remote: Counting objects: 82% (6547/7983)
remote: Counting objects: 83% (6626/7983)
remote: Counting objects: 84% (6706/7983)
remote: Counting objects: 85% (6786/7983)
remote: Counting objects: 86% (6866/7983)
remote: Counting objects: 87% (6946/7983)
remote: Counting objects: 88% (7026/7983)
remote: Counting objects: 89% (7105/7983)
remote: Counting objects: 90% (7185/7983)
remote: Counting objects: 91% (7265/7983)
remote: Counting objects: 92% (7345/7983)
remote: Counting objects: 93% (7425/7983)
remote: Counting objects: 94% (7505/7983)
remote: Counting objects: 95% (7584/7983)
remote: Counting objects: 96% (7664/7983)
remote: Counting objects: 97% (7744/7983)
remote: Counting objects: 98% (7824/7983)
remote: Counting objects: 99% (7904/7983)
remote: Counting objects: 100% (7983/7983)
remote: Counting objects: 100% (7983/7983), done.
2.39 s
remote: Compressing objects: 0% (1/1620)
remote: Compressing objects: 1% (17/1620)
remote: Compressing objects: 2% (33/1620)
remote: Compressing objects: 3% (49/1620)
remote: Compressing objects: 4% (65/1620)
remote: Compressing objects: 5% (81/1620)
remote: Compressing objects: 6% (98/1620)
remote: Compressing objects: 7% (114/1620)
remote: Compressing objects: 8% (130/1620)
remote: Compressing objects: 9% (146/1620)
remote: Compressing objects: 10% (162/1620)
remote: Compressing objects: 11% (179/1620)
remote: Compressing objects: 12% (195/1620)
remote: Compressing objects: 13% (211/1620)
remote: Compressing objects: 14% (227/1620)
remote: Compressing objects: 15% (243/1620)
remote: Compressing objects: 16% (260/1620)
remote: Compressing objects: 16% (262/1620)
remote: Compressing objects: 17% (276/1620)
remote: Compressing objects: 18% (292/1620)
remote: Compressing objects: 19% (308/1620)
remote: Compressing objects: 20% (324/1620)
remote: Compressing objects: 21% (341/1620)
remote: Compressing objects: 22% (357/1620)
remote: Compressing objects: 23% (373/1620)
remote: Compressing objects: 24% (389/1620)
remote: Compressing objects: 25% (405/1620)
remote: Compressing objects: 26% (422/1620)
remote: Compressing objects: 27% (438/1620)
remote: Compressing objects: 28% (454/1620)
remote: Compressing objects: 29% (470/1620)
remote: Compressing objects: 30% (486/1620)
remote: Compressing objects: 31% (503/1620)
remote: Compressing objects: 32% (519/1620)
remote: Compressing objects: 33% (535/1620)
remote: Compressing objects: 34% (551/1620)
remote: Compressing objects: 35% (567/1620)
remote: Compressing objects: 36% (584/1620)
remote: Compressing objects: 37% (600/1620)
remote: Compressing objects: 38% (616/1620)
remote: Compressing objects: 39% (632/1620)
remote: Compressing objects: 40% (648/1620)
remote: Compressing objects: 41% (665/1620)
remote: Compressing objects: 42% (681/1620)
remote: Compressing objects: 43% (697/1620)
remote: Compressing objects: 44% (713/1620)
remote: Compressing objects: 45% (729/1620)
remote: Compressing objects: 46% (746/1620)
remote: Compressing objects: 47% (762/1620)
remote: Compressing objects: 48% (778/1620)
remote: Compressing objects: 49% (794/1620)
remote: Compressing objects: 50% (810/1620)
remote: Compressing objects: 51% (827/1620)
remote: Compressing objects: 52% (843/1620)
remote: Compressing objects: 53% (859/1620)
remote: Compressing objects: 54% (875/1620)
remote: Compressing objects: 55% (891/1620)
remote: Compressing objects: 56% (908/1620)
remote: Compressing objects: 57% (924/1620)
remote: Compressing objects: 58% (940/1620)
remote: Compressing objects: 59% (956/1620)
remote: Compressing objects: 60% (972/1620)
remote: Compressing objects: 61% (989/1620)
remote: Compressing objects: 62% (1005/1620)
remote: Compressing objects: 63% (1021/1620)
remote: Compressing objects: 64% (1037/1620)
remote: Compressing objects: 65% (1053/1620)
remote: Compressing objects: 66% (1070/1620)
remote: Compressing objects: 67% (1086/1620)
remote: Compressing objects: 68% (1102/1620)
remote: Compressing objects: 69% (1118/1620)
remote: Compressing objects: 70% (1134/1620)
remote: Compressing objects: 71% (1151/1620)
remote: Compressing objects: 72% (1167/1620)
remote: Compressing objects: 73% (1183/1620)
remote: Compressing objects: 74% (1199/1620)
remote: Compressing objects: 75% (1215/1620)
remote: Compressing objects: 76% (1232/1620)
remote: Compressing objects: 77% (1248/1620)
remote: Compressing objects: 78% (1264/1620)
remote: Compressing objects: 79% (1280/1620)
remote: Compressing objects: 80% (1296/1620)
remote: Compressing objects: 81% (1313/1620)
remote: Compressing objects: 82% (1329/1620)
remote: Compressing objects: 83% (1345/1620)
remote: Compressing objects: 84% (1361/1620)
remote: Compressing objects: 85% (1377/1620)
remote: Compressing objects: 86% (1394/1620)
remote: Compressing objects: 87% (1410/1620)
remote: Compressing objects: 88% (1426/1620)
remote: Compressing objects: 89% (1442/1620)
remote: Compressing objects: 90% (1458/1620)
remote: Compressing objects: 91% (1475/1620)
remote: Compressing objects: 92% (1491/1620)
remote: Compressing objects: 93% (1507/1620)
remote: Compressing objects: 94% (1523/1620)
remote: Compressing objects: 95% (1539/1620)
remote: Compressing objects: 96% (1556/1620)
remote: Compressing objects: 97% (1572/1620)
remote: Compressing objects: 98% (1588/1620)
remote: Compressing objects: 99% (1604/1620)
remote: Compressing objects: 100% (1620/1620)
remote: Compressing objects: 100% (1620/1620), done.
4.94 s
Receiving objects: 0% (1/65311)
Receiving objects: 1% (654/65311)
Receiving objects: 2% (1307/65311)
Receiving objects: 3% (1960/65311)
Receiving objects: 4% (2613/65311)
Receiving objects: 5% (3266/65311)
Receiving objects: 6% (3919/65311)
Receiving objects: 7% (4572/65311)
Receiving objects: 8% (5225/65311)
Receiving objects: 9% (5878/65311)
Receiving objects: 10% (6532/65311)
Receiving objects: 11% (7185/65311)
Receiving objects: 12% (7838/65311), 16.07 MiB | 32.13 MiB/s
Receiving objects: 13% (8491/65311), 16.07 MiB | 32.13 MiB/s
Receiving objects: 14% (9144/65311), 16.07 MiB | 32.13 MiB/s
Receiving objects: 15% (9797/65311), 16.07 MiB | 32.13 MiB/s
Receiving objects: 16% (10450/65311), 16.07 MiB | 32.13 MiB/s
Receiving objects: 17% (11103/65311), 16.07 MiB | 32.13 MiB/s
Receiving objects: 18% (11756/65311), 16.07 MiB | 32.13 MiB/s
Receiving objects: 19% (12410/65311), 16.07 MiB | 32.13 MiB/s
Receiving objects: 20% (13063/65311), 16.07 MiB | 32.13 MiB/s
Receiving objects: 21% (13716/65311), 16.07 MiB | 32.13 MiB/s
Receiving objects: 22% (14369/65311), 16.07 MiB | 32.13 MiB/s
Receiving objects: 23% (15022/65311), 16.07 MiB | 32.13 MiB/s
Receiving objects: 24% (15675/65311), 16.07 MiB | 32.13 MiB/s
Receiving objects: 25% (16328/65311), 16.07 MiB | 32.13 MiB/s
Receiving objects: 26% (16981/65311), 16.07 MiB | 32.13 MiB/s
Receiving objects: 27% (17634/65311), 16.07 MiB | 32.13 MiB/s
Receiving objects: 28% (18288/65311), 16.07 MiB | 32.13 MiB/s
Receiving objects: 29% (18941/65311), 16.07 MiB | 32.13 MiB/s
Receiving objects: 30% (19594/65311), 16.07 MiB | 32.13 MiB/s
Receiving objects: 31% (20247/65311), 16.07 MiB | 32.13 MiB/s
Receiving objects: 32% (20900/65311), 16.07 MiB | 32.13 MiB/s
Receiving objects: 33% (21553/65311), 16.07 MiB | 32.13 MiB/s
Receiving objects: 34% (22206/65311), 16.07 MiB | 32.13 MiB/s
Receiving objects: 35% (22859/65311), 16.07 MiB | 32.13 MiB/s
Receiving objects: 36% (23512/65311), 16.07 MiB | 32.13 MiB/s
Receiving objects: 37% (24166/65311), 16.07 MiB | 32.13 MiB/s
Receiving objects: 38% (24819/65311), 16.07 MiB | 32.13 MiB/s
Receiving objects: 39% (25472/65311), 16.07 MiB | 32.13 MiB/s
Receiving objects: 40% (26125/65311), 16.07 MiB | 32.13 MiB/s
Receiving objects: 41% (26778/65311), 16.07 MiB | 32.13 MiB/s
Receiving objects: 42% (27431/65311), 16.07 MiB | 32.13 MiB/s
Receiving objects: 43% (28084/65311), 16.07 MiB | 32.13 MiB/s
Receiving objects: 44% (28737/65311), 16.07 MiB | 32.13 MiB/s
Receiving objects: 45% (29390/65311), 16.07 MiB | 32.13 MiB/s
Receiving objects: 46% (30044/65311), 16.07 MiB | 32.13 MiB/s
Receiving objects: 47% (30697/65311), 16.07 MiB | 32.13 MiB/s
Receiving objects: 48% (31350/65311), 16.07 MiB | 32.13 MiB/s
Receiving objects: 49% (32003/65311), 16.07 MiB | 32.13 MiB/s
Receiving objects: 50% (32656/65311), 16.07 MiB | 32.13 MiB/s
Receiving objects: 51% (33309/65311), 16.07 MiB | 32.13 MiB/s
Receiving objects: 52% (33962/65311), 16.07 MiB | 32.13 MiB/s
Receiving objects: 52% (34229/65311), 34.47 MiB | 34.16 MiB/s
Receiving objects: 53% (34615/65311), 34.47 MiB | 34.16 MiB/s
Receiving objects: 54% (35268/65311), 34.47 MiB | 34.16 MiB/s
Receiving objects: 55% (35922/65311), 34.47 MiB | 34.16 MiB/s
Receiving objects: 56% (36575/65311), 34.47 MiB | 34.16 MiB/s
Receiving objects: 57% (37228/65311), 34.47 MiB | 34.16 MiB/s
Receiving objects: 58% (37881/65311), 34.47 MiB | 34.16 MiB/s
Receiving objects: 59% (38534/65311), 34.47 MiB | 34.16 MiB/s
Receiving objects: 60% (39187/65311), 34.47 MiB | 34.16 MiB/s
Receiving objects: 61% (39840/65311), 34.47 MiB | 34.16 MiB/s
Receiving objects: 62% (40493/65311), 34.47 MiB | 34.16 MiB/s
Receiving objects: 63% (41146/65311), 34.47 MiB | 34.16 MiB/s
Receiving objects: 64% (41800/65311), 34.47 MiB | 34.16 MiB/s
Receiving objects: 65% (42453/65311), 34.47 MiB | 34.16 MiB/s
Receiving objects: 66% (43106/65311), 34.47 MiB | 34.16 MiB/s
Receiving objects: 67% (43759/65311), 34.47 MiB | 34.16 MiB/s
Receiving objects: 68% (44412/65311), 52.56 MiB | 34.83 MiB/s
Receiving objects: 69% (45065/65311), 52.56 MiB | 34.83 MiB/s
Receiving objects: 70% (45718/65311), 52.56 MiB | 34.83 MiB/s
Receiving objects: 71% (46371/65311), 52.56 MiB | 34.83 MiB/s
Receiving objects: 72% (47024/65311), 52.56 MiB | 34.83 MiB/s
Receiving objects: 73% (47678/65311), 52.56 MiB | 34.83 MiB/s
Receiving objects: 74% (48331/65311), 52.56 MiB | 34.83 MiB/s
Receiving objects: 75% (48984/65311), 52.56 MiB | 34.83 MiB/s
Receiving objects: 76% (49637/65311), 52.56 MiB | 34.83 MiB/s
Receiving objects: 76% (49930/65311), 68.96 MiB | 34.08 MiB/s
Receiving objects: 77% (50290/65311), 68.96 MiB | 34.08 MiB/s
Receiving objects: 78% (50943/65311), 68.96 MiB | 34.08 MiB/s
Receiving objects: 79% (51596/65311), 68.96 MiB | 34.08 MiB/s
Receiving objects: 80% (52249/65311), 68.96 MiB | 34.08 MiB/s
Receiving objects: 81% (52902/65311), 68.96 MiB | 34.08 MiB/s
Receiving objects: 82% (53556/65311), 68.96 MiB | 34.08 MiB/s
Receiving objects: 83% (54209/65311), 68.96 MiB | 34.08 MiB/s
Receiving objects: 84% (54862/65311), 68.96 MiB | 34.08 MiB/s
Receiving objects: 85% (55515/65311), 68.96 MiB | 34.08 MiB/s
Receiving objects: 86% (56168/65311), 68.96 MiB | 34.08 MiB/s
Receiving objects: 87% (56821/65311), 68.96 MiB | 34.08 MiB/s
Receiving objects: 88% (57474/65311), 68.96 MiB | 34.08 MiB/s
Receiving objects: 89% (58127/65311), 68.96 MiB | 34.08 MiB/s
Receiving objects: 90% (58780/65311), 68.96 MiB | 34.08 MiB/s
Receiving objects: 91% (59434/65311), 68.96 MiB | 34.08 MiB/s
Receiving objects: 92% (60087/65311), 68.96 MiB | 34.08 MiB/s
Receiving objects: 93% (60740/65311), 68.96 MiB | 34.08 MiB/s
Receiving objects: 94% (61393/65311), 68.96 MiB | 34.08 MiB/s
Receiving objects: 95% (62046/65311), 68.96 MiB | 34.08 MiB/s
Receiving objects: 96% (62699/65311), 68.96 MiB | 34.08 MiB/s
Receiving objects: 97% (63352/65311), 68.96 MiB | 34.08 MiB/s
Receiving objects: 98% (64005/65311), 68.96 MiB | 34.08 MiB/s
Receiving objects: 99% (64658/65311), 68.96 MiB | 34.08 MiB/s
remote: Total 65311 (delta 6915), reused 6455 (delta 6353), pack-reused 57328 (from 1)
4.94 s
Receiving objects: 100% (65311/65311), 87.01 MiB | 34.48 MiB/s
Receiving objects: 100% (65311/65311), 87.64 MiB | 34.53 MiB/s, done.
5.62 s
Resolving deltas: 0% (0/46012)
Resolving deltas: 1% (461/46012)
Resolving deltas: 2% (921/46012)
Resolving deltas: 3% (1381/46012)
Resolving deltas: 4% (1841/46012)
Resolving deltas: 5% (2301/46012)
Resolving deltas: 6% (2761/46012)
Resolving deltas: 7% (3225/46012)
Resolving deltas: 8% (3681/46012)
Resolving deltas: 9% (4142/46012)
Resolving deltas: 10% (4603/46012)
Resolving deltas: 11% (5062/46012)
Resolving deltas: 12% (5522/46012)
Resolving deltas: 13% (5982/46012)
Resolving deltas: 14% (6443/46012)
Resolving deltas: 15% (6902/46012)
Resolving deltas: 16% (7362/46012)
Resolving deltas: 17% (7823/46012)
Resolving deltas: 18% (8283/46012)
Resolving deltas: 19% (8743/46012)
Resolving deltas: 20% (9204/46012)
Resolving deltas: 21% (9664/46012)
Resolving deltas: 22% (10123/46012)
Resolving deltas: 23% (10585/46012)
Resolving deltas: 24% (11044/46012)
Resolving deltas: 25% (11503/46012)
Resolving deltas: 26% (11964/46012)
Resolving deltas: 27% (12424/46012)
Resolving deltas: 28% (12884/46012)
Resolving deltas: 29% (13345/46012)
Resolving deltas: 30% (13804/46012)
Resolving deltas: 31% (14265/46012)
Resolving deltas: 32% (14724/46012)
Resolving deltas: 33% (15184/46012)
Resolving deltas: 34% (15645/46012)
Resolving deltas: 35% (16105/46012)
Resolving deltas: 36% (16566/46012)
Resolving deltas: 37% (17025/46012)
Resolving deltas: 38% (17485/46012)
Resolving deltas: 39% (17945/46012)
Resolving deltas: 40% (18405/46012)
Resolving deltas: 41% (18865/46012)
Resolving deltas: 42% (19328/46012)
Resolving deltas: 43% (19787/46012)
Resolving deltas: 44% (20246/46012)
Resolving deltas: 45% (20707/46012)
Resolving deltas: 46% (21166/46012)
Resolving deltas: 47% (21628/46012)
Resolving deltas: 48% (22088/46012)
Resolving deltas: 49% (22546/46012)
Resolving deltas: 50% (23006/46012)
Resolving deltas: 51% (23467/46012)
Resolving deltas: 52% (23927/46012)
Resolving deltas: 53% (24387/46012)
Resolving deltas: 54% (24847/46012)
Resolving deltas: 55% (25307/46012)
Resolving deltas: 56% (25767/46012)
Resolving deltas: 57% (26227/46012)
Resolving deltas: 58% (26687/46012)
Resolving deltas: 59% (27149/46012)
Resolving deltas: 60% (27608/46012)
Resolving deltas: 61% (28068/46012)
Resolving deltas: 62% (28530/46012)
Resolving deltas: 63% (28991/46012)
Resolving deltas: 64% (29448/46012)
Resolving deltas: 65% (29908/46012)
Resolving deltas: 66% (30368/46012)
Resolving deltas: 67% (30829/46012)
Resolving deltas: 68% (31289/46012)
Resolving deltas: 69% (31749/46012)
Resolving deltas: 70% (32210/46012)
Resolving deltas: 71% (32669/46012)
Resolving deltas: 72% (33129/46012)
Resolving deltas: 73% (33589/46012)
Resolving deltas: 74% (34049/46012)
Resolving deltas: 75% (34509/46012)
Resolving deltas: 76% (34970/46012)
Resolving deltas: 77% (35430/46012)
Resolving deltas: 78% (35890/46012)
Resolving deltas: 79% (36350/46012)
Resolving deltas: 80% (36810/46012)
Resolving deltas: 81% (37270/46012)
Resolving deltas: 82% (37731/46012)
Resolving deltas: 83% (38190/46012)
Resolving deltas: 84% (38651/46012)
Resolving deltas: 85% (39111/46012)
Resolving deltas: 86% (39571/46012)
Resolving deltas: 87% (40031/46012)
Resolving deltas: 88% (40491/46012)
Resolving deltas: 89% (40951/46012)
Resolving deltas: 90% (41411/46012)
Resolving deltas: 91% (41872/46012)
Resolving deltas: 92% (42332/46012)
Resolving deltas: 93% (42792/46012)
Resolving deltas: 94% (43252/46012)
Resolving deltas: 95% (43714/46012)
Resolving deltas: 96% (44172/46012)
Resolving deltas: 97% (44632/46012)
Resolving deltas: 98% (45092/46012)
Resolving deltas: 99% (45555/46012)
Resolving deltas: 100% (46012/46012)
Resolving deltas: 100% (46012/46012), done.
5.93 s
Fetching commit 7b5358c6b7be5a42e56da6160542ea0d424ced97 for vakint_rustred ...
5.94 s
$ /nix/store/bcnisk3ydfgv26v2gw3zlky24g00yww2-git-2.54.0/bin/git fetch origin 7b5358c6b7be5a42e56da6160542ea0d424ced97
6.34 s
From https://github.com/alphal00p/gammaloop
6.34 s
* branch 7b5358c6b7be5a42e56da6160542ea0d424ced97 -> FETCH_HEAD
6.35 s
$ /nix/store/9ypz3flqsrl5xl495mm8h645gadjsxi1-coreutils-9.11/bin/timeout --kill-after=15s 7200s /nix/store/bcnisk3ydfgv26v2gw3zlky24g00yww2-git-2.54.0/bin/git -c advice.detachedHead=false checkout 7b5358c6b7be5a42e56da6160542ea0d424ced97
6.51 s
HEAD is now at 7b5358c6 Bind RustRed artifacts to terminal catalogs
6.51 s
$ /nix/store/9ypz3flqsrl5xl495mm8h645gadjsxi1-coreutils-9.11/bin/timeout --kill-after=15s 7200s /nix/store/23zk8sgzamrbmj1fday15szf7f2279s8-nix-2.34.7/bin/nix --extra-experimental-features nix-command --extra-experimental-features flakes --log-format internal-json run .#packages.x86_64-linux.nix-ci-check-gammaloop-nextest-spenso --print-build-logs
9.60 s
9.80 s
Downloading cached gammaloop-nextest-binaries-spenso-idenso from https://cache.nix-ci.com
9.80 s
Downloading cached gammaloop-nextest-binaries-spenso-spenso from https://cache.nix-ci.com
9.80 s
Downloading cached gammaloop-nextest-binaries-spenso-spenso-hep-lib from https://cache.nix-ci.com
9.80 s
Downloading cached gammaloop-nextest-binaries-spenso-spenso-macros from https://cache.nix-ci.com
9.80 s
Downloading cached gammaloop-nextest-binaries-spenso-symbolica-utils from https://cache.nix-ci.com
9.98 s
Downloaded cached gammaloop-nextest-binaries-spenso-symbolica-utils (6.3 MiB) in 180ms
9.98 s
Progress: 0 of 7 built, 1 of 5 downloaded from cache (4 downloading)
9.99 s
Downloaded cached gammaloop-nextest-binaries-spenso-spenso-macros (6.5 MiB) in 189ms
9.99 s
Progress: 0 of 6 built, 2 of 5 downloaded from cache (3 downloading)
10.05 s
Downloaded cached gammaloop-nextest-binaries-spenso-spenso (10.2 MiB) in 255ms
10.05 s
Progress: 0 of 5 built, 3 of 5 downloaded from cache (2 downloading)
10.26 s
Downloaded cached gammaloop-nextest-binaries-spenso-idenso (29.3 MiB) in 466ms
10.26 s
Progress: 0 of 4 built, 4 of 5 downloaded from cache (1 downloading)
10.29 s
Downloaded cached gammaloop-nextest-binaries-spenso-spenso-hep-lib (34 MiB) in 491ms
10.29 s
Progress: 0 of 3 built, 5 of 5 downloaded from cache
10.31 s
Building /nix/store/acqlq1xqzy7y6dp4z3f4br1z2px1xspm-gammaloop-nextest-binaries-spenso.drv
10.37 s
[gammaloop-nextest-binaries-spenso:post-build] Uploading to the NixCI cache: /nix/store/jbbh2wmiyx2sib5pqpnk2mmwi7svsdfs-gammaloop-nextest-binaries-spenso
10.41 s
[gammaloop-nextest-binaries-spenso:post-build] warning: 'warn-short-path-literals' is deprecated, use 'lint-short-path-literals = ignore' instead
10.41 s
[gammaloop-nextest-binaries-spenso:post-build] copying 1 paths...
10.41 s
[gammaloop-nextest-binaries-spenso:post-build] copying path '/nix/store/jbbh2wmiyx2sib5pqpnk2mmwi7svsdfs-gammaloop-nextest-binaries-spenso' to 'https://cache.nix-ci.com'...
10.48 s
[gammaloop-nextest-binaries-spenso:post-build] warning: 'warn-short-path-literals' is deprecated, use 'lint-short-path-literals = ignore' instead
10.60 s
[gammaloop-nextest-binaries-spenso:post-build] copying 0 paths...
10.62 s
Uploaded gammaloop-nextest-binaries-spenso in 255ms
10.62 s
Progress: 1 of 3 built, 5 of 5 downloaded from cache
10.62 s
Built gammaloop-nextest-binaries-spenso in 305ms
10.69 s
Building /nix/store/yl2kj0apjjv363w57i3b9my3yln8bpqi-nix-ci-check-gammaloop-nextest-spenso.drv
10.75 s
[nix-ci-check-gammaloop-nextest-spenso:post-build] Uploading to the NixCI cache: /nix/store/fmc3v8i1d8r07lb6lpzpkcix7ga6blai-nix-ci-check-gammaloop-nextest-spenso
10.78 s
[nix-ci-check-gammaloop-nextest-spenso:post-build] warning: 'warn-short-path-literals' is deprecated, use 'lint-short-path-literals = ignore' instead
10.79 s
[nix-ci-check-gammaloop-nextest-spenso:post-build] copying 1 paths...
10.79 s
[nix-ci-check-gammaloop-nextest-spenso:post-build] copying path '/nix/store/fmc3v8i1d8r07lb6lpzpkcix7ga6blai-nix-ci-check-gammaloop-nextest-spenso' to 'https://cache.nix-ci.com'...
10.85 s
[nix-ci-check-gammaloop-nextest-spenso:post-build] warning: 'warn-short-path-literals' is deprecated, use 'lint-short-path-literals = ignore' instead
11.02 s
[nix-ci-check-gammaloop-nextest-spenso:post-build] copying 0 paths...
11.04 s
Uploaded nix-ci-check-gammaloop-nextest-spenso in 306ms
11.04 s
Progress: 2 of 3 built, 5 of 5 downloaded from cache
11.04 s
Built nix-ci-check-gammaloop-nextest-spenso in 356ms
11.04 s
Progress: 3 of 3 built, 5 of 5 downloaded from cache
14.71 s
evaluating derivation 'g
copying '/nix/store/mvmy
evaluating derivation 'g
querying gammaloop-nexte
[0.0 KiB DL] querying in
[0 /1 built, 0.0 KiB DL]
[1 /0 /1 built, 0.0 KiB DLgammaloop-nextest-spenso> Extracting 5 binaries and 2 linked paths to /build/nextest-archive-zuPmy9
14.87 s
gammaloop-nextest-spenso> Extracted 19 files to /build/nextest-archive-zuPmy9 in 0.17s
14.88 s
gammaloop-nextest-spenso> ------------
14.88 s
gammaloop-nextest-spenso> Nextest run ID 0ab33c5f-8b1c-44e9-b986-90098e33e36a with nextest profile: ci_gammaloop
14.88 s
gammaloop-nextest-spenso> Starting 224 tests across 5 binaries (26 tests skipped , including 2 tests via profile.ci_gammaloop.default-filter )
14.97 s
gammaloop-nextest-spenso> FAIL [ 0.013s] ( 46/224) idenso color::test::form_reference :: metric_contraction_respects_antisymmetric_normalization
14.97 s
gammaloop-nextest-spenso> stdout ---
14.97 s
gammaloop-nextest-spenso>
14.97 s
gammaloop-nextest-spenso> running 1 test
14.97 s
gammaloop-nextest-spenso> test color::test::form_reference::metric_contraction_respects_antisymmetric_normalization ... FAILED
14.97 s
gammaloop-nextest-spenso>
14.97 s
gammaloop-nextest-spenso> failures:
14.97 s
gammaloop-nextest-spenso>
14.97 s
gammaloop-nextest-spenso> failures:
14.97 s
gammaloop-nextest-spenso> color::test::form_reference::metric_contraction_respects_antisymmetric_normalization
14.97 s
gammaloop-nextest-spenso>
14.97 s
gammaloop-nextest-spenso> test result: FAILED. 0 passed; 1 failed; 0 ignored; 0 measured; 240 filtered out; finished in 0.01s
14.97 s
gammaloop-nextest-spenso>
14.97 s
gammaloop-nextest-spenso> stderr ---
14.97 s
gammaloop-nextest-spenso>
14.97 s
gammaloop-nextest-spenso> thread 'color::test::form_reference::metric_contraction_respects_antisymmetric_normalization' (336) panicked at crates/idenso/src/color/test/form_reference.rs:171:5:
14.97 s
gammaloop-nextest-spenso> assertion `left == right` failed
14.97 s
gammaloop-nextest-spenso> left: "-1*f(coad(8,standalone_metric_j),coad(8,standalone_metric_s),coad(8,standalone_metric_u))"
14.97 s
gammaloop-nextest-spenso> right: "f(coad(8,standalone_metric_j),coad(8,standalone_metric_s),coad(8,standalone_metric_u))"
14.97 s
gammaloop-nextest-spenso> stack backtrace:
14.97 s
gammaloop-nextest-spenso> 0: __rustc::rust_begin_unwind
14.97 s
gammaloop-nextest-spenso> 1: core::panicking::panic_fmt
14.97 s
gammaloop-nextest-spenso> 2: core::panicking::assert_failed_inner
14.97 s
gammaloop-nextest-spenso> 3: core::panicking::assert_failed::<alloc::string::String, alloc::string::String>
14.97 s
gammaloop-nextest-spenso> 4: idenso::color::test::form_reference::metric_contraction_respects_antisymmetric_normalization
14.97 s
gammaloop-nextest-spenso> 5: <idenso::color::test::form_reference::metric_contraction_respects_antisymmetric_normalization::{closure#0} as core::ops::function::FnOnce<()>>::call_once
14.97 s
gammaloop-nextest-spenso> note: Some details are omitted, run with `RUST_BACKTRACE=full` for a verbose backtrace.
14.97 s
gammaloop-nextest-spenso>
15.20 s
gammaloop-nextest-spenso> FAIL [ 0.038s] (218/224) idenso tensor::tests::parsing :: infinite_execution
15.20 s
gammaloop-nextest-spenso> stdout ---
15.20 s
gammaloop-nextest-spenso>
15.20 s
gammaloop-nextest-spenso> running 1 test
15.20 s
gammaloop-nextest-spenso> ━━━━━━━━━━━━━━━━━━━━━━━━━━━━━━━ Snapshot Summary ━━━━━━━━━━━━━━━━━━━━━━━━━━━━━━━
15.20 s
gammaloop-nextest-spenso> Snapshot: infinite_execution
15.20 s
gammaloop-nextest-spenso> Source: crates/idenso/src/tensor/tests/parsing.rs:910
15.20 s
gammaloop-nextest-spenso> ────────────────────────────────────────────────────────────────────────────────
15.20 s
gammaloop-nextest-spenso> Expression: net_iter.snapshot_dot()
15.20 s
gammaloop-nextest-spenso> ────────────────────────────────────────────────────────────────────────────────
15.20 s
gammaloop-nextest-spenso> -old snapshot
15.20 s
gammaloop-nextest-spenso> +new results
15.20 s
gammaloop-nextest-spenso> ────────────┬───────────────────────────────────────────────────────────────────
15.20 s
gammaloop-nextest-spenso> 8 8 │ 0:0:s -> ext0 [id=0 color="red"];
15.20 s
gammaloop-nextest-spenso> 9 9 │ ext1 [style=invis];
15.20 s
gammaloop-nextest-spenso> 10 10 │ 0:5:s -> ext1 [id=1 dir=none color="red" label="mink4|l_0"];
15.20 s
gammaloop-nextest-spenso> 11 11 │ ext2 [style=invis];
15.20 s
gammaloop-nextest-spenso> 12 │- 0:4:s -> ext2 [id=2 dir=none color="red" label="bis4|l_2"];
15.20 s
gammaloop-nextest-spenso> 12 │+ 0:3:s -> ext2 [id=2 dir=none color="red" label="mink4|l_1"];
15.20 s
gammaloop-nextest-spenso> 13 13 │ ext3 [style=invis];
15.20 s
gammaloop-nextest-spenso> 14 │- 0:3:s -> ext3 [id=3 dir=none color="red" label="bis4|l_3"];
15.20 s
gammaloop-nextest-spenso> 14 │+ 0:1:s -> ext3 [id=3 dir=none color="red" label="bis4|l_2"];
15.20 s
gammaloop-nextest-spenso> 15 15 │ ext4 [style=invis];
15.20 s
gammaloop-nextest-spenso> 16 │- 0:1:s -> ext4 [id=4 dir=none color="red" label="mink4|l_1"];
15.20 s
gammaloop-nextest-spenso> 16 │+ 0:2:s -> ext4 [id=4 dir=none color="red" label="mink4|l_4"];
15.20 s
gammaloop-nextest-spenso> 17 17 │ ext5 [style=invis];
15.20 s
gammaloop-nextest-spenso> 18 │- 0:2:s -> ext5 [id=5 dir=none color="red" label="mink4|l_4"];
15.20 s
gammaloop-nextest-spenso> 18 │+ 0:4:s -> ext5 [id=5 dir=none color="red" label="bis4|l_3"];
15.20 s
gammaloop-nextest-spenso> 19 19 │ }
15.20 s
gammaloop-nextest-spenso> ────────────┴───────────────────────────────────────────────────────────────────
15.20 s
gammaloop-nextest-spenso> To update snapshots run `cargo insta review`
15.20 s
gammaloop-nextest-spenso> Stopped on the first failure. Run `cargo insta test` to run all snapshots.
15.20 s
gammaloop-nextest-spenso> test tensor::tests::parsing::infinite_execution ... FAILED
15.20 s
gammaloop-nextest-spenso>
15.20 s
gammaloop-nextest-spenso> failures:
15.20 s
gammaloop-nextest-spenso>
15.20 s
gammaloop-nextest-spenso> failures:
15.20 s
gammaloop-nextest-spenso> tensor::tests::parsing::infinite_execution
15.20 s
gammaloop-nextest-spenso>
15.20 s
gammaloop-nextest-spenso> test result: FAILED. 0 passed; 1 failed; 0 ignored; 0 measured; 240 filtered out; finished in 0.03s
15.20 s
gammaloop-nextest-spenso>
15.20 s
gammaloop-nextest-spenso> stderr ---
15.20 s
gammaloop-nextest-spenso>
15.20 s
gammaloop-nextest-spenso> thread 'tensor::tests::parsing::infinite_execution' (846) panicked at /nix/store/p13pfw1gvvk8m860apfhvzcgidxhbs7g-vendor-cargo-deps/c19b7c6f923b580ac259164a89f2577984ad5ab09ee9d583b888f934adbbe8d0/insta-1.47.2/src/runtime.rs:719:13:
15.20 s
gammaloop-nextest-spenso> snapshot assertion for 'infinite_execution' failed in line 910
15.20 s
gammaloop-nextest-spenso> stack backtrace:
15.20 s
gammaloop-nextest-spenso> 0: __rustc::rust_begin_unwind
15.20 s
gammaloop-nextest-spenso> 1: core::panicking::panic_fmt
15.20 s
gammaloop-nextest-spenso> 2: insta::runtime::assert_snapshot
15.20 s
gammaloop-nextest-spenso> 3: idenso::tensor::tests::parsing::infinite_execution
15.20 s
gammaloop-nextest-spenso> 4: <idenso::tensor::tests::parsing::infinite_execution::{closure#0} as core::ops::function::FnOnce<()>>::call_once
15.20 s
gammaloop-nextest-spenso> note: Some details are omitted, run with `RUST_BACKTRACE=full` for a verbose backtrace.
15.20 s
gammaloop-nextest-spenso>
16.47 s
gammaloop-nextest-spenso> ------------
16.48 s
gammaloop-nextest-spenso> Summary [ 1.583s] 224 tests run: 222 passed , 2 failed , 26 skipped
16.48 s
gammaloop-nextest-spenso> FAIL [ 0.013s] ( 46/224) idenso color::test::form_reference :: metric_contraction_respects_antisymmetric_normalization
16.48 s
gammaloop-nextest-spenso> stdout ---
16.48 s
gammaloop-nextest-spenso>
16.48 s
gammaloop-nextest-spenso> running 1 test
16.48 s
gammaloop-nextest-spenso> test color::test::form_reference::metric_contraction_respects_antisymmetric_normalization ... FAILED
16.48 s
gammaloop-nextest-spenso>
16.48 s
gammaloop-nextest-spenso> failures:
16.48 s
gammaloop-nextest-spenso>
16.48 s
gammaloop-nextest-spenso> failures:
16.48 s
gammaloop-nextest-spenso> color::test::form_reference::metric_contraction_respects_antisymmetric_normalization
16.48 s
gammaloop-nextest-spenso>
16.48 s
gammaloop-nextest-spenso> test result: FAILED. 0 passed; 1 failed; 0 ignored; 0 measured; 240 filtered out; finished in 0.01s
16.48 s
gammaloop-nextest-spenso>
16.48 s
gammaloop-nextest-spenso> stderr ---
16.48 s
gammaloop-nextest-spenso>
16.48 s
gammaloop-nextest-spenso> thread 'color::test::form_reference::metric_contraction_respects_antisymmetric_normalization' (336) panicked at crates/idenso/src/color/test/form_reference.rs:171:5:
16.48 s
gammaloop-nextest-spenso> assertion `left == right` failed
16.48 s
gammaloop-nextest-spenso> left: "-1*f(coad(8,standalone_metric_j),coad(8,standalone_metric_s),coad(8,standalone_metric_u))"
16.48 s
gammaloop-nextest-spenso> right: "f(coad(8,standalone_metric_j),coad(8,standalone_metric_s),coad(8,standalone_metric_u))"
16.48 s
gammaloop-nextest-spenso> stack backtrace:
16.48 s
gammaloop-nextest-spenso> 0: __rustc::rust_begin_unwind
16.48 s
gammaloop-nextest-spenso> 1: core::panicking::panic_fmt
16.48 s
gammaloop-nextest-spenso> 2: core::panicking::assert_failed_inner
16.48 s
gammaloop-nextest-spenso> 3: core::panicking::assert_failed::<alloc::string::String, alloc::string::String>
16.48 s
gammaloop-nextest-spenso> 4: idenso::color::test::form_reference::metric_contraction_respects_antisymmetric_normalization
16.48 s
gammaloop-nextest-spenso> 5: <idenso::color::test::form_reference::metric_contraction_respects_antisymmetric_normalization::{closure#0} as core::ops::function::FnOnce<()>>::call_once
16.48 s
gammaloop-nextest-spenso> note: Some details are omitted, run with `RUST_BACKTRACE=full` for a verbose backtrace.
16.48 s
gammaloop-nextest-spenso>
16.48 s
gammaloop-nextest-spenso> FAIL [ 0.038s] (218/224) idenso tensor::tests::parsing :: infinite_execution
16.48 s
gammaloop-nextest-spenso> stdout ---
16.48 s
gammaloop-nextest-spenso>
16.48 s
gammaloop-nextest-spenso> running 1 test
16.48 s
gammaloop-nextest-spenso> ━━━━━━━━━━━━━━━━━━━━━━━━━━━━━━━ Snapshot Summary ━━━━━━━━━━━━━━━━━━━━━━━━━━━━━━━
16.48 s
gammaloop-nextest-spenso> Snapshot: infinite_execution
16.48 s
gammaloop-nextest-spenso> Source: crates/idenso/src/tensor/tests/parsing.rs:910
16.48 s
gammaloop-nextest-spenso> ────────────────────────────────────────────────────────────────────────────────
16.48 s
gammaloop-nextest-spenso> Expression: net_iter.snapshot_dot()
16.48 s
gammaloop-nextest-spenso> ────────────────────────────────────────────────────────────────────────────────
16.48 s
gammaloop-nextest-spenso> -old snapshot
16.48 s
gammaloop-nextest-spenso> +new results
16.48 s
gammaloop-nextest-spenso> ────────────┬───────────────────────────────────────────────────────────────────
16.48 s
gammaloop-nextest-spenso> 8 8 │ 0:0:s -> ext0 [id=0 color="red"];
16.48 s
gammaloop-nextest-spenso> 9 9 │ ext1 [style=invis];
16.48 s
gammaloop-nextest-spenso> 10 10 │ 0:5:s -> ext1 [id=1 dir=none color="red" label="mink4|l_0"];
16.48 s
gammaloop-nextest-spenso> 11 11 │ ext2 [style=invis];
16.48 s
gammaloop-nextest-spenso> 12 │- 0:4:s -> ext2 [id=2 dir=none color="red" label="bis4|l_2"];
16.48 s
gammaloop-nextest-spenso> 12 │+ 0:3:s -> ext2 [id=2 dir=none color="red" label="mink4|l_1"];
16.48 s
gammaloop-nextest-spenso> 13 13 │ ext3 [style=invis];
16.48 s
gammaloop-nextest-spenso> 14 │- 0:3:s -> ext3 [id=3 dir=none color="red" label="bis4|l_3"];
16.48 s
gammaloop-nextest-spenso> 14 │+ 0:1:s -> ext3 [id=3 dir=none color="red" label="bis4|l_2"];
16.48 s
gammaloop-nextest-spenso> 15 15 │ ext4 [style=invis];
16.48 s
gammaloop-nextest-spenso> 16 │- 0:1:s -> ext4 [id=4 dir=none color="red" label="mink4|l_1"];
16.48 s
gammaloop-nextest-spenso> 16 │+ 0:2:s -> ext4 [id=4 dir=none color="red" label="mink4|l_4"];
16.48 s
gammaloop-nextest-spenso> 17 17 │ ext5 [style=invis];
16.48 s
gammaloop-nextest-spenso> 18 │- 0:2:s -> ext5 [id=5 dir=none color="red" label="mink4|l_4"];
16.48 s
gammaloop-nextest-spenso> 18 │+ 0:4:s -> ext5 [id=5 dir=none color="red" label="bis4|l_3"];
16.48 s
gammaloop-nextest-spenso> 19 19 │ }
16.48 s
gammaloop-nextest-spenso> ────────────┴───────────────────────────────────────────────────────────────────
16.48 s
gammaloop-nextest-spenso> To update snapshots run `cargo insta review`
16.48 s
gammaloop-nextest-spenso> Stopped on the first failure. Run `cargo insta test` to run all snapshots.
16.48 s
gammaloop-nextest-spenso> test tensor::tests::parsing::infinite_execution ... FAILED
16.48 s
gammaloop-nextest-spenso>
16.48 s
gammaloop-nextest-spenso> failures:
16.48 s
gammaloop-nextest-spenso>
16.48 s
gammaloop-nextest-spenso> failures:
16.48 s
gammaloop-nextest-spenso> tensor::tests::parsing::infinite_execution
16.48 s
gammaloop-nextest-spenso>
16.48 s
gammaloop-nextest-spenso> test result: FAILED. 0 passed; 1 failed; 0 ignored; 0 measured; 240 filtered out; finished in 0.03s
16.48 s
gammaloop-nextest-spenso>
16.48 s
gammaloop-nextest-spenso> stderr ---
16.48 s
gammaloop-nextest-spenso>
16.48 s
gammaloop-nextest-spenso> thread 'tensor::tests::parsing::infinite_execution' (846) panicked at /nix/store/p13pfw1gvvk8m860apfhvzcgidxhbs7g-vendor-cargo-deps/c19b7c6f923b580ac259164a89f2577984ad5ab09ee9d583b888f934adbbe8d0/insta-1.47.2/src/runtime.rs:719:13:
16.48 s
gammaloop-nextest-spenso> snapshot assertion for 'infinite_execution' failed in line 910
16.48 s
gammaloop-nextest-spenso> stack backtrace:
16.48 s
gammaloop-nextest-spenso> 0: __rustc::rust_begin_unwind
16.48 s
gammaloop-nextest-spenso> 1: core::panicking::panic_fmt
16.48 s
gammaloop-nextest-spenso> 2: insta::runtime::assert_snapshot
16.48 s
gammaloop-nextest-spenso> 3: idenso::tensor::tests::parsing::infinite_execution
16.48 s
gammaloop-nextest-spenso> 4: <idenso::tensor::tests::parsing::infinite_execution::{closure#0} as core::ops::function::FnOnce<()>>::call_once
16.48 s
gammaloop-nextest-spenso> note: Some details are omitted, run with `RUST_BACKTRACE=full` for a verbose backtrace.
16.48 s
gammaloop-nextest-spenso>
16.50 s
gammaloop-nextest-spenso> error : test run failed
16.52 s
gammaloop-nextest-spenso>
16.52 s
gammaloop-nextest-spenso> ========== nextest test summary ==========
16.52 s
gammaloop-nextest-spenso> report: target/nextest/ci_gammaloop/junit.xml
16.52 s
gammaloop-nextest-spenso> tests: 224, failures: 2, errors: 0
16.52 s
gammaloop-nextest-spenso>
16.52 s
gammaloop-nextest-spenso> 1. idenso::color::test::form_reference::metric_contraction_respects_antisymmetric_normalization
16.52 s
gammaloop-nextest-spenso> failure: test failure with exit code 101
16.52 s
gammaloop-nextest-spenso> thread 'color::test::form_reference::metric_contraction_respects_antisymmetric_normalization' (336) panicked at crates/idenso/src/color/test/form_reference.rs:171:5:
16.52 s
gammaloop-nextest-spenso> assertion `left == right` failed
16.52 s
gammaloop-nextest-spenso> left: "-1*f(coad(8,standalone_metric_j),coad(8,standalone_metric_s),coad(8,standalone_metric_u))"
16.52 s
gammaloop-nextest-spenso> right: "f(coad(8,standalone_metric_j),coad(8,standalone_metric_s),coad(8,standalone_metric_u))"
16.52 s
gammaloop-nextest-spenso> stack backtrace:
16.52 s
gammaloop-nextest-spenso> 0: __rustc::rust_begin_unwind
16.52 s
gammaloop-nextest-spenso> 1: core::panicking::panic_fmt
16.52 s
gammaloop-nextest-spenso> 2: core::panicking::assert_failed_inner
16.52 s
gammaloop-nextest-spenso> 3: core::panicking::assert_failed::<alloc::string::String, alloc::string::String>
16.52 s
gammaloop-nextest-spenso> 4: idenso::color::test::form_reference::metric_contraction_respects_antisymmetric_normalization
16.52 s
gammaloop-nextest-spenso> 5: <idenso::color::test::form_reference::metric_contraction_respects_antisymmetric_normalization::{closure#0} as core::ops::function::FnOnce<()>>::call_once
16.52 s
gammaloop-nextest-spenso> note: Some details are omitted, run with `RUST_BACKTRACE=full` for a verbose backtrace.
16.52 s
gammaloop-nextest-spenso> system-out
16.52 s
gammaloop-nextest-spenso> running 1 test
16.52 s
gammaloop-nextest-spenso> test color::test::form_reference::metric_contraction_respects_antisymmetric_normalization ... FAILED
16.52 s
gammaloop-nextest-spenso>
16.52 s
gammaloop-nextest-spenso> failures:
16.52 s
gammaloop-nextest-spenso>
16.52 s
gammaloop-nextest-spenso> failures:
16.52 s
gammaloop-nextest-spenso> color::test::form_reference::metric_contraction_respects_antisymmetric_normalization
16.52 s
gammaloop-nextest-spenso>
16.52 s
gammaloop-nextest-spenso> test result: FAILED. 0 passed; 1 failed; 0 ignored; 0 measured; 240 filtered out; finished in 0.01s
16.52 s
gammaloop-nextest-spenso> system-err
16.52 s
gammaloop-nextest-spenso> thread 'color::test::form_reference::metric_contraction_respects_antisymmetric_normalization' (336) panicked at crates/idenso/src/color/test/form_reference.rs:171:5:
16.52 s
gammaloop-nextest-spenso> assertion `left == right` failed
16.52 s
gammaloop-nextest-spenso> left: "-1*f(coad(8,standalone_metric_j),coad(8,standalone_metric_s),coad(8,standalone_metric_u))"
16.52 s
gammaloop-nextest-spenso> right: "f(coad(8,standalone_metric_j),coad(8,standalone_metric_s),coad(8,standalone_metric_u))"
16.52 s
gammaloop-nextest-spenso> stack backtrace:
16.52 s
gammaloop-nextest-spenso> 0: __rustc::rust_begin_unwind
16.52 s
gammaloop-nextest-spenso> 1: core::panicking::panic_fmt
16.52 s
gammaloop-nextest-spenso> 2: core::panicking::assert_failed_inner
16.52 s
gammaloop-nextest-spenso> 3: core::panicking::assert_failed::<alloc::string::String, alloc::string::String>
16.52 s
gammaloop-nextest-spenso> 4: idenso::color::test::form_reference::metric_contraction_respects_antisymmetric_normalization
16.52 s
gammaloop-nextest-spenso> 5: <idenso::color::test::form_reference::metric_contraction_respects_antisymmetric_normalization::{closure#0} as core::ops::function::FnOnce<()>>::call_once
16.52 s
gammaloop-nextest-spenso> note: Some details are omitted, run with `RUST_BACKTRACE=full` for a verbose backtrace.
16.52 s
gammaloop-nextest-spenso>
16.52 s
gammaloop-nextest-spenso> 2. idenso::tensor::tests::parsing::infinite_execution
16.52 s
gammaloop-nextest-spenso> failure: test failure with exit code 101
16.52 s
gammaloop-nextest-spenso> thread 'tensor::tests::parsing::infinite_execution' (846) panicked at /nix/store/p13pfw1gvvk8m860apfhvzcgidxhbs7g-vendor-cargo-deps/c19b7c6f923b580ac259164a89f2577984ad5ab09ee9d583b888f934adbbe8d0/insta-1.47.2/src/runtime.rs:719:13:
16.52 s
gammaloop-nextest-spenso> snapshot assertion for 'infinite_execution' failed in line 910
16.52 s
gammaloop-nextest-spenso> stack backtrace:
16.52 s
gammaloop-nextest-spenso> 0: __rustc::rust_begin_unwind
16.52 s
gammaloop-nextest-spenso> 1: core::panicking::panic_fmt
16.52 s
gammaloop-nextest-spenso> 2: insta::runtime::assert_snapshot
16.52 s
gammaloop-nextest-spenso> 3: idenso::tensor::tests::parsing::infinite_execution
16.52 s
gammaloop-nextest-spenso> 4: <idenso::tensor::tests::parsing::infinite_execution::{closure#0} as core::ops::function::FnOnce<()>>::call_once
16.52 s
gammaloop-nextest-spenso> note: Some details are omitted, run with `RUST_BACKTRACE=full` for a verbose backtrace.
16.52 s
gammaloop-nextest-spenso> system-out
16.52 s
gammaloop-nextest-spenso> running 1 test
16.52 s
gammaloop-nextest-spenso> ━━━━━━━━━━━━━━━━━━━━━━━━━━━━━━━ Snapshot Summary ━━━━━━━━━━━━━━━━━━━━━━━━━━━━━━━
16.52 s
gammaloop-nextest-spenso> Snapshot: infinite_execution
16.52 s
gammaloop-nextest-spenso> Source: crates/idenso/src/tensor/tests/parsing.rs:910
16.52 s
gammaloop-nextest-spenso> ────────────────────────────────────────────────────────────────────────────────
16.52 s
gammaloop-nextest-spenso> Expression: net_iter.snapshot_dot()
16.52 s
gammaloop-nextest-spenso> ────────────────────────────────────────────────────────────────────────────────
16.52 s
gammaloop-nextest-spenso> -old snapshot
16.52 s
gammaloop-nextest-spenso> +new results
16.52 s
gammaloop-nextest-spenso> ────────────┬───────────────────────────────────────────────────────────────────
16.52 s
gammaloop-nextest-spenso> 8 8 │ 0:0:s-> ext0 [id=0 color="red"];
16.52 s
gammaloop-nextest-spenso> 9 9 │ ext1 [style=invis];
16.52 s
gammaloop-nextest-spenso> 10 10 │ 0:5:s-> ext1 [id=1 dir=none color="red" label="mink4|l_0"];
16.52 s
gammaloop-nextest-spenso> 11 11 │ ext2 [style=invis];
16.52 s
gammaloop-nextest-spenso> 12 │- 0:4:s-> ext2 [id=2 dir=none color="red" label="bis4|l_2"];
16.52 s
gammaloop-nextest-spenso> 12 │+ 0:3:s-> ext2 [id=2 dir=none color="red" label="mink4|l_1"];
16.52 s
gammaloop-nextest-spenso> 13 13 │ ext3 [style=invis];
16.52 s
gammaloop-nextest-spenso> 14 │- 0:3:s-> ext3 [id=3 dir=none color="red" label="bis4|l_3"];
16.52 s
gammaloop-nextest-spenso> 14 │+ 0:1:s-> ext3 [id=3 dir=none color="red" label="bis4|l_2"];
16.52 s
gammaloop-nextest-spenso> 15 15 │ ext4 [style=invis];
16.52 s
gammaloop-nextest-spenso> 16 │- 0:1:s-> ext4 [id=4 dir=none color="red" label="mink4|l_1"];
16.52 s
gammaloop-nextest-spenso> 16 │+ 0:2:s-> ext4 [id=4 dir=none color="red" label="mink4|l_4"];
16.52 s
gammaloop-nextest-spenso> 17 17 │ ext5 [style=invis];
16.52 s
gammaloop-nextest-spenso> 18 │- 0:2:s-> ext5 [id=5 dir=none color="red" label="mink4|l_4"];
16.52 s
gammaloop-nextest-spenso> 18 │+ 0:4:s-> ext5 [id=5 dir=none color="red" label="bis4|l_3"];
16.52 s
gammaloop-nextest-spenso> 19 19 │ }
16.52 s
gammaloop-nextest-spenso> ────────────┴───────────────────────────────────────────────────────────────────
16.52 s
gammaloop-nextest-spenso> To update snapshots run `cargo insta review`
16.52 s
gammaloop-nextest-spenso> Stopped on the first failure. Run `cargo insta test` to run all snapshots.
16.52 s
gammaloop-nextest-spenso> test tensor::tests::parsing::infinite_execution ... FAILED
16.52 s
gammaloop-nextest-spenso>
16.52 s
gammaloop-nextest-spenso> failures:
16.52 s
gammaloop-nextest-spenso>
16.52 s
gammaloop-nextest-spenso> failures:
16.52 s
gammaloop-nextest-spenso> tensor::tests::parsing::infinite_execution
16.52 s
gammaloop-nextest-spenso>
16.52 s
gammaloop-nextest-spenso> test result: FAILED. 0 passed; 1 failed; 0 ignored; 0 measured; 240 filtered out; finished in 0.03s
16.52 s
gammaloop-nextest-spenso> system-err
16.52 s
gammaloop-nextest-spenso> thread 'tensor::tests::parsing::infinite_execution' (846) panicked at /nix/store/p13pfw1gvvk8m860apfhvzcgidxhbs7g-vendor-cargo-deps/c19b7c6f923b580ac259164a89f2577984ad5ab09ee9d583b888f934adbbe8d0/insta-1.47.2/src/runtime.rs:719:13:
16.52 s
gammaloop-nextest-spenso> snapshot assertion for 'infinite_execution' failed in line 910
16.52 s
gammaloop-nextest-spenso> stack backtrace:
16.52 s
gammaloop-nextest-spenso> 0: __rustc::rust_begin_unwind
16.52 s
gammaloop-nextest-spenso> 1: core::panicking::panic_fmt
16.52 s
gammaloop-nextest-spenso> 2: insta::runtime::assert_snapshot
16.52 s
gammaloop-nextest-spenso> 3: idenso::tensor::tests::parsing::infinite_execution
16.52 s
gammaloop-nextest-spenso> 4: <idenso::tensor::tests::parsing::infinite_execution::{closure#0} as core::ops::function::FnOnce<()>>::call_once
16.52 s
gammaloop-nextest-spenso> note: Some details are omitted, run with `RUST_BACKTRACE=full` for a verbose backtrace.
16.52 s
gammaloop-nextest-spenso> =========================================
16.53 s
gammaloop-nextest-spenso> Extracting 2 binaries and 1 linked path to /build/nextest-archive-ffTKUZ
16.60 s
gammaloop-nextest-spenso> Extracted 8 files to /build/nextest-archive-ffTKUZ in 0.07s
16.61 s
gammaloop-nextest-spenso> ------------
16.61 s
gammaloop-nextest-spenso> Nextest run ID 9696ad40-1b10-44d5-98f7-01119906db46 with nextest profile: ci_gammaloop
16.61 s
gammaloop-nextest-spenso> Starting 135 tests across 2 binaries
16.68 s
gammaloop-nextest-spenso> ------------
16.68 s
gammaloop-nextest-spenso> Summary [ 0.077s] 135 tests run: 135 passed , 0 skipped
16.72 s
gammaloop-nextest-spenso>
16.72 s
gammaloop-nextest-spenso> ========== nextest test summary ==========
16.72 s
gammaloop-nextest-spenso> report: target/nextest/ci_gammaloop/junit.xml
16.72 s
gammaloop-nextest-spenso> tests: 135, failures: 0, errors: 0
16.72 s
gammaloop-nextest-spenso> No failing testcases found.
16.72 s
gammaloop-nextest-spenso> =========================================
16.73 s
gammaloop-nextest-spenso> Extracting 5 binaries and 2 linked paths to /build/nextest-archive-p31EFW
16.92 s
gammaloop-nextest-spenso> Extracted 19 files to /build/nextest-archive-p31EFW in 0.19s
16.93 s
gammaloop-nextest-spenso> ------------
16.93 s
gammaloop-nextest-spenso> Nextest run ID 8de20d47-6b69-4492-a8b2-6a1ff20026c8 with nextest profile: ci_gammaloop
16.93 s
gammaloop-nextest-spenso> Starting 25 tests across 5 binaries (1 test skipped via profile.ci_gammaloop.default-filter )
17.12 s
gammaloop-nextest-spenso> ------------
17.12 s
gammaloop-nextest-spenso> Summary [ 0.194s] 25 tests run: 25 passed , 1 skipped
17.18 s
gammaloop-nextest-spenso>
17.18 s
gammaloop-nextest-spenso> ========== nextest test summary ==========
17.18 s
gammaloop-nextest-spenso> report: target/nextest/ci_gammaloop/junit.xml
17.18 s
gammaloop-nextest-spenso> tests: 25, failures: 0, errors: 0
17.18 s
gammaloop-nextest-spenso> No failing testcases found.
17.18 s
gammaloop-nextest-spenso> =========================================
17.19 s
gammaloop-nextest-spenso> Extracting 2 binaries and 1 linked path to /build/nextest-archive-3z391M
17.24 s
gammaloop-nextest-spenso> Extracted 8 files to /build/nextest-archive-3z391M in 0.05s
17.25 s
gammaloop-nextest-spenso> ------------
17.25 s
gammaloop-nextest-spenso> Nextest run ID d3e2d6d3-dba2-4cb7-a0be-3c69fc31a9c2 with nextest profile: ci_gammaloop
17.25 s
gammaloop-nextest-spenso> Starting 1 test across 2 binaries
17.25 s
gammaloop-nextest-spenso> ------------
17.25 s
gammaloop-nextest-spenso> Summary [ 0.005s] 1 test run: 1 passed , 0 skipped
17.28 s
gammaloop-nextest-spenso>
17.28 s
gammaloop-nextest-spenso> ========== nextest test summary ==========
17.28 s
gammaloop-nextest-spenso> report: target/nextest/ci_gammaloop/junit.xml
17.28 s
gammaloop-nextest-spenso> tests: 1, failures: 0, errors: 0
17.28 s
gammaloop-nextest-spenso> No failing testcases found.
17.28 s
gammaloop-nextest-spenso> =========================================
17.29 s
gammaloop-nextest-spenso> Extracting 1 binary and 1 linked path to /build/nextest-archive-i0dR4o
17.34 s
gammaloop-nextest-spenso> Extracted 7 files to /build/nextest-archive-i0dR4o in 0.05s
17.35 s
gammaloop-nextest-spenso> ------------
17.35 s
gammaloop-nextest-spenso> Nextest run ID 6ce54cc0-0496-4221-8527-dfceddf659a1 with nextest profile: ci_gammaloop
17.35 s
gammaloop-nextest-spenso> Starting 0 tests across 1 binary
17.35 s
gammaloop-nextest-spenso> ------------
17.35 s
gammaloop-nextest-spenso> Summary [ 0.000s] 0 tests run: 0 passed , 0 skipped
17.38 s
gammaloop-nextest-spenso>
17.38 s
gammaloop-nextest-spenso> ========== nextest test summary ==========
17.38 s
gammaloop-nextest-spenso> report: target/nextest/ci_gammaloop/junit.xml
17.38 s
gammaloop-nextest-spenso> tests: 0, failures: 0, errors: 0
17.38 s
gammaloop-nextest-spenso> No failing testcases found.
17.38 s
gammaloop-nextest-spenso> =========================================
17.41 s
error: Cannot build '/nix/store/8hj2j3n1562bs62vvl44s3db1hsxblr2-gammaloop-nextest-spenso.drv '.
17.41 s
Reason: builder failed with exit code 100 .
17.41 s
Output paths:
17.41 s
/nix/store/q6zi5vs0q3wnr64456imbjpsvsayaj2c-gammaloop-nextest-spenso
17.41 s
Last 325 log lines:
17.41 s
> Extracting 5 binaries and 2 linked paths to /build/nextest-archive-zuPmy9
17.41 s
> Extracted 19 files to /build/nextest-archive-zuPmy9 in 0.17s
17.41 s
> ------------
17.41 s
> Nextest run ID 0ab33c5f-8b1c-44e9-b986-90098e33e36a with nextest profile: ci_gammaloop
17.41 s
> Starting 224 tests across 5 binaries (26 tests skipped , including 2 tests via profile.ci_gammaloop.default-filter )
17.41 s
> FAIL [ 0.013s] ( 46/224) idenso color::test::form_reference :: metric_contraction_respects_antisymmetric_normalization
17.41 s
> stdout ---
17.41 s
>
17.41 s
> running 1 test
17.41 s
> test color::test::form_reference::metric_contraction_respects_antisymmetric_normalization ... FAILED
17.41 s
>
17.41 s
> failures:
17.41 s
>
17.41 s
> failures:
17.41 s
> color::test::form_reference::metric_contraction_respects_antisymmetric_normalization
17.41 s
>
17.41 s
> test result: FAILED. 0 passed; 1 failed; 0 ignored; 0 measured; 240 filtered out; finished in 0.01s
17.41 s
>
17.41 s
> stderr ---
17.41 s
>
17.41 s
> thread 'color::test::form_reference::metric_contraction_respects_antisymmetric_normalization' (336) panicked at crates/idenso/src/color/test/form_reference.rs:171:5:
17.41 s
> assertion `left == right` failed
17.41 s
> left: "-1*f(coad(8,standalone_metric_j),coad(8,standalone_metric_s),coad(8,standalone_metric_u))"
17.41 s
> right: "f(coad(8,standalone_metric_j),coad(8,standalone_metric_s),coad(8,standalone_metric_u))"
17.41 s
> stack backtrace:
17.41 s
> 0: __rustc::rust_begin_unwind
17.41 s
> 1: core::panicking::panic_fmt
17.41 s
> 2: core::panicking::assert_failed_inner
17.41 s
> 3: core::panicking::assert_failed::<alloc::string::String, alloc::string::String>
17.41 s
> 4: idenso::color::test::form_reference::metric_contraction_respects_antisymmetric_normalization
17.41 s
> 5: <idenso::color::test::form_reference::metric_contraction_respects_antisymmetric_normalization::{closure#0} as core::ops::function::FnOnce<()>>::call_once
17.41 s
> note: Some details are omitted, run with `RUST_BACKTRACE=full` for a verbose backtrace.
17.41 s
>
17.41 s
> FAIL [ 0.038s] (218/224) idenso tensor::tests::parsing :: infinite_execution
17.41 s
> stdout ---
17.41 s
>
17.41 s
> running 1 test
17.41 s
> ━━━━━━━━━━━━━━━━━━━━━━━━━━━━━━━ Snapshot Summary ━━━━━━━━━━━━━━━━━━━━━━━━━━━━━━━
17.41 s
> Snapshot: infinite_execution
17.41 s
> Source: crates/idenso/src/tensor/tests/parsing.rs:910
17.41 s
> ────────────────────────────────────────────────────────────────────────────────
17.41 s
> Expression: net_iter.snapshot_dot()
17.41 s
> ────────────────────────────────────────────────────────────────────────────────
17.41 s
> -old snapshot
17.41 s
> +new results
17.41 s
> ────────────┬───────────────────────────────────────────────────────────────────
17.41 s
> 8 8 │ 0:0:s -> ext0 [id=0 color="red"];
17.41 s
> 9 9 │ ext1 [style=invis];
17.41 s
> 10 10 │ 0:5:s -> ext1 [id=1 dir=none color="red" label="mink4|l_0"];
17.41 s
> 11 11 │ ext2 [style=invis];
17.41 s
> 12 │- 0:4:s -> ext2 [id=2 dir=none color="red" label="bis4|l_2"];
17.41 s
> 12 │+ 0:3:s -> ext2 [id=2 dir=none color="red" label="mink4|l_1"];
17.41 s
> 13 13 │ ext3 [style=invis];
17.41 s
> 14 │- 0:3:s -> ext3 [id=3 dir=none color="red" label="bis4|l_3"];
17.41 s
> 14 │+ 0:1:s -> ext3 [id=3 dir=none color="red" label="bis4|l_2"];
17.41 s
> 15 15 │ ext4 [style=invis];
17.41 s
> 16 │- 0:1:s -> ext4 [id=4 dir=none color="red" label="mink4|l_1"];
17.41 s
> 16 │+ 0:2:s -> ext4 [id=4 dir=none color="red" label="mink4|l_4"];
17.41 s
> 17 17 │ ext5 [style=invis];
17.41 s
> 18 │- 0:2:s -> ext5 [id=5 dir=none color="red" label="mink4|l_4"];
17.41 s
> 18 │+ 0:4:s -> ext5 [id=5 dir=none color="red" label="bis4|l_3"];
17.41 s
> 19 19 │ }
17.41 s
> ────────────┴───────────────────────────────────────────────────────────────────
17.41 s
> To update snapshots run `cargo insta review`
17.41 s
> Stopped on the first failure. Run `cargo insta test` to run all snapshots.
17.41 s
> test tensor::tests::parsing::infinite_execution ... FAILED
17.41 s
>
17.41 s
> failures:
17.41 s
>
17.41 s
> failures:
17.41 s
> tensor::tests::parsing::infinite_execution
17.41 s
>
17.41 s
> test result: FAILED. 0 passed; 1 failed; 0 ignored; 0 measured; 240 filtered out; finished in 0.03s
17.41 s
>
17.41 s
> stderr ---
17.41 s
>
17.41 s
> thread 'tensor::tests::parsing::infinite_execution' (846) panicked at /nix/store/p13pfw1gvvk8m860apfhvzcgidxhbs7g-vendor-cargo-deps/c19b7c6f923b580ac259164a89f2577984ad5ab09ee9d583b888f934adbbe8d0/insta-1.47.2/src/runtime.rs:719:13:
17.41 s
> snapshot assertion for 'infinite_execution' failed in line 910
17.41 s
> stack backtrace:
17.41 s
> 0: __rustc::rust_begin_unwind
17.41 s
> 1: core::panicking::panic_fmt
17.41 s
> 2: insta::runtime::assert_snapshot
17.41 s
> 3: idenso::tensor::tests::parsing::infinite_execution
17.41 s
> 4: <idenso::tensor::tests::parsing::infinite_execution::{closure#0} as core::ops::function::FnOnce<()>>::call_once
17.41 s
> note: Some details are omitted, run with `RUST_BACKTRACE=full` for a verbose backtrace.
17.41 s
>
17.41 s
> ------------
17.41 s
> Summary [ 1.583s] 224 tests run: 222 passed , 2 failed , 26 skipped
17.41 s
> FAIL [ 0.013s] ( 46/224) idenso color::test::form_reference :: metric_contraction_respects_antisymmetric_normalization
17.41 s
> stdout ---
17.41 s
>
17.41 s
> running 1 test
17.41 s
> test color::test::form_reference::metric_contraction_respects_antisymmetric_normalization ... FAILED
17.41 s
>
17.41 s
> failures:
17.41 s
>
17.41 s
> failures:
17.41 s
> color::test::form_reference::metric_contraction_respects_antisymmetric_normalization
17.41 s
>
17.41 s
> test result: FAILED. 0 passed; 1 failed; 0 ignored; 0 measured; 240 filtered out; finished in 0.01s
17.41 s
>
17.41 s
> stderr ---
17.41 s
>
17.41 s
> thread 'color::test::form_reference::metric_contraction_respects_antisymmetric_normalization' (336) panicked at crates/idenso/src/color/test/form_reference.rs:171:5:
17.41 s
> assertion `left == right` failed
17.41 s
> left: "-1*f(coad(8,standalone_metric_j),coad(8,standalone_metric_s),coad(8,standalone_metric_u))"
17.41 s
> right: "f(coad(8,standalone_metric_j),coad(8,standalone_metric_s),coad(8,standalone_metric_u))"
17.41 s
> stack backtrace:
17.41 s
> 0: __rustc::rust_begin_unwind
17.41 s
> 1: core::panicking::panic_fmt
17.41 s
> 2: core::panicking::assert_failed_inner
17.41 s
> 3: core::panicking::assert_failed::<alloc::string::String, alloc::string::String>
17.41 s
> 4: idenso::color::test::form_reference::metric_contraction_respects_antisymmetric_normalization
17.41 s
> 5: <idenso::color::test::form_reference::metric_contraction_respects_antisymmetric_normalization::{closure#0} as core::ops::function::FnOnce<()>>::call_once
17.41 s
> note: Some details are omitted, run with `RUST_BACKTRACE=full` for a verbose backtrace.
17.41 s
>
17.41 s
> FAIL [ 0.038s] (218/224) idenso tensor::tests::parsing :: infinite_execution
17.41 s
> stdout ---
17.41 s
>
17.41 s
> running 1 test
17.41 s
> ━━━━━━━━━━━━━━━━━━━━━━━━━━━━━━━ Snapshot Summary ━━━━━━━━━━━━━━━━━━━━━━━━━━━━━━━
17.41 s
> Snapshot: infinite_execution
17.41 s
> Source: crates/idenso/src/tensor/tests/parsing.rs:910
17.41 s
> ────────────────────────────────────────────────────────────────────────────────
17.41 s
> Expression: net_iter.snapshot_dot()
17.41 s
> ────────────────────────────────────────────────────────────────────────────────
17.41 s
> -old snapshot
17.41 s
> +new results
17.41 s
> ────────────┬───────────────────────────────────────────────────────────────────
17.41 s
> 8 8 │ 0:0:s -> ext0 [id=0 color="red"];
17.41 s
> 9 9 │ ext1 [style=invis];
17.41 s
> 10 10 │ 0:5:s -> ext1 [id=1 dir=none color="red" label="mink4|l_0"];
17.41 s
> 11 11 │ ext2 [style=invis];
17.41 s
> 12 │- 0:4:s -> ext2 [id=2 dir=none color="red" label="bis4|l_2"];
17.41 s
> 12 │+ 0:3:s -> ext2 [id=2 dir=none color="red" label="mink4|l_1"];
17.41 s
> 13 13 │ ext3 [style=invis];
17.41 s
> 14 │- 0:3:s -> ext3 [id=3 dir=none color="red" label="bis4|l_3"];
17.41 s
> 14 │+ 0:1:s -> ext3 [id=3 dir=none color="red" label="bis4|l_2"];
17.41 s
> 15 15 │ ext4 [style=invis];
17.41 s
> 16 │- 0:1:s -> ext4 [id=4 dir=none color="red" label="mink4|l_1"];
17.41 s
> 16 │+ 0:2:s -> ext4 [id=4 dir=none color="red" label="mink4|l_4"];
17.41 s
> 17 17 │ ext5 [style=invis];
17.41 s
> 18 │- 0:2:s -> ext5 [id=5 dir=none color="red" label="mink4|l_4"];
17.41 s
> 18 │+ 0:4:s -> ext5 [id=5 dir=none color="red" label="bis4|l_3"];
17.41 s
> 19 19 │ }
17.41 s
> ────────────┴───────────────────────────────────────────────────────────────────
17.41 s
> To update snapshots run `cargo insta review`
17.41 s
> Stopped on the first failure. Run `cargo insta test` to run all snapshots.
17.41 s
> test tensor::tests::parsing::infinite_execution ... FAILED
17.41 s
>
17.41 s
> failures:
17.41 s
>
17.41 s
> failures:
17.41 s
> tensor::tests::parsing::infinite_execution
17.41 s
>
17.41 s
> test result: FAILED. 0 passed; 1 failed; 0 ignored; 0 measured; 240 filtered out; finished in 0.03s
17.41 s
>
17.41 s
> stderr ---
17.41 s
>
17.41 s
> thread 'tensor::tests::parsing::infinite_execution' (846) panicked at /nix/store/p13pfw1gvvk8m860apfhvzcgidxhbs7g-vendor-cargo-deps/c19b7c6f923b580ac259164a89f2577984ad5ab09ee9d583b888f934adbbe8d0/insta-1.47.2/src/runtime.rs:719:13:
17.41 s
> snapshot assertion for 'infinite_execution' failed in line 910
17.41 s
> stack backtrace:
17.41 s
> 0: __rustc::rust_begin_unwind
17.41 s
> 1: core::panicking::panic_fmt
17.41 s
> 2: insta::runtime::assert_snapshot
17.41 s
> 3: idenso::tensor::tests::parsing::infinite_execution
17.41 s
> 4: <idenso::tensor::tests::parsing::infinite_execution::{closure#0} as core::ops::function::FnOnce<()>>::call_once
17.41 s
> note: Some details are omitted, run with `RUST_BACKTRACE=full` for a verbose backtrace.
17.41 s
>
17.41 s
> error : test run failed
17.41 s
>
17.41 s
> ========== nextest test summary ==========
17.41 s
> report: target/nextest/ci_gammaloop/junit.xml
17.41 s
> tests: 224, failures: 2, errors: 0
17.41 s
>
17.41 s
> 1. idenso::color::test::form_reference::metric_contraction_respects_antisymmetric_normalization
17.41 s
> failure: test failure with exit code 101
17.41 s
> thread 'color::test::form_reference::metric_contraction_respects_antisymmetric_normalization' (336) panicked at crates/idenso/src/color/test/form_reference.rs:171:5:
17.41 s
> assertion `left == right` failed
17.41 s
> left: "-1*f(coad(8,standalone_metric_j),coad(8,standalone_metric_s),coad(8,standalone_metric_u))"
17.41 s
> right: "f(coad(8,standalone_metric_j),coad(8,standalone_metric_s),coad(8,standalone_metric_u))"
17.41 s
> stack backtrace:
17.41 s
> 0: __rustc::rust_begin_unwind
17.41 s
> 1: core::panicking::panic_fmt
17.41 s
> 2: core::panicking::assert_failed_inner
17.41 s
> 3: core::panicking::assert_failed::<alloc::string::String, alloc::string::String>
17.41 s
> 4: idenso::color::test::form_reference::metric_contraction_respects_antisymmetric_normalization
17.41 s
> 5: <idenso::color::test::form_reference::metric_contraction_respects_antisymmetric_normalization::{closure#0} as core::ops::function::FnOnce<()>>::call_once
17.41 s
> note: Some details are omitted, run with `RUST_BACKTRACE=full` for a verbose backtrace.
17.41 s
> system-out
17.41 s
> running 1 test
17.41 s
> test color::test::form_reference::metric_contraction_respects_antisymmetric_normalization ... FAILED
17.41 s
>
17.41 s
> failures:
17.41 s
>
17.41 s
> failures:
17.41 s
> color::test::form_reference::metric_contraction_respects_antisymmetric_normalization
17.41 s
>
17.41 s
> test result: FAILED. 0 passed; 1 failed; 0 ignored; 0 measured; 240 filtered out; finished in 0.01s
17.41 s
> system-err
17.41 s
> thread 'color::test::form_reference::metric_contraction_respects_antisymmetric_normalization' (336) panicked at crates/idenso/src/color/test/form_reference.rs:171:5:
17.41 s
> assertion `left == right` failed
17.41 s
> left: "-1*f(coad(8,standalone_metric_j),coad(8,standalone_metric_s),coad(8,standalone_metric_u))"
17.41 s
> right: "f(coad(8,standalone_metric_j),coad(8,standalone_metric_s),coad(8,standalone_metric_u))"
17.41 s
> stack backtrace:
17.41 s
> 0: __rustc::rust_begin_unwind
17.41 s
> 1: core::panicking::panic_fmt
17.41 s
> 2: core::panicking::assert_failed_inner
17.41 s
> 3: core::panicking::assert_failed::<alloc::string::String, alloc::string::String>
17.41 s
> 4: idenso::color::test::form_reference::metric_contraction_respects_antisymmetric_normalization
17.41 s
> 5: <idenso::color::test::form_reference::metric_contraction_respects_antisymmetric_normalization::{closure#0} as core::ops::function::FnOnce<()>>::call_once
17.41 s
> note: Some details are omitted, run with `RUST_BACKTRACE=full` for a verbose backtrace.
17.41 s
>
17.41 s
> 2. idenso::tensor::tests::parsing::infinite_execution
17.41 s
> failure: test failure with exit code 101
17.41 s
> thread 'tensor::tests::parsing::infinite_execution' (846) panicked at /nix/store/p13pfw1gvvk8m860apfhvzcgidxhbs7g-vendor-cargo-deps/c19b7c6f923b580ac259164a89f2577984ad5ab09ee9d583b888f934adbbe8d0/insta-1.47.2/src/runtime.rs:719:13:
17.41 s
> snapshot assertion for 'infinite_execution' failed in line 910
17.41 s
> stack backtrace:
17.41 s
> 0: __rustc::rust_begin_unwind
17.41 s
> 1: core::panicking::panic_fmt
17.41 s
> 2: insta::runtime::assert_snapshot
17.41 s
> 3: idenso::tensor::tests::parsing::infinite_execution
17.41 s
> 4: <idenso::tensor::tests::parsing::infinite_execution::{closure#0} as core::ops::function::FnOnce<()>>::call_once
17.41 s
> note: Some details are omitted, run with `RUST_BACKTRACE=full` for a verbose backtrace.
17.41 s
> system-out
17.41 s
> running 1 test
17.41 s
> ━━━━━━━━━━━━━━━━━━━━━━━━━━━━━━━ Snapshot Summary ━━━━━━━━━━━━━━━━━━━━━━━━━━━━━━━
17.41 s
> Snapshot: infinite_execution
17.41 s
> Source: crates/idenso/src/tensor/tests/parsing.rs:910
17.41 s
> ────────────────────────────────────────────────────────────────────────────────
17.41 s
> Expression: net_iter.snapshot_dot()
17.41 s
> ────────────────────────────────────────────────────────────────────────────────
17.41 s
> -old snapshot
17.41 s
> +new results
17.41 s
> ────────────┬───────────────────────────────────────────────────────────────────
17.41 s
> 8 8 │ 0:0:s-> ext0 [id=0 color="red"];
17.41 s
> 9 9 │ ext1 [style=invis];
17.41 s
> 10 10 │ 0:5:s-> ext1 [id=1 dir=none color="red" label="mink4|l_0"];
17.41 s
> 11 11 │ ext2 [style=invis];
17.41 s
> 12 │- 0:4:s-> ext2 [id=2 dir=none color="red" label="bis4|l_2"];
17.41 s
> 12 │+ 0:3:s-> ext2 [id=2 dir=none color="red" label="mink4|l_1"];
17.41 s
> 13 13 │ ext3 [style=invis];
17.41 s
> 14 │- 0:3:s-> ext3 [id=3 dir=none color="red" label="bis4|l_3"];
17.41 s
> 14 │+ 0:1:s-> ext3 [id=3 dir=none color="red" label="bis4|l_2"];
17.41 s
> 15 15 │ ext4 [style=invis];
17.41 s
> 16 │- 0:1:s-> ext4 [id=4 dir=none color="red" label="mink4|l_1"];
17.41 s
> 16 │+ 0:2:s-> ext4 [id=4 dir=none color="red" label="mink4|l_4"];
17.41 s
> 17 17 │ ext5 [style=invis];
17.41 s
> 18 │- 0:2:s-> ext5 [id=5 dir=none color="red" label="mink4|l_4"];
17.41 s
> 18 │+ 0:4:s-> ext5 [id=5 dir=none color="red" label="bis4|l_3"];
17.41 s
> 19 19 │ }
17.41 s
> ────────────┴───────────────────────────────────────────────────────────────────
17.41 s
> To update snapshots run `cargo insta review`
17.41 s
> Stopped on the first failure. Run `cargo insta test` to run all snapshots.
17.41 s
> test tensor::tests::parsing::infinite_execution ... FAILED
17.41 s
>
17.41 s
> failures:
17.41 s
>
17.41 s
> failures:
17.41 s
> tensor::tests::parsing::infinite_execution
17.41 s
>
17.41 s
> test result: FAILED. 0 passed; 1 failed; 0 ignored; 0 measured; 240 filtered out; finished in 0.03s
17.41 s
> system-err
17.41 s
> thread 'tensor::tests::parsing::infinite_execution' (846) panicked at /nix/store/p13pfw1gvvk8m860apfhvzcgidxhbs7g-vendor-cargo-deps/c19b7c6f923b580ac259164a89f2577984ad5ab09ee9d583b888f934adbbe8d0/insta-1.47.2/src/runtime.rs:719:13:
17.41 s
> snapshot assertion for 'infinite_execution' failed in line 910
17.41 s
> stack backtrace:
17.41 s
> 0: __rustc::rust_begin_unwind
17.41 s
> 1: core::panicking::panic_fmt
17.41 s
> 2: insta::runtime::assert_snapshot
17.41 s
> 3: idenso::tensor::tests::parsing::infinite_execution
17.41 s
> 4: <idenso::tensor::tests::parsing::infinite_execution::{closure#0} as core::ops::function::FnOnce<()>>::call_once
17.41 s
> note: Some details are omitted, run with `RUST_BACKTRACE=full` for a verbose backtrace.
17.41 s
> =========================================
17.41 s
> Extracting 2 binaries and 1 linked path to /build/nextest-archive-ffTKUZ
17.41 s
> Extracted 8 files to /build/nextest-archive-ffTKUZ in 0.07s
17.41 s
> ------------
17.41 s
> Nextest run ID 9696ad40-1b10-44d5-98f7-01119906db46 with nextest profile: ci_gammaloop
17.41 s
> Starting 135 tests across 2 binaries
17.41 s
> ------------
17.41 s
> Summary [ 0.077s] 135 tests run: 135 passed , 0 skipped
17.41 s
>
17.41 s
> ========== nextest test summary ==========
17.41 s
> report: target/nextest/ci_gammaloop/junit.xml
17.41 s
> tests: 135, failures: 0, errors: 0
17.41 s
> No failing testcases found.
17.41 s
> =========================================
17.41 s
> Extracting 5 binaries and 2 linked paths to /build/nextest-archive-p31EFW
17.41 s
> Extracted 19 files to /build/nextest-archive-p31EFW in 0.19s
17.41 s
> ------------
17.41 s
> Nextest run ID 8de20d47-6b69-4492-a8b2-6a1ff20026c8 with nextest profile: ci_gammaloop
17.41 s
> Starting 25 tests across 5 binaries (1 test skipped via profile.ci_gammaloop.default-filter )
17.41 s
> ------------
17.41 s
> Summary [ 0.194s] 25 tests run: 25 passed , 1 skipped
17.41 s
>
17.41 s
> ========== nextest test summary ==========
17.41 s
> report: target/nextest/ci_gammaloop/junit.xml
17.41 s
> tests: 25, failures: 0, errors: 0
17.41 s
> No failing testcases found.
17.41 s
> =========================================
17.41 s
> Extracting 2 binaries and 1 linked path to /build/nextest-archive-3z391M
17.41 s
> Extracted 8 files to /build/nextest-archive-3z391M in 0.05s
17.41 s
> ------------
17.41 s
> Nextest run ID d3e2d6d3-dba2-4cb7-a0be-3c69fc31a9c2 with nextest profile: ci_gammaloop
17.41 s
> Starting 1 test across 2 binaries
17.41 s
> ------------
17.41 s
> Summary [ 0.005s] 1 test run: 1 passed , 0 skipped
17.41 s
>
17.41 s
> ========== nextest test summary ==========
17.41 s
> report: target/nextest/ci_gammaloop/junit.xml
17.41 s
> tests: 1, failures: 0, errors: 0
17.41 s
> No failing testcases found.
17.41 s
> =========================================
17.41 s
> Extracting 1 binary and 1 linked path to /build/nextest-archive-i0dR4o
17.41 s
> Extracted 7 files to /build/nextest-archive-i0dR4o in 0.05s
17.41 s
> ------------
17.41 s
> Nextest run ID 6ce54cc0-0496-4221-8527-dfceddf659a1 with nextest profile: ci_gammaloop
17.41 s
> Starting 0 tests across 1 binary
17.41 s
> ------------
17.41 s
> Summary [ 0.000s] 0 tests run: 0 passed , 0 skipped
17.41 s
>
17.41 s
> ========== nextest test summary ==========
17.41 s
> report: target/nextest/ci_gammaloop/junit.xml
17.41 s
> tests: 0, failures: 0, errors: 0
17.41 s
> No failing testcases found.
17.41 s
> =========================================
17.41 s
For full logs, run:
17.41 s
nix log /nix/store/8hj2j3n1562bs62vvl44s3db1hsxblr2-gammaloop-nextest-spenso.drv
17.50 s
[0 built (1 failed ), 0.0 Run failed.