1. 1.09 s $ /nix/store/9ypz3flqsrl5xl495mm8h645gadjsxi1-coreutils-9.11/bin/timeout --kill-after=15s 7200s /nix/store/23zk8sgzamrbmj1fday15szf7f2279s8-nix-2.34.7/bin/nix --extra-experimental-features nix-command --extra-experimental-features flakes flake clone git+https://github.com/alphal00p/gammaloop --dest /tmp/nix-ci-worker/stable-pwd/repo/
  2. 1.12 s Cloning into '/tmp/nix-ci-worker/stable-pwd/repo'...
  3. 1.12 s remote: Enumerating objects: 65060, done.
  4. 1.36 s remote: Counting objects: 0% (1/7732) remote: Counting objects: 1% (78/7732) remote: Counting objects: 2% (155/7732) remote: Counting objects: 3% (232/7732) remote: Counting objects: 4% (310/7732) remote: Counting objects: 5% (387/7732) remote: Counting objects: 6% (464/7732) remote: Counting objects: 7% (542/7732) remote: Counting objects: 8% (619/7732) remote: Counting objects: 9% (696/7732) remote: Counting objects: 10% (774/7732) remote: Counting objects: 11% (851/7732) remote: Counting objects: 12% (928/7732) remote: Counting objects: 13% (1006/7732) remote: Counting objects: 14% (1083/7732) remote: Counting objects: 15% (1160/7732) remote: Counting objects: 16% (1238/7732) remote: Counting objects: 17% (1315/7732) remote: Counting objects: 18% (1392/7732) remote: Counting objects: 19% (1470/7732) remote: Counting objects: 20% (1547/7732) remote: Counting objects: 21% (1624/7732) remote: Counting objects: 22% (1702/7732) remote: Counting objects: 23% (1779/7732) remote: Counting objects: 24% (1856/7732) remote: Counting objects: 25% (1933/7732) remote: Counting objects: 26% (2011/7732) remote: Counting objects: 27% (2088/7732) remote: Counting objects: 28% (2165/7732) remote: Counting objects: 29% (2243/7732) remote: Counting objects: 30% (2320/7732) remote: Counting objects: 31% (2397/7732) remote: Counting objects: 32% (2475/7732) remote: Counting objects: 33% (2552/7732) remote: Counting objects: 34% (2629/7732) remote: Counting objects: 35% (2707/7732) remote: Counting objects: 36% (2784/7732) remote: Counting objects: 37% (2861/7732) remote: Counting objects: 38% (2939/7732) remote: Counting objects: 39% (3016/7732) remote: Counting objects: 40% (3093/7732) remote: Counting objects: 41% (3171/7732) remote: Counting objects: 42% (3248/7732) remote: Counting objects: 43% (3325/7732) remote: Counting objects: 44% (3403/7732) remote: Counting objects: 45% (3480/7732) remote: Counting objects: 46% (3557/7732) remote: Counting objects: 47% (3635/7732) remote: Counting objects: 48% (3712/7732) remote: Counting objects: 49% (3789/7732) remote: Counting objects: 50% (3866/7732) remote: Counting objects: 51% (3944/7732) remote: Counting objects: 52% (4021/7732) remote: Counting objects: 53% (4098/7732) remote: Counting objects: 54% (4176/7732) remote: Counting objects: 55% (4253/7732) remote: Counting objects: 56% (4330/7732) remote: Counting objects: 57% (4408/7732) remote: Counting objects: 58% (4485/7732) remote: Counting objects: 59% (4562/7732) remote: Counting objects: 60% (4640/7732) remote: Counting objects: 61% (4717/7732) remote: Counting objects: 62% (4794/7732) remote: Counting objects: 63% (4872/7732) remote: Counting objects: 64% (4949/7732) remote: Counting objects: 65% (5026/7732) remote: Counting objects: 66% (5104/7732) remote: Counting objects: 67% (5181/7732) remote: Counting objects: 68% (5258/7732) remote: Counting objects: 69% (5336/7732) remote: Counting objects: 70% (5413/7732) remote: Counting objects: 71% (5490/7732) remote: Counting objects: 72% (5568/7732) remote: Counting objects: 73% (5645/7732) remote: Counting objects: 74% (5722/7732) remote: Counting objects: 75% (5799/7732) remote: Counting objects: 76% (5877/7732) remote: Counting objects: 77% (5954/7732) remote: Counting objects: 78% (6031/7732) remote: Counting objects: 79% (6109/7732) remote: Counting objects: 80% (6186/7732) remote: Counting objects: 81% (6263/7732) remote: Counting objects: 82% (6341/7732) remote: Counting objects: 83% (6418/7732) remote: Counting objects: 84% (6495/7732) remote: Counting objects: 85% (6573/7732) remote: Counting objects: 86% (6650/7732) remote: Counting objects: 87% (6727/7732) remote: Counting objects: 88% (6805/7732) remote: Counting objects: 89% (6882/7732) remote: Counting objects: 90% (6959/7732) remote: Counting objects: 91% (7037/7732) remote: Counting objects: 92% (7114/7732) remote: Counting objects: 93% (7191/7732) remote: Counting objects: 94% (7269/7732) remote: Counting objects: 95% (7346/7732) remote: Counting objects: 96% (7423/7732) remote: Counting objects: 97% (7501/7732) remote: Counting objects: 98% (7578/7732) remote: Counting objects: 99% (7655/7732) remote: Counting objects: 100% (7732/7732) remote: Counting objects: 100% (7732/7732), done.
  5. 2.60 s remote: Compressing objects: 0% (1/1434) remote: Compressing objects: 1% (15/1434) remote: Compressing objects: 2% (29/1434) remote: Compressing objects: 3% (44/1434) remote: Compressing objects: 4% (58/1434) remote: Compressing objects: 5% (72/1434) remote: Compressing objects: 6% (87/1434) remote: Compressing objects: 7% (101/1434) remote: Compressing objects: 8% (115/1434) remote: Compressing objects: 9% (130/1434) remote: Compressing objects: 10% (144/1434) remote: Compressing objects: 11% (158/1434) remote: Compressing objects: 12% (173/1434) remote: Compressing objects: 13% (187/1434) remote: Compressing objects: 13% (194/1434) remote: Compressing objects: 14% (201/1434) remote: Compressing objects: 15% (216/1434) remote: Compressing objects: 16% (230/1434) remote: Compressing objects: 17% (244/1434) remote: Compressing objects: 18% (259/1434) remote: Compressing objects: 19% (273/1434) remote: Compressing objects: 20% (287/1434) remote: Compressing objects: 21% (302/1434) remote: Compressing objects: 22% (316/1434) remote: Compressing objects: 23% (330/1434) remote: Compressing objects: 24% (345/1434) remote: Compressing objects: 25% (359/1434) remote: Compressing objects: 26% (373/1434) remote: Compressing objects: 27% (388/1434) remote: Compressing objects: 28% (402/1434) remote: Compressing objects: 29% (416/1434) remote: Compressing objects: 30% (431/1434) remote: Compressing objects: 31% (445/1434) remote: Compressing objects: 32% (459/1434) remote: Compressing objects: 33% (474/1434) remote: Compressing objects: 34% (488/1434) remote: Compressing objects: 35% (502/1434) remote: Compressing objects: 36% (517/1434) remote: Compressing objects: 37% (531/1434) remote: Compressing objects: 38% (545/1434) remote: Compressing objects: 39% (560/1434) remote: Compressing objects: 40% (574/1434) remote: Compressing objects: 41% (588/1434) remote: Compressing objects: 42% (603/1434) remote: Compressing objects: 43% (617/1434) remote: Compressing objects: 44% (631/1434) remote: Compressing objects: 45% (646/1434) remote: Compressing objects: 46% (660/1434) remote: Compressing objects: 47% (674/1434) remote: Compressing objects: 48% (689/1434) remote: Compressing objects: 49% (703/1434) remote: Compressing objects: 50% (717/1434) remote: Compressing objects: 51% (732/1434) remote: Compressing objects: 52% (746/1434) remote: Compressing objects: 53% (761/1434) remote: Compressing objects: 54% (775/1434) remote: Compressing objects: 55% (789/1434) remote: Compressing objects: 56% (804/1434) remote: Compressing objects: 57% (818/1434) remote: Compressing objects: 58% (832/1434) remote: Compressing objects: 59% (847/1434) remote: Compressing objects: 60% (861/1434) remote: Compressing objects: 61% (875/1434) remote: Compressing objects: 62% (890/1434) remote: Compressing objects: 63% (904/1434) remote: Compressing objects: 64% (918/1434) remote: Compressing objects: 65% (933/1434) remote: Compressing objects: 66% (947/1434) remote: Compressing objects: 67% (961/1434) remote: Compressing objects: 68% (976/1434) remote: Compressing objects: 69% (990/1434) remote: Compressing objects: 70% (1004/1434) remote: Compressing objects: 71% (1019/1434) remote: Compressing objects: 72% (1033/1434) remote: Compressing objects: 73% (1047/1434) remote: Compressing objects: 74% (1062/1434) remote: Compressing objects: 75% (1076/1434) remote: Compressing objects: 76% (1090/1434) remote: Compressing objects: 77% (1105/1434) remote: Compressing objects: 78% (1119/1434) remote: Compressing objects: 79% (1133/1434) remote: Compressing objects: 80% (1148/1434) remote: Compressing objects: 81% (1162/1434) remote: Compressing objects: 82% (1176/1434) remote: Compressing objects: 83% (1191/1434) remote: Compressing objects: 84% (1205/1434) remote: Compressing objects: 85% (1219/1434) remote: Compressing objects: 86% (1234/1434) remote: Compressing objects: 87% (1248/1434) remote: Compressing objects: 88% (1262/1434) remote: Compressing objects: 89% (1277/1434) remote: Compressing objects: 90% (1291/1434) remote: Compressing objects: 91% (1305/1434) remote: Compressing objects: 92% (1320/1434) remote: Compressing objects: 93% (1334/1434) remote: Compressing objects: 94% (1348/1434) remote: Compressing objects: 95% (1363/1434) remote: Compressing objects: 96% (1377/1434) remote: Compressing objects: 97% (1391/1434) remote: Compressing objects: 98% (1406/1434) remote: Compressing objects: 99% (1420/1434) remote: Compressing objects: 100% (1434/1434) remote: Compressing objects: 100% (1434/1434), done.
  6. 5.49 s Receiving objects: 0% (1/65060) Receiving objects: 1% (651/65060) Receiving objects: 2% (1302/65060) Receiving objects: 3% (1952/65060) Receiving objects: 4% (2603/65060) Receiving objects: 5% (3253/65060) Receiving objects: 6% (3904/65060) Receiving objects: 7% (4555/65060) Receiving objects: 8% (5205/65060) Receiving objects: 9% (5856/65060) Receiving objects: 10% (6506/65060) Receiving objects: 11% (7157/65060) Receiving objects: 12% (7808/65060), 13.34 MiB | 26.66 MiB/s Receiving objects: 13% (8458/65060), 13.34 MiB | 26.66 MiB/s Receiving objects: 14% (9109/65060), 13.34 MiB | 26.66 MiB/s Receiving objects: 15% (9759/65060), 13.34 MiB | 26.66 MiB/s Receiving objects: 16% (10410/65060), 13.34 MiB | 26.66 MiB/s Receiving objects: 17% (11061/65060), 13.34 MiB | 26.66 MiB/s Receiving objects: 18% (11711/65060), 13.34 MiB | 26.66 MiB/s Receiving objects: 19% (12362/65060), 13.34 MiB | 26.66 MiB/s Receiving objects: 20% (13012/65060), 13.34 MiB | 26.66 MiB/s Receiving objects: 21% (13663/65060), 13.34 MiB | 26.66 MiB/s Receiving objects: 22% (14314/65060), 13.34 MiB | 26.66 MiB/s Receiving objects: 23% (14964/65060), 13.34 MiB | 26.66 MiB/s Receiving objects: 24% (15615/65060), 13.34 MiB | 26.66 MiB/s Receiving objects: 25% (16265/65060), 13.34 MiB | 26.66 MiB/s Receiving objects: 26% (16916/65060), 13.34 MiB | 26.66 MiB/s Receiving objects: 27% (17567/65060), 13.34 MiB | 26.66 MiB/s Receiving objects: 28% (18217/65060), 13.34 MiB | 26.66 MiB/s Receiving objects: 29% (18868/65060), 13.34 MiB | 26.66 MiB/s Receiving objects: 30% (19518/65060), 13.34 MiB | 26.66 MiB/s Receiving objects: 31% (20169/65060), 13.34 MiB | 26.66 MiB/s Receiving objects: 32% (20820/65060), 13.34 MiB | 26.66 MiB/s Receiving objects: 33% (21470/65060), 13.34 MiB | 26.66 MiB/s Receiving objects: 34% (22121/65060), 13.34 MiB | 26.66 MiB/s Receiving objects: 35% (22771/65060), 13.34 MiB | 26.66 MiB/s Receiving objects: 36% (23422/65060), 13.34 MiB | 26.66 MiB/s Receiving objects: 37% (24073/65060), 13.34 MiB | 26.66 MiB/s Receiving objects: 38% (24723/65060), 13.34 MiB | 26.66 MiB/s Receiving objects: 39% (25374/65060), 13.34 MiB | 26.66 MiB/s Receiving objects: 40% (26024/65060), 13.34 MiB | 26.66 MiB/s Receiving objects: 41% (26675/65060), 13.34 MiB | 26.66 MiB/s Receiving objects: 42% (27326/65060), 13.34 MiB | 26.66 MiB/s Receiving objects: 43% (27976/65060), 13.34 MiB | 26.66 MiB/s Receiving objects: 44% (28627/65060), 13.34 MiB | 26.66 MiB/s Receiving objects: 45% (29277/65060), 13.34 MiB | 26.66 MiB/s Receiving objects: 46% (29928/65060), 13.34 MiB | 26.66 MiB/s Receiving objects: 47% (30579/65060), 13.34 MiB | 26.66 MiB/s Receiving objects: 48% (31229/65060), 13.34 MiB | 26.66 MiB/s Receiving objects: 49% (31880/65060), 13.34 MiB | 26.66 MiB/s Receiving objects: 50% (32530/65060), 13.34 MiB | 26.66 MiB/s Receiving objects: 50% (32753/65060), 30.13 MiB | 30.15 MiB/s Receiving objects: 51% (33181/65060), 30.13 MiB | 30.15 MiB/s Receiving objects: 52% (33832/65060), 30.13 MiB | 30.15 MiB/s Receiving objects: 53% (34482/65060), 30.13 MiB | 30.15 MiB/s Receiving objects: 54% (35133/65060), 30.13 MiB | 30.15 MiB/s Receiving objects: 55% (35783/65060), 30.13 MiB | 30.15 MiB/s Receiving objects: 56% (36434/65060), 30.13 MiB | 30.15 MiB/s Receiving objects: 57% (37085/65060), 30.13 MiB | 30.15 MiB/s Receiving objects: 58% (37735/65060), 30.13 MiB | 30.15 MiB/s Receiving objects: 59% (38386/65060), 30.13 MiB | 30.15 MiB/s Receiving objects: 60% (39036/65060), 30.13 MiB | 30.15 MiB/s Receiving objects: 61% (39687/65060), 45.43 MiB | 30.32 MiB/s Receiving objects: 62% (40338/65060), 45.43 MiB | 30.32 MiB/s Receiving objects: 63% (40988/65060), 45.43 MiB | 30.32 MiB/s Receiving objects: 64% (41639/65060), 45.43 MiB | 30.32 MiB/s Receiving objects: 65% (42289/65060), 45.43 MiB | 30.32 MiB/s Receiving objects: 66% (42940/65060), 45.43 MiB | 30.32 MiB/s Receiving objects: 67% (43591/65060), 45.43 MiB | 30.32 MiB/s Receiving objects: 68% (44241/65060), 45.43 MiB | 30.32 MiB/s Receiving objects: 69% (44892/65060), 45.43 MiB | 30.32 MiB/s Receiving objects: 70% (45542/65060), 45.43 MiB | 30.32 MiB/s Receiving objects: 71% (46193/65060), 45.43 MiB | 30.32 MiB/s Receiving objects: 72% (46844/65060), 45.43 MiB | 30.32 MiB/s Receiving objects: 73% (47494/65060), 45.43 MiB | 30.32 MiB/s Receiving objects: 73% (47519/65060), 45.43 MiB | 30.32 MiB/s Receiving objects: 74% (48145/65060), 59.90 MiB | 29.97 MiB/s Receiving objects: 75% (48795/65060), 59.90 MiB | 29.97 MiB/s Receiving objects: 76% (49446/65060), 59.90 MiB | 29.97 MiB/s Receiving objects: 77% (50097/65060), 59.90 MiB | 29.97 MiB/s Receiving objects: 78% (50747/65060), 59.90 MiB | 29.97 MiB/s Receiving objects: 79% (51398/65060), 59.90 MiB | 29.97 MiB/s Receiving objects: 80% (52048/65060), 59.90 MiB | 29.97 MiB/s Receiving objects: 81% (52699/65060), 75.32 MiB | 30.15 MiB/s Receiving objects: 82% (53350/65060), 75.32 MiB | 30.15 MiB/s Receiving objects: 83% (54000/65060), 75.32 MiB | 30.15 MiB/s Receiving objects: 84% (54651/65060), 75.32 MiB | 30.15 MiB/s Receiving objects: 85% (55301/65060), 75.32 MiB | 30.15 MiB/s Receiving objects: 86% (55952/65060), 75.32 MiB | 30.15 MiB/s Receiving objects: 87% (56603/65060), 75.32 MiB | 30.15 MiB/s Receiving objects: 88% (57253/65060), 75.32 MiB | 30.15 MiB/s Receiving objects: 89% (57904/65060), 75.32 MiB | 30.15 MiB/s Receiving objects: 90% (58554/65060), 75.32 MiB | 30.15 MiB/s Receiving objects: 91% (59205/65060), 75.32 MiB | 30.15 MiB/s Receiving objects: 92% (59856/65060), 75.32 MiB | 30.15 MiB/s Receiving objects: 93% (60506/65060), 75.32 MiB | 30.15 MiB/s Receiving objects: 94% (61157/65060), 75.32 MiB | 30.15 MiB/s Receiving objects: 95% (61807/65060), 75.32 MiB | 30.15 MiB/s Receiving objects: 96% (62458/65060), 75.32 MiB | 30.15 MiB/s Receiving objects: 97% (63109/65060), 75.32 MiB | 30.15 MiB/s Receiving objects: 98% (63759/65060), 75.32 MiB | 30.15 MiB/s Receiving objects: 99% (64410/65060), 75.32 MiB | 30.15 MiB/s remote: Total 65060 (delta 6825), reused 6316 (delta 6297), pack-reused 57328 (from 1)
  7. 5.49 s Receiving objects: 100% (65060/65060), 75.32 MiB | 30.15 MiB/s Receiving objects: 100% (65060/65060), 87.00 MiB | 30.23 MiB/s, done.
  8. 6.21 s Resolving deltas: 0% (0/45922) Resolving deltas: 1% (460/45922) Resolving deltas: 2% (919/45922) Resolving deltas: 3% (1378/45922) Resolving deltas: 4% (1837/45922) Resolving deltas: 5% (2297/45922) Resolving deltas: 6% (2756/45922) Resolving deltas: 7% (3219/45922) Resolving deltas: 8% (3676/45922) Resolving deltas: 9% (4133/45922) Resolving deltas: 10% (4593/45922) Resolving deltas: 11% (5052/45922) Resolving deltas: 12% (5511/45922) Resolving deltas: 13% (5970/45922) Resolving deltas: 14% (6430/45922) Resolving deltas: 15% (6889/45922) Resolving deltas: 16% (7349/45922) Resolving deltas: 17% (7807/45922) Resolving deltas: 18% (8266/45922) Resolving deltas: 19% (8726/45922) Resolving deltas: 20% (9185/45922) Resolving deltas: 21% (9644/45922) Resolving deltas: 22% (10103/45922) Resolving deltas: 23% (10563/45922) Resolving deltas: 24% (11022/45922) Resolving deltas: 25% (11482/45922) Resolving deltas: 26% (11940/45922) Resolving deltas: 27% (12401/45922) Resolving deltas: 28% (12859/45922) Resolving deltas: 29% (13318/45922) Resolving deltas: 30% (13777/45922) Resolving deltas: 31% (14236/45922) Resolving deltas: 32% (14696/45922) Resolving deltas: 33% (15157/45922) Resolving deltas: 34% (15615/45922) Resolving deltas: 35% (16073/45922) Resolving deltas: 36% (16532/45922) Resolving deltas: 37% (16992/45922) Resolving deltas: 38% (17451/45922) Resolving deltas: 39% (17911/45922) Resolving deltas: 40% (18369/45922) Resolving deltas: 41% (18829/45922) Resolving deltas: 42% (19289/45922) Resolving deltas: 43% (19747/45922) Resolving deltas: 44% (20206/45922) Resolving deltas: 45% (20665/45922) Resolving deltas: 46% (21125/45922) Resolving deltas: 47% (21584/45922) Resolving deltas: 48% (22044/45922) Resolving deltas: 49% (22503/45922) Resolving deltas: 50% (22961/45922) Resolving deltas: 51% (23421/45922) Resolving deltas: 52% (23880/45922) Resolving deltas: 53% (24339/45922) Resolving deltas: 54% (24800/45922) Resolving deltas: 55% (25258/45922) Resolving deltas: 56% (25717/45922) Resolving deltas: 57% (26176/45922) Resolving deltas: 58% (26635/45922) Resolving deltas: 59% (27094/45922) Resolving deltas: 60% (27554/45922) Resolving deltas: 61% (28013/45922) Resolving deltas: 62% (28472/45922) Resolving deltas: 63% (28931/45922) Resolving deltas: 64% (29391/45922) Resolving deltas: 65% (29850/45922) Resolving deltas: 66% (30309/45922) Resolving deltas: 67% (30768/45922) Resolving deltas: 68% (31227/45922) Resolving deltas: 69% (31687/45922) Resolving deltas: 70% (32146/45922) Resolving deltas: 71% (32605/45922) Resolving deltas: 72% (33064/45922) Resolving deltas: 73% (33524/45922) Resolving deltas: 74% (33983/45922) Resolving deltas: 75% (34442/45922) Resolving deltas: 76% (34901/45922) Resolving deltas: 77% (35360/45922) Resolving deltas: 78% (35821/45922) Resolving deltas: 79% (36282/45922) Resolving deltas: 80% (36738/45922) Resolving deltas: 81% (37197/45922) Resolving deltas: 82% (37657/45922) Resolving deltas: 83% (38116/45922) Resolving deltas: 84% (38575/45922) Resolving deltas: 85% (39035/45922) Resolving deltas: 86% (39493/45922) Resolving deltas: 87% (39953/45922) Resolving deltas: 88% (40412/45922) Resolving deltas: 89% (40871/45922) Resolving deltas: 90% (41330/45922) Resolving deltas: 91% (41790/45922) Resolving deltas: 92% (42249/45922) Resolving deltas: 93% (42708/45922) Resolving deltas: 94% (43167/45922) Resolving deltas: 95% (43628/45922) Resolving deltas: 96% (44087/45922) Resolving deltas: 97% (44545/45922) Resolving deltas: 98% (45004/45922) Resolving deltas: 99% (45463/45922) Resolving deltas: 100% (45922/45922) Resolving deltas: 100% (45922/45922), done.
  9. 7.04 s Fetching commit c1745ddd5ccecc94c54a846b90ea9a0e89de4682 for vakint_rustred ...
  10. 7.04 s $ /nix/store/bcnisk3ydfgv26v2gw3zlky24g00yww2-git-2.54.0/bin/git fetch origin c1745ddd5ccecc94c54a846b90ea9a0e89de4682
  11. 8.12 s From https://github.com/alphal00p/gammaloop
  12. 8.12 s * branch c1745ddd5ccecc94c54a846b90ea9a0e89de4682 -> FETCH_HEAD
  13. 8.16 s $ /nix/store/9ypz3flqsrl5xl495mm8h645gadjsxi1-coreutils-9.11/bin/timeout --kill-after=15s 7200s /nix/store/bcnisk3ydfgv26v2gw3zlky24g00yww2-git-2.54.0/bin/git -c advice.detachedHead=false checkout c1745ddd5ccecc94c54a846b90ea9a0e89de4682
  14. 8.45 s HEAD is now at c1745ddd Validate explicit RustRed tensor routings
  15. 8.48 s $ /nix/store/9ypz3flqsrl5xl495mm8h645gadjsxi1-coreutils-9.11/bin/timeout --kill-after=15s 7200s /nix/store/23zk8sgzamrbmj1fday15szf7f2279s8-nix-2.34.7/bin/nix --extra-experimental-features nix-command --extra-experimental-features flakes --log-format internal-json run .#packages.x86_64-linux.nix-ci-check-gammaloop-nextest-spenso --print-build-logs
  16. 16.16 s
  17. 24.84 s evaluating derivation 'g copying '/nix/store/1zhf evaluating derivation 'g copying '/nix/store/1zhf evaluating derivation 'g copying '/nix/store/1zhf evaluating derivation 'g copying '/nix/store/1zhf evaluating derivation 'g copying '/nix/store/1zhf evaluating derivation 'g copying '/nix/store/1zhf evaluating derivation 'g copying '/nix/store/51z7 evaluating derivation 'g querying gammaloop-nexte [0/13 built, 0.0 KiB DL] [0/1 built, 0.0 KiB DL] [1/0/1 built, 0.0 KiB DLgammaloop-nextest-spenso> Extracting 5 binaries and 2 linked paths to /build/nextest-archive-qZn7Dz
  18. 25.06 s gammaloop-nextest-spenso> Extracted 19 files to /build/nextest-archive-qZn7Dz in 0.22s
  19. 25.08 s gammaloop-nextest-spenso> ------------
  20. 25.08 s gammaloop-nextest-spenso> Nextest run ID 1cf26cc1-6758-45f5-a285-be9435a5f0f7 with nextest profile: ci_gammaloop
  21. 25.08 s gammaloop-nextest-spenso> Starting 224 tests across 5 binaries (26 tests skipped, including 2 tests via profile.ci_gammaloop.default-filter)
  22. 26.13 s gammaloop-nextest-spenso> FAIL [ 0.930s] (220/224) idenso color::test::form_reference::metric_contraction_respects_antisymmetric_normalization
  23. 26.13 s gammaloop-nextest-spenso> stdout ---
  24. 26.13 s gammaloop-nextest-spenso>
  25. 26.13 s gammaloop-nextest-spenso> running 1 test
  26. 26.13 s gammaloop-nextest-spenso> test color::test::form_reference::metric_contraction_respects_antisymmetric_normalization ... FAILED
  27. 26.13 s gammaloop-nextest-spenso>
  28. 26.13 s gammaloop-nextest-spenso> failures:
  29. 26.13 s gammaloop-nextest-spenso>
  30. 26.13 s gammaloop-nextest-spenso> failures:
  31. 26.13 s gammaloop-nextest-spenso> color::test::form_reference::metric_contraction_respects_antisymmetric_normalization
  32. 26.13 s gammaloop-nextest-spenso>
  33. 26.13 s gammaloop-nextest-spenso> test result: FAILED. 0 passed; 1 failed; 0 ignored; 0 measured; 240 filtered out; finished in 0.91s
  34. 26.13 s gammaloop-nextest-spenso>
  35. 26.13 s gammaloop-nextest-spenso> stderr ---
  36. 26.13 s gammaloop-nextest-spenso>
  37. 26.13 s gammaloop-nextest-spenso> thread 'color::test::form_reference::metric_contraction_respects_antisymmetric_normalization' (333) panicked at crates/idenso/src/color/test/form_reference.rs:171:5:
  38. 26.13 s gammaloop-nextest-spenso> assertion `left == right` failed
  39. 26.13 s gammaloop-nextest-spenso> left: "-1*f(coad(8,standalone_metric_j),coad(8,standalone_metric_s),coad(8,standalone_metric_u))"
  40. 26.13 s gammaloop-nextest-spenso> right: "f(coad(8,standalone_metric_j),coad(8,standalone_metric_s),coad(8,standalone_metric_u))"
  41. 26.13 s gammaloop-nextest-spenso> stack backtrace:
  42. 26.13 s gammaloop-nextest-spenso> 0: __rustc::rust_begin_unwind
  43. 26.13 s gammaloop-nextest-spenso> 1: core::panicking::panic_fmt
  44. 26.13 s gammaloop-nextest-spenso> 2: core::panicking::assert_failed_inner
  45. 26.13 s gammaloop-nextest-spenso> 3: core::panicking::assert_failed::<alloc::string::String, alloc::string::String>
  46. 26.13 s gammaloop-nextest-spenso> 4: idenso::color::test::form_reference::metric_contraction_respects_antisymmetric_normalization
  47. 26.13 s gammaloop-nextest-spenso> 5: <idenso::color::test::form_reference::metric_contraction_respects_antisymmetric_normalization::{closure#0} as core::ops::function::FnOnce<()>>::call_once
  48. 26.13 s gammaloop-nextest-spenso> note: Some details are omitted, run with `RUST_BACKTRACE=full` for a verbose backtrace.
  49. 26.13 s gammaloop-nextest-spenso>
  50. 26.16 s gammaloop-nextest-spenso> FAIL [ 0.562s] (221/224) idenso tensor::tests::parsing::infinite_execution
  51. 26.16 s gammaloop-nextest-spenso> stdout ---
  52. 26.16 s gammaloop-nextest-spenso>
  53. 26.16 s gammaloop-nextest-spenso> running 1 test
  54. 26.16 s gammaloop-nextest-spenso> ━━━━━━━━━━━━━━━━━━━━━━━━━━━━━━━ Snapshot Summary ━━━━━━━━━━━━━━━━━━━━━━━━━━━━━━━
  55. 26.16 s gammaloop-nextest-spenso> Snapshot: infinite_execution
  56. 26.16 s gammaloop-nextest-spenso> Source: crates/idenso/src/tensor/tests/parsing.rs:910
  57. 26.16 s gammaloop-nextest-spenso> ────────────────────────────────────────────────────────────────────────────────
  58. 26.16 s gammaloop-nextest-spenso> Expression: net_iter.snapshot_dot()
  59. 26.16 s gammaloop-nextest-spenso> ────────────────────────────────────────────────────────────────────────────────
  60. 26.16 s gammaloop-nextest-spenso> -old snapshot
  61. 26.16 s gammaloop-nextest-spenso> +new results
  62. 26.16 s gammaloop-nextest-spenso> ────────────┬───────────────────────────────────────────────────────────────────
  63. 26.16 s gammaloop-nextest-spenso> 8 8 │ 0:0:s -> ext0 [id=0 color="red"];
  64. 26.16 s gammaloop-nextest-spenso> 9 9 │ ext1 [style=invis];
  65. 26.16 s gammaloop-nextest-spenso> 10 10 │ 0:5:s -> ext1 [id=1 dir=none color="red" label="mink4|l_0"];
  66. 26.16 s gammaloop-nextest-spenso> 11 11 │ ext2 [style=invis];
  67. 26.16 s gammaloop-nextest-spenso> 12 │- 0:4:s -> ext2 [id=2 dir=none color="red" label="bis4|l_2"];
  68. 26.16 s gammaloop-nextest-spenso> 12 │+ 0:3:s -> ext2 [id=2 dir=none color="red" label="mink4|l_1"];
  69. 26.16 s gammaloop-nextest-spenso> 13 13 │ ext3 [style=invis];
  70. 26.16 s gammaloop-nextest-spenso> 14 │- 0:3:s -> ext3 [id=3 dir=none color="red" label="bis4|l_3"];
  71. 26.16 s gammaloop-nextest-spenso> 14 │+ 0:1:s -> ext3 [id=3 dir=none color="red" label="bis4|l_2"];
  72. 26.16 s gammaloop-nextest-spenso> 15 15 │ ext4 [style=invis];
  73. 26.16 s gammaloop-nextest-spenso> 16 │- 0:1:s -> ext4 [id=4 dir=none color="red" label="mink4|l_1"];
  74. 26.16 s gammaloop-nextest-spenso> 16 │+ 0:2:s -> ext4 [id=4 dir=none color="red" label="mink4|l_4"];
  75. 26.16 s gammaloop-nextest-spenso> 17 17 │ ext5 [style=invis];
  76. 26.16 s gammaloop-nextest-spenso> 18 │- 0:2:s -> ext5 [id=5 dir=none color="red" label="mink4|l_4"];
  77. 26.16 s gammaloop-nextest-spenso> 18 │+ 0:4:s -> ext5 [id=5 dir=none color="red" label="bis4|l_3"];
  78. 26.16 s gammaloop-nextest-spenso> 19 19 │ }
  79. 26.16 s gammaloop-nextest-spenso> ────────────┴───────────────────────────────────────────────────────────────────
  80. 26.16 s gammaloop-nextest-spenso> To update snapshots run `cargo insta review`
  81. 26.16 s gammaloop-nextest-spenso> Stopped on the first failure. Run `cargo insta test` to run all snapshots.
  82. 26.16 s gammaloop-nextest-spenso> test tensor::tests::parsing::infinite_execution ... FAILED
  83. 26.16 s gammaloop-nextest-spenso>
  84. 26.16 s gammaloop-nextest-spenso> failures:
  85. 26.16 s gammaloop-nextest-spenso>
  86. 26.16 s gammaloop-nextest-spenso> failures:
  87. 26.16 s gammaloop-nextest-spenso> tensor::tests::parsing::infinite_execution
  88. 26.16 s gammaloop-nextest-spenso>
  89. 26.16 s gammaloop-nextest-spenso> test result: FAILED. 0 passed; 1 failed; 0 ignored; 0 measured; 240 filtered out; finished in 0.55s
  90. 26.16 s gammaloop-nextest-spenso>
  91. 26.16 s gammaloop-nextest-spenso> stderr ---
  92. 26.16 s gammaloop-nextest-spenso>
  93. 26.16 s gammaloop-nextest-spenso> thread 'tensor::tests::parsing::infinite_execution' (848) panicked at /nix/store/30svmzr0z0zpcqjyynjn7w21wgx18y4b-vendor-cargo-deps/c19b7c6f923b580ac259164a89f2577984ad5ab09ee9d583b888f934adbbe8d0/insta-1.47.2/src/runtime.rs:719:13:
  94. 26.16 s gammaloop-nextest-spenso> snapshot assertion for 'infinite_execution' failed in line 910
  95. 26.16 s gammaloop-nextest-spenso> stack backtrace:
  96. 26.16 s gammaloop-nextest-spenso> 0: __rustc::rust_begin_unwind
  97. 26.16 s gammaloop-nextest-spenso> 1: core::panicking::panic_fmt
  98. 26.16 s gammaloop-nextest-spenso> 2: insta::runtime::assert_snapshot
  99. 26.16 s gammaloop-nextest-spenso> 3: idenso::tensor::tests::parsing::infinite_execution
  100. 26.16 s gammaloop-nextest-spenso> 4: <idenso::tensor::tests::parsing::infinite_execution::{closure#0} as core::ops::function::FnOnce<()>>::call_once
  101. 26.16 s gammaloop-nextest-spenso> note: Some details are omitted, run with `RUST_BACKTRACE=full` for a verbose backtrace.
  102. 26.16 s gammaloop-nextest-spenso>
  103. 28.16 s gammaloop-nextest-spenso> ------------
  104. 28.16 s gammaloop-nextest-spenso> Summary [ 3.082s] 224 tests run: 222 passed, 2 failed, 26 skipped
  105. 28.16 s gammaloop-nextest-spenso> FAIL [ 0.930s] (220/224) idenso color::test::form_reference::metric_contraction_respects_antisymmetric_normalization
  106. 28.16 s gammaloop-nextest-spenso> stdout ---
  107. 28.16 s gammaloop-nextest-spenso>
  108. 28.16 s gammaloop-nextest-spenso> running 1 test
  109. 28.16 s gammaloop-nextest-spenso> test color::test::form_reference::metric_contraction_respects_antisymmetric_normalization ... FAILED
  110. 28.16 s gammaloop-nextest-spenso>
  111. 28.16 s gammaloop-nextest-spenso> failures:
  112. 28.16 s gammaloop-nextest-spenso>
  113. 28.16 s gammaloop-nextest-spenso> failures:
  114. 28.16 s gammaloop-nextest-spenso> color::test::form_reference::metric_contraction_respects_antisymmetric_normalization
  115. 28.16 s gammaloop-nextest-spenso>
  116. 28.16 s gammaloop-nextest-spenso> test result: FAILED. 0 passed; 1 failed; 0 ignored; 0 measured; 240 filtered out; finished in 0.91s
  117. 28.16 s gammaloop-nextest-spenso>
  118. 28.16 s gammaloop-nextest-spenso> stderr ---
  119. 28.16 s gammaloop-nextest-spenso>
  120. 28.16 s gammaloop-nextest-spenso> thread 'color::test::form_reference::metric_contraction_respects_antisymmetric_normalization' (333) panicked at crates/idenso/src/color/test/form_reference.rs:171:5:
  121. 28.16 s gammaloop-nextest-spenso> assertion `left == right` failed
  122. 28.16 s gammaloop-nextest-spenso> left: "-1*f(coad(8,standalone_metric_j),coad(8,standalone_metric_s),coad(8,standalone_metric_u))"
  123. 28.16 s gammaloop-nextest-spenso> right: "f(coad(8,standalone_metric_j),coad(8,standalone_metric_s),coad(8,standalone_metric_u))"
  124. 28.16 s gammaloop-nextest-spenso> stack backtrace:
  125. 28.16 s gammaloop-nextest-spenso> 0: __rustc::rust_begin_unwind
  126. 28.16 s gammaloop-nextest-spenso> 1: core::panicking::panic_fmt
  127. 28.16 s gammaloop-nextest-spenso> 2: core::panicking::assert_failed_inner
  128. 28.16 s gammaloop-nextest-spenso> 3: core::panicking::assert_failed::<alloc::string::String, alloc::string::String>
  129. 28.16 s gammaloop-nextest-spenso> 4: idenso::color::test::form_reference::metric_contraction_respects_antisymmetric_normalization
  130. 28.16 s gammaloop-nextest-spenso> 5: <idenso::color::test::form_reference::metric_contraction_respects_antisymmetric_normalization::{closure#0} as core::ops::function::FnOnce<()>>::call_once
  131. 28.16 s gammaloop-nextest-spenso> note: Some details are omitted, run with `RUST_BACKTRACE=full` for a verbose backtrace.
  132. 28.16 s gammaloop-nextest-spenso>
  133. 28.16 s gammaloop-nextest-spenso> FAIL [ 0.562s] (221/224) idenso tensor::tests::parsing::infinite_execution
  134. 28.16 s gammaloop-nextest-spenso> stdout ---
  135. 28.16 s gammaloop-nextest-spenso>
  136. 28.16 s gammaloop-nextest-spenso> running 1 test
  137. 28.16 s gammaloop-nextest-spenso> ━━━━━━━━━━━━━━━━━━━━━━━━━━━━━━━ Snapshot Summary ━━━━━━━━━━━━━━━━━━━━━━━━━━━━━━━
  138. 28.16 s gammaloop-nextest-spenso> Snapshot: infinite_execution
  139. 28.16 s gammaloop-nextest-spenso> Source: crates/idenso/src/tensor/tests/parsing.rs:910
  140. 28.16 s gammaloop-nextest-spenso> ────────────────────────────────────────────────────────────────────────────────
  141. 28.16 s gammaloop-nextest-spenso> Expression: net_iter.snapshot_dot()
  142. 28.16 s gammaloop-nextest-spenso> ────────────────────────────────────────────────────────────────────────────────
  143. 28.16 s gammaloop-nextest-spenso> -old snapshot
  144. 28.16 s gammaloop-nextest-spenso> +new results
  145. 28.16 s gammaloop-nextest-spenso> ────────────┬───────────────────────────────────────────────────────────────────
  146. 28.16 s gammaloop-nextest-spenso> 8 8 │ 0:0:s -> ext0 [id=0 color="red"];
  147. 28.16 s gammaloop-nextest-spenso> 9 9 │ ext1 [style=invis];
  148. 28.16 s gammaloop-nextest-spenso> 10 10 │ 0:5:s -> ext1 [id=1 dir=none color="red" label="mink4|l_0"];
  149. 28.16 s gammaloop-nextest-spenso> 11 11 │ ext2 [style=invis];
  150. 28.16 s gammaloop-nextest-spenso> 12 │- 0:4:s -> ext2 [id=2 dir=none color="red" label="bis4|l_2"];
  151. 28.16 s gammaloop-nextest-spenso> 12 │+ 0:3:s -> ext2 [id=2 dir=none color="red" label="mink4|l_1"];
  152. 28.16 s gammaloop-nextest-spenso> 13 13 │ ext3 [style=invis];
  153. 28.16 s gammaloop-nextest-spenso> 14 │- 0:3:s -> ext3 [id=3 dir=none color="red" label="bis4|l_3"];
  154. 28.16 s gammaloop-nextest-spenso> 14 │+ 0:1:s -> ext3 [id=3 dir=none color="red" label="bis4|l_2"];
  155. 28.16 s gammaloop-nextest-spenso> 15 15 │ ext4 [style=invis];
  156. 28.16 s gammaloop-nextest-spenso> 16 │- 0:1:s -> ext4 [id=4 dir=none color="red" label="mink4|l_1"];
  157. 28.16 s gammaloop-nextest-spenso> 16 │+ 0:2:s -> ext4 [id=4 dir=none color="red" label="mink4|l_4"];
  158. 28.16 s gammaloop-nextest-spenso> 17 17 │ ext5 [style=invis];
  159. 28.16 s gammaloop-nextest-spenso> 18 │- 0:2:s -> ext5 [id=5 dir=none color="red" label="mink4|l_4"];
  160. 28.16 s gammaloop-nextest-spenso> 18 │+ 0:4:s -> ext5 [id=5 dir=none color="red" label="bis4|l_3"];
  161. 28.16 s gammaloop-nextest-spenso> 19 19 │ }
  162. 28.16 s gammaloop-nextest-spenso> ────────────┴───────────────────────────────────────────────────────────────────
  163. 28.16 s gammaloop-nextest-spenso> To update snapshots run `cargo insta review`
  164. 28.16 s gammaloop-nextest-spenso> Stopped on the first failure. Run `cargo insta test` to run all snapshots.
  165. 28.16 s gammaloop-nextest-spenso> test tensor::tests::parsing::infinite_execution ... FAILED
  166. 28.16 s gammaloop-nextest-spenso>
  167. 28.16 s gammaloop-nextest-spenso> failures:
  168. 28.16 s gammaloop-nextest-spenso>
  169. 28.16 s gammaloop-nextest-spenso> failures:
  170. 28.16 s gammaloop-nextest-spenso> tensor::tests::parsing::infinite_execution
  171. 28.16 s gammaloop-nextest-spenso>
  172. 28.16 s gammaloop-nextest-spenso> test result: FAILED. 0 passed; 1 failed; 0 ignored; 0 measured; 240 filtered out; finished in 0.55s
  173. 28.16 s gammaloop-nextest-spenso>
  174. 28.16 s gammaloop-nextest-spenso> stderr ---
  175. 28.16 s gammaloop-nextest-spenso>
  176. 28.16 s gammaloop-nextest-spenso> thread 'tensor::tests::parsing::infinite_execution' (848) panicked at /nix/store/30svmzr0z0zpcqjyynjn7w21wgx18y4b-vendor-cargo-deps/c19b7c6f923b580ac259164a89f2577984ad5ab09ee9d583b888f934adbbe8d0/insta-1.47.2/src/runtime.rs:719:13:
  177. 28.16 s gammaloop-nextest-spenso> snapshot assertion for 'infinite_execution' failed in line 910
  178. 28.16 s gammaloop-nextest-spenso> stack backtrace:
  179. 28.16 s gammaloop-nextest-spenso> 0: __rustc::rust_begin_unwind
  180. 28.16 s gammaloop-nextest-spenso> 1: core::panicking::panic_fmt
  181. 28.16 s gammaloop-nextest-spenso> 2: insta::runtime::assert_snapshot
  182. 28.16 s gammaloop-nextest-spenso> 3: idenso::tensor::tests::parsing::infinite_execution
  183. 28.16 s gammaloop-nextest-spenso> 4: <idenso::tensor::tests::parsing::infinite_execution::{closure#0} as core::ops::function::FnOnce<()>>::call_once
  184. 28.16 s gammaloop-nextest-spenso> note: Some details are omitted, run with `RUST_BACKTRACE=full` for a verbose backtrace.
  185. 28.16 s gammaloop-nextest-spenso>
  186. 28.23 s gammaloop-nextest-spenso> error: test run failed
  187. 28.33 s gammaloop-nextest-spenso>
  188. 28.33 s gammaloop-nextest-spenso> ========== nextest test summary ==========
  189. 28.33 s gammaloop-nextest-spenso> report: target/nextest/ci_gammaloop/junit.xml
  190. 28.33 s gammaloop-nextest-spenso> tests: 224, failures: 2, errors: 0
  191. 28.33 s gammaloop-nextest-spenso>
  192. 28.33 s gammaloop-nextest-spenso> 1. idenso::color::test::form_reference::metric_contraction_respects_antisymmetric_normalization
  193. 28.33 s gammaloop-nextest-spenso> failure: test failure with exit code 101
  194. 28.33 s gammaloop-nextest-spenso> thread 'color::test::form_reference::metric_contraction_respects_antisymmetric_normalization' (333) panicked at crates/idenso/src/color/test/form_reference.rs:171:5:
  195. 28.33 s gammaloop-nextest-spenso> assertion `left == right` failed
  196. 28.33 s gammaloop-nextest-spenso> left: "-1*f(coad(8,standalone_metric_j),coad(8,standalone_metric_s),coad(8,standalone_metric_u))"
  197. 28.33 s gammaloop-nextest-spenso> right: "f(coad(8,standalone_metric_j),coad(8,standalone_metric_s),coad(8,standalone_metric_u))"
  198. 28.33 s gammaloop-nextest-spenso> stack backtrace:
  199. 28.33 s gammaloop-nextest-spenso> 0: __rustc::rust_begin_unwind
  200. 28.33 s gammaloop-nextest-spenso> 1: core::panicking::panic_fmt
  201. 28.33 s gammaloop-nextest-spenso> 2: core::panicking::assert_failed_inner
  202. 28.33 s gammaloop-nextest-spenso> 3: core::panicking::assert_failed::<alloc::string::String, alloc::string::String>
  203. 28.33 s gammaloop-nextest-spenso> 4: idenso::color::test::form_reference::metric_contraction_respects_antisymmetric_normalization
  204. 28.33 s gammaloop-nextest-spenso> 5: <idenso::color::test::form_reference::metric_contraction_respects_antisymmetric_normalization::{closure#0} as core::ops::function::FnOnce<()>>::call_once
  205. 28.33 s gammaloop-nextest-spenso> note: Some details are omitted, run with `RUST_BACKTRACE=full` for a verbose backtrace.
  206. 28.33 s gammaloop-nextest-spenso> system-out
  207. 28.33 s gammaloop-nextest-spenso> running 1 test
  208. 28.33 s gammaloop-nextest-spenso> test color::test::form_reference::metric_contraction_respects_antisymmetric_normalization ... FAILED
  209. 28.33 s gammaloop-nextest-spenso>
  210. 28.33 s gammaloop-nextest-spenso> failures:
  211. 28.33 s gammaloop-nextest-spenso>
  212. 28.33 s gammaloop-nextest-spenso> failures:
  213. 28.33 s gammaloop-nextest-spenso> color::test::form_reference::metric_contraction_respects_antisymmetric_normalization
  214. 28.33 s gammaloop-nextest-spenso>
  215. 28.33 s gammaloop-nextest-spenso> test result: FAILED. 0 passed; 1 failed; 0 ignored; 0 measured; 240 filtered out; finished in 0.91s
  216. 28.33 s gammaloop-nextest-spenso> system-err
  217. 28.33 s gammaloop-nextest-spenso> thread 'color::test::form_reference::metric_contraction_respects_antisymmetric_normalization' (333) panicked at crates/idenso/src/color/test/form_reference.rs:171:5:
  218. 28.33 s gammaloop-nextest-spenso> assertion `left == right` failed
  219. 28.33 s gammaloop-nextest-spenso> left: "-1*f(coad(8,standalone_metric_j),coad(8,standalone_metric_s),coad(8,standalone_metric_u))"
  220. 28.33 s gammaloop-nextest-spenso> right: "f(coad(8,standalone_metric_j),coad(8,standalone_metric_s),coad(8,standalone_metric_u))"
  221. 28.33 s gammaloop-nextest-spenso> stack backtrace:
  222. 28.33 s gammaloop-nextest-spenso> 0: __rustc::rust_begin_unwind
  223. 28.33 s gammaloop-nextest-spenso> 1: core::panicking::panic_fmt
  224. 28.33 s gammaloop-nextest-spenso> 2: core::panicking::assert_failed_inner
  225. 28.33 s gammaloop-nextest-spenso> 3: core::panicking::assert_failed::<alloc::string::String, alloc::string::String>
  226. 28.33 s gammaloop-nextest-spenso> 4: idenso::color::test::form_reference::metric_contraction_respects_antisymmetric_normalization
  227. 28.33 s gammaloop-nextest-spenso> 5: <idenso::color::test::form_reference::metric_contraction_respects_antisymmetric_normalization::{closure#0} as core::ops::function::FnOnce<()>>::call_once
  228. 28.33 s gammaloop-nextest-spenso> note: Some details are omitted, run with `RUST_BACKTRACE=full` for a verbose backtrace.
  229. 28.33 s gammaloop-nextest-spenso>
  230. 28.33 s gammaloop-nextest-spenso> 2. idenso::tensor::tests::parsing::infinite_execution
  231. 28.33 s gammaloop-nextest-spenso> failure: test failure with exit code 101
  232. 28.33 s gammaloop-nextest-spenso> thread 'tensor::tests::parsing::infinite_execution' (848) panicked at /nix/store/30svmzr0z0zpcqjyynjn7w21wgx18y4b-vendor-cargo-deps/c19b7c6f923b580ac259164a89f2577984ad5ab09ee9d583b888f934adbbe8d0/insta-1.47.2/src/runtime.rs:719:13:
  233. 28.33 s gammaloop-nextest-spenso> snapshot assertion for 'infinite_execution' failed in line 910
  234. 28.33 s gammaloop-nextest-spenso> stack backtrace:
  235. 28.33 s gammaloop-nextest-spenso> 0: __rustc::rust_begin_unwind
  236. 28.33 s gammaloop-nextest-spenso> 1: core::panicking::panic_fmt
  237. 28.33 s gammaloop-nextest-spenso> 2: insta::runtime::assert_snapshot
  238. 28.33 s gammaloop-nextest-spenso> 3: idenso::tensor::tests::parsing::infinite_execution
  239. 28.33 s gammaloop-nextest-spenso> 4: <idenso::tensor::tests::parsing::infinite_execution::{closure#0} as core::ops::function::FnOnce<()>>::call_once
  240. 28.33 s gammaloop-nextest-spenso> note: Some details are omitted, run with `RUST_BACKTRACE=full` for a verbose backtrace.
  241. 28.33 s gammaloop-nextest-spenso> system-out
  242. 28.33 s gammaloop-nextest-spenso> running 1 test
  243. 28.33 s gammaloop-nextest-spenso> ━━━━━━━━━━━━━━━━━━━━━━━━━━━━━━━ Snapshot Summary ━━━━━━━━━━━━━━━━━━━━━━━━━━━━━━━
  244. 28.33 s gammaloop-nextest-spenso> Snapshot: infinite_execution
  245. 28.33 s gammaloop-nextest-spenso> Source: crates/idenso/src/tensor/tests/parsing.rs:910
  246. 28.33 s gammaloop-nextest-spenso> ────────────────────────────────────────────────────────────────────────────────
  247. 28.33 s gammaloop-nextest-spenso> Expression: net_iter.snapshot_dot()
  248. 28.33 s gammaloop-nextest-spenso> ────────────────────────────────────────────────────────────────────────────────
  249. 28.33 s gammaloop-nextest-spenso> -old snapshot
  250. 28.33 s gammaloop-nextest-spenso> +new results
  251. 28.33 s gammaloop-nextest-spenso> ────────────┬───────────────────────────────────────────────────────────────────
  252. 28.33 s gammaloop-nextest-spenso> 8 8 │ 0:0:s-> ext0 [id=0 color="red"];
  253. 28.33 s gammaloop-nextest-spenso> 9 9 │ ext1 [style=invis];
  254. 28.33 s gammaloop-nextest-spenso> 10 10 │ 0:5:s-> ext1 [id=1 dir=none color="red" label="mink4|l_0"];
  255. 28.33 s gammaloop-nextest-spenso> 11 11 │ ext2 [style=invis];
  256. 28.33 s gammaloop-nextest-spenso> 12 │- 0:4:s-> ext2 [id=2 dir=none color="red" label="bis4|l_2"];
  257. 28.33 s gammaloop-nextest-spenso> 12 │+ 0:3:s-> ext2 [id=2 dir=none color="red" label="mink4|l_1"];
  258. 28.33 s gammaloop-nextest-spenso> 13 13 │ ext3 [style=invis];
  259. 28.33 s gammaloop-nextest-spenso> 14 │- 0:3:s-> ext3 [id=3 dir=none color="red" label="bis4|l_3"];
  260. 28.33 s gammaloop-nextest-spenso> 14 │+ 0:1:s-> ext3 [id=3 dir=none color="red" label="bis4|l_2"];
  261. 28.33 s gammaloop-nextest-spenso> 15 15 │ ext4 [style=invis];
  262. 28.33 s gammaloop-nextest-spenso> 16 │- 0:1:s-> ext4 [id=4 dir=none color="red" label="mink4|l_1"];
  263. 28.33 s gammaloop-nextest-spenso> 16 │+ 0:2:s-> ext4 [id=4 dir=none color="red" label="mink4|l_4"];
  264. 28.33 s gammaloop-nextest-spenso> 17 17 │ ext5 [style=invis];
  265. 28.33 s gammaloop-nextest-spenso> 18 │- 0:2:s-> ext5 [id=5 dir=none color="red" label="mink4|l_4"];
  266. 28.33 s gammaloop-nextest-spenso> 18 │+ 0:4:s-> ext5 [id=5 dir=none color="red" label="bis4|l_3"];
  267. 28.33 s gammaloop-nextest-spenso> 19 19 │ }
  268. 28.33 s gammaloop-nextest-spenso> ────────────┴───────────────────────────────────────────────────────────────────
  269. 28.33 s gammaloop-nextest-spenso> To update snapshots run `cargo insta review`
  270. 28.33 s gammaloop-nextest-spenso> Stopped on the first failure. Run `cargo insta test` to run all snapshots.
  271. 28.33 s gammaloop-nextest-spenso> test tensor::tests::parsing::infinite_execution ... FAILED
  272. 28.33 s gammaloop-nextest-spenso>
  273. 28.33 s gammaloop-nextest-spenso> failures:
  274. 28.33 s gammaloop-nextest-spenso>
  275. 28.33 s gammaloop-nextest-spenso> failures:
  276. 28.33 s gammaloop-nextest-spenso> tensor::tests::parsing::infinite_execution
  277. 28.33 s gammaloop-nextest-spenso>
  278. 28.33 s gammaloop-nextest-spenso> test result: FAILED. 0 passed; 1 failed; 0 ignored; 0 measured; 240 filtered out; finished in 0.55s
  279. 28.33 s gammaloop-nextest-spenso> system-err
  280. 28.33 s gammaloop-nextest-spenso> thread 'tensor::tests::parsing::infinite_execution' (848) panicked at /nix/store/30svmzr0z0zpcqjyynjn7w21wgx18y4b-vendor-cargo-deps/c19b7c6f923b580ac259164a89f2577984ad5ab09ee9d583b888f934adbbe8d0/insta-1.47.2/src/runtime.rs:719:13:
  281. 28.33 s gammaloop-nextest-spenso> snapshot assertion for 'infinite_execution' failed in line 910
  282. 28.33 s gammaloop-nextest-spenso> stack backtrace:
  283. 28.33 s gammaloop-nextest-spenso> 0: __rustc::rust_begin_unwind
  284. 28.33 s gammaloop-nextest-spenso> 1: core::panicking::panic_fmt
  285. 28.33 s gammaloop-nextest-spenso> 2: insta::runtime::assert_snapshot
  286. 28.33 s gammaloop-nextest-spenso> 3: idenso::tensor::tests::parsing::infinite_execution
  287. 28.33 s gammaloop-nextest-spenso> 4: <idenso::tensor::tests::parsing::infinite_execution::{closure#0} as core::ops::function::FnOnce<()>>::call_once
  288. 28.33 s gammaloop-nextest-spenso> note: Some details are omitted, run with `RUST_BACKTRACE=full` for a verbose backtrace.
  289. 28.33 s gammaloop-nextest-spenso> =========================================
  290. 28.37 s gammaloop-nextest-spenso> Extracting 2 binaries and 1 linked path to /build/nextest-archive-hc74u2
  291. 28.64 s gammaloop-nextest-spenso> Extracted 8 files to /build/nextest-archive-hc74u2 in 0.27s
  292. 28.70 s gammaloop-nextest-spenso> ------------
  293. 28.70 s gammaloop-nextest-spenso> Nextest run ID c188dbdb-9725-4cc7-94d6-1614c40e0d23 with nextest profile: ci_gammaloop
  294. 28.70 s gammaloop-nextest-spenso> Starting 135 tests across 2 binaries
  295. 29.01 s gammaloop-nextest-spenso> ------------
  296. 29.01 s gammaloop-nextest-spenso> Summary [ 0.305s] 135 tests run: 135 passed, 0 skipped
  297. 29.12 s gammaloop-nextest-spenso>
  298. 29.12 s gammaloop-nextest-spenso> ========== nextest test summary ==========
  299. 29.12 s gammaloop-nextest-spenso> report: target/nextest/ci_gammaloop/junit.xml
  300. 29.12 s gammaloop-nextest-spenso> tests: 135, failures: 0, errors: 0
  301. 29.12 s gammaloop-nextest-spenso> No failing testcases found.
  302. 29.12 s gammaloop-nextest-spenso> =========================================
  303. 29.14 s gammaloop-nextest-spenso> Extracting 5 binaries and 2 linked paths to /build/nextest-archive-9G4Xx2
  304. 29.50 s gammaloop-nextest-spenso> Extracted 19 files to /build/nextest-archive-9G4Xx2 in 0.36s
  305. 29.56 s gammaloop-nextest-spenso> ------------
  306. 29.56 s gammaloop-nextest-spenso> Nextest run ID 86543b62-621b-4a49-8679-781e459c4a44 with nextest profile: ci_gammaloop
  307. 29.56 s gammaloop-nextest-spenso> Starting 25 tests across 5 binaries (1 test skipped via profile.ci_gammaloop.default-filter)
  308. 29.91 s gammaloop-nextest-spenso> ------------
  309. 29.91 s gammaloop-nextest-spenso> Summary [ 0.354s] 25 tests run: 25 passed, 1 skipped
  310. 30.00 s gammaloop-nextest-spenso>
  311. 30.00 s gammaloop-nextest-spenso> ========== nextest test summary ==========
  312. 30.00 s gammaloop-nextest-spenso> report: target/nextest/ci_gammaloop/junit.xml
  313. 30.00 s gammaloop-nextest-spenso> tests: 25, failures: 0, errors: 0
  314. 30.00 s gammaloop-nextest-spenso> No failing testcases found.
  315. 30.00 s gammaloop-nextest-spenso> =========================================
  316. 30.02 s gammaloop-nextest-spenso> Extracting 2 binaries and 1 linked path to /build/nextest-archive-IKbDng
  317. 30.12 s gammaloop-nextest-spenso> Extracted 8 files to /build/nextest-archive-IKbDng in 0.10s
  318. 30.15 s gammaloop-nextest-spenso> ------------
  319. 30.15 s gammaloop-nextest-spenso> Nextest run ID 8b09aba8-c229-412d-8327-bfd0fa01a935 with nextest profile: ci_gammaloop
  320. 30.15 s gammaloop-nextest-spenso> Starting 1 test across 2 binaries
  321. 30.16 s gammaloop-nextest-spenso> ------------
  322. 30.16 s gammaloop-nextest-spenso> Summary [ 0.009s] 1 test run: 1 passed, 0 skipped
  323. 30.22 s gammaloop-nextest-spenso>
  324. 30.23 s gammaloop-nextest-spenso> ========== nextest test summary ==========
  325. 30.23 s gammaloop-nextest-spenso> report: target/nextest/ci_gammaloop/junit.xml
  326. 30.23 s gammaloop-nextest-spenso> tests: 1, failures: 0, errors: 0
  327. 30.23 s gammaloop-nextest-spenso> No failing testcases found.
  328. 30.23 s gammaloop-nextest-spenso> =========================================
  329. 30.25 s gammaloop-nextest-spenso> Extracting 1 binary and 1 linked path to /build/nextest-archive-umoq1E
  330. 30.34 s gammaloop-nextest-spenso> Extracted 7 files to /build/nextest-archive-umoq1E in 0.09s
  331. 30.42 s gammaloop-nextest-spenso> ------------
  332. 30.42 s gammaloop-nextest-spenso> Nextest run ID 5a1374a7-5afe-40e7-9926-5daf58fd9d1c with nextest profile: ci_gammaloop
  333. 30.42 s gammaloop-nextest-spenso> Starting 0 tests across 1 binary
  334. 30.42 s gammaloop-nextest-spenso> ------------
  335. 30.42 s gammaloop-nextest-spenso> Summary [ 0.003s] 0 tests run: 0 passed, 0 skipped
  336. 30.53 s gammaloop-nextest-spenso>
  337. 30.53 s gammaloop-nextest-spenso> ========== nextest test summary ==========
  338. 30.53 s gammaloop-nextest-spenso> report: target/nextest/ci_gammaloop/junit.xml
  339. 30.53 s gammaloop-nextest-spenso> tests: 0, failures: 0, errors: 0
  340. 30.53 s gammaloop-nextest-spenso> No failing testcases found.
  341. 30.53 s gammaloop-nextest-spenso> =========================================
  342. 30.61 s error: Cannot build '/nix/store/wg9z1d6ybvc8xl844i0n0mklxxwi1328-gammaloop-nextest-spenso.drv'.
  343. 30.61 s Reason: builder failed with exit code 100.
  344. 30.61 s Output paths:
  345. 30.61 s /nix/store/lllalkgcfjij64ixlnv0xp0j8dfki7lv-gammaloop-nextest-spenso
  346. 30.61 s Last 325 log lines:
  347. 30.61 s > Extracting 5 binaries and 2 linked paths to /build/nextest-archive-qZn7Dz
  348. 30.61 s > Extracted 19 files to /build/nextest-archive-qZn7Dz in 0.22s
  349. 30.61 s > ------------
  350. 30.61 s > Nextest run ID 1cf26cc1-6758-45f5-a285-be9435a5f0f7 with nextest profile: ci_gammaloop
  351. 30.61 s > Starting 224 tests across 5 binaries (26 tests skipped, including 2 tests via profile.ci_gammaloop.default-filter)
  352. 30.61 s > FAIL [ 0.930s] (220/224) idenso color::test::form_reference::metric_contraction_respects_antisymmetric_normalization
  353. 30.61 s > stdout ---
  354. 30.61 s >
  355. 30.61 s > running 1 test
  356. 30.61 s > test color::test::form_reference::metric_contraction_respects_antisymmetric_normalization ... FAILED
  357. 30.61 s >
  358. 30.61 s > failures:
  359. 30.61 s >
  360. 30.61 s > failures:
  361. 30.61 s > color::test::form_reference::metric_contraction_respects_antisymmetric_normalization
  362. 30.61 s >
  363. 30.61 s > test result: FAILED. 0 passed; 1 failed; 0 ignored; 0 measured; 240 filtered out; finished in 0.91s
  364. 30.61 s >
  365. 30.61 s > stderr ---
  366. 30.61 s >
  367. 30.61 s > thread 'color::test::form_reference::metric_contraction_respects_antisymmetric_normalization' (333) panicked at crates/idenso/src/color/test/form_reference.rs:171:5:
  368. 30.61 s > assertion `left == right` failed
  369. 30.61 s > left: "-1*f(coad(8,standalone_metric_j),coad(8,standalone_metric_s),coad(8,standalone_metric_u))"
  370. 30.61 s > right: "f(coad(8,standalone_metric_j),coad(8,standalone_metric_s),coad(8,standalone_metric_u))"
  371. 30.61 s > stack backtrace:
  372. 30.61 s > 0: __rustc::rust_begin_unwind
  373. 30.61 s > 1: core::panicking::panic_fmt
  374. 30.61 s > 2: core::panicking::assert_failed_inner
  375. 30.61 s > 3: core::panicking::assert_failed::<alloc::string::String, alloc::string::String>
  376. 30.61 s > 4: idenso::color::test::form_reference::metric_contraction_respects_antisymmetric_normalization
  377. 30.61 s > 5: <idenso::color::test::form_reference::metric_contraction_respects_antisymmetric_normalization::{closure#0} as core::ops::function::FnOnce<()>>::call_once
  378. 30.61 s > note: Some details are omitted, run with `RUST_BACKTRACE=full` for a verbose backtrace.
  379. 30.61 s >
  380. 30.61 s > FAIL [ 0.562s] (221/224) idenso tensor::tests::parsing::infinite_execution
  381. 30.61 s > stdout ---
  382. 30.61 s >
  383. 30.61 s > running 1 test
  384. 30.61 s > ━━━━━━━━━━━━━━━━━━━━━━━━━━━━━━━ Snapshot Summary ━━━━━━━━━━━━━━━━━━━━━━━━━━━━━━━
  385. 30.61 s > Snapshot: infinite_execution
  386. 30.61 s > Source: crates/idenso/src/tensor/tests/parsing.rs:910
  387. 30.61 s > ────────────────────────────────────────────────────────────────────────────────
  388. 30.61 s > Expression: net_iter.snapshot_dot()
  389. 30.61 s > ────────────────────────────────────────────────────────────────────────────────
  390. 30.61 s > -old snapshot
  391. 30.61 s > +new results
  392. 30.61 s > ────────────┬───────────────────────────────────────────────────────────────────
  393. 30.61 s > 8 8 │ 0:0:s -> ext0 [id=0 color="red"];
  394. 30.61 s > 9 9 │ ext1 [style=invis];
  395. 30.61 s > 10 10 │ 0:5:s -> ext1 [id=1 dir=none color="red" label="mink4|l_0"];
  396. 30.61 s > 11 11 │ ext2 [style=invis];
  397. 30.61 s > 12 │- 0:4:s -> ext2 [id=2 dir=none color="red" label="bis4|l_2"];
  398. 30.61 s > 12 │+ 0:3:s -> ext2 [id=2 dir=none color="red" label="mink4|l_1"];
  399. 30.61 s > 13 13 │ ext3 [style=invis];
  400. 30.61 s > 14 │- 0:3:s -> ext3 [id=3 dir=none color="red" label="bis4|l_3"];
  401. 30.61 s > 14 │+ 0:1:s -> ext3 [id=3 dir=none color="red" label="bis4|l_2"];
  402. 30.61 s > 15 15 │ ext4 [style=invis];
  403. 30.61 s > 16 │- 0:1:s -> ext4 [id=4 dir=none color="red" label="mink4|l_1"];
  404. 30.61 s > 16 │+ 0:2:s -> ext4 [id=4 dir=none color="red" label="mink4|l_4"];
  405. 30.61 s > 17 17 │ ext5 [style=invis];
  406. 30.61 s > 18 │- 0:2:s -> ext5 [id=5 dir=none color="red" label="mink4|l_4"];
  407. 30.61 s > 18 │+ 0:4:s -> ext5 [id=5 dir=none color="red" label="bis4|l_3"];
  408. 30.61 s > 19 19 │ }
  409. 30.61 s > ────────────┴───────────────────────────────────────────────────────────────────
  410. 30.61 s > To update snapshots run `cargo insta review`
  411. 30.61 s > Stopped on the first failure. Run `cargo insta test` to run all snapshots.
  412. 30.61 s > test tensor::tests::parsing::infinite_execution ... FAILED
  413. 30.61 s >
  414. 30.61 s > failures:
  415. 30.61 s >
  416. 30.61 s > failures:
  417. 30.61 s > tensor::tests::parsing::infinite_execution
  418. 30.61 s >
  419. 30.61 s > test result: FAILED. 0 passed; 1 failed; 0 ignored; 0 measured; 240 filtered out; finished in 0.55s
  420. 30.61 s >
  421. 30.61 s > stderr ---
  422. 30.61 s >
  423. 30.61 s > thread 'tensor::tests::parsing::infinite_execution' (848) panicked at /nix/store/30svmzr0z0zpcqjyynjn7w21wgx18y4b-vendor-cargo-deps/c19b7c6f923b580ac259164a89f2577984ad5ab09ee9d583b888f934adbbe8d0/insta-1.47.2/src/runtime.rs:719:13:
  424. 30.61 s > snapshot assertion for 'infinite_execution' failed in line 910
  425. 30.61 s > stack backtrace:
  426. 30.61 s > 0: __rustc::rust_begin_unwind
  427. 30.61 s > 1: core::panicking::panic_fmt
  428. 30.61 s > 2: insta::runtime::assert_snapshot
  429. 30.61 s > 3: idenso::tensor::tests::parsing::infinite_execution
  430. 30.61 s > 4: <idenso::tensor::tests::parsing::infinite_execution::{closure#0} as core::ops::function::FnOnce<()>>::call_once
  431. 30.61 s > note: Some details are omitted, run with `RUST_BACKTRACE=full` for a verbose backtrace.
  432. 30.61 s >
  433. 30.61 s > ------------
  434. 30.61 s > Summary [ 3.082s] 224 tests run: 222 passed, 2 failed, 26 skipped
  435. 30.61 s > FAIL [ 0.930s] (220/224) idenso color::test::form_reference::metric_contraction_respects_antisymmetric_normalization
  436. 30.61 s > stdout ---
  437. 30.61 s >
  438. 30.61 s > running 1 test
  439. 30.61 s > test color::test::form_reference::metric_contraction_respects_antisymmetric_normalization ... FAILED
  440. 30.61 s >
  441. 30.61 s > failures:
  442. 30.61 s >
  443. 30.61 s > failures:
  444. 30.61 s > color::test::form_reference::metric_contraction_respects_antisymmetric_normalization
  445. 30.61 s >
  446. 30.61 s > test result: FAILED. 0 passed; 1 failed; 0 ignored; 0 measured; 240 filtered out; finished in 0.91s
  447. 30.61 s >
  448. 30.61 s > stderr ---
  449. 30.61 s >
  450. 30.61 s > thread 'color::test::form_reference::metric_contraction_respects_antisymmetric_normalization' (333) panicked at crates/idenso/src/color/test/form_reference.rs:171:5:
  451. 30.61 s > assertion `left == right` failed
  452. 30.61 s > left: "-1*f(coad(8,standalone_metric_j),coad(8,standalone_metric_s),coad(8,standalone_metric_u))"
  453. 30.61 s > right: "f(coad(8,standalone_metric_j),coad(8,standalone_metric_s),coad(8,standalone_metric_u))"
  454. 30.61 s > stack backtrace:
  455. 30.61 s > 0: __rustc::rust_begin_unwind
  456. 30.61 s > 1: core::panicking::panic_fmt
  457. 30.61 s > 2: core::panicking::assert_failed_inner
  458. 30.61 s > 3: core::panicking::assert_failed::<alloc::string::String, alloc::string::String>
  459. 30.61 s > 4: idenso::color::test::form_reference::metric_contraction_respects_antisymmetric_normalization
  460. 30.61 s > 5: <idenso::color::test::form_reference::metric_contraction_respects_antisymmetric_normalization::{closure#0} as core::ops::function::FnOnce<()>>::call_once
  461. 30.61 s > note: Some details are omitted, run with `RUST_BACKTRACE=full` for a verbose backtrace.
  462. 30.61 s >
  463. 30.61 s > FAIL [ 0.562s] (221/224) idenso tensor::tests::parsing::infinite_execution
  464. 30.61 s > stdout ---
  465. 30.61 s >
  466. 30.61 s > running 1 test
  467. 30.61 s > ━━━━━━━━━━━━━━━━━━━━━━━━━━━━━━━ Snapshot Summary ━━━━━━━━━━━━━━━━━━━━━━━━━━━━━━━
  468. 30.61 s > Snapshot: infinite_execution
  469. 30.61 s > Source: crates/idenso/src/tensor/tests/parsing.rs:910
  470. 30.61 s > ────────────────────────────────────────────────────────────────────────────────
  471. 30.61 s > Expression: net_iter.snapshot_dot()
  472. 30.61 s > ────────────────────────────────────────────────────────────────────────────────
  473. 30.61 s > -old snapshot
  474. 30.61 s > +new results
  475. 30.61 s > ────────────┬───────────────────────────────────────────────────────────────────
  476. 30.61 s > 8 8 │ 0:0:s -> ext0 [id=0 color="red"];
  477. 30.61 s > 9 9 │ ext1 [style=invis];
  478. 30.61 s > 10 10 │ 0:5:s -> ext1 [id=1 dir=none color="red" label="mink4|l_0"];
  479. 30.61 s > 11 11 │ ext2 [style=invis];
  480. 30.61 s > 12 │- 0:4:s -> ext2 [id=2 dir=none color="red" label="bis4|l_2"];
  481. 30.61 s > 12 │+ 0:3:s -> ext2 [id=2 dir=none color="red" label="mink4|l_1"];
  482. 30.61 s > 13 13 │ ext3 [style=invis];
  483. 30.61 s > 14 │- 0:3:s -> ext3 [id=3 dir=none color="red" label="bis4|l_3"];
  484. 30.61 s > 14 │+ 0:1:s -> ext3 [id=3 dir=none color="red" label="bis4|l_2"];
  485. 30.61 s > 15 15 │ ext4 [style=invis];
  486. 30.61 s > 16 │- 0:1:s -> ext4 [id=4 dir=none color="red" label="mink4|l_1"];
  487. 30.61 s > 16 │+ 0:2:s -> ext4 [id=4 dir=none color="red" label="mink4|l_4"];
  488. 30.61 s > 17 17 │ ext5 [style=invis];
  489. 30.61 s > 18 │- 0:2:s -> ext5 [id=5 dir=none color="red" label="mink4|l_4"];
  490. 30.61 s > 18 │+ 0:4:s -> ext5 [id=5 dir=none color="red" label="bis4|l_3"];
  491. 30.61 s > 19 19 │ }
  492. 30.61 s > ────────────┴───────────────────────────────────────────────────────────────────
  493. 30.61 s > To update snapshots run `cargo insta review`
  494. 30.61 s > Stopped on the first failure. Run `cargo insta test` to run all snapshots.
  495. 30.61 s > test tensor::tests::parsing::infinite_execution ... FAILED
  496. 30.61 s >
  497. 30.61 s > failures:
  498. 30.61 s >
  499. 30.61 s > failures:
  500. 30.61 s > tensor::tests::parsing::infinite_execution
  501. 30.61 s >
  502. 30.61 s > test result: FAILED. 0 passed; 1 failed; 0 ignored; 0 measured; 240 filtered out; finished in 0.55s
  503. 30.61 s >
  504. 30.61 s > stderr ---
  505. 30.61 s >
  506. 30.61 s > thread 'tensor::tests::parsing::infinite_execution' (848) panicked at /nix/store/30svmzr0z0zpcqjyynjn7w21wgx18y4b-vendor-cargo-deps/c19b7c6f923b580ac259164a89f2577984ad5ab09ee9d583b888f934adbbe8d0/insta-1.47.2/src/runtime.rs:719:13:
  507. 30.61 s > snapshot assertion for 'infinite_execution' failed in line 910
  508. 30.61 s > stack backtrace:
  509. 30.62 s > 0: __rustc::rust_begin_unwind
  510. 30.62 s > 1: core::panicking::panic_fmt
  511. 30.62 s > 2: insta::runtime::assert_snapshot
  512. 30.62 s > 3: idenso::tensor::tests::parsing::infinite_execution
  513. 30.62 s > 4: <idenso::tensor::tests::parsing::infinite_execution::{closure#0} as core::ops::function::FnOnce<()>>::call_once
  514. 30.62 s > note: Some details are omitted, run with `RUST_BACKTRACE=full` for a verbose backtrace.
  515. 30.62 s >
  516. 30.62 s > error: test run failed
  517. 30.62 s >
  518. 30.62 s > ========== nextest test summary ==========
  519. 30.62 s > report: target/nextest/ci_gammaloop/junit.xml
  520. 30.62 s > tests: 224, failures: 2, errors: 0
  521. 30.62 s >
  522. 30.62 s > 1. idenso::color::test::form_reference::metric_contraction_respects_antisymmetric_normalization
  523. 30.62 s > failure: test failure with exit code 101
  524. 30.62 s > thread 'color::test::form_reference::metric_contraction_respects_antisymmetric_normalization' (333) panicked at crates/idenso/src/color/test/form_reference.rs:171:5:
  525. 30.62 s > assertion `left == right` failed
  526. 30.62 s > left: "-1*f(coad(8,standalone_metric_j),coad(8,standalone_metric_s),coad(8,standalone_metric_u))"
  527. 30.62 s > right: "f(coad(8,standalone_metric_j),coad(8,standalone_metric_s),coad(8,standalone_metric_u))"
  528. 30.62 s > stack backtrace:
  529. 30.62 s > 0: __rustc::rust_begin_unwind
  530. 30.62 s > 1: core::panicking::panic_fmt
  531. 30.62 s > 2: core::panicking::assert_failed_inner
  532. 30.62 s > 3: core::panicking::assert_failed::<alloc::string::String, alloc::string::String>
  533. 30.62 s > 4: idenso::color::test::form_reference::metric_contraction_respects_antisymmetric_normalization
  534. 30.62 s > 5: <idenso::color::test::form_reference::metric_contraction_respects_antisymmetric_normalization::{closure#0} as core::ops::function::FnOnce<()>>::call_once
  535. 30.62 s > note: Some details are omitted, run with `RUST_BACKTRACE=full` for a verbose backtrace.
  536. 30.62 s > system-out
  537. 30.62 s > running 1 test
  538. 30.62 s > test color::test::form_reference::metric_contraction_respects_antisymmetric_normalization ... FAILED
  539. 30.62 s >
  540. 30.62 s > failures:
  541. 30.62 s >
  542. 30.62 s > failures:
  543. 30.62 s > color::test::form_reference::metric_contraction_respects_antisymmetric_normalization
  544. 30.62 s >
  545. 30.62 s > test result: FAILED. 0 passed; 1 failed; 0 ignored; 0 measured; 240 filtered out; finished in 0.91s
  546. 30.62 s > system-err
  547. 30.62 s > thread 'color::test::form_reference::metric_contraction_respects_antisymmetric_normalization' (333) panicked at crates/idenso/src/color/test/form_reference.rs:171:5:
  548. 30.62 s > assertion `left == right` failed
  549. 30.62 s > left: "-1*f(coad(8,standalone_metric_j),coad(8,standalone_metric_s),coad(8,standalone_metric_u))"
  550. 30.62 s > right: "f(coad(8,standalone_metric_j),coad(8,standalone_metric_s),coad(8,standalone_metric_u))"
  551. 30.62 s > stack backtrace:
  552. 30.62 s > 0: __rustc::rust_begin_unwind
  553. 30.62 s > 1: core::panicking::panic_fmt
  554. 30.62 s > 2: core::panicking::assert_failed_inner
  555. 30.62 s > 3: core::panicking::assert_failed::<alloc::string::String, alloc::string::String>
  556. 30.62 s > 4: idenso::color::test::form_reference::metric_contraction_respects_antisymmetric_normalization
  557. 30.62 s > 5: <idenso::color::test::form_reference::metric_contraction_respects_antisymmetric_normalization::{closure#0} as core::ops::function::FnOnce<()>>::call_once
  558. 30.62 s > note: Some details are omitted, run with `RUST_BACKTRACE=full` for a verbose backtrace.
  559. 30.62 s >
  560. 30.62 s > 2. idenso::tensor::tests::parsing::infinite_execution
  561. 30.62 s > failure: test failure with exit code 101
  562. 30.62 s > thread 'tensor::tests::parsing::infinite_execution' (848) panicked at /nix/store/30svmzr0z0zpcqjyynjn7w21wgx18y4b-vendor-cargo-deps/c19b7c6f923b580ac259164a89f2577984ad5ab09ee9d583b888f934adbbe8d0/insta-1.47.2/src/runtime.rs:719:13:
  563. 30.62 s > snapshot assertion for 'infinite_execution' failed in line 910
  564. 30.62 s > stack backtrace:
  565. 30.62 s > 0: __rustc::rust_begin_unwind
  566. 30.62 s > 1: core::panicking::panic_fmt
  567. 30.62 s > 2: insta::runtime::assert_snapshot
  568. 30.62 s > 3: idenso::tensor::tests::parsing::infinite_execution
  569. 30.62 s > 4: <idenso::tensor::tests::parsing::infinite_execution::{closure#0} as core::ops::function::FnOnce<()>>::call_once
  570. 30.62 s > note: Some details are omitted, run with `RUST_BACKTRACE=full` for a verbose backtrace.
  571. 30.62 s > system-out
  572. 30.62 s > running 1 test
  573. 30.62 s > ━━━━━━━━━━━━━━━━━━━━━━━━━━━━━━━ Snapshot Summary ━━━━━━━━━━━━━━━━━━━━━━━━━━━━━━━
  574. 30.62 s > Snapshot: infinite_execution
  575. 30.62 s > Source: crates/idenso/src/tensor/tests/parsing.rs:910
  576. 30.62 s > ────────────────────────────────────────────────────────────────────────────────
  577. 30.62 s > Expression: net_iter.snapshot_dot()
  578. 30.62 s > ────────────────────────────────────────────────────────────────────────────────
  579. 30.62 s > -old snapshot
  580. 30.62 s > +new results
  581. 30.62 s > ────────────┬───────────────────────────────────────────────────────────────────
  582. 30.62 s > 8 8 │ 0:0:s-> ext0 [id=0 color="red"];
  583. 30.62 s > 9 9 │ ext1 [style=invis];
  584. 30.62 s > 10 10 │ 0:5:s-> ext1 [id=1 dir=none color="red" label="mink4|l_0"];
  585. 30.62 s > 11 11 │ ext2 [style=invis];
  586. 30.62 s > 12 │- 0:4:s-> ext2 [id=2 dir=none color="red" label="bis4|l_2"];
  587. 30.62 s > 12 │+ 0:3:s-> ext2 [id=2 dir=none color="red" label="mink4|l_1"];
  588. 30.62 s > 13 13 │ ext3 [style=invis];
  589. 30.62 s > 14 │- 0:3:s-> ext3 [id=3 dir=none color="red" label="bis4|l_3"];
  590. 30.62 s > 14 │+ 0:1:s-> ext3 [id=3 dir=none color="red" label="bis4|l_2"];
  591. 30.62 s > 15 15 │ ext4 [style=invis];
  592. 30.62 s > 16 │- 0:1:s-> ext4 [id=4 dir=none color="red" label="mink4|l_1"];
  593. 30.62 s > 16 │+ 0:2:s-> ext4 [id=4 dir=none color="red" label="mink4|l_4"];
  594. 30.62 s > 17 17 │ ext5 [style=invis];
  595. 30.62 s > 18 │- 0:2:s-> ext5 [id=5 dir=none color="red" label="mink4|l_4"];
  596. 30.62 s > 18 │+ 0:4:s-> ext5 [id=5 dir=none color="red" label="bis4|l_3"];
  597. 30.62 s > 19 19 │ }
  598. 30.62 s > ────────────┴───────────────────────────────────────────────────────────────────
  599. 30.62 s > To update snapshots run `cargo insta review`
  600. 30.62 s > Stopped on the first failure. Run `cargo insta test` to run all snapshots.
  601. 30.62 s > test tensor::tests::parsing::infinite_execution ... FAILED
  602. 30.62 s >
  603. 30.62 s > failures:
  604. 30.62 s >
  605. 30.62 s > failures:
  606. 30.62 s > tensor::tests::parsing::infinite_execution
  607. 30.62 s >
  608. 30.62 s > test result: FAILED. 0 passed; 1 failed; 0 ignored; 0 measured; 240 filtered out; finished in 0.55s
  609. 30.62 s > system-err
  610. 30.62 s > thread 'tensor::tests::parsing::infinite_execution' (848) panicked at /nix/store/30svmzr0z0zpcqjyynjn7w21wgx18y4b-vendor-cargo-deps/c19b7c6f923b580ac259164a89f2577984ad5ab09ee9d583b888f934adbbe8d0/insta-1.47.2/src/runtime.rs:719:13:
  611. 30.62 s > snapshot assertion for 'infinite_execution' failed in line 910
  612. 30.62 s > stack backtrace:
  613. 30.62 s > 0: __rustc::rust_begin_unwind
  614. 30.62 s > 1: core::panicking::panic_fmt
  615. 30.62 s > 2: insta::runtime::assert_snapshot
  616. 30.62 s > 3: idenso::tensor::tests::parsing::infinite_execution
  617. 30.62 s > 4: <idenso::tensor::tests::parsing::infinite_execution::{closure#0} as core::ops::function::FnOnce<()>>::call_once
  618. 30.62 s > note: Some details are omitted, run with `RUST_BACKTRACE=full` for a verbose backtrace.
  619. 30.62 s > =========================================
  620. 30.62 s > Extracting 2 binaries and 1 linked path to /build/nextest-archive-hc74u2
  621. 30.62 s > Extracted 8 files to /build/nextest-archive-hc74u2 in 0.27s
  622. 30.62 s > ------------
  623. 30.62 s > Nextest run ID c188dbdb-9725-4cc7-94d6-1614c40e0d23 with nextest profile: ci_gammaloop
  624. 30.62 s > Starting 135 tests across 2 binaries
  625. 30.62 s > ------------
  626. 30.62 s > Summary [ 0.305s] 135 tests run: 135 passed, 0 skipped
  627. 30.62 s >
  628. 30.62 s > ========== nextest test summary ==========
  629. 30.62 s > report: target/nextest/ci_gammaloop/junit.xml
  630. 30.62 s > tests: 135, failures: 0, errors: 0
  631. 30.62 s > No failing testcases found.
  632. 30.62 s > =========================================
  633. 30.62 s > Extracting 5 binaries and 2 linked paths to /build/nextest-archive-9G4Xx2
  634. 30.62 s > Extracted 19 files to /build/nextest-archive-9G4Xx2 in 0.36s
  635. 30.62 s > ------------
  636. 30.62 s > Nextest run ID 86543b62-621b-4a49-8679-781e459c4a44 with nextest profile: ci_gammaloop
  637. 30.62 s > Starting 25 tests across 5 binaries (1 test skipped via profile.ci_gammaloop.default-filter)
  638. 30.62 s > ------------
  639. 30.62 s > Summary [ 0.354s] 25 tests run: 25 passed, 1 skipped
  640. 30.62 s >
  641. 30.62 s > ========== nextest test summary ==========
  642. 30.62 s > report: target/nextest/ci_gammaloop/junit.xml
  643. 30.62 s > tests: 25, failures: 0, errors: 0
  644. 30.62 s > No failing testcases found.
  645. 30.62 s > =========================================
  646. 30.62 s > Extracting 2 binaries and 1 linked path to /build/nextest-archive-IKbDng
  647. 30.62 s > Extracted 8 files to /build/nextest-archive-IKbDng in 0.10s
  648. 30.62 s > ------------
  649. 30.62 s > Nextest run ID 8b09aba8-c229-412d-8327-bfd0fa01a935 with nextest profile: ci_gammaloop
  650. 30.62 s > Starting 1 test across 2 binaries
  651. 30.62 s > ------------
  652. 30.62 s > Summary [ 0.009s] 1 test run: 1 passed, 0 skipped
  653. 30.62 s >
  654. 30.62 s > ========== nextest test summary ==========
  655. 30.62 s > report: target/nextest/ci_gammaloop/junit.xml
  656. 30.62 s > tests: 1, failures: 0, errors: 0
  657. 30.62 s > No failing testcases found.
  658. 30.62 s > =========================================
  659. 30.62 s > Extracting 1 binary and 1 linked path to /build/nextest-archive-umoq1E
  660. 30.62 s > Extracted 7 files to /build/nextest-archive-umoq1E in 0.09s
  661. 30.62 s > ------------
  662. 30.62 s > Nextest run ID 5a1374a7-5afe-40e7-9926-5daf58fd9d1c with nextest profile: ci_gammaloop
  663. 30.62 s > Starting 0 tests across 1 binary
  664. 30.62 s > ------------
  665. 30.62 s > Summary [ 0.003s] 0 tests run: 0 passed, 0 skipped
  666. 30.62 s >
  667. 30.62 s > ========== nextest test summary ==========
  668. 30.62 s > report: target/nextest/ci_gammaloop/junit.xml
  669. 30.62 s > tests: 0, failures: 0, errors: 0
  670. 30.62 s > No failing testcases found.
  671. 30.62 s > =========================================
  672. 30.62 s For full logs, run:
  673. 30.62 s nix log /nix/store/wg9z1d6ybvc8xl844i0n0mklxxwi1328-gammaloop-nextest-spenso.drv
  674. 30.80 s [0 built (1 failed), 0.0Run failed.