0.48 s
$ /nix/store/9ypz3flqsrl5xl495mm8h645gadjsxi1-coreutils-9.11/bin/timeout --kill-after=15s 7200s /nix/store/23zk8sgzamrbmj1fday15szf7f2279s8-nix-2.34.7/bin/nix --extra-experimental-features nix-command --extra-experimental-features flakes flake clone git+https://github.com/alphal00p/gammaloop --dest /tmp/nix-ci-worker/stable-pwd/repo/
0.49 s
Cloning into '/tmp/nix-ci-worker/stable-pwd/repo'...
0.89 s
remote: Enumerating objects: 65060, done.
1.01 s
remote: Counting objects: 0% (1/7732)
remote: Counting objects: 1% (78/7732)
remote: Counting objects: 2% (155/7732)
remote: Counting objects: 3% (232/7732)
remote: Counting objects: 4% (310/7732)
remote: Counting objects: 5% (387/7732)
remote: Counting objects: 6% (464/7732)
remote: Counting objects: 7% (542/7732)
remote: Counting objects: 8% (619/7732)
remote: Counting objects: 9% (696/7732)
remote: Counting objects: 10% (774/7732)
remote: Counting objects: 11% (851/7732)
remote: Counting objects: 12% (928/7732)
remote: Counting objects: 13% (1006/7732)
remote: Counting objects: 14% (1083/7732)
remote: Counting objects: 15% (1160/7732)
remote: Counting objects: 16% (1238/7732)
remote: Counting objects: 17% (1315/7732)
remote: Counting objects: 18% (1392/7732)
remote: Counting objects: 19% (1470/7732)
remote: Counting objects: 20% (1547/7732)
remote: Counting objects: 21% (1624/7732)
remote: Counting objects: 22% (1702/7732)
remote: Counting objects: 23% (1779/7732)
remote: Counting objects: 24% (1856/7732)
remote: Counting objects: 25% (1933/7732)
remote: Counting objects: 26% (2011/7732)
remote: Counting objects: 27% (2088/7732)
remote: Counting objects: 28% (2165/7732)
remote: Counting objects: 29% (2243/7732)
remote: Counting objects: 30% (2320/7732)
remote: Counting objects: 31% (2397/7732)
remote: Counting objects: 32% (2475/7732)
remote: Counting objects: 33% (2552/7732)
remote: Counting objects: 34% (2629/7732)
remote: Counting objects: 35% (2707/7732)
remote: Counting objects: 36% (2784/7732)
remote: Counting objects: 37% (2861/7732)
remote: Counting objects: 38% (2939/7732)
remote: Counting objects: 39% (3016/7732)
remote: Counting objects: 40% (3093/7732)
remote: Counting objects: 41% (3171/7732)
remote: Counting objects: 42% (3248/7732)
remote: Counting objects: 43% (3325/7732)
remote: Counting objects: 44% (3403/7732)
remote: Counting objects: 45% (3480/7732)
remote: Counting objects: 46% (3557/7732)
remote: Counting objects: 47% (3635/7732)
remote: Counting objects: 48% (3712/7732)
remote: Counting objects: 49% (3789/7732)
remote: Counting objects: 50% (3866/7732)
remote: Counting objects: 51% (3944/7732)
remote: Counting objects: 52% (4021/7732)
remote: Counting objects: 53% (4098/7732)
remote: Counting objects: 54% (4176/7732)
remote: Counting objects: 55% (4253/7732)
remote: Counting objects: 56% (4330/7732)
remote: Counting objects: 57% (4408/7732)
remote: Counting objects: 58% (4485/7732)
remote: Counting objects: 59% (4562/7732)
remote: Counting objects: 60% (4640/7732)
remote: Counting objects: 61% (4717/7732)
remote: Counting objects: 62% (4794/7732)
remote: Counting objects: 63% (4872/7732)
remote: Counting objects: 64% (4949/7732)
remote: Counting objects: 65% (5026/7732)
remote: Counting objects: 66% (5104/7732)
remote: Counting objects: 67% (5181/7732)
remote: Counting objects: 68% (5258/7732)
remote: Counting objects: 69% (5336/7732)
remote: Counting objects: 70% (5413/7732)
remote: Counting objects: 71% (5490/7732)
remote: Counting objects: 72% (5568/7732)
remote: Counting objects: 73% (5645/7732)
remote: Counting objects: 74% (5722/7732)
remote: Counting objects: 75% (5799/7732)
remote: Counting objects: 76% (5877/7732)
remote: Counting objects: 77% (5954/7732)
remote: Counting objects: 78% (6031/7732)
remote: Counting objects: 79% (6109/7732)
remote: Counting objects: 80% (6186/7732)
remote: Counting objects: 81% (6263/7732)
remote: Counting objects: 82% (6341/7732)
remote: Counting objects: 83% (6418/7732)
remote: Counting objects: 84% (6495/7732)
remote: Counting objects: 85% (6573/7732)
remote: Counting objects: 86% (6650/7732)
remote: Counting objects: 87% (6727/7732)
remote: Counting objects: 88% (6805/7732)
remote: Counting objects: 89% (6882/7732)
remote: Counting objects: 90% (6959/7732)
remote: Counting objects: 91% (7037/7732)
remote: Counting objects: 92% (7114/7732)
remote: Counting objects: 93% (7191/7732)
remote: Counting objects: 94% (7269/7732)
remote: Counting objects: 95% (7346/7732)
remote: Counting objects: 96% (7423/7732)
remote: Counting objects: 97% (7501/7732)
remote: Counting objects: 98% (7578/7732)
remote: Counting objects: 99% (7655/7732)
remote: Counting objects: 100% (7732/7732)
remote: Counting objects: 100% (7732/7732), done.
2.44 s
remote: Compressing objects: 0% (1/1434)
remote: Compressing objects: 1% (15/1434)
remote: Compressing objects: 2% (29/1434)
remote: Compressing objects: 3% (44/1434)
remote: Compressing objects: 4% (58/1434)
remote: Compressing objects: 5% (72/1434)
remote: Compressing objects: 6% (87/1434)
remote: Compressing objects: 7% (101/1434)
remote: Compressing objects: 8% (115/1434)
remote: Compressing objects: 9% (130/1434)
remote: Compressing objects: 10% (144/1434)
remote: Compressing objects: 11% (158/1434)
remote: Compressing objects: 12% (173/1434)
remote: Compressing objects: 13% (187/1434)
remote: Compressing objects: 13% (193/1434)
remote: Compressing objects: 14% (201/1434)
remote: Compressing objects: 15% (216/1434)
remote: Compressing objects: 16% (230/1434)
remote: Compressing objects: 17% (244/1434)
remote: Compressing objects: 18% (259/1434)
remote: Compressing objects: 19% (273/1434)
remote: Compressing objects: 20% (287/1434)
remote: Compressing objects: 21% (302/1434)
remote: Compressing objects: 22% (316/1434)
remote: Compressing objects: 23% (330/1434)
remote: Compressing objects: 24% (345/1434)
remote: Compressing objects: 25% (359/1434)
remote: Compressing objects: 26% (373/1434)
remote: Compressing objects: 27% (388/1434)
remote: Compressing objects: 28% (402/1434)
remote: Compressing objects: 29% (416/1434)
remote: Compressing objects: 30% (431/1434)
remote: Compressing objects: 31% (445/1434)
remote: Compressing objects: 32% (459/1434)
remote: Compressing objects: 33% (474/1434)
remote: Compressing objects: 34% (488/1434)
remote: Compressing objects: 35% (502/1434)
remote: Compressing objects: 36% (517/1434)
remote: Compressing objects: 37% (531/1434)
remote: Compressing objects: 38% (545/1434)
remote: Compressing objects: 39% (560/1434)
remote: Compressing objects: 40% (574/1434)
remote: Compressing objects: 41% (588/1434)
remote: Compressing objects: 42% (603/1434)
remote: Compressing objects: 43% (617/1434)
remote: Compressing objects: 44% (631/1434)
remote: Compressing objects: 45% (646/1434)
remote: Compressing objects: 46% (660/1434)
remote: Compressing objects: 47% (674/1434)
remote: Compressing objects: 48% (689/1434)
remote: Compressing objects: 49% (703/1434)
remote: Compressing objects: 50% (717/1434)
remote: Compressing objects: 51% (732/1434)
remote: Compressing objects: 52% (746/1434)
remote: Compressing objects: 53% (761/1434)
remote: Compressing objects: 54% (775/1434)
remote: Compressing objects: 55% (789/1434)
remote: Compressing objects: 56% (804/1434)
remote: Compressing objects: 57% (818/1434)
remote: Compressing objects: 58% (832/1434)
remote: Compressing objects: 59% (847/1434)
remote: Compressing objects: 60% (861/1434)
remote: Compressing objects: 61% (875/1434)
remote: Compressing objects: 62% (890/1434)
remote: Compressing objects: 63% (904/1434)
remote: Compressing objects: 64% (918/1434)
remote: Compressing objects: 65% (933/1434)
remote: Compressing objects: 66% (947/1434)
remote: Compressing objects: 67% (961/1434)
remote: Compressing objects: 68% (976/1434)
remote: Compressing objects: 69% (990/1434)
remote: Compressing objects: 70% (1004/1434)
remote: Compressing objects: 71% (1019/1434)
remote: Compressing objects: 72% (1033/1434)
remote: Compressing objects: 73% (1047/1434)
remote: Compressing objects: 74% (1062/1434)
remote: Compressing objects: 75% (1076/1434)
remote: Compressing objects: 76% (1090/1434)
remote: Compressing objects: 77% (1105/1434)
remote: Compressing objects: 78% (1119/1434)
remote: Compressing objects: 79% (1133/1434)
remote: Compressing objects: 80% (1148/1434)
remote: Compressing objects: 81% (1162/1434)
remote: Compressing objects: 82% (1176/1434)
remote: Compressing objects: 83% (1191/1434)
remote: Compressing objects: 84% (1205/1434)
remote: Compressing objects: 85% (1219/1434)
remote: Compressing objects: 86% (1234/1434)
remote: Compressing objects: 87% (1248/1434)
remote: Compressing objects: 88% (1262/1434)
remote: Compressing objects: 89% (1277/1434)
remote: Compressing objects: 90% (1291/1434)
remote: Compressing objects: 91% (1305/1434)
remote: Compressing objects: 92% (1320/1434)
remote: Compressing objects: 93% (1334/1434)
remote: Compressing objects: 94% (1348/1434)
remote: Compressing objects: 95% (1363/1434)
remote: Compressing objects: 96% (1377/1434)
remote: Compressing objects: 97% (1391/1434)
remote: Compressing objects: 98% (1406/1434)
remote: Compressing objects: 99% (1420/1434)
remote: Compressing objects: 100% (1434/1434)
remote: Compressing objects: 100% (1434/1434), done.
5.41 s
Receiving objects: 0% (1/65060)
Receiving objects: 1% (651/65060)
Receiving objects: 2% (1302/65060)
Receiving objects: 3% (1952/65060)
Receiving objects: 4% (2603/65060)
Receiving objects: 5% (3253/65060)
Receiving objects: 6% (3904/65060)
Receiving objects: 7% (4555/65060)
Receiving objects: 8% (5205/65060), 8.69 MiB | 17.36 MiB/s
Receiving objects: 9% (5856/65060), 8.69 MiB | 17.36 MiB/s
Receiving objects: 10% (6506/65060), 8.69 MiB | 17.36 MiB/s
Receiving objects: 11% (7157/65060), 8.69 MiB | 17.36 MiB/s
Receiving objects: 12% (7808/65060), 8.69 MiB | 17.36 MiB/s
Receiving objects: 13% (8458/65060), 8.69 MiB | 17.36 MiB/s
Receiving objects: 14% (9109/65060), 8.69 MiB | 17.36 MiB/s
Receiving objects: 15% (9759/65060), 8.69 MiB | 17.36 MiB/s
Receiving objects: 16% (10410/65060), 8.69 MiB | 17.36 MiB/s
Receiving objects: 17% (11061/65060), 8.69 MiB | 17.36 MiB/s
Receiving objects: 18% (11711/65060), 8.69 MiB | 17.36 MiB/s
Receiving objects: 19% (12362/65060), 8.69 MiB | 17.36 MiB/s
Receiving objects: 20% (13012/65060), 8.69 MiB | 17.36 MiB/s
Receiving objects: 21% (13663/65060), 8.69 MiB | 17.36 MiB/s
Receiving objects: 22% (14314/65060), 8.69 MiB | 17.36 MiB/s
Receiving objects: 23% (14964/65060), 8.69 MiB | 17.36 MiB/s
Receiving objects: 24% (15615/65060), 8.69 MiB | 17.36 MiB/s
Receiving objects: 25% (16265/65060), 8.69 MiB | 17.36 MiB/s
Receiving objects: 26% (16916/65060), 8.69 MiB | 17.36 MiB/s
Receiving objects: 27% (17567/65060), 8.69 MiB | 17.36 MiB/s
Receiving objects: 28% (18217/65060), 8.69 MiB | 17.36 MiB/s
Receiving objects: 29% (18868/65060), 8.69 MiB | 17.36 MiB/s
Receiving objects: 30% (19518/65060), 8.69 MiB | 17.36 MiB/s
Receiving objects: 31% (20169/65060), 8.69 MiB | 17.36 MiB/s
Receiving objects: 31% (20602/65060), 8.69 MiB | 17.36 MiB/s
Receiving objects: 32% (20820/65060), 22.42 MiB | 22.41 MiB/s
Receiving objects: 33% (21470/65060), 22.42 MiB | 22.41 MiB/s
Receiving objects: 34% (22121/65060), 22.42 MiB | 22.41 MiB/s
Receiving objects: 35% (22771/65060), 22.42 MiB | 22.41 MiB/s
Receiving objects: 36% (23422/65060), 22.42 MiB | 22.41 MiB/s
Receiving objects: 37% (24073/65060), 22.42 MiB | 22.41 MiB/s
Receiving objects: 38% (24723/65060), 22.42 MiB | 22.41 MiB/s
Receiving objects: 39% (25374/65060), 22.42 MiB | 22.41 MiB/s
Receiving objects: 40% (26024/65060), 22.42 MiB | 22.41 MiB/s
Receiving objects: 41% (26675/65060), 22.42 MiB | 22.41 MiB/s
Receiving objects: 42% (27326/65060), 22.42 MiB | 22.41 MiB/s
Receiving objects: 43% (27976/65060), 22.42 MiB | 22.41 MiB/s
Receiving objects: 44% (28627/65060), 22.42 MiB | 22.41 MiB/s
Receiving objects: 45% (29277/65060), 22.42 MiB | 22.41 MiB/s
Receiving objects: 46% (29928/65060), 22.42 MiB | 22.41 MiB/s
Receiving objects: 47% (30579/65060), 22.42 MiB | 22.41 MiB/s
Receiving objects: 48% (31229/65060), 22.42 MiB | 22.41 MiB/s
Receiving objects: 49% (31880/65060), 22.42 MiB | 22.41 MiB/s
Receiving objects: 50% (32530/65060), 22.42 MiB | 22.41 MiB/s
Receiving objects: 51% (33181/65060), 22.42 MiB | 22.41 MiB/s
Receiving objects: 52% (33832/65060), 22.42 MiB | 22.41 MiB/s
Receiving objects: 53% (34482/65060), 22.42 MiB | 22.41 MiB/s
Receiving objects: 54% (35133/65060), 22.42 MiB | 22.41 MiB/s
Receiving objects: 55% (35783/65060), 22.42 MiB | 22.41 MiB/s
Receiving objects: 56% (36434/65060), 22.42 MiB | 22.41 MiB/s
Receiving objects: 57% (37085/65060), 22.42 MiB | 22.41 MiB/s
Receiving objects: 58% (37735/65060), 40.81 MiB | 26.61 MiB/s
Receiving objects: 59% (38386/65060), 40.81 MiB | 26.61 MiB/s
Receiving objects: 60% (39036/65060), 40.81 MiB | 26.61 MiB/s
Receiving objects: 61% (39687/65060), 40.81 MiB | 26.61 MiB/s
Receiving objects: 62% (40338/65060), 40.81 MiB | 26.61 MiB/s
Receiving objects: 63% (40988/65060), 40.81 MiB | 26.61 MiB/s
Receiving objects: 64% (41639/65060), 40.81 MiB | 26.61 MiB/s
Receiving objects: 65% (42289/65060), 40.81 MiB | 26.61 MiB/s
Receiving objects: 66% (42940/65060), 40.81 MiB | 26.61 MiB/s
Receiving objects: 67% (43591/65060), 40.81 MiB | 26.61 MiB/s
Receiving objects: 68% (44241/65060), 40.81 MiB | 26.61 MiB/s
Receiving objects: 69% (44892/65060), 40.81 MiB | 26.61 MiB/s
Receiving objects: 70% (45542/65060), 40.81 MiB | 26.61 MiB/s
Receiving objects: 71% (46193/65060), 40.81 MiB | 26.61 MiB/s
Receiving objects: 71% (46480/65060), 40.81 MiB | 26.61 MiB/s
Receiving objects: 72% (46844/65060), 57.54 MiB | 28.31 MiB/s
Receiving objects: 73% (47494/65060), 57.54 MiB | 28.31 MiB/s
Receiving objects: 74% (48145/65060), 57.54 MiB | 28.31 MiB/s
Receiving objects: 75% (48795/65060), 57.54 MiB | 28.31 MiB/s
Receiving objects: 76% (49446/65060), 57.54 MiB | 28.31 MiB/s
Receiving objects: 77% (50097/65060), 57.54 MiB | 28.31 MiB/s
Receiving objects: 78% (50747/65060), 57.54 MiB | 28.31 MiB/s
Receiving objects: 79% (51398/65060), 57.54 MiB | 28.31 MiB/s
Receiving objects: 80% (52048/65060), 73.92 MiB | 29.19 MiB/s
Receiving objects: 81% (52699/65060), 73.92 MiB | 29.19 MiB/s
Receiving objects: 82% (53350/65060), 73.92 MiB | 29.19 MiB/s
Receiving objects: 83% (54000/65060), 73.92 MiB | 29.19 MiB/s
Receiving objects: 84% (54651/65060), 73.92 MiB | 29.19 MiB/s
Receiving objects: 85% (55301/65060), 73.92 MiB | 29.19 MiB/s
Receiving objects: 86% (55952/65060), 73.92 MiB | 29.19 MiB/s
Receiving objects: 87% (56603/65060), 73.92 MiB | 29.19 MiB/s
Receiving objects: 88% (57253/65060), 73.92 MiB | 29.19 MiB/s
Receiving objects: 89% (57904/65060), 73.92 MiB | 29.19 MiB/s
Receiving objects: 90% (58554/65060), 73.92 MiB | 29.19 MiB/s
Receiving objects: 91% (59205/65060), 73.92 MiB | 29.19 MiB/s
Receiving objects: 92% (59856/65060), 73.92 MiB | 29.19 MiB/s
Receiving objects: 93% (60506/65060), 73.92 MiB | 29.19 MiB/s
Receiving objects: 94% (61157/65060), 73.92 MiB | 29.19 MiB/s
Receiving objects: 95% (61807/65060), 73.92 MiB | 29.19 MiB/s
Receiving objects: 96% (62458/65060), 73.92 MiB | 29.19 MiB/s
Receiving objects: 97% (63109/65060), 73.92 MiB | 29.19 MiB/s
Receiving objects: 98% (63759/65060), 73.92 MiB | 29.19 MiB/s
Receiving objects: 99% (64410/65060), 73.92 MiB | 29.19 MiB/s
remote: Total 65060 (delta 6825), reused 6316 (delta 6297), pack-reused 57328 (from 1)
5.41 s
Receiving objects: 100% (65060/65060), 73.92 MiB | 29.19 MiB/s
Receiving objects: 100% (65060/65060), 87.00 MiB | 29.27 MiB/s, done.
6.55 s
Resolving deltas: 0% (0/45922)
Resolving deltas: 1% (460/45922)
Resolving deltas: 2% (919/45922)
Resolving deltas: 3% (1378/45922)
Resolving deltas: 4% (1837/45922)
Resolving deltas: 5% (2297/45922)
Resolving deltas: 6% (2756/45922)
Resolving deltas: 7% (3215/45922)
Resolving deltas: 8% (3674/45922)
Resolving deltas: 9% (4133/45922)
Resolving deltas: 10% (4593/45922)
Resolving deltas: 11% (5052/45922)
Resolving deltas: 12% (5511/45922)
Resolving deltas: 13% (5970/45922)
Resolving deltas: 14% (6430/45922)
Resolving deltas: 15% (6889/45922)
Resolving deltas: 16% (7348/45922)
Resolving deltas: 17% (7807/45922)
Resolving deltas: 18% (8266/45922)
Resolving deltas: 19% (8726/45922)
Resolving deltas: 20% (9185/45922)
Resolving deltas: 21% (9644/45922)
Resolving deltas: 22% (10103/45922)
Resolving deltas: 23% (10564/45922)
Resolving deltas: 24% (11022/45922)
Resolving deltas: 25% (11481/45922)
Resolving deltas: 26% (11940/45922)
Resolving deltas: 27% (12399/45922)
Resolving deltas: 28% (12859/45922)
Resolving deltas: 29% (13319/45922)
Resolving deltas: 30% (13778/45922)
Resolving deltas: 31% (14236/45922)
Resolving deltas: 32% (14696/45922)
Resolving deltas: 33% (15155/45922)
Resolving deltas: 34% (15614/45922)
Resolving deltas: 35% (16073/45922)
Resolving deltas: 36% (16532/45922)
Resolving deltas: 37% (16992/45922)
Resolving deltas: 38% (17451/45922)
Resolving deltas: 39% (17910/45922)
Resolving deltas: 40% (18369/45922)
Resolving deltas: 41% (18829/45922)
Resolving deltas: 42% (19288/45922)
Resolving deltas: 43% (19747/45922)
Resolving deltas: 44% (20207/45922)
Resolving deltas: 45% (20665/45922)
Resolving deltas: 46% (21125/45922)
Resolving deltas: 47% (21584/45922)
Resolving deltas: 48% (22043/45922)
Resolving deltas: 49% (22502/45922)
Resolving deltas: 50% (22961/45922)
Resolving deltas: 51% (23421/45922)
Resolving deltas: 52% (23880/45922)
Resolving deltas: 53% (24339/45922)
Resolving deltas: 54% (24798/45922)
Resolving deltas: 55% (25258/45922)
Resolving deltas: 56% (25717/45922)
Resolving deltas: 57% (26176/45922)
Resolving deltas: 58% (26635/45922)
Resolving deltas: 59% (27094/45922)
Resolving deltas: 60% (27554/45922)
Resolving deltas: 61% (28014/45922)
Resolving deltas: 62% (28472/45922)
Resolving deltas: 63% (28934/45922)
Resolving deltas: 64% (29391/45922)
Resolving deltas: 65% (29850/45922)
Resolving deltas: 66% (30309/45922)
Resolving deltas: 67% (30768/45922)
Resolving deltas: 68% (31227/45922)
Resolving deltas: 69% (31687/45922)
Resolving deltas: 70% (32146/45922)
Resolving deltas: 71% (32605/45922)
Resolving deltas: 72% (33064/45922)
Resolving deltas: 73% (33524/45922)
Resolving deltas: 74% (33984/45922)
Resolving deltas: 75% (34442/45922)
Resolving deltas: 76% (34901/45922)
Resolving deltas: 77% (35360/45922)
Resolving deltas: 78% (35820/45922)
Resolving deltas: 79% (36279/45922)
Resolving deltas: 80% (36738/45922)
Resolving deltas: 81% (37197/45922)
Resolving deltas: 82% (37657/45922)
Resolving deltas: 83% (38116/45922)
Resolving deltas: 83% (38397/45922)
Resolving deltas: 84% (38575/45922)
Resolving deltas: 85% (39034/45922)
Resolving deltas: 86% (39493/45922)
Resolving deltas: 87% (39953/45922)
Resolving deltas: 88% (40412/45922)
Resolving deltas: 89% (40871/45922)
Resolving deltas: 90% (41330/45922)
Resolving deltas: 91% (41790/45922)
Resolving deltas: 92% (42249/45922)
Resolving deltas: 93% (42708/45922)
Resolving deltas: 94% (43167/45922)
Resolving deltas: 95% (43626/45922)
Resolving deltas: 96% (44086/45922)
Resolving deltas: 97% (44545/45922)
Resolving deltas: 98% (45004/45922)
Resolving deltas: 99% (45466/45922)
Resolving deltas: 100% (45922/45922)
Resolving deltas: 100% (45922/45922), done.
6.89 s
Fetching commit c1745ddd5ccecc94c54a846b90ea9a0e89de4682 for vakint_rustred ...
6.89 s
$ /nix/store/bcnisk3ydfgv26v2gw3zlky24g00yww2-git-2.54.0/bin/git fetch origin c1745ddd5ccecc94c54a846b90ea9a0e89de4682
7.52 s
From https://github.com/alphal00p/gammaloop
7.52 s
* branch c1745ddd5ccecc94c54a846b90ea9a0e89de4682 -> FETCH_HEAD
8.09 s
$ /nix/store/9ypz3flqsrl5xl495mm8h645gadjsxi1-coreutils-9.11/bin/timeout --kill-after=15s 7200s /nix/store/bcnisk3ydfgv26v2gw3zlky24g00yww2-git-2.54.0/bin/git -c advice.detachedHead=false checkout c1745ddd5ccecc94c54a846b90ea9a0e89de4682
9.30 s
HEAD is now at c1745ddd Validate explicit RustRed tensor routings
9.30 s
$ /nix/store/9ypz3flqsrl5xl495mm8h645gadjsxi1-coreutils-9.11/bin/timeout --kill-after=15s 7200s /nix/store/23zk8sgzamrbmj1fday15szf7f2279s8-nix-2.34.7/bin/nix --extra-experimental-features nix-command --extra-experimental-features flakes --log-format internal-json run .#packages.x86_64-linux.nix-ci-check-gammaloop-nextest-spenso --print-build-logs
9.41 s
14.30 s
evaluating derivation 'g
copying '/nix/store/1zhf
evaluating derivation 'g
copying '/nix/store/1zhf
evaluating derivation 'g
copying '/nix/store/1zhf
evaluating derivation 'g
copying '/nix/store/1zhf
evaluating derivation 'g
[0 /1 built]
[1 /0 /1 built]
[1 /0 /1 built] building g gammaloop-nextest-spenso> Extracting 5 binaries and 2 linked paths to /build/nextest-archive-IDzsFi
14.49 s
gammaloop-nextest-spenso> Extracted 19 files to /build/nextest-archive-IDzsFi in 0.20s
14.50 s
gammaloop-nextest-spenso> ------------
14.51 s
gammaloop-nextest-spenso> Nextest run ID b3598f75-5db4-4bc1-8e25-508a89b75ad7 with nextest profile: ci_gammaloop
14.51 s
gammaloop-nextest-spenso> Starting 224 tests across 5 binaries (26 tests skipped , including 2 tests via profile.ci_gammaloop.default-filter )
14.60 s
gammaloop-nextest-spenso> FAIL [ 0.012s] ( 46/224) idenso color::test::form_reference :: metric_contraction_respects_antisymmetric_normalization
14.60 s
gammaloop-nextest-spenso> stdout ---
14.60 s
gammaloop-nextest-spenso>
14.60 s
gammaloop-nextest-spenso> running 1 test
14.60 s
gammaloop-nextest-spenso> test color::test::form_reference::metric_contraction_respects_antisymmetric_normalization ... FAILED
14.60 s
gammaloop-nextest-spenso>
14.60 s
gammaloop-nextest-spenso> failures:
14.60 s
gammaloop-nextest-spenso>
14.60 s
gammaloop-nextest-spenso> failures:
14.60 s
gammaloop-nextest-spenso> color::test::form_reference::metric_contraction_respects_antisymmetric_normalization
14.60 s
gammaloop-nextest-spenso>
14.60 s
gammaloop-nextest-spenso> test result: FAILED. 0 passed; 1 failed; 0 ignored; 0 measured; 240 filtered out; finished in 0.00s
14.60 s
gammaloop-nextest-spenso>
14.60 s
gammaloop-nextest-spenso> stderr ---
14.60 s
gammaloop-nextest-spenso>
14.60 s
gammaloop-nextest-spenso> thread 'color::test::form_reference::metric_contraction_respects_antisymmetric_normalization' (331) panicked at crates/idenso/src/color/test/form_reference.rs:171:5:
14.60 s
gammaloop-nextest-spenso> assertion `left == right` failed
14.60 s
gammaloop-nextest-spenso> left: "-1*f(coad(8,standalone_metric_j),coad(8,standalone_metric_s),coad(8,standalone_metric_u))"
14.60 s
gammaloop-nextest-spenso> right: "f(coad(8,standalone_metric_j),coad(8,standalone_metric_s),coad(8,standalone_metric_u))"
14.60 s
gammaloop-nextest-spenso> stack backtrace:
14.60 s
gammaloop-nextest-spenso> 0: __rustc::rust_begin_unwind
14.60 s
gammaloop-nextest-spenso> 1: core::panicking::panic_fmt
14.60 s
gammaloop-nextest-spenso> 2: core::panicking::assert_failed_inner
14.60 s
gammaloop-nextest-spenso> 3: core::panicking::assert_failed::<alloc::string::String, alloc::string::String>
14.60 s
gammaloop-nextest-spenso> 4: idenso::color::test::form_reference::metric_contraction_respects_antisymmetric_normalization
14.60 s
gammaloop-nextest-spenso> 5: <idenso::color::test::form_reference::metric_contraction_respects_antisymmetric_normalization::{closure#0} as core::ops::function::FnOnce<()>>::call_once
14.60 s
gammaloop-nextest-spenso> note: Some details are omitted, run with `RUST_BACKTRACE=full` for a verbose backtrace.
14.60 s
gammaloop-nextest-spenso>
14.85 s
gammaloop-nextest-spenso> FAIL [ 0.042s] (219/224) idenso tensor::tests::parsing :: infinite_execution
14.85 s
gammaloop-nextest-spenso> stdout ---
14.85 s
gammaloop-nextest-spenso>
14.85 s
gammaloop-nextest-spenso> running 1 test
14.85 s
gammaloop-nextest-spenso> ━━━━━━━━━━━━━━━━━━━━━━━━━━━━━━━ Snapshot Summary ━━━━━━━━━━━━━━━━━━━━━━━━━━━━━━━
14.85 s
gammaloop-nextest-spenso> Snapshot: infinite_execution
14.85 s
gammaloop-nextest-spenso> Source: crates/idenso/src/tensor/tests/parsing.rs:910
14.85 s
gammaloop-nextest-spenso> ────────────────────────────────────────────────────────────────────────────────
14.85 s
gammaloop-nextest-spenso> Expression: net_iter.snapshot_dot()
14.85 s
gammaloop-nextest-spenso> ────────────────────────────────────────────────────────────────────────────────
14.85 s
gammaloop-nextest-spenso> -old snapshot
14.85 s
gammaloop-nextest-spenso> +new results
14.85 s
gammaloop-nextest-spenso> ────────────┬───────────────────────────────────────────────────────────────────
14.85 s
gammaloop-nextest-spenso> 8 8 │ 0:0:s -> ext0 [id=0 color="red"];
14.85 s
gammaloop-nextest-spenso> 9 9 │ ext1 [style=invis];
14.85 s
gammaloop-nextest-spenso> 10 10 │ 0:5:s -> ext1 [id=1 dir=none color="red" label="mink4|l_0"];
14.85 s
gammaloop-nextest-spenso> 11 11 │ ext2 [style=invis];
14.85 s
gammaloop-nextest-spenso> 12 │- 0:4:s -> ext2 [id=2 dir=none color="red" label="bis4|l_2"];
14.85 s
gammaloop-nextest-spenso> 12 │+ 0:3:s -> ext2 [id=2 dir=none color="red" label="mink4|l_1"];
14.85 s
gammaloop-nextest-spenso> 13 13 │ ext3 [style=invis];
14.85 s
gammaloop-nextest-spenso> 14 │- 0:3:s -> ext3 [id=3 dir=none color="red" label="bis4|l_3"];
14.85 s
gammaloop-nextest-spenso> 14 │+ 0:1:s -> ext3 [id=3 dir=none color="red" label="bis4|l_2"];
14.85 s
gammaloop-nextest-spenso> 15 15 │ ext4 [style=invis];
14.85 s
gammaloop-nextest-spenso> 16 │- 0:1:s -> ext4 [id=4 dir=none color="red" label="mink4|l_1"];
14.85 s
gammaloop-nextest-spenso> 16 │+ 0:2:s -> ext4 [id=4 dir=none color="red" label="mink4|l_4"];
14.85 s
gammaloop-nextest-spenso> 17 17 │ ext5 [style=invis];
14.85 s
gammaloop-nextest-spenso> 18 │- 0:2:s -> ext5 [id=5 dir=none color="red" label="mink4|l_4"];
14.85 s
gammaloop-nextest-spenso> 18 │+ 0:4:s -> ext5 [id=5 dir=none color="red" label="bis4|l_3"];
14.85 s
gammaloop-nextest-spenso> 19 19 │ }
14.85 s
gammaloop-nextest-spenso> ────────────┴───────────────────────────────────────────────────────────────────
14.85 s
gammaloop-nextest-spenso> To update snapshots run `cargo insta review`
14.85 s
gammaloop-nextest-spenso> Stopped on the first failure. Run `cargo insta test` to run all snapshots.
14.85 s
gammaloop-nextest-spenso> test tensor::tests::parsing::infinite_execution ... FAILED
14.85 s
gammaloop-nextest-spenso>
14.85 s
gammaloop-nextest-spenso> failures:
14.85 s
gammaloop-nextest-spenso>
14.85 s
gammaloop-nextest-spenso> failures:
14.85 s
gammaloop-nextest-spenso> tensor::tests::parsing::infinite_execution
14.85 s
gammaloop-nextest-spenso>
14.85 s
gammaloop-nextest-spenso> test result: FAILED. 0 passed; 1 failed; 0 ignored; 0 measured; 240 filtered out; finished in 0.03s
14.85 s
gammaloop-nextest-spenso>
14.85 s
gammaloop-nextest-spenso> stderr ---
14.85 s
gammaloop-nextest-spenso>
14.85 s
gammaloop-nextest-spenso> thread 'tensor::tests::parsing::infinite_execution' (866) panicked at /nix/store/30svmzr0z0zpcqjyynjn7w21wgx18y4b-vendor-cargo-deps/c19b7c6f923b580ac259164a89f2577984ad5ab09ee9d583b888f934adbbe8d0/insta-1.47.2/src/runtime.rs:719:13:
14.85 s
gammaloop-nextest-spenso> snapshot assertion for 'infinite_execution' failed in line 910
14.85 s
gammaloop-nextest-spenso> stack backtrace:
14.85 s
gammaloop-nextest-spenso> 0: __rustc::rust_begin_unwind
14.85 s
gammaloop-nextest-spenso> 1: core::panicking::panic_fmt
14.85 s
gammaloop-nextest-spenso> 2: insta::runtime::assert_snapshot
14.85 s
gammaloop-nextest-spenso> 3: idenso::tensor::tests::parsing::infinite_execution
14.85 s
gammaloop-nextest-spenso> 4: <idenso::tensor::tests::parsing::infinite_execution::{closure#0} as core::ops::function::FnOnce<()>>::call_once
14.85 s
gammaloop-nextest-spenso> note: Some details are omitted, run with `RUST_BACKTRACE=full` for a verbose backtrace.
14.85 s
gammaloop-nextest-spenso>
16.30 s
gammaloop-nextest-spenso> ------------
16.30 s
gammaloop-nextest-spenso> Summary [ 1.793s] 224 tests run: 222 passed , 2 failed , 26 skipped
16.30 s
gammaloop-nextest-spenso> FAIL [ 0.012s] ( 46/224) idenso color::test::form_reference :: metric_contraction_respects_antisymmetric_normalization
16.30 s
gammaloop-nextest-spenso> stdout ---
16.30 s
gammaloop-nextest-spenso>
16.30 s
gammaloop-nextest-spenso> running 1 test
16.30 s
gammaloop-nextest-spenso> test color::test::form_reference::metric_contraction_respects_antisymmetric_normalization ... FAILED
16.30 s
gammaloop-nextest-spenso>
16.30 s
gammaloop-nextest-spenso> failures:
16.30 s
gammaloop-nextest-spenso>
16.30 s
gammaloop-nextest-spenso> failures:
16.30 s
gammaloop-nextest-spenso> color::test::form_reference::metric_contraction_respects_antisymmetric_normalization
16.30 s
gammaloop-nextest-spenso>
16.30 s
gammaloop-nextest-spenso> test result: FAILED. 0 passed; 1 failed; 0 ignored; 0 measured; 240 filtered out; finished in 0.00s
16.30 s
gammaloop-nextest-spenso>
16.30 s
gammaloop-nextest-spenso> stderr ---
16.30 s
gammaloop-nextest-spenso>
16.30 s
gammaloop-nextest-spenso> thread 'color::test::form_reference::metric_contraction_respects_antisymmetric_normalization' (331) panicked at crates/idenso/src/color/test/form_reference.rs:171:5:
16.30 s
gammaloop-nextest-spenso> assertion `left == right` failed
16.30 s
gammaloop-nextest-spenso> left: "-1*f(coad(8,standalone_metric_j),coad(8,standalone_metric_s),coad(8,standalone_metric_u))"
16.30 s
gammaloop-nextest-spenso> right: "f(coad(8,standalone_metric_j),coad(8,standalone_metric_s),coad(8,standalone_metric_u))"
16.30 s
gammaloop-nextest-spenso> stack backtrace:
16.30 s
gammaloop-nextest-spenso> 0: __rustc::rust_begin_unwind
16.30 s
gammaloop-nextest-spenso> 1: core::panicking::panic_fmt
16.30 s
gammaloop-nextest-spenso> 2: core::panicking::assert_failed_inner
16.30 s
gammaloop-nextest-spenso> 3: core::panicking::assert_failed::<alloc::string::String, alloc::string::String>
16.30 s
gammaloop-nextest-spenso> 4: idenso::color::test::form_reference::metric_contraction_respects_antisymmetric_normalization
16.30 s
gammaloop-nextest-spenso> 5: <idenso::color::test::form_reference::metric_contraction_respects_antisymmetric_normalization::{closure#0} as core::ops::function::FnOnce<()>>::call_once
16.30 s
gammaloop-nextest-spenso> note: Some details are omitted, run with `RUST_BACKTRACE=full` for a verbose backtrace.
16.30 s
gammaloop-nextest-spenso>
16.30 s
gammaloop-nextest-spenso> FAIL [ 0.042s] (219/224) idenso tensor::tests::parsing :: infinite_execution
16.30 s
gammaloop-nextest-spenso> stdout ---
16.30 s
gammaloop-nextest-spenso>
16.30 s
gammaloop-nextest-spenso> running 1 test
16.30 s
gammaloop-nextest-spenso> ━━━━━━━━━━━━━━━━━━━━━━━━━━━━━━━ Snapshot Summary ━━━━━━━━━━━━━━━━━━━━━━━━━━━━━━━
16.30 s
gammaloop-nextest-spenso> Snapshot: infinite_execution
16.30 s
gammaloop-nextest-spenso> Source: crates/idenso/src/tensor/tests/parsing.rs:910
16.30 s
gammaloop-nextest-spenso> ────────────────────────────────────────────────────────────────────────────────
16.30 s
gammaloop-nextest-spenso> Expression: net_iter.snapshot_dot()
16.30 s
gammaloop-nextest-spenso> ────────────────────────────────────────────────────────────────────────────────
16.30 s
gammaloop-nextest-spenso> -old snapshot
16.30 s
gammaloop-nextest-spenso> +new results
16.30 s
gammaloop-nextest-spenso> ────────────┬───────────────────────────────────────────────────────────────────
16.30 s
gammaloop-nextest-spenso> 8 8 │ 0:0:s -> ext0 [id=0 color="red"];
16.30 s
gammaloop-nextest-spenso> 9 9 │ ext1 [style=invis];
16.30 s
gammaloop-nextest-spenso> 10 10 │ 0:5:s -> ext1 [id=1 dir=none color="red" label="mink4|l_0"];
16.30 s
gammaloop-nextest-spenso> 11 11 │ ext2 [style=invis];
16.30 s
gammaloop-nextest-spenso> 12 │- 0:4:s -> ext2 [id=2 dir=none color="red" label="bis4|l_2"];
16.30 s
gammaloop-nextest-spenso> 12 │+ 0:3:s -> ext2 [id=2 dir=none color="red" label="mink4|l_1"];
16.30 s
gammaloop-nextest-spenso> 13 13 │ ext3 [style=invis];
16.30 s
gammaloop-nextest-spenso> 14 │- 0:3:s -> ext3 [id=3 dir=none color="red" label="bis4|l_3"];
16.30 s
gammaloop-nextest-spenso> 14 │+ 0:1:s -> ext3 [id=3 dir=none color="red" label="bis4|l_2"];
16.30 s
gammaloop-nextest-spenso> 15 15 │ ext4 [style=invis];
16.30 s
gammaloop-nextest-spenso> 16 │- 0:1:s -> ext4 [id=4 dir=none color="red" label="mink4|l_1"];
16.30 s
gammaloop-nextest-spenso> 16 │+ 0:2:s -> ext4 [id=4 dir=none color="red" label="mink4|l_4"];
16.30 s
gammaloop-nextest-spenso> 17 17 │ ext5 [style=invis];
16.30 s
gammaloop-nextest-spenso> 18 │- 0:2:s -> ext5 [id=5 dir=none color="red" label="mink4|l_4"];
16.30 s
gammaloop-nextest-spenso> 18 │+ 0:4:s -> ext5 [id=5 dir=none color="red" label="bis4|l_3"];
16.30 s
gammaloop-nextest-spenso> 19 19 │ }
16.30 s
gammaloop-nextest-spenso> ────────────┴───────────────────────────────────────────────────────────────────
16.30 s
gammaloop-nextest-spenso> To update snapshots run `cargo insta review`
16.30 s
gammaloop-nextest-spenso> Stopped on the first failure. Run `cargo insta test` to run all snapshots.
16.30 s
gammaloop-nextest-spenso> test tensor::tests::parsing::infinite_execution ... FAILED
16.30 s
gammaloop-nextest-spenso>
16.30 s
gammaloop-nextest-spenso> failures:
16.30 s
gammaloop-nextest-spenso>
16.30 s
gammaloop-nextest-spenso> failures:
16.30 s
gammaloop-nextest-spenso> tensor::tests::parsing::infinite_execution
16.30 s
gammaloop-nextest-spenso>
16.30 s
gammaloop-nextest-spenso> test result: FAILED. 0 passed; 1 failed; 0 ignored; 0 measured; 240 filtered out; finished in 0.03s
16.30 s
gammaloop-nextest-spenso>
16.30 s
gammaloop-nextest-spenso> stderr ---
16.30 s
gammaloop-nextest-spenso>
16.30 s
gammaloop-nextest-spenso> thread 'tensor::tests::parsing::infinite_execution' (866) panicked at /nix/store/30svmzr0z0zpcqjyynjn7w21wgx18y4b-vendor-cargo-deps/c19b7c6f923b580ac259164a89f2577984ad5ab09ee9d583b888f934adbbe8d0/insta-1.47.2/src/runtime.rs:719:13:
16.30 s
gammaloop-nextest-spenso> snapshot assertion for 'infinite_execution' failed in line 910
16.30 s
gammaloop-nextest-spenso> stack backtrace:
16.30 s
gammaloop-nextest-spenso> 0: __rustc::rust_begin_unwind
16.30 s
gammaloop-nextest-spenso> 1: core::panicking::panic_fmt
16.30 s
gammaloop-nextest-spenso> 2: insta::runtime::assert_snapshot
16.30 s
gammaloop-nextest-spenso> 3: idenso::tensor::tests::parsing::infinite_execution
16.30 s
gammaloop-nextest-spenso> 4: <idenso::tensor::tests::parsing::infinite_execution::{closure#0} as core::ops::function::FnOnce<()>>::call_once
16.30 s
gammaloop-nextest-spenso> note: Some details are omitted, run with `RUST_BACKTRACE=full` for a verbose backtrace.
16.30 s
gammaloop-nextest-spenso>
16.33 s
gammaloop-nextest-spenso> error : test run failed
16.36 s
gammaloop-nextest-spenso>
16.36 s
gammaloop-nextest-spenso> ========== nextest test summary ==========
16.36 s
gammaloop-nextest-spenso> report: target/nextest/ci_gammaloop/junit.xml
16.36 s
gammaloop-nextest-spenso> tests: 224, failures: 2, errors: 0
16.36 s
gammaloop-nextest-spenso>
16.36 s
gammaloop-nextest-spenso> 1. idenso::color::test::form_reference::metric_contraction_respects_antisymmetric_normalization
16.36 s
gammaloop-nextest-spenso> failure: test failure with exit code 101
16.36 s
gammaloop-nextest-spenso> thread 'color::test::form_reference::metric_contraction_respects_antisymmetric_normalization' (331) panicked at crates/idenso/src/color/test/form_reference.rs:171:5:
16.36 s
gammaloop-nextest-spenso> assertion `left == right` failed
16.36 s
gammaloop-nextest-spenso> left: "-1*f(coad(8,standalone_metric_j),coad(8,standalone_metric_s),coad(8,standalone_metric_u))"
16.36 s
gammaloop-nextest-spenso> right: "f(coad(8,standalone_metric_j),coad(8,standalone_metric_s),coad(8,standalone_metric_u))"
16.36 s
gammaloop-nextest-spenso> stack backtrace:
16.36 s
gammaloop-nextest-spenso> 0: __rustc::rust_begin_unwind
16.36 s
gammaloop-nextest-spenso> 1: core::panicking::panic_fmt
16.36 s
gammaloop-nextest-spenso> 2: core::panicking::assert_failed_inner
16.36 s
gammaloop-nextest-spenso> 3: core::panicking::assert_failed::<alloc::string::String, alloc::string::String>
16.36 s
gammaloop-nextest-spenso> 4: idenso::color::test::form_reference::metric_contraction_respects_antisymmetric_normalization
16.36 s
gammaloop-nextest-spenso> 5: <idenso::color::test::form_reference::metric_contraction_respects_antisymmetric_normalization::{closure#0} as core::ops::function::FnOnce<()>>::call_once
16.36 s
gammaloop-nextest-spenso> note: Some details are omitted, run with `RUST_BACKTRACE=full` for a verbose backtrace.
16.36 s
gammaloop-nextest-spenso> system-out
16.36 s
gammaloop-nextest-spenso> running 1 test
16.36 s
gammaloop-nextest-spenso> test color::test::form_reference::metric_contraction_respects_antisymmetric_normalization ... FAILED
16.36 s
gammaloop-nextest-spenso>
16.36 s
gammaloop-nextest-spenso> failures:
16.36 s
gammaloop-nextest-spenso>
16.36 s
gammaloop-nextest-spenso> failures:
16.36 s
gammaloop-nextest-spenso> color::test::form_reference::metric_contraction_respects_antisymmetric_normalization
16.36 s
gammaloop-nextest-spenso>
16.36 s
gammaloop-nextest-spenso> test result: FAILED. 0 passed; 1 failed; 0 ignored; 0 measured; 240 filtered out; finished in 0.00s
16.36 s
gammaloop-nextest-spenso> system-err
16.36 s
gammaloop-nextest-spenso> thread 'color::test::form_reference::metric_contraction_respects_antisymmetric_normalization' (331) panicked at crates/idenso/src/color/test/form_reference.rs:171:5:
16.36 s
gammaloop-nextest-spenso> assertion `left == right` failed
16.36 s
gammaloop-nextest-spenso> left: "-1*f(coad(8,standalone_metric_j),coad(8,standalone_metric_s),coad(8,standalone_metric_u))"
16.36 s
gammaloop-nextest-spenso> right: "f(coad(8,standalone_metric_j),coad(8,standalone_metric_s),coad(8,standalone_metric_u))"
16.36 s
gammaloop-nextest-spenso> stack backtrace:
16.36 s
gammaloop-nextest-spenso> 0: __rustc::rust_begin_unwind
16.36 s
gammaloop-nextest-spenso> 1: core::panicking::panic_fmt
16.36 s
gammaloop-nextest-spenso> 2: core::panicking::assert_failed_inner
16.36 s
gammaloop-nextest-spenso> 3: core::panicking::assert_failed::<alloc::string::String, alloc::string::String>
16.36 s
gammaloop-nextest-spenso> 4: idenso::color::test::form_reference::metric_contraction_respects_antisymmetric_normalization
16.36 s
gammaloop-nextest-spenso> 5: <idenso::color::test::form_reference::metric_contraction_respects_antisymmetric_normalization::{closure#0} as core::ops::function::FnOnce<()>>::call_once
16.36 s
gammaloop-nextest-spenso> note: Some details are omitted, run with `RUST_BACKTRACE=full` for a verbose backtrace.
16.36 s
gammaloop-nextest-spenso>
16.36 s
gammaloop-nextest-spenso> 2. idenso::tensor::tests::parsing::infinite_execution
16.36 s
gammaloop-nextest-spenso> failure: test failure with exit code 101
16.36 s
gammaloop-nextest-spenso> thread 'tensor::tests::parsing::infinite_execution' (866) panicked at /nix/store/30svmzr0z0zpcqjyynjn7w21wgx18y4b-vendor-cargo-deps/c19b7c6f923b580ac259164a89f2577984ad5ab09ee9d583b888f934adbbe8d0/insta-1.47.2/src/runtime.rs:719:13:
16.36 s
gammaloop-nextest-spenso> snapshot assertion for 'infinite_execution' failed in line 910
16.36 s
gammaloop-nextest-spenso> stack backtrace:
16.36 s
gammaloop-nextest-spenso> 0: __rustc::rust_begin_unwind
16.36 s
gammaloop-nextest-spenso> 1: core::panicking::panic_fmt
16.36 s
gammaloop-nextest-spenso> 2: insta::runtime::assert_snapshot
16.36 s
gammaloop-nextest-spenso> 3: idenso::tensor::tests::parsing::infinite_execution
16.36 s
gammaloop-nextest-spenso> 4: <idenso::tensor::tests::parsing::infinite_execution::{closure#0} as core::ops::function::FnOnce<()>>::call_once
16.36 s
gammaloop-nextest-spenso> note: Some details are omitted, run with `RUST_BACKTRACE=full` for a verbose backtrace.
16.36 s
gammaloop-nextest-spenso> system-out
16.36 s
gammaloop-nextest-spenso> running 1 test
16.36 s
gammaloop-nextest-spenso> ━━━━━━━━━━━━━━━━━━━━━━━━━━━━━━━ Snapshot Summary ━━━━━━━━━━━━━━━━━━━━━━━━━━━━━━━
16.36 s
gammaloop-nextest-spenso> Snapshot: infinite_execution
16.36 s
gammaloop-nextest-spenso> Source: crates/idenso/src/tensor/tests/parsing.rs:910
16.36 s
gammaloop-nextest-spenso> ────────────────────────────────────────────────────────────────────────────────
16.36 s
gammaloop-nextest-spenso> Expression: net_iter.snapshot_dot()
16.36 s
gammaloop-nextest-spenso> ────────────────────────────────────────────────────────────────────────────────
16.36 s
gammaloop-nextest-spenso> -old snapshot
16.36 s
gammaloop-nextest-spenso> +new results
16.36 s
gammaloop-nextest-spenso> ────────────┬───────────────────────────────────────────────────────────────────
16.36 s
gammaloop-nextest-spenso> 8 8 │ 0:0:s-> ext0 [id=0 color="red"];
16.36 s
gammaloop-nextest-spenso> 9 9 │ ext1 [style=invis];
16.36 s
gammaloop-nextest-spenso> 10 10 │ 0:5:s-> ext1 [id=1 dir=none color="red" label="mink4|l_0"];
16.36 s
gammaloop-nextest-spenso> 11 11 │ ext2 [style=invis];
16.36 s
gammaloop-nextest-spenso> 12 │- 0:4:s-> ext2 [id=2 dir=none color="red" label="bis4|l_2"];
16.36 s
gammaloop-nextest-spenso> 12 │+ 0:3:s-> ext2 [id=2 dir=none color="red" label="mink4|l_1"];
16.36 s
gammaloop-nextest-spenso> 13 13 │ ext3 [style=invis];
16.36 s
gammaloop-nextest-spenso> 14 │- 0:3:s-> ext3 [id=3 dir=none color="red" label="bis4|l_3"];
16.36 s
gammaloop-nextest-spenso> 14 │+ 0:1:s-> ext3 [id=3 dir=none color="red" label="bis4|l_2"];
16.36 s
gammaloop-nextest-spenso> 15 15 │ ext4 [style=invis];
16.36 s
gammaloop-nextest-spenso> 16 │- 0:1:s-> ext4 [id=4 dir=none color="red" label="mink4|l_1"];
16.36 s
gammaloop-nextest-spenso> 16 │+ 0:2:s-> ext4 [id=4 dir=none color="red" label="mink4|l_4"];
16.36 s
gammaloop-nextest-spenso> 17 17 │ ext5 [style=invis];
16.36 s
gammaloop-nextest-spenso> 18 │- 0:2:s-> ext5 [id=5 dir=none color="red" label="mink4|l_4"];
16.36 s
gammaloop-nextest-spenso> 18 │+ 0:4:s-> ext5 [id=5 dir=none color="red" label="bis4|l_3"];
16.36 s
gammaloop-nextest-spenso> 19 19 │ }
16.36 s
gammaloop-nextest-spenso> ────────────┴───────────────────────────────────────────────────────────────────
16.36 s
gammaloop-nextest-spenso> To update snapshots run `cargo insta review`
16.36 s
gammaloop-nextest-spenso> Stopped on the first failure. Run `cargo insta test` to run all snapshots.
16.36 s
gammaloop-nextest-spenso> test tensor::tests::parsing::infinite_execution ... FAILED
16.36 s
gammaloop-nextest-spenso>
16.36 s
gammaloop-nextest-spenso> failures:
16.36 s
gammaloop-nextest-spenso>
16.36 s
gammaloop-nextest-spenso> failures:
16.36 s
gammaloop-nextest-spenso> tensor::tests::parsing::infinite_execution
16.36 s
gammaloop-nextest-spenso>
16.36 s
gammaloop-nextest-spenso> test result: FAILED. 0 passed; 1 failed; 0 ignored; 0 measured; 240 filtered out; finished in 0.03s
16.36 s
gammaloop-nextest-spenso> system-err
16.36 s
gammaloop-nextest-spenso> thread 'tensor::tests::parsing::infinite_execution' (866) panicked at /nix/store/30svmzr0z0zpcqjyynjn7w21wgx18y4b-vendor-cargo-deps/c19b7c6f923b580ac259164a89f2577984ad5ab09ee9d583b888f934adbbe8d0/insta-1.47.2/src/runtime.rs:719:13:
16.36 s
gammaloop-nextest-spenso> snapshot assertion for 'infinite_execution' failed in line 910
16.36 s
gammaloop-nextest-spenso> stack backtrace:
16.36 s
gammaloop-nextest-spenso> 0: __rustc::rust_begin_unwind
16.36 s
gammaloop-nextest-spenso> 1: core::panicking::panic_fmt
16.36 s
gammaloop-nextest-spenso> 2: insta::runtime::assert_snapshot
16.36 s
gammaloop-nextest-spenso> 3: idenso::tensor::tests::parsing::infinite_execution
16.36 s
gammaloop-nextest-spenso> 4: <idenso::tensor::tests::parsing::infinite_execution::{closure#0} as core::ops::function::FnOnce<()>>::call_once
16.36 s
gammaloop-nextest-spenso> note: Some details are omitted, run with `RUST_BACKTRACE=full` for a verbose backtrace.
16.36 s
gammaloop-nextest-spenso> =========================================
16.38 s
gammaloop-nextest-spenso> Extracting 2 binaries and 1 linked path to /build/nextest-archive-UUz8KS
16.46 s
gammaloop-nextest-spenso> Extracted 8 files to /build/nextest-archive-UUz8KS in 0.08s
16.47 s
gammaloop-nextest-spenso> ------------
16.47 s
gammaloop-nextest-spenso> Nextest run ID a8f3e9f5-fbd9-403f-a462-67691535a1fb with nextest profile: ci_gammaloop
16.47 s
gammaloop-nextest-spenso> Starting 135 tests across 2 binaries
16.56 s
gammaloop-nextest-spenso> ------------
16.56 s
gammaloop-nextest-spenso> Summary [ 0.093s] 135 tests run: 135 passed , 0 skipped
16.60 s
gammaloop-nextest-spenso>
16.60 s
gammaloop-nextest-spenso> ========== nextest test summary ==========
16.60 s
gammaloop-nextest-spenso> report: target/nextest/ci_gammaloop/junit.xml
16.60 s
gammaloop-nextest-spenso> tests: 135, failures: 0, errors: 0
16.60 s
gammaloop-nextest-spenso> No failing testcases found.
16.60 s
gammaloop-nextest-spenso> =========================================
16.62 s
gammaloop-nextest-spenso> Extracting 5 binaries and 2 linked paths to /build/nextest-archive-8I9kI8
16.82 s
gammaloop-nextest-spenso> Extracted 19 files to /build/nextest-archive-8I9kI8 in 0.21s
16.83 s
gammaloop-nextest-spenso> ------------
16.83 s
gammaloop-nextest-spenso> Nextest run ID 4121be62-2129-41e2-8c7a-20d0d1cb0f4a with nextest profile: ci_gammaloop
16.83 s
gammaloop-nextest-spenso> Starting 25 tests across 5 binaries (1 test skipped via profile.ci_gammaloop.default-filter )
17.05 s
gammaloop-nextest-spenso> ------------
17.05 s
gammaloop-nextest-spenso> Summary [ 0.212s] 25 tests run: 25 passed , 1 skipped
17.10 s
gammaloop-nextest-spenso>
17.10 s
gammaloop-nextest-spenso> ========== nextest test summary ==========
17.10 s
gammaloop-nextest-spenso> report: target/nextest/ci_gammaloop/junit.xml
17.10 s
gammaloop-nextest-spenso> tests: 25, failures: 0, errors: 0
17.10 s
gammaloop-nextest-spenso> No failing testcases found.
17.10 s
gammaloop-nextest-spenso> =========================================
17.12 s
gammaloop-nextest-spenso> Extracting 2 binaries and 1 linked path to /build/nextest-archive-GV3cQM
17.17 s
gammaloop-nextest-spenso> Extracted 8 files to /build/nextest-archive-GV3cQM in 0.06s
17.18 s
gammaloop-nextest-spenso> ------------
17.18 s
gammaloop-nextest-spenso> Nextest run ID e1a266b9-f2b3-4b38-856c-b802d4559b19 with nextest profile: ci_gammaloop
17.18 s
gammaloop-nextest-spenso> Starting 1 test across 2 binaries
17.19 s
gammaloop-nextest-spenso> ------------
17.19 s
gammaloop-nextest-spenso> Summary [ 0.005s] 1 test run: 1 passed , 0 skipped
17.22 s
gammaloop-nextest-spenso>
17.23 s
gammaloop-nextest-spenso> ========== nextest test summary ==========
17.23 s
gammaloop-nextest-spenso> report: target/nextest/ci_gammaloop/junit.xml
17.23 s
gammaloop-nextest-spenso> tests: 1, failures: 0, errors: 0
17.23 s
gammaloop-nextest-spenso> No failing testcases found.
17.23 s
gammaloop-nextest-spenso> =========================================
17.24 s
gammaloop-nextest-spenso> Extracting 1 binary and 1 linked path to /build/nextest-archive-4YWk5c
17.29 s
gammaloop-nextest-spenso> Extracted 7 files to /build/nextest-archive-4YWk5c in 0.06s
17.30 s
gammaloop-nextest-spenso> ------------
17.30 s
gammaloop-nextest-spenso> Nextest run ID 2c568b57-d6c9-4bc9-a3e1-194206b741a5 with nextest profile: ci_gammaloop
17.30 s
gammaloop-nextest-spenso> Starting 0 tests across 1 binary
17.30 s
gammaloop-nextest-spenso> ------------
17.30 s
gammaloop-nextest-spenso> Summary [ 0.000s] 0 tests run: 0 passed , 0 skipped
17.34 s
gammaloop-nextest-spenso>
17.34 s
gammaloop-nextest-spenso> ========== nextest test summary ==========
17.34 s
gammaloop-nextest-spenso> report: target/nextest/ci_gammaloop/junit.xml
17.34 s
gammaloop-nextest-spenso> tests: 0, failures: 0, errors: 0
17.34 s
gammaloop-nextest-spenso> No failing testcases found.
17.34 s
gammaloop-nextest-spenso> =========================================
17.37 s
error: Cannot build '/nix/store/wg9z1d6ybvc8xl844i0n0mklxxwi1328-gammaloop-nextest-spenso.drv '.
17.37 s
Reason: builder failed with exit code 100 .
17.37 s
Output paths:
17.37 s
/nix/store/lllalkgcfjij64ixlnv0xp0j8dfki7lv-gammaloop-nextest-spenso
17.37 s
Last 325 log lines:
17.37 s
> Extracting 5 binaries and 2 linked paths to /build/nextest-archive-IDzsFi
17.37 s
> Extracted 19 files to /build/nextest-archive-IDzsFi in 0.20s
17.37 s
> ------------
17.37 s
> Nextest run ID b3598f75-5db4-4bc1-8e25-508a89b75ad7 with nextest profile: ci_gammaloop
17.37 s
> Starting 224 tests across 5 binaries (26 tests skipped , including 2 tests via profile.ci_gammaloop.default-filter )
17.37 s
> FAIL [ 0.012s] ( 46/224) idenso color::test::form_reference :: metric_contraction_respects_antisymmetric_normalization
17.37 s
> stdout ---
17.37 s
>
17.37 s
> running 1 test
17.37 s
> test color::test::form_reference::metric_contraction_respects_antisymmetric_normalization ... FAILED
17.37 s
>
17.37 s
> failures:
17.37 s
>
17.37 s
> failures:
17.37 s
> color::test::form_reference::metric_contraction_respects_antisymmetric_normalization
17.37 s
>
17.37 s
> test result: FAILED. 0 passed; 1 failed; 0 ignored; 0 measured; 240 filtered out; finished in 0.00s
17.37 s
>
17.37 s
> stderr ---
17.37 s
>
17.37 s
> thread 'color::test::form_reference::metric_contraction_respects_antisymmetric_normalization' (331) panicked at crates/idenso/src/color/test/form_reference.rs:171:5:
17.37 s
> assertion `left == right` failed
17.37 s
> left: "-1*f(coad(8,standalone_metric_j),coad(8,standalone_metric_s),coad(8,standalone_metric_u))"
17.37 s
> right: "f(coad(8,standalone_metric_j),coad(8,standalone_metric_s),coad(8,standalone_metric_u))"
17.37 s
> stack backtrace:
17.37 s
> 0: __rustc::rust_begin_unwind
17.37 s
> 1: core::panicking::panic_fmt
17.37 s
> 2: core::panicking::assert_failed_inner
17.37 s
> 3: core::panicking::assert_failed::<alloc::string::String, alloc::string::String>
17.37 s
> 4: idenso::color::test::form_reference::metric_contraction_respects_antisymmetric_normalization
17.37 s
> 5: <idenso::color::test::form_reference::metric_contraction_respects_antisymmetric_normalization::{closure#0} as core::ops::function::FnOnce<()>>::call_once
17.37 s
> note: Some details are omitted, run with `RUST_BACKTRACE=full` for a verbose backtrace.
17.37 s
>
17.37 s
> FAIL [ 0.042s] (219/224) idenso tensor::tests::parsing :: infinite_execution
17.37 s
> stdout ---
17.37 s
>
17.37 s
> running 1 test
17.37 s
> ━━━━━━━━━━━━━━━━━━━━━━━━━━━━━━━ Snapshot Summary ━━━━━━━━━━━━━━━━━━━━━━━━━━━━━━━
17.37 s
> Snapshot: infinite_execution
17.37 s
> Source: crates/idenso/src/tensor/tests/parsing.rs:910
17.37 s
> ────────────────────────────────────────────────────────────────────────────────
17.37 s
> Expression: net_iter.snapshot_dot()
17.37 s
> ────────────────────────────────────────────────────────────────────────────────
17.37 s
> -old snapshot
17.37 s
> +new results
17.37 s
> ────────────┬───────────────────────────────────────────────────────────────────
17.37 s
> 8 8 │ 0:0:s -> ext0 [id=0 color="red"];
17.37 s
> 9 9 │ ext1 [style=invis];
17.37 s
> 10 10 │ 0:5:s -> ext1 [id=1 dir=none color="red" label="mink4|l_0"];
17.37 s
> 11 11 │ ext2 [style=invis];
17.37 s
> 12 │- 0:4:s -> ext2 [id=2 dir=none color="red" label="bis4|l_2"];
17.37 s
> 12 │+ 0:3:s -> ext2 [id=2 dir=none color="red" label="mink4|l_1"];
17.37 s
> 13 13 │ ext3 [style=invis];
17.37 s
> 14 │- 0:3:s -> ext3 [id=3 dir=none color="red" label="bis4|l_3"];
17.37 s
> 14 │+ 0:1:s -> ext3 [id=3 dir=none color="red" label="bis4|l_2"];
17.37 s
> 15 15 │ ext4 [style=invis];
17.37 s
> 16 │- 0:1:s -> ext4 [id=4 dir=none color="red" label="mink4|l_1"];
17.37 s
> 16 │+ 0:2:s -> ext4 [id=4 dir=none color="red" label="mink4|l_4"];
17.37 s
> 17 17 │ ext5 [style=invis];
17.37 s
> 18 │- 0:2:s -> ext5 [id=5 dir=none color="red" label="mink4|l_4"];
17.37 s
> 18 │+ 0:4:s -> ext5 [id=5 dir=none color="red" label="bis4|l_3"];
17.37 s
> 19 19 │ }
17.37 s
> ────────────┴───────────────────────────────────────────────────────────────────
17.37 s
> To update snapshots run `cargo insta review`
17.37 s
> Stopped on the first failure. Run `cargo insta test` to run all snapshots.
17.37 s
> test tensor::tests::parsing::infinite_execution ... FAILED
17.37 s
>
17.37 s
> failures:
17.37 s
>
17.37 s
> failures:
17.37 s
> tensor::tests::parsing::infinite_execution
17.37 s
>
17.37 s
> test result: FAILED. 0 passed; 1 failed; 0 ignored; 0 measured; 240 filtered out; finished in 0.03s
17.37 s
>
17.37 s
> stderr ---
17.37 s
>
17.37 s
> thread 'tensor::tests::parsing::infinite_execution' (866) panicked at /nix/store/30svmzr0z0zpcqjyynjn7w21wgx18y4b-vendor-cargo-deps/c19b7c6f923b580ac259164a89f2577984ad5ab09ee9d583b888f934adbbe8d0/insta-1.47.2/src/runtime.rs:719:13:
17.37 s
> snapshot assertion for 'infinite_execution' failed in line 910
17.37 s
> stack backtrace:
17.37 s
> 0: __rustc::rust_begin_unwind
17.37 s
> 1: core::panicking::panic_fmt
17.37 s
> 2: insta::runtime::assert_snapshot
17.37 s
> 3: idenso::tensor::tests::parsing::infinite_execution
17.37 s
> 4: <idenso::tensor::tests::parsing::infinite_execution::{closure#0} as core::ops::function::FnOnce<()>>::call_once
17.37 s
> note: Some details are omitted, run with `RUST_BACKTRACE=full` for a verbose backtrace.
17.37 s
>
17.37 s
> ------------
17.37 s
> Summary [ 1.793s] 224 tests run: 222 passed , 2 failed , 26 skipped
17.37 s
> FAIL [ 0.012s] ( 46/224) idenso color::test::form_reference :: metric_contraction_respects_antisymmetric_normalization
17.37 s
> stdout ---
17.37 s
>
17.37 s
> running 1 test
17.37 s
> test color::test::form_reference::metric_contraction_respects_antisymmetric_normalization ... FAILED
17.37 s
>
17.37 s
> failures:
17.37 s
>
17.37 s
> failures:
17.37 s
> color::test::form_reference::metric_contraction_respects_antisymmetric_normalization
17.37 s
>
17.37 s
> test result: FAILED. 0 passed; 1 failed; 0 ignored; 0 measured; 240 filtered out; finished in 0.00s
17.37 s
>
17.37 s
> stderr ---
17.37 s
>
17.37 s
> thread 'color::test::form_reference::metric_contraction_respects_antisymmetric_normalization' (331) panicked at crates/idenso/src/color/test/form_reference.rs:171:5:
17.37 s
> assertion `left == right` failed
17.37 s
> left: "-1*f(coad(8,standalone_metric_j),coad(8,standalone_metric_s),coad(8,standalone_metric_u))"
17.37 s
> right: "f(coad(8,standalone_metric_j),coad(8,standalone_metric_s),coad(8,standalone_metric_u))"
17.37 s
> stack backtrace:
17.37 s
> 0: __rustc::rust_begin_unwind
17.37 s
> 1: core::panicking::panic_fmt
17.37 s
> 2: core::panicking::assert_failed_inner
17.37 s
> 3: core::panicking::assert_failed::<alloc::string::String, alloc::string::String>
17.37 s
> 4: idenso::color::test::form_reference::metric_contraction_respects_antisymmetric_normalization
17.37 s
> 5: <idenso::color::test::form_reference::metric_contraction_respects_antisymmetric_normalization::{closure#0} as core::ops::function::FnOnce<()>>::call_once
17.37 s
> note: Some details are omitted, run with `RUST_BACKTRACE=full` for a verbose backtrace.
17.37 s
>
17.37 s
> FAIL [ 0.042s] (219/224) idenso tensor::tests::parsing :: infinite_execution
17.37 s
> stdout ---
17.37 s
>
17.37 s
> running 1 test
17.37 s
> ━━━━━━━━━━━━━━━━━━━━━━━━━━━━━━━ Snapshot Summary ━━━━━━━━━━━━━━━━━━━━━━━━━━━━━━━
17.37 s
> Snapshot: infinite_execution
17.37 s
> Source: crates/idenso/src/tensor/tests/parsing.rs:910
17.37 s
> ────────────────────────────────────────────────────────────────────────────────
17.37 s
> Expression: net_iter.snapshot_dot()
17.37 s
> ────────────────────────────────────────────────────────────────────────────────
17.37 s
> -old snapshot
17.37 s
> +new results
17.37 s
> ────────────┬───────────────────────────────────────────────────────────────────
17.37 s
> 8 8 │ 0:0:s -> ext0 [id=0 color="red"];
17.37 s
> 9 9 │ ext1 [style=invis];
17.37 s
> 10 10 │ 0:5:s -> ext1 [id=1 dir=none color="red" label="mink4|l_0"];
17.37 s
> 11 11 │ ext2 [style=invis];
17.37 s
> 12 │- 0:4:s -> ext2 [id=2 dir=none color="red" label="bis4|l_2"];
17.37 s
> 12 │+ 0:3:s -> ext2 [id=2 dir=none color="red" label="mink4|l_1"];
17.37 s
> 13 13 │ ext3 [style=invis];
17.37 s
> 14 │- 0:3:s -> ext3 [id=3 dir=none color="red" label="bis4|l_3"];
17.37 s
> 14 │+ 0:1:s -> ext3 [id=3 dir=none color="red" label="bis4|l_2"];
17.37 s
> 15 15 │ ext4 [style=invis];
17.37 s
> 16 │- 0:1:s -> ext4 [id=4 dir=none color="red" label="mink4|l_1"];
17.37 s
> 16 │+ 0:2:s -> ext4 [id=4 dir=none color="red" label="mink4|l_4"];
17.37 s
> 17 17 │ ext5 [style=invis];
17.37 s
> 18 │- 0:2:s -> ext5 [id=5 dir=none color="red" label="mink4|l_4"];
17.37 s
> 18 │+ 0:4:s -> ext5 [id=5 dir=none color="red" label="bis4|l_3"];
17.37 s
> 19 19 │ }
17.37 s
> ────────────┴───────────────────────────────────────────────────────────────────
17.37 s
> To update snapshots run `cargo insta review`
17.37 s
> Stopped on the first failure. Run `cargo insta test` to run all snapshots.
17.37 s
> test tensor::tests::parsing::infinite_execution ... FAILED
17.37 s
>
17.37 s
> failures:
17.37 s
>
17.37 s
> failures:
17.37 s
> tensor::tests::parsing::infinite_execution
17.37 s
>
17.37 s
> test result: FAILED. 0 passed; 1 failed; 0 ignored; 0 measured; 240 filtered out; finished in 0.03s
17.37 s
>
17.37 s
> stderr ---
17.37 s
>
17.37 s
> thread 'tensor::tests::parsing::infinite_execution' (866) panicked at /nix/store/30svmzr0z0zpcqjyynjn7w21wgx18y4b-vendor-cargo-deps/c19b7c6f923b580ac259164a89f2577984ad5ab09ee9d583b888f934adbbe8d0/insta-1.47.2/src/runtime.rs:719:13:
17.37 s
> snapshot assertion for 'infinite_execution' failed in line 910
17.37 s
> stack backtrace:
17.37 s
> 0: __rustc::rust_begin_unwind
17.37 s
> 1: core::panicking::panic_fmt
17.37 s
> 2: insta::runtime::assert_snapshot
17.37 s
> 3: idenso::tensor::tests::parsing::infinite_execution
17.37 s
> 4: <idenso::tensor::tests::parsing::infinite_execution::{closure#0} as core::ops::function::FnOnce<()>>::call_once
17.37 s
> note: Some details are omitted, run with `RUST_BACKTRACE=full` for a verbose backtrace.
17.37 s
>
17.37 s
> error : test run failed
17.37 s
>
17.37 s
> ========== nextest test summary ==========
17.37 s
> report: target/nextest/ci_gammaloop/junit.xml
17.37 s
> tests: 224, failures: 2, errors: 0
17.37 s
>
17.37 s
> 1. idenso::color::test::form_reference::metric_contraction_respects_antisymmetric_normalization
17.37 s
> failure: test failure with exit code 101
17.37 s
> thread 'color::test::form_reference::metric_contraction_respects_antisymmetric_normalization' (331) panicked at crates/idenso/src/color/test/form_reference.rs:171:5:
17.37 s
> assertion `left == right` failed
17.37 s
> left: "-1*f(coad(8,standalone_metric_j),coad(8,standalone_metric_s),coad(8,standalone_metric_u))"
17.37 s
> right: "f(coad(8,standalone_metric_j),coad(8,standalone_metric_s),coad(8,standalone_metric_u))"
17.37 s
> stack backtrace:
17.37 s
> 0: __rustc::rust_begin_unwind
17.37 s
> 1: core::panicking::panic_fmt
17.37 s
> 2: core::panicking::assert_failed_inner
17.37 s
> 3: core::panicking::assert_failed::<alloc::string::String, alloc::string::String>
17.37 s
> 4: idenso::color::test::form_reference::metric_contraction_respects_antisymmetric_normalization
17.37 s
> 5: <idenso::color::test::form_reference::metric_contraction_respects_antisymmetric_normalization::{closure#0} as core::ops::function::FnOnce<()>>::call_once
17.37 s
> note: Some details are omitted, run with `RUST_BACKTRACE=full` for a verbose backtrace.
17.37 s
> system-out
17.37 s
> running 1 test
17.37 s
> test color::test::form_reference::metric_contraction_respects_antisymmetric_normalization ... FAILED
17.37 s
>
17.37 s
> failures:
17.37 s
>
17.37 s
> failures:
17.37 s
> color::test::form_reference::metric_contraction_respects_antisymmetric_normalization
17.37 s
>
17.37 s
> test result: FAILED. 0 passed; 1 failed; 0 ignored; 0 measured; 240 filtered out; finished in 0.00s
17.37 s
> system-err
17.37 s
> thread 'color::test::form_reference::metric_contraction_respects_antisymmetric_normalization' (331) panicked at crates/idenso/src/color/test/form_reference.rs:171:5:
17.37 s
> assertion `left == right` failed
17.37 s
> left: "-1*f(coad(8,standalone_metric_j),coad(8,standalone_metric_s),coad(8,standalone_metric_u))"
17.37 s
> right: "f(coad(8,standalone_metric_j),coad(8,standalone_metric_s),coad(8,standalone_metric_u))"
17.37 s
> stack backtrace:
17.37 s
> 0: __rustc::rust_begin_unwind
17.37 s
> 1: core::panicking::panic_fmt
17.37 s
> 2: core::panicking::assert_failed_inner
17.37 s
> 3: core::panicking::assert_failed::<alloc::string::String, alloc::string::String>
17.37 s
> 4: idenso::color::test::form_reference::metric_contraction_respects_antisymmetric_normalization
17.37 s
> 5: <idenso::color::test::form_reference::metric_contraction_respects_antisymmetric_normalization::{closure#0} as core::ops::function::FnOnce<()>>::call_once
17.37 s
> note: Some details are omitted, run with `RUST_BACKTRACE=full` for a verbose backtrace.
17.37 s
>
17.37 s
> 2. idenso::tensor::tests::parsing::infinite_execution
17.37 s
> failure: test failure with exit code 101
17.37 s
> thread 'tensor::tests::parsing::infinite_execution' (866) panicked at /nix/store/30svmzr0z0zpcqjyynjn7w21wgx18y4b-vendor-cargo-deps/c19b7c6f923b580ac259164a89f2577984ad5ab09ee9d583b888f934adbbe8d0/insta-1.47.2/src/runtime.rs:719:13:
17.37 s
> snapshot assertion for 'infinite_execution' failed in line 910
17.37 s
> stack backtrace:
17.37 s
> 0: __rustc::rust_begin_unwind
17.37 s
> 1: core::panicking::panic_fmt
17.37 s
> 2: insta::runtime::assert_snapshot
17.37 s
> 3: idenso::tensor::tests::parsing::infinite_execution
17.37 s
> 4: <idenso::tensor::tests::parsing::infinite_execution::{closure#0} as core::ops::function::FnOnce<()>>::call_once
17.37 s
> note: Some details are omitted, run with `RUST_BACKTRACE=full` for a verbose backtrace.
17.37 s
> system-out
17.37 s
> running 1 test
17.37 s
> ━━━━━━━━━━━━━━━━━━━━━━━━━━━━━━━ Snapshot Summary ━━━━━━━━━━━━━━━━━━━━━━━━━━━━━━━
17.37 s
> Snapshot: infinite_execution
17.37 s
> Source: crates/idenso/src/tensor/tests/parsing.rs:910
17.37 s
> ────────────────────────────────────────────────────────────────────────────────
17.37 s
> Expression: net_iter.snapshot_dot()
17.37 s
> ────────────────────────────────────────────────────────────────────────────────
17.37 s
> -old snapshot
17.37 s
> +new results
17.37 s
> ────────────┬───────────────────────────────────────────────────────────────────
17.37 s
> 8 8 │ 0:0:s-> ext0 [id=0 color="red"];
17.37 s
> 9 9 │ ext1 [style=invis];
17.37 s
> 10 10 │ 0:5:s-> ext1 [id=1 dir=none color="red" label="mink4|l_0"];
17.37 s
> 11 11 │ ext2 [style=invis];
17.37 s
> 12 │- 0:4:s-> ext2 [id=2 dir=none color="red" label="bis4|l_2"];
17.37 s
> 12 │+ 0:3:s-> ext2 [id=2 dir=none color="red" label="mink4|l_1"];
17.37 s
> 13 13 │ ext3 [style=invis];
17.37 s
> 14 │- 0:3:s-> ext3 [id=3 dir=none color="red" label="bis4|l_3"];
17.37 s
> 14 │+ 0:1:s-> ext3 [id=3 dir=none color="red" label="bis4|l_2"];
17.37 s
> 15 15 │ ext4 [style=invis];
17.37 s
> 16 │- 0:1:s-> ext4 [id=4 dir=none color="red" label="mink4|l_1"];
17.37 s
> 16 │+ 0:2:s-> ext4 [id=4 dir=none color="red" label="mink4|l_4"];
17.37 s
> 17 17 │ ext5 [style=invis];
17.37 s
> 18 │- 0:2:s-> ext5 [id=5 dir=none color="red" label="mink4|l_4"];
17.37 s
> 18 │+ 0:4:s-> ext5 [id=5 dir=none color="red" label="bis4|l_3"];
17.37 s
> 19 19 │ }
17.37 s
> ────────────┴───────────────────────────────────────────────────────────────────
17.37 s
> To update snapshots run `cargo insta review`
17.37 s
> Stopped on the first failure. Run `cargo insta test` to run all snapshots.
17.37 s
> test tensor::tests::parsing::infinite_execution ... FAILED
17.37 s
>
17.37 s
> failures:
17.37 s
>
17.37 s
> failures:
17.37 s
> tensor::tests::parsing::infinite_execution
17.37 s
>
17.37 s
> test result: FAILED. 0 passed; 1 failed; 0 ignored; 0 measured; 240 filtered out; finished in 0.03s
17.37 s
> system-err
17.37 s
> thread 'tensor::tests::parsing::infinite_execution' (866) panicked at /nix/store/30svmzr0z0zpcqjyynjn7w21wgx18y4b-vendor-cargo-deps/c19b7c6f923b580ac259164a89f2577984ad5ab09ee9d583b888f934adbbe8d0/insta-1.47.2/src/runtime.rs:719:13:
17.37 s
> snapshot assertion for 'infinite_execution' failed in line 910
17.37 s
> stack backtrace:
17.37 s
> 0: __rustc::rust_begin_unwind
17.37 s
> 1: core::panicking::panic_fmt
17.37 s
> 2: insta::runtime::assert_snapshot
17.37 s
> 3: idenso::tensor::tests::parsing::infinite_execution
17.37 s
> 4: <idenso::tensor::tests::parsing::infinite_execution::{closure#0} as core::ops::function::FnOnce<()>>::call_once
17.37 s
> note: Some details are omitted, run with `RUST_BACKTRACE=full` for a verbose backtrace.
17.37 s
> =========================================
17.37 s
> Extracting 2 binaries and 1 linked path to /build/nextest-archive-UUz8KS
17.37 s
> Extracted 8 files to /build/nextest-archive-UUz8KS in 0.08s
17.37 s
> ------------
17.37 s
> Nextest run ID a8f3e9f5-fbd9-403f-a462-67691535a1fb with nextest profile: ci_gammaloop
17.37 s
> Starting 135 tests across 2 binaries
17.37 s
> ------------
17.37 s
> Summary [ 0.093s] 135 tests run: 135 passed , 0 skipped
17.37 s
>
17.37 s
> ========== nextest test summary ==========
17.37 s
> report: target/nextest/ci_gammaloop/junit.xml
17.37 s
> tests: 135, failures: 0, errors: 0
17.37 s
> No failing testcases found.
17.37 s
> =========================================
17.37 s
> Extracting 5 binaries and 2 linked paths to /build/nextest-archive-8I9kI8
17.37 s
> Extracted 19 files to /build/nextest-archive-8I9kI8 in 0.21s
17.37 s
> ------------
17.37 s
> Nextest run ID 4121be62-2129-41e2-8c7a-20d0d1cb0f4a with nextest profile: ci_gammaloop
17.37 s
> Starting 25 tests across 5 binaries (1 test skipped via profile.ci_gammaloop.default-filter )
17.37 s
> ------------
17.37 s
> Summary [ 0.212s] 25 tests run: 25 passed , 1 skipped
17.37 s
>
17.37 s
> ========== nextest test summary ==========
17.37 s
> report: target/nextest/ci_gammaloop/junit.xml
17.37 s
> tests: 25, failures: 0, errors: 0
17.37 s
> No failing testcases found.
17.37 s
> =========================================
17.37 s
> Extracting 2 binaries and 1 linked path to /build/nextest-archive-GV3cQM
17.37 s
> Extracted 8 files to /build/nextest-archive-GV3cQM in 0.06s
17.37 s
> ------------
17.37 s
> Nextest run ID e1a266b9-f2b3-4b38-856c-b802d4559b19 with nextest profile: ci_gammaloop
17.37 s
> Starting 1 test across 2 binaries
17.37 s
> ------------
17.37 s
> Summary [ 0.005s] 1 test run: 1 passed , 0 skipped
17.37 s
>
17.37 s
> ========== nextest test summary ==========
17.37 s
> report: target/nextest/ci_gammaloop/junit.xml
17.37 s
> tests: 1, failures: 0, errors: 0
17.37 s
> No failing testcases found.
17.37 s
> =========================================
17.37 s
> Extracting 1 binary and 1 linked path to /build/nextest-archive-4YWk5c
17.37 s
> Extracted 7 files to /build/nextest-archive-4YWk5c in 0.06s
17.37 s
> ------------
17.37 s
> Nextest run ID 2c568b57-d6c9-4bc9-a3e1-194206b741a5 with nextest profile: ci_gammaloop
17.37 s
> Starting 0 tests across 1 binary
17.37 s
> ------------
17.37 s
> Summary [ 0.000s] 0 tests run: 0 passed , 0 skipped
17.37 s
>
17.37 s
> ========== nextest test summary ==========
17.37 s
> report: target/nextest/ci_gammaloop/junit.xml
17.37 s
> tests: 0, failures: 0, errors: 0
17.37 s
> No failing testcases found.
17.37 s
> =========================================
17.37 s
For full logs, run:
17.37 s
nix log /nix/store/wg9z1d6ybvc8xl844i0n0mklxxwi1328-gammaloop-nextest-spenso.drv
17.47 s
[0 built (1 failed )]Run failed.