test packages.x86_64-linux.nix-ci-check-gammaloop-nextest-spenso

Reproduce this run
Retry Run
  1. 0.15 s $ /nix/store/9ypz3flqsrl5xl495mm8h645gadjsxi1-coreutils-9.11/bin/timeout --kill-after=15s 7200s /nix/store/23zk8sgzamrbmj1fday15szf7f2279s8-nix-2.34.7/bin/nix --extra-experimental-features nix-command --extra-experimental-features flakes flake clone git+https://github.com/alphal00p/gammaloop --dest /tmp/nix-ci-worker/stable-pwd/repo/
  2. 0.18 s Cloning into '/tmp/nix-ci-worker/stable-pwd/repo'...
  3. 0.77 s remote: Enumerating objects: 65289, done.
  4. 0.89 s remote: Counting objects: 0% (1/7961) remote: Counting objects: 1% (80/7961) remote: Counting objects: 2% (160/7961) remote: Counting objects: 3% (239/7961) remote: Counting objects: 4% (319/7961) remote: Counting objects: 5% (399/7961) remote: Counting objects: 6% (478/7961) remote: Counting objects: 7% (558/7961) remote: Counting objects: 8% (637/7961) remote: Counting objects: 9% (717/7961) remote: Counting objects: 10% (797/7961) remote: Counting objects: 11% (876/7961) remote: Counting objects: 12% (956/7961) remote: Counting objects: 13% (1035/7961) remote: Counting objects: 14% (1115/7961) remote: Counting objects: 15% (1195/7961) remote: Counting objects: 16% (1274/7961) remote: Counting objects: 17% (1354/7961) remote: Counting objects: 18% (1433/7961) remote: Counting objects: 19% (1513/7961) remote: Counting objects: 20% (1593/7961) remote: Counting objects: 21% (1672/7961) remote: Counting objects: 22% (1752/7961) remote: Counting objects: 23% (1832/7961) remote: Counting objects: 24% (1911/7961) remote: Counting objects: 25% (1991/7961) remote: Counting objects: 26% (2070/7961) remote: Counting objects: 27% (2150/7961) remote: Counting objects: 28% (2230/7961) remote: Counting objects: 29% (2309/7961) remote: Counting objects: 30% (2389/7961) remote: Counting objects: 31% (2468/7961) remote: Counting objects: 32% (2548/7961) remote: Counting objects: 33% (2628/7961) remote: Counting objects: 34% (2707/7961) remote: Counting objects: 35% (2787/7961) remote: Counting objects: 36% (2866/7961) remote: Counting objects: 37% (2946/7961) remote: Counting objects: 38% (3026/7961) remote: Counting objects: 39% (3105/7961) remote: Counting objects: 40% (3185/7961) remote: Counting objects: 41% (3265/7961) remote: Counting objects: 42% (3344/7961) remote: Counting objects: 43% (3424/7961) remote: Counting objects: 44% (3503/7961) remote: Counting objects: 45% (3583/7961) remote: Counting objects: 46% (3663/7961) remote: Counting objects: 47% (3742/7961) remote: Counting objects: 48% (3822/7961) remote: Counting objects: 49% (3901/7961) remote: Counting objects: 50% (3981/7961) remote: Counting objects: 51% (4061/7961) remote: Counting objects: 52% (4140/7961) remote: Counting objects: 53% (4220/7961) remote: Counting objects: 54% (4299/7961) remote: Counting objects: 55% (4379/7961) remote: Counting objects: 56% (4459/7961) remote: Counting objects: 57% (4538/7961) remote: Counting objects: 58% (4618/7961) remote: Counting objects: 59% (4697/7961) remote: Counting objects: 60% (4777/7961) remote: Counting objects: 61% (4857/7961) remote: Counting objects: 62% (4936/7961) remote: Counting objects: 63% (5016/7961) remote: Counting objects: 64% (5096/7961) remote: Counting objects: 65% (5175/7961) remote: Counting objects: 66% (5255/7961) remote: Counting objects: 67% (5334/7961) remote: Counting objects: 68% (5414/7961) remote: Counting objects: 69% (5494/7961) remote: Counting objects: 70% (5573/7961) remote: Counting objects: 71% (5653/7961) remote: Counting objects: 72% (5732/7961) remote: Counting objects: 73% (5812/7961) remote: Counting objects: 74% (5892/7961) remote: Counting objects: 75% (5971/7961) remote: Counting objects: 76% (6051/7961) remote: Counting objects: 77% (6130/7961) remote: Counting objects: 78% (6210/7961) remote: Counting objects: 79% (6290/7961) remote: Counting objects: 80% (6369/7961) remote: Counting objects: 81% (6449/7961) remote: Counting objects: 82% (6529/7961) remote: Counting objects: 83% (6608/7961) remote: Counting objects: 84% (6688/7961) remote: Counting objects: 85% (6767/7961) remote: Counting objects: 86% (6847/7961) remote: Counting objects: 87% (6927/7961) remote: Counting objects: 88% (7006/7961) remote: Counting objects: 89% (7086/7961) remote: Counting objects: 90% (7165/7961) remote: Counting objects: 91% (7245/7961) remote: Counting objects: 92% (7325/7961) remote: Counting objects: 93% (7404/7961) remote: Counting objects: 94% (7484/7961) remote: Counting objects: 95% (7563/7961) remote: Counting objects: 96% (7643/7961) remote: Counting objects: 97% (7723/7961) remote: Counting objects: 98% (7802/7961) remote: Counting objects: 99% (7882/7961) remote: Counting objects: 100% (7961/7961) remote: Counting objects: 100% (7961/7961), done.
  5. 2.36 s remote: Compressing objects: 0% (1/1608) remote: Compressing objects: 1% (17/1608) remote: Compressing objects: 2% (33/1608) remote: Compressing objects: 3% (49/1608) remote: Compressing objects: 4% (65/1608) remote: Compressing objects: 5% (81/1608) remote: Compressing objects: 6% (97/1608) remote: Compressing objects: 7% (113/1608) remote: Compressing objects: 8% (129/1608) remote: Compressing objects: 9% (145/1608) remote: Compressing objects: 10% (161/1608) remote: Compressing objects: 11% (177/1608) remote: Compressing objects: 12% (193/1608) remote: Compressing objects: 13% (210/1608) remote: Compressing objects: 14% (226/1608) remote: Compressing objects: 15% (242/1608) remote: Compressing objects: 16% (258/1608) remote: Compressing objects: 17% (274/1608) remote: Compressing objects: 18% (290/1608) remote: Compressing objects: 19% (306/1608) remote: Compressing objects: 20% (322/1608) remote: Compressing objects: 21% (338/1608) remote: Compressing objects: 22% (354/1608) remote: Compressing objects: 23% (370/1608) remote: Compressing objects: 24% (386/1608) remote: Compressing objects: 25% (402/1608) remote: Compressing objects: 26% (419/1608) remote: Compressing objects: 27% (435/1608) remote: Compressing objects: 28% (451/1608) remote: Compressing objects: 29% (467/1608) remote: Compressing objects: 30% (483/1608) remote: Compressing objects: 31% (499/1608) remote: Compressing objects: 32% (515/1608) remote: Compressing objects: 33% (531/1608) remote: Compressing objects: 34% (547/1608) remote: Compressing objects: 35% (563/1608) remote: Compressing objects: 36% (579/1608) remote: Compressing objects: 37% (595/1608) remote: Compressing objects: 38% (612/1608) remote: Compressing objects: 39% (628/1608) remote: Compressing objects: 40% (644/1608) remote: Compressing objects: 41% (660/1608) remote: Compressing objects: 42% (676/1608) remote: Compressing objects: 43% (692/1608) remote: Compressing objects: 44% (708/1608) remote: Compressing objects: 45% (724/1608) remote: Compressing objects: 46% (740/1608) remote: Compressing objects: 47% (756/1608) remote: Compressing objects: 48% (772/1608) remote: Compressing objects: 49% (788/1608) remote: Compressing objects: 50% (804/1608) remote: Compressing objects: 51% (821/1608) remote: Compressing objects: 52% (837/1608) remote: Compressing objects: 53% (853/1608) remote: Compressing objects: 54% (869/1608) remote: Compressing objects: 55% (885/1608) remote: Compressing objects: 56% (901/1608) remote: Compressing objects: 57% (917/1608) remote: Compressing objects: 58% (933/1608) remote: Compressing objects: 59% (949/1608) remote: Compressing objects: 60% (965/1608) remote: Compressing objects: 61% (981/1608) remote: Compressing objects: 62% (997/1608) remote: Compressing objects: 63% (1014/1608) remote: Compressing objects: 64% (1030/1608) remote: Compressing objects: 65% (1046/1608) remote: Compressing objects: 66% (1062/1608) remote: Compressing objects: 67% (1078/1608) remote: Compressing objects: 68% (1094/1608) remote: Compressing objects: 69% (1110/1608) remote: Compressing objects: 70% (1126/1608) remote: Compressing objects: 71% (1142/1608) remote: Compressing objects: 72% (1158/1608) remote: Compressing objects: 73% (1174/1608) remote: Compressing objects: 74% (1190/1608) remote: Compressing objects: 75% (1206/1608) remote: Compressing objects: 76% (1223/1608) remote: Compressing objects: 77% (1239/1608) remote: Compressing objects: 78% (1255/1608) remote: Compressing objects: 79% (1271/1608) remote: Compressing objects: 80% (1287/1608) remote: Compressing objects: 81% (1303/1608) remote: Compressing objects: 82% (1319/1608) remote: Compressing objects: 83% (1335/1608) remote: Compressing objects: 84% (1351/1608) remote: Compressing objects: 85% (1367/1608) remote: Compressing objects: 86% (1383/1608) remote: Compressing objects: 87% (1399/1608) remote: Compressing objects: 88% (1416/1608) remote: Compressing objects: 89% (1432/1608) remote: Compressing objects: 90% (1448/1608) remote: Compressing objects: 91% (1464/1608) remote: Compressing objects: 92% (1480/1608) remote: Compressing objects: 93% (1496/1608) remote: Compressing objects: 94% (1512/1608) remote: Compressing objects: 95% (1528/1608) remote: Compressing objects: 96% (1544/1608) remote: Compressing objects: 97% (1560/1608) remote: Compressing objects: 98% (1576/1608) remote: Compressing objects: 99% (1592/1608) remote: Compressing objects: 100% (1608/1608) remote: Compressing objects: 100% (1608/1608), done.
  6. 5.19 s Receiving objects: 0% (1/65289) Receiving objects: 1% (653/65289) Receiving objects: 2% (1306/65289) Receiving objects: 3% (1959/65289) Receiving objects: 4% (2612/65289) Receiving objects: 5% (3265/65289) Receiving objects: 6% (3918/65289) Receiving objects: 7% (4571/65289) Receiving objects: 8% (5224/65289) Receiving objects: 9% (5877/65289) Receiving objects: 10% (6529/65289) Receiving objects: 11% (7182/65289), 10.66 MiB | 21.34 MiB/s Receiving objects: 12% (7835/65289), 10.66 MiB | 21.34 MiB/s Receiving objects: 13% (8488/65289), 10.66 MiB | 21.34 MiB/s Receiving objects: 14% (9141/65289), 10.66 MiB | 21.34 MiB/s Receiving objects: 15% (9794/65289), 10.66 MiB | 21.34 MiB/s Receiving objects: 16% (10447/65289), 10.66 MiB | 21.34 MiB/s Receiving objects: 17% (11100/65289), 10.66 MiB | 21.34 MiB/s Receiving objects: 18% (11753/65289), 10.66 MiB | 21.34 MiB/s Receiving objects: 19% (12405/65289), 10.66 MiB | 21.34 MiB/s Receiving objects: 20% (13058/65289), 10.66 MiB | 21.34 MiB/s Receiving objects: 21% (13711/65289), 10.66 MiB | 21.34 MiB/s Receiving objects: 22% (14364/65289), 10.66 MiB | 21.34 MiB/s Receiving objects: 23% (15017/65289), 10.66 MiB | 21.34 MiB/s Receiving objects: 24% (15670/65289), 10.66 MiB | 21.34 MiB/s Receiving objects: 25% (16323/65289), 10.66 MiB | 21.34 MiB/s Receiving objects: 26% (16976/65289), 10.66 MiB | 21.34 MiB/s Receiving objects: 27% (17629/65289), 10.66 MiB | 21.34 MiB/s Receiving objects: 28% (18281/65289), 10.66 MiB | 21.34 MiB/s Receiving objects: 29% (18934/65289), 10.66 MiB | 21.34 MiB/s Receiving objects: 30% (19587/65289), 10.66 MiB | 21.34 MiB/s Receiving objects: 31% (20240/65289), 10.66 MiB | 21.34 MiB/s Receiving objects: 32% (20893/65289), 10.66 MiB | 21.34 MiB/s Receiving objects: 33% (21546/65289), 10.66 MiB | 21.34 MiB/s Receiving objects: 34% (22199/65289), 10.66 MiB | 21.34 MiB/s Receiving objects: 35% (22852/65289), 10.66 MiB | 21.34 MiB/s Receiving objects: 36% (23505/65289), 10.66 MiB | 21.34 MiB/s Receiving objects: 37% (24157/65289), 10.66 MiB | 21.34 MiB/s Receiving objects: 38% (24810/65289), 10.66 MiB | 21.34 MiB/s Receiving objects: 39% (25463/65289), 10.66 MiB | 21.34 MiB/s Receiving objects: 40% (26116/65289), 10.66 MiB | 21.34 MiB/s Receiving objects: 41% (26769/65289), 10.66 MiB | 21.34 MiB/s Receiving objects: 42% (27422/65289), 10.66 MiB | 21.34 MiB/s Receiving objects: 43% (28075/65289), 10.66 MiB | 21.34 MiB/s Receiving objects: 44% (28728/65289), 10.66 MiB | 21.34 MiB/s Receiving objects: 45% (29381/65289), 10.66 MiB | 21.34 MiB/s Receiving objects: 46% (30033/65289), 10.66 MiB | 21.34 MiB/s Receiving objects: 47% (30686/65289), 10.66 MiB | 21.34 MiB/s Receiving objects: 48% (31339/65289), 10.66 MiB | 21.34 MiB/s Receiving objects: 49% (31992/65289), 10.66 MiB | 21.34 MiB/s Receiving objects: 50% (32645/65289), 10.66 MiB | 21.34 MiB/s Receiving objects: 50% (32753/65289), 30.22 MiB | 29.89 MiB/s Receiving objects: 51% (33298/65289), 30.22 MiB | 29.89 MiB/s Receiving objects: 52% (33951/65289), 30.22 MiB | 29.89 MiB/s Receiving objects: 53% (34604/65289), 30.22 MiB | 29.89 MiB/s Receiving objects: 54% (35257/65289), 30.22 MiB | 29.89 MiB/s Receiving objects: 55% (35909/65289), 30.22 MiB | 29.89 MiB/s Receiving objects: 56% (36562/65289), 30.22 MiB | 29.89 MiB/s Receiving objects: 57% (37215/65289), 30.22 MiB | 29.89 MiB/s Receiving objects: 58% (37868/65289), 30.22 MiB | 29.89 MiB/s Receiving objects: 59% (38521/65289), 30.22 MiB | 29.89 MiB/s Receiving objects: 60% (39174/65289), 30.22 MiB | 29.89 MiB/s Receiving objects: 61% (39827/65289), 46.23 MiB | 30.59 MiB/s Receiving objects: 62% (40480/65289), 46.23 MiB | 30.59 MiB/s Receiving objects: 63% (41133/65289), 46.23 MiB | 30.59 MiB/s Receiving objects: 64% (41785/65289), 46.23 MiB | 30.59 MiB/s Receiving objects: 65% (42438/65289), 46.23 MiB | 30.59 MiB/s Receiving objects: 66% (43091/65289), 46.23 MiB | 30.59 MiB/s Receiving objects: 67% (43744/65289), 46.23 MiB | 30.59 MiB/s Receiving objects: 68% (44397/65289), 46.23 MiB | 30.59 MiB/s Receiving objects: 69% (45050/65289), 46.23 MiB | 30.59 MiB/s Receiving objects: 70% (45703/65289), 46.23 MiB | 30.59 MiB/s Receiving objects: 71% (46356/65289), 46.23 MiB | 30.59 MiB/s Receiving objects: 72% (47009/65289), 46.23 MiB | 30.59 MiB/s Receiving objects: 73% (47661/65289), 46.23 MiB | 30.59 MiB/s Receiving objects: 74% (48314/65289), 46.23 MiB | 30.59 MiB/s Receiving objects: 74% (48902/65289), 62.72 MiB | 31.19 MiB/s Receiving objects: 75% (48967/65289), 62.72 MiB | 31.19 MiB/s Receiving objects: 76% (49620/65289), 62.72 MiB | 31.19 MiB/s Receiving objects: 77% (50273/65289), 62.72 MiB | 31.19 MiB/s Receiving objects: 78% (50926/65289), 62.72 MiB | 31.19 MiB/s Receiving objects: 79% (51579/65289), 62.72 MiB | 31.19 MiB/s Receiving objects: 80% (52232/65289), 62.72 MiB | 31.19 MiB/s Receiving objects: 81% (52885/65289), 62.72 MiB | 31.19 MiB/s Receiving objects: 82% (53537/65289), 62.72 MiB | 31.19 MiB/s Receiving objects: 83% (54190/65289), 78.66 MiB | 31.31 MiB/s Receiving objects: 84% (54843/65289), 78.66 MiB | 31.31 MiB/s Receiving objects: 85% (55496/65289), 78.66 MiB | 31.31 MiB/s Receiving objects: 86% (56149/65289), 78.66 MiB | 31.31 MiB/s Receiving objects: 87% (56802/65289), 78.66 MiB | 31.31 MiB/s Receiving objects: 88% (57455/65289), 78.66 MiB | 31.31 MiB/s Receiving objects: 89% (58108/65289), 78.66 MiB | 31.31 MiB/s Receiving objects: 90% (58761/65289), 78.66 MiB | 31.31 MiB/s Receiving objects: 91% (59413/65289), 78.66 MiB | 31.31 MiB/s Receiving objects: 92% (60066/65289), 78.66 MiB | 31.31 MiB/s Receiving objects: 93% (60719/65289), 78.66 MiB | 31.31 MiB/s Receiving objects: 94% (61372/65289), 78.66 MiB | 31.31 MiB/s Receiving objects: 95% (62025/65289), 78.66 MiB | 31.31 MiB/s Receiving objects: 96% (62678/65289), 78.66 MiB | 31.31 MiB/s Receiving objects: 97% (63331/65289), 78.66 MiB | 31.31 MiB/s Receiving objects: 98% (63984/65289), 78.66 MiB | 31.31 MiB/s Receiving objects: 99% (64637/65289), 78.66 MiB | 31.31 MiB/s remote: Total 65289 (delta 6902), reused 6441 (delta 6343), pack-reused 57328 (from 1)
  7. 5.26 s Receiving objects: 100% (65289/65289), 78.66 MiB | 31.31 MiB/s Receiving objects: 100% (65289/65289), 87.61 MiB | 31.19 MiB/s, done.
  8. 5.83 s Resolving deltas: 0% (0/45999) Resolving deltas: 1% (460/45999) Resolving deltas: 2% (920/45999) Resolving deltas: 3% (1380/45999) Resolving deltas: 4% (1840/45999) Resolving deltas: 5% (2301/45999) Resolving deltas: 6% (2760/45999) Resolving deltas: 7% (3220/45999) Resolving deltas: 8% (3680/45999) Resolving deltas: 9% (4140/45999) Resolving deltas: 10% (4600/45999) Resolving deltas: 11% (5061/45999) Resolving deltas: 12% (5521/45999) Resolving deltas: 13% (5984/45999) Resolving deltas: 14% (6443/45999) Resolving deltas: 15% (6900/45999) Resolving deltas: 16% (7360/45999) Resolving deltas: 17% (7820/45999) Resolving deltas: 18% (8281/45999) Resolving deltas: 19% (8740/45999) Resolving deltas: 20% (9200/45999) Resolving deltas: 21% (9660/45999) Resolving deltas: 22% (10120/45999) Resolving deltas: 23% (10580/45999) Resolving deltas: 24% (11040/45999) Resolving deltas: 25% (11503/45999) Resolving deltas: 26% (11961/45999) Resolving deltas: 27% (12420/45999) Resolving deltas: 28% (12880/45999) Resolving deltas: 29% (13341/45999) Resolving deltas: 30% (13800/45999) Resolving deltas: 31% (14260/45999) Resolving deltas: 32% (14720/45999) Resolving deltas: 33% (15180/45999) Resolving deltas: 34% (15640/45999) Resolving deltas: 35% (16100/45999) Resolving deltas: 36% (16561/45999) Resolving deltas: 37% (17020/45999) Resolving deltas: 38% (17483/45999) Resolving deltas: 39% (17940/45999) Resolving deltas: 40% (18400/45999) Resolving deltas: 41% (18860/45999) Resolving deltas: 42% (19321/45999) Resolving deltas: 43% (19780/45999) Resolving deltas: 44% (20240/45999) Resolving deltas: 45% (20700/45999) Resolving deltas: 46% (21160/45999) Resolving deltas: 47% (21621/45999) Resolving deltas: 48% (22080/45999) Resolving deltas: 49% (22540/45999) Resolving deltas: 50% (23000/45999) Resolving deltas: 51% (23460/45999) Resolving deltas: 52% (23920/45999) Resolving deltas: 53% (24380/45999) Resolving deltas: 54% (24841/45999) Resolving deltas: 55% (25300/45999) Resolving deltas: 56% (25761/45999) Resolving deltas: 57% (26220/45999) Resolving deltas: 58% (26680/45999) Resolving deltas: 59% (27141/45999) Resolving deltas: 60% (27601/45999) Resolving deltas: 61% (28061/45999) Resolving deltas: 62% (28520/45999) Resolving deltas: 63% (28980/45999) Resolving deltas: 64% (29440/45999) Resolving deltas: 65% (29900/45999) Resolving deltas: 66% (30362/45999) Resolving deltas: 67% (30820/45999) Resolving deltas: 68% (31280/45999) Resolving deltas: 69% (31740/45999) Resolving deltas: 70% (32200/45999) Resolving deltas: 71% (32660/45999) Resolving deltas: 72% (33120/45999) Resolving deltas: 73% (33580/45999) Resolving deltas: 74% (34040/45999) Resolving deltas: 75% (34500/45999) Resolving deltas: 76% (34960/45999) Resolving deltas: 77% (35420/45999) Resolving deltas: 78% (35880/45999) Resolving deltas: 79% (36340/45999) Resolving deltas: 80% (36801/45999) Resolving deltas: 81% (37261/45999) Resolving deltas: 82% (37720/45999) Resolving deltas: 83% (38180/45999) Resolving deltas: 84% (38644/45999) Resolving deltas: 85% (39100/45999) Resolving deltas: 86% (39560/45999) Resolving deltas: 87% (40020/45999) Resolving deltas: 88% (40480/45999) Resolving deltas: 89% (40940/45999) Resolving deltas: 90% (41400/45999) Resolving deltas: 91% (41860/45999) Resolving deltas: 92% (42320/45999) Resolving deltas: 93% (42780/45999) Resolving deltas: 94% (43243/45999) Resolving deltas: 95% (43700/45999) Resolving deltas: 96% (44160/45999) Resolving deltas: 97% (44620/45999) Resolving deltas: 98% (45080/45999) Resolving deltas: 99% (45540/45999) Resolving deltas: 100% (45999/45999) Resolving deltas: 100% (45999/45999), done.
  9. 6.10 s Fetching commit f59a0308f0232540279438aa697f28160f090069 for vakint_rustred ...
  10. 6.10 s $ /nix/store/bcnisk3ydfgv26v2gw3zlky24g00yww2-git-2.54.0/bin/git fetch origin f59a0308f0232540279438aa697f28160f090069
  11. 6.56 s From https://github.com/alphal00p/gammaloop
  12. 6.56 s * branch f59a0308f0232540279438aa697f28160f090069 -> FETCH_HEAD
  13. 6.57 s $ /nix/store/9ypz3flqsrl5xl495mm8h645gadjsxi1-coreutils-9.11/bin/timeout --kill-after=15s 7200s /nix/store/bcnisk3ydfgv26v2gw3zlky24g00yww2-git-2.54.0/bin/git -c advice.detachedHead=false checkout f59a0308f0232540279438aa697f28160f090069
  14. 6.69 s HEAD is now at f59a0308 Add offline MATAD oracle for K6 closure diagnostics
  15. 6.69 s $ /nix/store/9ypz3flqsrl5xl495mm8h645gadjsxi1-coreutils-9.11/bin/timeout --kill-after=15s 7200s /nix/store/23zk8sgzamrbmj1fday15szf7f2279s8-nix-2.34.7/bin/nix --extra-experimental-features nix-command --extra-experimental-features flakes --log-format internal-json run .#packages.x86_64-linux.nix-ci-check-gammaloop-nextest-spenso --print-build-logs
  16. 11.17 s
  17. 11.39 s Downloading cached gammaloop-nextest-binaries-spenso-idenso from https://cache.nix-ci.com
  18. 11.44 s Downloading cached gammaloop-nextest-binaries-spenso-spenso from https://cache.nix-ci.com
  19. 11.44 s Downloading cached gammaloop-nextest-binaries-spenso-spenso-hep-lib from https://cache.nix-ci.com
  20. 11.44 s Downloading cached gammaloop-nextest-binaries-spenso-spenso-macros from https://cache.nix-ci.com
  21. 11.44 s Downloading cached gammaloop-nextest-binaries-spenso-symbolica-utils from https://cache.nix-ci.com
  22. 12.01 s Downloaded cached gammaloop-nextest-binaries-spenso-spenso-hep-lib (34 MiB) in 578ms
  23. 12.01 s Progress: 0 of 7 built, 1 of 5 downloaded from cache (4 downloading)
  24. 12.06 s Downloaded cached gammaloop-nextest-binaries-spenso-symbolica-utils (6.3 MiB) in 619ms
  25. 12.06 s Progress: 0 of 6 built, 2 of 5 downloaded from cache (3 downloading)
  26. 12.09 s Downloaded cached gammaloop-nextest-binaries-spenso-spenso-macros (6.5 MiB) in 658ms
  27. 12.09 s Progress: 0 of 5 built, 3 of 5 downloaded from cache (2 downloading)
  28. 12.17 s Downloaded cached gammaloop-nextest-binaries-spenso-spenso (10.2 MiB) in 734ms
  29. 12.17 s Progress: 0 of 4 built, 4 of 5 downloaded from cache (1 downloading)
  30. 12.42 s Downloaded cached gammaloop-nextest-binaries-spenso-idenso (29.3 MiB) in 1.0s
  31. 12.42 s Progress: 0 of 3 built, 5 of 5 downloaded from cache
  32. 12.45 s Building /nix/store/phsx8ghmch5ps4b809qv903qiszh1fp6-gammaloop-nextest-binaries-spenso.drv
  33. 12.50 s [gammaloop-nextest-binaries-spenso:post-build] Uploading to the NixCI cache: /nix/store/9fkdg17krq5nzfrjbar42jdwr02nvavd-gammaloop-nextest-binaries-spenso
  34. 12.54 s [gammaloop-nextest-binaries-spenso:post-build] warning: 'warn-short-path-literals' is deprecated, use 'lint-short-path-literals = ignore' instead
  35. 12.55 s [gammaloop-nextest-binaries-spenso:post-build] copying 1 paths...
  36. 12.55 s [gammaloop-nextest-binaries-spenso:post-build] copying path '/nix/store/9fkdg17krq5nzfrjbar42jdwr02nvavd-gammaloop-nextest-binaries-spenso' to 'https://cache.nix-ci.com'...
  37. 12.70 s [gammaloop-nextest-binaries-spenso:post-build] warning: 'warn-short-path-literals' is deprecated, use 'lint-short-path-literals = ignore' instead
  38. 12.89 s [gammaloop-nextest-binaries-spenso:post-build] copying 0 paths...
  39. 12.90 s Uploaded gammaloop-nextest-binaries-spenso in 410ms
  40. 12.90 s Progress: 1 of 3 built, 5 of 5 downloaded from cache
  41. 12.91 s Built gammaloop-nextest-binaries-spenso in 459ms
  42. 12.98 s Building /nix/store/sj92c6xpc5l0kmkyyxnq47zzx69yv48s-nix-ci-check-gammaloop-nextest-spenso.drv
  43. 13.04 s [nix-ci-check-gammaloop-nextest-spenso:post-build] Uploading to the NixCI cache: /nix/store/ll3gwq880xiqvj7gq9inz6az4ycp27d2-nix-ci-check-gammaloop-nextest-spenso
  44. 13.08 s [nix-ci-check-gammaloop-nextest-spenso:post-build] warning: 'warn-short-path-literals' is deprecated, use 'lint-short-path-literals = ignore' instead
  45. 13.09 s [nix-ci-check-gammaloop-nextest-spenso:post-build] copying 1 paths...
  46. 13.09 s [nix-ci-check-gammaloop-nextest-spenso:post-build] copying path '/nix/store/ll3gwq880xiqvj7gq9inz6az4ycp27d2-nix-ci-check-gammaloop-nextest-spenso' to 'https://cache.nix-ci.com'...
  47. 13.25 s [nix-ci-check-gammaloop-nextest-spenso:post-build] warning: 'warn-short-path-literals' is deprecated, use 'lint-short-path-literals = ignore' instead
  48. 13.47 s [nix-ci-check-gammaloop-nextest-spenso:post-build] copying 0 paths...
  49. 13.49 s Uploaded nix-ci-check-gammaloop-nextest-spenso in 458ms
  50. 13.49 s Progress: 2 of 3 built, 5 of 5 downloaded from cache
  51. 13.49 s Built nix-ci-check-gammaloop-nextest-spenso in 509ms
  52. 13.49 s Progress: 3 of 3 built, 5 of 5 downloaded from cache
  53. 18.60 s evaluating derivation 'g copying '/nix/store/irp0 evaluating derivation 'g copying '/nix/store/irp0 evaluating derivation 'g querying gammaloop-nexte [0/1 built, 0.0 KiB DL] [1/0/1 built, 0.0 KiB DLgammaloop-nextest-spenso> Extracting 5 binaries and 2 linked paths to /build/nextest-archive-V9QiAp
  54. 18.76 s gammaloop-nextest-spenso> Extracted 19 files to /build/nextest-archive-V9QiAp in 0.16s
  55. 18.77 s gammaloop-nextest-spenso> ------------
  56. 18.77 s gammaloop-nextest-spenso> Nextest run ID 0ba90e36-fc7e-44e4-8619-95db33146556 with nextest profile: ci_gammaloop
  57. 18.77 s gammaloop-nextest-spenso> Starting 224 tests across 5 binaries (26 tests skipped, including 2 tests via profile.ci_gammaloop.default-filter)
  58. 18.86 s gammaloop-nextest-spenso> FAIL [ 0.011s] ( 45/224) idenso color::test::form_reference::metric_contraction_respects_antisymmetric_normalization
  59. 18.86 s gammaloop-nextest-spenso> stdout ---
  60. 18.86 s gammaloop-nextest-spenso>
  61. 18.86 s gammaloop-nextest-spenso> running 1 test
  62. 18.86 s gammaloop-nextest-spenso> test color::test::form_reference::metric_contraction_respects_antisymmetric_normalization ... FAILED
  63. 18.86 s gammaloop-nextest-spenso>
  64. 18.86 s gammaloop-nextest-spenso> failures:
  65. 18.86 s gammaloop-nextest-spenso>
  66. 18.86 s gammaloop-nextest-spenso> failures:
  67. 18.86 s gammaloop-nextest-spenso> color::test::form_reference::metric_contraction_respects_antisymmetric_normalization
  68. 18.86 s gammaloop-nextest-spenso>
  69. 18.86 s gammaloop-nextest-spenso> test result: FAILED. 0 passed; 1 failed; 0 ignored; 0 measured; 240 filtered out; finished in 0.00s
  70. 18.86 s gammaloop-nextest-spenso>
  71. 18.86 s gammaloop-nextest-spenso> stderr ---
  72. 18.86 s gammaloop-nextest-spenso>
  73. 18.86 s gammaloop-nextest-spenso> thread 'color::test::form_reference::metric_contraction_respects_antisymmetric_normalization' (339) panicked at crates/idenso/src/color/test/form_reference.rs:171:5:
  74. 18.86 s gammaloop-nextest-spenso> assertion `left == right` failed
  75. 18.86 s gammaloop-nextest-spenso> left: "-1*f(coad(8,standalone_metric_j),coad(8,standalone_metric_s),coad(8,standalone_metric_u))"
  76. 18.86 s gammaloop-nextest-spenso> right: "f(coad(8,standalone_metric_j),coad(8,standalone_metric_s),coad(8,standalone_metric_u))"
  77. 18.86 s gammaloop-nextest-spenso> stack backtrace:
  78. 18.86 s gammaloop-nextest-spenso> 0: __rustc::rust_begin_unwind
  79. 18.86 s gammaloop-nextest-spenso> 1: core::panicking::panic_fmt
  80. 18.86 s gammaloop-nextest-spenso> 2: core::panicking::assert_failed_inner
  81. 18.86 s gammaloop-nextest-spenso> 3: core::panicking::assert_failed::<alloc::string::String, alloc::string::String>
  82. 18.86 s gammaloop-nextest-spenso> 4: idenso::color::test::form_reference::metric_contraction_respects_antisymmetric_normalization
  83. 18.86 s gammaloop-nextest-spenso> 5: <idenso::color::test::form_reference::metric_contraction_respects_antisymmetric_normalization::{closure#0} as core::ops::function::FnOnce<()>>::call_once
  84. 18.86 s gammaloop-nextest-spenso> note: Some details are omitted, run with `RUST_BACKTRACE=full` for a verbose backtrace.
  85. 18.86 s gammaloop-nextest-spenso>
  86. 19.11 s gammaloop-nextest-spenso> FAIL [ 0.056s] (220/224) idenso tensor::tests::parsing::infinite_execution
  87. 19.11 s gammaloop-nextest-spenso> stdout ---
  88. 19.11 s gammaloop-nextest-spenso>
  89. 19.11 s gammaloop-nextest-spenso> running 1 test
  90. 19.11 s gammaloop-nextest-spenso> ━━━━━━━━━━━━━━━━━━━━━━━━━━━━━━━ Snapshot Summary ━━━━━━━━━━━━━━━━━━━━━━━━━━━━━━━
  91. 19.11 s gammaloop-nextest-spenso> Snapshot: infinite_execution
  92. 19.11 s gammaloop-nextest-spenso> Source: crates/idenso/src/tensor/tests/parsing.rs:910
  93. 19.11 s gammaloop-nextest-spenso> ────────────────────────────────────────────────────────────────────────────────
  94. 19.11 s gammaloop-nextest-spenso> Expression: net_iter.snapshot_dot()
  95. 19.11 s gammaloop-nextest-spenso> ────────────────────────────────────────────────────────────────────────────────
  96. 19.11 s gammaloop-nextest-spenso> -old snapshot
  97. 19.11 s gammaloop-nextest-spenso> +new results
  98. 19.11 s gammaloop-nextest-spenso> ────────────┬───────────────────────────────────────────────────────────────────
  99. 19.11 s gammaloop-nextest-spenso> 8 8 │ 0:0:s -> ext0 [id=0 color="red"];
  100. 19.11 s gammaloop-nextest-spenso> 9 9 │ ext1 [style=invis];
  101. 19.11 s gammaloop-nextest-spenso> 10 10 │ 0:5:s -> ext1 [id=1 dir=none color="red" label="mink4|l_0"];
  102. 19.11 s gammaloop-nextest-spenso> 11 11 │ ext2 [style=invis];
  103. 19.11 s gammaloop-nextest-spenso> 12 │- 0:4:s -> ext2 [id=2 dir=none color="red" label="bis4|l_2"];
  104. 19.11 s gammaloop-nextest-spenso> 12 │+ 0:3:s -> ext2 [id=2 dir=none color="red" label="mink4|l_1"];
  105. 19.11 s gammaloop-nextest-spenso> 13 13 │ ext3 [style=invis];
  106. 19.11 s gammaloop-nextest-spenso> 14 │- 0:3:s -> ext3 [id=3 dir=none color="red" label="bis4|l_3"];
  107. 19.11 s gammaloop-nextest-spenso> 14 │+ 0:1:s -> ext3 [id=3 dir=none color="red" label="bis4|l_2"];
  108. 19.11 s gammaloop-nextest-spenso> 15 15 │ ext4 [style=invis];
  109. 19.11 s gammaloop-nextest-spenso> 16 │- 0:1:s -> ext4 [id=4 dir=none color="red" label="mink4|l_1"];
  110. 19.11 s gammaloop-nextest-spenso> 16 │+ 0:2:s -> ext4 [id=4 dir=none color="red" label="mink4|l_4"];
  111. 19.11 s gammaloop-nextest-spenso> 17 17 │ ext5 [style=invis];
  112. 19.11 s gammaloop-nextest-spenso> 18 │- 0:2:s -> ext5 [id=5 dir=none color="red" label="mink4|l_4"];
  113. 19.11 s gammaloop-nextest-spenso> 18 │+ 0:4:s -> ext5 [id=5 dir=none color="red" label="bis4|l_3"];
  114. 19.11 s gammaloop-nextest-spenso> 19 19 │ }
  115. 19.11 s gammaloop-nextest-spenso> ────────────┴───────────────────────────────────────────────────────────────────
  116. 19.11 s gammaloop-nextest-spenso> To update snapshots run `cargo insta review`
  117. 19.11 s gammaloop-nextest-spenso> Stopped on the first failure. Run `cargo insta test` to run all snapshots.
  118. 19.11 s gammaloop-nextest-spenso> test tensor::tests::parsing::infinite_execution ... FAILED
  119. 19.11 s gammaloop-nextest-spenso>
  120. 19.11 s gammaloop-nextest-spenso> failures:
  121. 19.11 s gammaloop-nextest-spenso>
  122. 19.11 s gammaloop-nextest-spenso> failures:
  123. 19.11 s gammaloop-nextest-spenso> tensor::tests::parsing::infinite_execution
  124. 19.11 s gammaloop-nextest-spenso>
  125. 19.11 s gammaloop-nextest-spenso> test result: FAILED. 0 passed; 1 failed; 0 ignored; 0 measured; 240 filtered out; finished in 0.05s
  126. 19.11 s gammaloop-nextest-spenso>
  127. 19.11 s gammaloop-nextest-spenso> stderr ---
  128. 19.11 s gammaloop-nextest-spenso>
  129. 19.11 s gammaloop-nextest-spenso> thread 'tensor::tests::parsing::infinite_execution' (836) panicked at /nix/store/hvwd4qqiaadc4s871lfyylxrciqrvlgs-vendor-cargo-deps/c19b7c6f923b580ac259164a89f2577984ad5ab09ee9d583b888f934adbbe8d0/insta-1.47.2/src/runtime.rs:719:13:
  130. 19.11 s gammaloop-nextest-spenso> snapshot assertion for 'infinite_execution' failed in line 910
  131. 19.11 s gammaloop-nextest-spenso> stack backtrace:
  132. 19.11 s gammaloop-nextest-spenso> 0: __rustc::rust_begin_unwind
  133. 19.11 s gammaloop-nextest-spenso> 1: core::panicking::panic_fmt
  134. 19.11 s gammaloop-nextest-spenso> 2: insta::runtime::assert_snapshot
  135. 19.11 s gammaloop-nextest-spenso> 3: idenso::tensor::tests::parsing::infinite_execution
  136. 19.11 s gammaloop-nextest-spenso> 4: <idenso::tensor::tests::parsing::infinite_execution::{closure#0} as core::ops::function::FnOnce<()>>::call_once
  137. 19.11 s gammaloop-nextest-spenso> note: Some details are omitted, run with `RUST_BACKTRACE=full` for a verbose backtrace.
  138. 19.11 s gammaloop-nextest-spenso>
  139. 20.34 s gammaloop-nextest-spenso> ------------
  140. 20.34 s gammaloop-nextest-spenso> Summary [ 1.567s] 224 tests run: 222 passed, 2 failed, 26 skipped
  141. 20.34 s gammaloop-nextest-spenso> FAIL [ 0.011s] ( 45/224) idenso color::test::form_reference::metric_contraction_respects_antisymmetric_normalization
  142. 20.34 s gammaloop-nextest-spenso> stdout ---
  143. 20.34 s gammaloop-nextest-spenso>
  144. 20.34 s gammaloop-nextest-spenso> running 1 test
  145. 20.34 s gammaloop-nextest-spenso> test color::test::form_reference::metric_contraction_respects_antisymmetric_normalization ... FAILED
  146. 20.34 s gammaloop-nextest-spenso>
  147. 20.34 s gammaloop-nextest-spenso> failures:
  148. 20.34 s gammaloop-nextest-spenso>
  149. 20.34 s gammaloop-nextest-spenso> failures:
  150. 20.34 s gammaloop-nextest-spenso> color::test::form_reference::metric_contraction_respects_antisymmetric_normalization
  151. 20.34 s gammaloop-nextest-spenso>
  152. 20.34 s gammaloop-nextest-spenso> test result: FAILED. 0 passed; 1 failed; 0 ignored; 0 measured; 240 filtered out; finished in 0.00s
  153. 20.34 s gammaloop-nextest-spenso>
  154. 20.34 s gammaloop-nextest-spenso> stderr ---
  155. 20.34 s gammaloop-nextest-spenso>
  156. 20.34 s gammaloop-nextest-spenso> thread 'color::test::form_reference::metric_contraction_respects_antisymmetric_normalization' (339) panicked at crates/idenso/src/color/test/form_reference.rs:171:5:
  157. 20.34 s gammaloop-nextest-spenso> assertion `left == right` failed
  158. 20.34 s gammaloop-nextest-spenso> left: "-1*f(coad(8,standalone_metric_j),coad(8,standalone_metric_s),coad(8,standalone_metric_u))"
  159. 20.34 s gammaloop-nextest-spenso> right: "f(coad(8,standalone_metric_j),coad(8,standalone_metric_s),coad(8,standalone_metric_u))"
  160. 20.34 s gammaloop-nextest-spenso> stack backtrace:
  161. 20.34 s gammaloop-nextest-spenso> 0: __rustc::rust_begin_unwind
  162. 20.34 s gammaloop-nextest-spenso> 1: core::panicking::panic_fmt
  163. 20.34 s gammaloop-nextest-spenso> 2: core::panicking::assert_failed_inner
  164. 20.34 s gammaloop-nextest-spenso> 3: core::panicking::assert_failed::<alloc::string::String, alloc::string::String>
  165. 20.34 s gammaloop-nextest-spenso> 4: idenso::color::test::form_reference::metric_contraction_respects_antisymmetric_normalization
  166. 20.34 s gammaloop-nextest-spenso> 5: <idenso::color::test::form_reference::metric_contraction_respects_antisymmetric_normalization::{closure#0} as core::ops::function::FnOnce<()>>::call_once
  167. 20.34 s gammaloop-nextest-spenso> note: Some details are omitted, run with `RUST_BACKTRACE=full` for a verbose backtrace.
  168. 20.34 s gammaloop-nextest-spenso>
  169. 20.34 s gammaloop-nextest-spenso> FAIL [ 0.056s] (220/224) idenso tensor::tests::parsing::infinite_execution
  170. 20.34 s gammaloop-nextest-spenso> stdout ---
  171. 20.34 s gammaloop-nextest-spenso>
  172. 20.34 s gammaloop-nextest-spenso> running 1 test
  173. 20.34 s gammaloop-nextest-spenso> ━━━━━━━━━━━━━━━━━━━━━━━━━━━━━━━ Snapshot Summary ━━━━━━━━━━━━━━━━━━━━━━━━━━━━━━━
  174. 20.34 s gammaloop-nextest-spenso> Snapshot: infinite_execution
  175. 20.34 s gammaloop-nextest-spenso> Source: crates/idenso/src/tensor/tests/parsing.rs:910
  176. 20.34 s gammaloop-nextest-spenso> ────────────────────────────────────────────────────────────────────────────────
  177. 20.34 s gammaloop-nextest-spenso> Expression: net_iter.snapshot_dot()
  178. 20.34 s gammaloop-nextest-spenso> ────────────────────────────────────────────────────────────────────────────────
  179. 20.34 s gammaloop-nextest-spenso> -old snapshot
  180. 20.34 s gammaloop-nextest-spenso> +new results
  181. 20.34 s gammaloop-nextest-spenso> ────────────┬───────────────────────────────────────────────────────────────────
  182. 20.34 s gammaloop-nextest-spenso> 8 8 │ 0:0:s -> ext0 [id=0 color="red"];
  183. 20.34 s gammaloop-nextest-spenso> 9 9 │ ext1 [style=invis];
  184. 20.34 s gammaloop-nextest-spenso> 10 10 │ 0:5:s -> ext1 [id=1 dir=none color="red" label="mink4|l_0"];
  185. 20.34 s gammaloop-nextest-spenso> 11 11 │ ext2 [style=invis];
  186. 20.34 s gammaloop-nextest-spenso> 12 │- 0:4:s -> ext2 [id=2 dir=none color="red" label="bis4|l_2"];
  187. 20.34 s gammaloop-nextest-spenso> 12 │+ 0:3:s -> ext2 [id=2 dir=none color="red" label="mink4|l_1"];
  188. 20.34 s gammaloop-nextest-spenso> 13 13 │ ext3 [style=invis];
  189. 20.34 s gammaloop-nextest-spenso> 14 │- 0:3:s -> ext3 [id=3 dir=none color="red" label="bis4|l_3"];
  190. 20.34 s gammaloop-nextest-spenso> 14 │+ 0:1:s -> ext3 [id=3 dir=none color="red" label="bis4|l_2"];
  191. 20.34 s gammaloop-nextest-spenso> 15 15 │ ext4 [style=invis];
  192. 20.34 s gammaloop-nextest-spenso> 16 │- 0:1:s -> ext4 [id=4 dir=none color="red" label="mink4|l_1"];
  193. 20.34 s gammaloop-nextest-spenso> 16 │+ 0:2:s -> ext4 [id=4 dir=none color="red" label="mink4|l_4"];
  194. 20.34 s gammaloop-nextest-spenso> 17 17 │ ext5 [style=invis];
  195. 20.34 s gammaloop-nextest-spenso> 18 │- 0:2:s -> ext5 [id=5 dir=none color="red" label="mink4|l_4"];
  196. 20.34 s gammaloop-nextest-spenso> 18 │+ 0:4:s -> ext5 [id=5 dir=none color="red" label="bis4|l_3"];
  197. 20.34 s gammaloop-nextest-spenso> 19 19 │ }
  198. 20.34 s gammaloop-nextest-spenso> ────────────┴───────────────────────────────────────────────────────────────────
  199. 20.34 s gammaloop-nextest-spenso> To update snapshots run `cargo insta review`
  200. 20.34 s gammaloop-nextest-spenso> Stopped on the first failure. Run `cargo insta test` to run all snapshots.
  201. 20.34 s gammaloop-nextest-spenso> test tensor::tests::parsing::infinite_execution ... FAILED
  202. 20.34 s gammaloop-nextest-spenso>
  203. 20.34 s gammaloop-nextest-spenso> failures:
  204. 20.34 s gammaloop-nextest-spenso>
  205. 20.34 s gammaloop-nextest-spenso> failures:
  206. 20.34 s gammaloop-nextest-spenso> tensor::tests::parsing::infinite_execution
  207. 20.34 s gammaloop-nextest-spenso>
  208. 20.34 s gammaloop-nextest-spenso> test result: FAILED. 0 passed; 1 failed; 0 ignored; 0 measured; 240 filtered out; finished in 0.05s
  209. 20.34 s gammaloop-nextest-spenso>
  210. 20.34 s gammaloop-nextest-spenso> stderr ---
  211. 20.34 s gammaloop-nextest-spenso>
  212. 20.34 s gammaloop-nextest-spenso> thread 'tensor::tests::parsing::infinite_execution' (836) panicked at /nix/store/hvwd4qqiaadc4s871lfyylxrciqrvlgs-vendor-cargo-deps/c19b7c6f923b580ac259164a89f2577984ad5ab09ee9d583b888f934adbbe8d0/insta-1.47.2/src/runtime.rs:719:13:
  213. 20.34 s gammaloop-nextest-spenso> snapshot assertion for 'infinite_execution' failed in line 910
  214. 20.34 s gammaloop-nextest-spenso> stack backtrace:
  215. 20.34 s gammaloop-nextest-spenso> 0: __rustc::rust_begin_unwind
  216. 20.34 s gammaloop-nextest-spenso> 1: core::panicking::panic_fmt
  217. 20.34 s gammaloop-nextest-spenso> 2: insta::runtime::assert_snapshot
  218. 20.34 s gammaloop-nextest-spenso> 3: idenso::tensor::tests::parsing::infinite_execution
  219. 20.34 s gammaloop-nextest-spenso> 4: <idenso::tensor::tests::parsing::infinite_execution::{closure#0} as core::ops::function::FnOnce<()>>::call_once
  220. 20.34 s gammaloop-nextest-spenso> note: Some details are omitted, run with `RUST_BACKTRACE=full` for a verbose backtrace.
  221. 20.34 s gammaloop-nextest-spenso>
  222. 20.37 s gammaloop-nextest-spenso> error: test run failed
  223. 20.39 s gammaloop-nextest-spenso>
  224. 20.39 s gammaloop-nextest-spenso> ========== nextest test summary ==========
  225. 20.39 s gammaloop-nextest-spenso> report: target/nextest/ci_gammaloop/junit.xml
  226. 20.39 s gammaloop-nextest-spenso> tests: 224, failures: 2, errors: 0
  227. 20.39 s gammaloop-nextest-spenso>
  228. 20.39 s gammaloop-nextest-spenso> 1. idenso::color::test::form_reference::metric_contraction_respects_antisymmetric_normalization
  229. 20.39 s gammaloop-nextest-spenso> failure: test failure with exit code 101
  230. 20.39 s gammaloop-nextest-spenso> thread 'color::test::form_reference::metric_contraction_respects_antisymmetric_normalization' (339) panicked at crates/idenso/src/color/test/form_reference.rs:171:5:
  231. 20.39 s gammaloop-nextest-spenso> assertion `left == right` failed
  232. 20.39 s gammaloop-nextest-spenso> left: "-1*f(coad(8,standalone_metric_j),coad(8,standalone_metric_s),coad(8,standalone_metric_u))"
  233. 20.39 s gammaloop-nextest-spenso> right: "f(coad(8,standalone_metric_j),coad(8,standalone_metric_s),coad(8,standalone_metric_u))"
  234. 20.39 s gammaloop-nextest-spenso> stack backtrace:
  235. 20.39 s gammaloop-nextest-spenso> 0: __rustc::rust_begin_unwind
  236. 20.40 s gammaloop-nextest-spenso> 1: core::panicking::panic_fmt
  237. 20.40 s gammaloop-nextest-spenso> 2: core::panicking::assert_failed_inner
  238. 20.40 s gammaloop-nextest-spenso> 3: core::panicking::assert_failed::<alloc::string::String, alloc::string::String>
  239. 20.40 s gammaloop-nextest-spenso> 4: idenso::color::test::form_reference::metric_contraction_respects_antisymmetric_normalization
  240. 20.40 s gammaloop-nextest-spenso> 5: <idenso::color::test::form_reference::metric_contraction_respects_antisymmetric_normalization::{closure#0} as core::ops::function::FnOnce<()>>::call_once
  241. 20.40 s gammaloop-nextest-spenso> note: Some details are omitted, run with `RUST_BACKTRACE=full` for a verbose backtrace.
  242. 20.40 s gammaloop-nextest-spenso> system-out
  243. 20.40 s gammaloop-nextest-spenso> running 1 test
  244. 20.40 s gammaloop-nextest-spenso> test color::test::form_reference::metric_contraction_respects_antisymmetric_normalization ... FAILED
  245. 20.40 s gammaloop-nextest-spenso>
  246. 20.40 s gammaloop-nextest-spenso> failures:
  247. 20.40 s gammaloop-nextest-spenso>
  248. 20.40 s gammaloop-nextest-spenso> failures:
  249. 20.40 s gammaloop-nextest-spenso> color::test::form_reference::metric_contraction_respects_antisymmetric_normalization
  250. 20.40 s gammaloop-nextest-spenso>
  251. 20.40 s gammaloop-nextest-spenso> test result: FAILED. 0 passed; 1 failed; 0 ignored; 0 measured; 240 filtered out; finished in 0.00s
  252. 20.40 s gammaloop-nextest-spenso> system-err
  253. 20.40 s gammaloop-nextest-spenso> thread 'color::test::form_reference::metric_contraction_respects_antisymmetric_normalization' (339) panicked at crates/idenso/src/color/test/form_reference.rs:171:5:
  254. 20.40 s gammaloop-nextest-spenso> assertion `left == right` failed
  255. 20.40 s gammaloop-nextest-spenso> left: "-1*f(coad(8,standalone_metric_j),coad(8,standalone_metric_s),coad(8,standalone_metric_u))"
  256. 20.40 s gammaloop-nextest-spenso> right: "f(coad(8,standalone_metric_j),coad(8,standalone_metric_s),coad(8,standalone_metric_u))"
  257. 20.40 s gammaloop-nextest-spenso> stack backtrace:
  258. 20.40 s gammaloop-nextest-spenso> 0: __rustc::rust_begin_unwind
  259. 20.40 s gammaloop-nextest-spenso> 1: core::panicking::panic_fmt
  260. 20.40 s gammaloop-nextest-spenso> 2: core::panicking::assert_failed_inner
  261. 20.40 s gammaloop-nextest-spenso> 3: core::panicking::assert_failed::<alloc::string::String, alloc::string::String>
  262. 20.40 s gammaloop-nextest-spenso> 4: idenso::color::test::form_reference::metric_contraction_respects_antisymmetric_normalization
  263. 20.40 s gammaloop-nextest-spenso> 5: <idenso::color::test::form_reference::metric_contraction_respects_antisymmetric_normalization::{closure#0} as core::ops::function::FnOnce<()>>::call_once
  264. 20.40 s gammaloop-nextest-spenso> note: Some details are omitted, run with `RUST_BACKTRACE=full` for a verbose backtrace.
  265. 20.40 s gammaloop-nextest-spenso>
  266. 20.40 s gammaloop-nextest-spenso> 2. idenso::tensor::tests::parsing::infinite_execution
  267. 20.40 s gammaloop-nextest-spenso> failure: test failure with exit code 101
  268. 20.40 s gammaloop-nextest-spenso> thread 'tensor::tests::parsing::infinite_execution' (836) panicked at /nix/store/hvwd4qqiaadc4s871lfyylxrciqrvlgs-vendor-cargo-deps/c19b7c6f923b580ac259164a89f2577984ad5ab09ee9d583b888f934adbbe8d0/insta-1.47.2/src/runtime.rs:719:13:
  269. 20.40 s gammaloop-nextest-spenso> snapshot assertion for 'infinite_execution' failed in line 910
  270. 20.40 s gammaloop-nextest-spenso> stack backtrace:
  271. 20.40 s gammaloop-nextest-spenso> 0: __rustc::rust_begin_unwind
  272. 20.40 s gammaloop-nextest-spenso> 1: core::panicking::panic_fmt
  273. 20.40 s gammaloop-nextest-spenso> 2: insta::runtime::assert_snapshot
  274. 20.40 s gammaloop-nextest-spenso> 3: idenso::tensor::tests::parsing::infinite_execution
  275. 20.40 s gammaloop-nextest-spenso> 4: <idenso::tensor::tests::parsing::infinite_execution::{closure#0} as core::ops::function::FnOnce<()>>::call_once
  276. 20.40 s gammaloop-nextest-spenso> note: Some details are omitted, run with `RUST_BACKTRACE=full` for a verbose backtrace.
  277. 20.40 s gammaloop-nextest-spenso> system-out
  278. 20.40 s gammaloop-nextest-spenso> running 1 test
  279. 20.40 s gammaloop-nextest-spenso> ━━━━━━━━━━━━━━━━━━━━━━━━━━━━━━━ Snapshot Summary ━━━━━━━━━━━━━━━━━━━━━━━━━━━━━━━
  280. 20.40 s gammaloop-nextest-spenso> Snapshot: infinite_execution
  281. 20.40 s gammaloop-nextest-spenso> Source: crates/idenso/src/tensor/tests/parsing.rs:910
  282. 20.40 s gammaloop-nextest-spenso> ────────────────────────────────────────────────────────────────────────────────
  283. 20.40 s gammaloop-nextest-spenso> Expression: net_iter.snapshot_dot()
  284. 20.40 s gammaloop-nextest-spenso> ────────────────────────────────────────────────────────────────────────────────
  285. 20.40 s gammaloop-nextest-spenso> -old snapshot
  286. 20.40 s gammaloop-nextest-spenso> +new results
  287. 20.40 s gammaloop-nextest-spenso> ────────────┬───────────────────────────────────────────────────────────────────
  288. 20.40 s gammaloop-nextest-spenso> 8 8 │ 0:0:s-> ext0 [id=0 color="red"];
  289. 20.40 s gammaloop-nextest-spenso> 9 9 │ ext1 [style=invis];
  290. 20.40 s gammaloop-nextest-spenso> 10 10 │ 0:5:s-> ext1 [id=1 dir=none color="red" label="mink4|l_0"];
  291. 20.40 s gammaloop-nextest-spenso> 11 11 │ ext2 [style=invis];
  292. 20.40 s gammaloop-nextest-spenso> 12 │- 0:4:s-> ext2 [id=2 dir=none color="red" label="bis4|l_2"];
  293. 20.40 s gammaloop-nextest-spenso> 12 │+ 0:3:s-> ext2 [id=2 dir=none color="red" label="mink4|l_1"];
  294. 20.40 s gammaloop-nextest-spenso> 13 13 │ ext3 [style=invis];
  295. 20.40 s gammaloop-nextest-spenso> 14 │- 0:3:s-> ext3 [id=3 dir=none color="red" label="bis4|l_3"];
  296. 20.40 s gammaloop-nextest-spenso> 14 │+ 0:1:s-> ext3 [id=3 dir=none color="red" label="bis4|l_2"];
  297. 20.40 s gammaloop-nextest-spenso> 15 15 │ ext4 [style=invis];
  298. 20.40 s gammaloop-nextest-spenso> 16 │- 0:1:s-> ext4 [id=4 dir=none color="red" label="mink4|l_1"];
  299. 20.40 s gammaloop-nextest-spenso> 16 │+ 0:2:s-> ext4 [id=4 dir=none color="red" label="mink4|l_4"];
  300. 20.40 s gammaloop-nextest-spenso> 17 17 │ ext5 [style=invis];
  301. 20.40 s gammaloop-nextest-spenso> 18 │- 0:2:s-> ext5 [id=5 dir=none color="red" label="mink4|l_4"];
  302. 20.40 s gammaloop-nextest-spenso> 18 │+ 0:4:s-> ext5 [id=5 dir=none color="red" label="bis4|l_3"];
  303. 20.40 s gammaloop-nextest-spenso> 19 19 │ }
  304. 20.40 s gammaloop-nextest-spenso> ────────────┴───────────────────────────────────────────────────────────────────
  305. 20.40 s gammaloop-nextest-spenso> To update snapshots run `cargo insta review`
  306. 20.40 s gammaloop-nextest-spenso> Stopped on the first failure. Run `cargo insta test` to run all snapshots.
  307. 20.40 s gammaloop-nextest-spenso> test tensor::tests::parsing::infinite_execution ... FAILED
  308. 20.40 s gammaloop-nextest-spenso>
  309. 20.40 s gammaloop-nextest-spenso> failures:
  310. 20.40 s gammaloop-nextest-spenso>
  311. 20.40 s gammaloop-nextest-spenso> failures:
  312. 20.40 s gammaloop-nextest-spenso> tensor::tests::parsing::infinite_execution
  313. 20.40 s gammaloop-nextest-spenso>
  314. 20.40 s gammaloop-nextest-spenso> test result: FAILED. 0 passed; 1 failed; 0 ignored; 0 measured; 240 filtered out; finished in 0.05s
  315. 20.40 s gammaloop-nextest-spenso> system-err
  316. 20.40 s gammaloop-nextest-spenso> thread 'tensor::tests::parsing::infinite_execution' (836) panicked at /nix/store/hvwd4qqiaadc4s871lfyylxrciqrvlgs-vendor-cargo-deps/c19b7c6f923b580ac259164a89f2577984ad5ab09ee9d583b888f934adbbe8d0/insta-1.47.2/src/runtime.rs:719:13:
  317. 20.40 s gammaloop-nextest-spenso> snapshot assertion for 'infinite_execution' failed in line 910
  318. 20.40 s gammaloop-nextest-spenso> stack backtrace:
  319. 20.40 s gammaloop-nextest-spenso> 0: __rustc::rust_begin_unwind
  320. 20.40 s gammaloop-nextest-spenso> 1: core::panicking::panic_fmt
  321. 20.40 s gammaloop-nextest-spenso> 2: insta::runtime::assert_snapshot
  322. 20.40 s gammaloop-nextest-spenso> 3: idenso::tensor::tests::parsing::infinite_execution
  323. 20.40 s gammaloop-nextest-spenso> 4: <idenso::tensor::tests::parsing::infinite_execution::{closure#0} as core::ops::function::FnOnce<()>>::call_once
  324. 20.40 s gammaloop-nextest-spenso> note: Some details are omitted, run with `RUST_BACKTRACE=full` for a verbose backtrace.
  325. 20.40 s gammaloop-nextest-spenso> =========================================
  326. 20.41 s gammaloop-nextest-spenso> Extracting 2 binaries and 1 linked path to /build/nextest-archive-RfDvIO
  327. 20.48 s gammaloop-nextest-spenso> Extracted 8 files to /build/nextest-archive-RfDvIO in 0.07s
  328. 20.49 s gammaloop-nextest-spenso> ------------
  329. 20.49 s gammaloop-nextest-spenso> Nextest run ID c8acedad-09f0-457d-95cc-4612f47d64e8 with nextest profile: ci_gammaloop
  330. 20.49 s gammaloop-nextest-spenso> Starting 135 tests across 2 binaries
  331. 20.56 s gammaloop-nextest-spenso> ------------
  332. 20.56 s gammaloop-nextest-spenso> Summary [ 0.074s] 135 tests run: 135 passed, 0 skipped
  333. 20.60 s gammaloop-nextest-spenso>
  334. 20.60 s gammaloop-nextest-spenso> ========== nextest test summary ==========
  335. 20.60 s gammaloop-nextest-spenso> report: target/nextest/ci_gammaloop/junit.xml
  336. 20.60 s gammaloop-nextest-spenso> tests: 135, failures: 0, errors: 0
  337. 20.60 s gammaloop-nextest-spenso> No failing testcases found.
  338. 20.60 s gammaloop-nextest-spenso> =========================================
  339. 20.61 s gammaloop-nextest-spenso> Extracting 5 binaries and 2 linked paths to /build/nextest-archive-KiQPjm
  340. 20.80 s gammaloop-nextest-spenso> Extracted 19 files to /build/nextest-archive-KiQPjm in 0.19s
  341. 20.81 s gammaloop-nextest-spenso> ------------
  342. 20.81 s gammaloop-nextest-spenso> Nextest run ID b37bf9f3-6d1a-4fd5-893d-afa50cc21ea7 with nextest profile: ci_gammaloop
  343. 20.81 s gammaloop-nextest-spenso> Starting 25 tests across 5 binaries (1 test skipped via profile.ci_gammaloop.default-filter)
  344. 20.99 s gammaloop-nextest-spenso> ------------
  345. 20.99 s gammaloop-nextest-spenso> Summary [ 0.181s] 25 tests run: 25 passed, 1 skipped
  346. 21.04 s gammaloop-nextest-spenso>
  347. 21.04 s gammaloop-nextest-spenso> ========== nextest test summary ==========
  348. 21.04 s gammaloop-nextest-spenso> report: target/nextest/ci_gammaloop/junit.xml
  349. 21.04 s gammaloop-nextest-spenso> tests: 25, failures: 0, errors: 0
  350. 21.04 s gammaloop-nextest-spenso> No failing testcases found.
  351. 21.04 s gammaloop-nextest-spenso> =========================================
  352. 21.06 s gammaloop-nextest-spenso> Extracting 2 binaries and 1 linked path to /build/nextest-archive-Zp1flR
  353. 21.11 s gammaloop-nextest-spenso> Extracted 8 files to /build/nextest-archive-Zp1flR in 0.05s
  354. 21.12 s gammaloop-nextest-spenso> ------------
  355. 21.12 s gammaloop-nextest-spenso> Nextest run ID a19144a5-be18-4449-a2af-5984319a3999 with nextest profile: ci_gammaloop
  356. 21.12 s gammaloop-nextest-spenso> Starting 1 test across 2 binaries
  357. 21.12 s gammaloop-nextest-spenso> ------------
  358. 21.12 s gammaloop-nextest-spenso> Summary [ 0.004s] 1 test run: 1 passed, 0 skipped
  359. 21.15 s gammaloop-nextest-spenso>
  360. 21.15 s gammaloop-nextest-spenso> ========== nextest test summary ==========
  361. 21.15 s gammaloop-nextest-spenso> report: target/nextest/ci_gammaloop/junit.xml
  362. 21.15 s gammaloop-nextest-spenso> tests: 1, failures: 0, errors: 0
  363. 21.15 s gammaloop-nextest-spenso> No failing testcases found.
  364. 21.15 s gammaloop-nextest-spenso> =========================================
  365. 21.16 s gammaloop-nextest-spenso> Extracting 1 binary and 1 linked path to /build/nextest-archive-llLy9d
  366. 21.21 s gammaloop-nextest-spenso> Extracted 7 files to /build/nextest-archive-llLy9d in 0.05s
  367. 21.22 s gammaloop-nextest-spenso> ------------
  368. 21.22 s gammaloop-nextest-spenso> Nextest run ID 63821ce8-51f1-4f4f-a873-7857066839c5 with nextest profile: ci_gammaloop
  369. 21.22 s gammaloop-nextest-spenso> Starting 0 tests across 1 binary
  370. 21.22 s gammaloop-nextest-spenso> ------------
  371. 21.22 s gammaloop-nextest-spenso> Summary [ 0.000s] 0 tests run: 0 passed, 0 skipped
  372. 21.25 s gammaloop-nextest-spenso>
  373. 21.25 s gammaloop-nextest-spenso> ========== nextest test summary ==========
  374. 21.25 s gammaloop-nextest-spenso> report: target/nextest/ci_gammaloop/junit.xml
  375. 21.25 s gammaloop-nextest-spenso> tests: 0, failures: 0, errors: 0
  376. 21.25 s gammaloop-nextest-spenso> No failing testcases found.
  377. 21.25 s gammaloop-nextest-spenso> =========================================
  378. 21.28 s error: Cannot build '/nix/store/ajh0inglfjv92dj2wayik39a1nhpnyss-gammaloop-nextest-spenso.drv'.
  379. 21.28 s Reason: builder failed with exit code 100.
  380. 21.28 s Output paths:
  381. 21.28 s /nix/store/72a4m9x9qi6rgavfi53ygk515kxybbbl-gammaloop-nextest-spenso
  382. 21.28 s Last 325 log lines:
  383. 21.28 s > Extracting 5 binaries and 2 linked paths to /build/nextest-archive-V9QiAp
  384. 21.28 s > Extracted 19 files to /build/nextest-archive-V9QiAp in 0.16s
  385. 21.28 s > ------------
  386. 21.28 s > Nextest run ID 0ba90e36-fc7e-44e4-8619-95db33146556 with nextest profile: ci_gammaloop
  387. 21.28 s > Starting 224 tests across 5 binaries (26 tests skipped, including 2 tests via profile.ci_gammaloop.default-filter)
  388. 21.28 s > FAIL [ 0.011s] ( 45/224) idenso color::test::form_reference::metric_contraction_respects_antisymmetric_normalization
  389. 21.28 s > stdout ---
  390. 21.28 s >
  391. 21.28 s > running 1 test
  392. 21.28 s > test color::test::form_reference::metric_contraction_respects_antisymmetric_normalization ... FAILED
  393. 21.28 s >
  394. 21.28 s > failures:
  395. 21.28 s >
  396. 21.28 s > failures:
  397. 21.28 s > color::test::form_reference::metric_contraction_respects_antisymmetric_normalization
  398. 21.28 s >
  399. 21.28 s > test result: FAILED. 0 passed; 1 failed; 0 ignored; 0 measured; 240 filtered out; finished in 0.00s
  400. 21.28 s >
  401. 21.28 s > stderr ---
  402. 21.28 s >
  403. 21.28 s > thread 'color::test::form_reference::metric_contraction_respects_antisymmetric_normalization' (339) panicked at crates/idenso/src/color/test/form_reference.rs:171:5:
  404. 21.28 s > assertion `left == right` failed
  405. 21.28 s > left: "-1*f(coad(8,standalone_metric_j),coad(8,standalone_metric_s),coad(8,standalone_metric_u))"
  406. 21.28 s > right: "f(coad(8,standalone_metric_j),coad(8,standalone_metric_s),coad(8,standalone_metric_u))"
  407. 21.28 s > stack backtrace:
  408. 21.28 s > 0: __rustc::rust_begin_unwind
  409. 21.28 s > 1: core::panicking::panic_fmt
  410. 21.28 s > 2: core::panicking::assert_failed_inner
  411. 21.28 s > 3: core::panicking::assert_failed::<alloc::string::String, alloc::string::String>
  412. 21.28 s > 4: idenso::color::test::form_reference::metric_contraction_respects_antisymmetric_normalization
  413. 21.28 s > 5: <idenso::color::test::form_reference::metric_contraction_respects_antisymmetric_normalization::{closure#0} as core::ops::function::FnOnce<()>>::call_once
  414. 21.28 s > note: Some details are omitted, run with `RUST_BACKTRACE=full` for a verbose backtrace.
  415. 21.28 s >
  416. 21.28 s > FAIL [ 0.056s] (220/224) idenso tensor::tests::parsing::infinite_execution
  417. 21.28 s > stdout ---
  418. 21.28 s >
  419. 21.28 s > running 1 test
  420. 21.28 s > ━━━━━━━━━━━━━━━━━━━━━━━━━━━━━━━ Snapshot Summary ━━━━━━━━━━━━━━━━━━━━━━━━━━━━━━━
  421. 21.28 s > Snapshot: infinite_execution
  422. 21.28 s > Source: crates/idenso/src/tensor/tests/parsing.rs:910
  423. 21.28 s > ────────────────────────────────────────────────────────────────────────────────
  424. 21.28 s > Expression: net_iter.snapshot_dot()
  425. 21.28 s > ────────────────────────────────────────────────────────────────────────────────
  426. 21.28 s > -old snapshot
  427. 21.28 s > +new results
  428. 21.28 s > ────────────┬───────────────────────────────────────────────────────────────────
  429. 21.28 s > 8 8 │ 0:0:s -> ext0 [id=0 color="red"];
  430. 21.28 s > 9 9 │ ext1 [style=invis];
  431. 21.28 s > 10 10 │ 0:5:s -> ext1 [id=1 dir=none color="red" label="mink4|l_0"];
  432. 21.28 s > 11 11 │ ext2 [style=invis];
  433. 21.28 s > 12 │- 0:4:s -> ext2 [id=2 dir=none color="red" label="bis4|l_2"];
  434. 21.28 s > 12 │+ 0:3:s -> ext2 [id=2 dir=none color="red" label="mink4|l_1"];
  435. 21.28 s > 13 13 │ ext3 [style=invis];
  436. 21.28 s > 14 │- 0:3:s -> ext3 [id=3 dir=none color="red" label="bis4|l_3"];
  437. 21.28 s > 14 │+ 0:1:s -> ext3 [id=3 dir=none color="red" label="bis4|l_2"];
  438. 21.28 s > 15 15 │ ext4 [style=invis];
  439. 21.28 s > 16 │- 0:1:s -> ext4 [id=4 dir=none color="red" label="mink4|l_1"];
  440. 21.28 s > 16 │+ 0:2:s -> ext4 [id=4 dir=none color="red" label="mink4|l_4"];
  441. 21.28 s > 17 17 │ ext5 [style=invis];
  442. 21.28 s > 18 │- 0:2:s -> ext5 [id=5 dir=none color="red" label="mink4|l_4"];
  443. 21.28 s > 18 │+ 0:4:s -> ext5 [id=5 dir=none color="red" label="bis4|l_3"];
  444. 21.28 s > 19 19 │ }
  445. 21.28 s > ────────────┴───────────────────────────────────────────────────────────────────
  446. 21.28 s > To update snapshots run `cargo insta review`
  447. 21.28 s > Stopped on the first failure. Run `cargo insta test` to run all snapshots.
  448. 21.28 s > test tensor::tests::parsing::infinite_execution ... FAILED
  449. 21.28 s >
  450. 21.28 s > failures:
  451. 21.28 s >
  452. 21.28 s > failures:
  453. 21.28 s > tensor::tests::parsing::infinite_execution
  454. 21.28 s >
  455. 21.28 s > test result: FAILED. 0 passed; 1 failed; 0 ignored; 0 measured; 240 filtered out; finished in 0.05s
  456. 21.28 s >
  457. 21.28 s > stderr ---
  458. 21.28 s >
  459. 21.28 s > thread 'tensor::tests::parsing::infinite_execution' (836) panicked at /nix/store/hvwd4qqiaadc4s871lfyylxrciqrvlgs-vendor-cargo-deps/c19b7c6f923b580ac259164a89f2577984ad5ab09ee9d583b888f934adbbe8d0/insta-1.47.2/src/runtime.rs:719:13:
  460. 21.28 s > snapshot assertion for 'infinite_execution' failed in line 910
  461. 21.28 s > stack backtrace:
  462. 21.28 s > 0: __rustc::rust_begin_unwind
  463. 21.28 s > 1: core::panicking::panic_fmt
  464. 21.28 s > 2: insta::runtime::assert_snapshot
  465. 21.28 s > 3: idenso::tensor::tests::parsing::infinite_execution
  466. 21.28 s > 4: <idenso::tensor::tests::parsing::infinite_execution::{closure#0} as core::ops::function::FnOnce<()>>::call_once
  467. 21.28 s > note: Some details are omitted, run with `RUST_BACKTRACE=full` for a verbose backtrace.
  468. 21.28 s >
  469. 21.28 s > ------------
  470. 21.28 s > Summary [ 1.567s] 224 tests run: 222 passed, 2 failed, 26 skipped
  471. 21.28 s > FAIL [ 0.011s] ( 45/224) idenso color::test::form_reference::metric_contraction_respects_antisymmetric_normalization
  472. 21.28 s > stdout ---
  473. 21.28 s >
  474. 21.28 s > running 1 test
  475. 21.28 s > test color::test::form_reference::metric_contraction_respects_antisymmetric_normalization ... FAILED
  476. 21.28 s >
  477. 21.28 s > failures:
  478. 21.28 s >
  479. 21.28 s > failures:
  480. 21.28 s > color::test::form_reference::metric_contraction_respects_antisymmetric_normalization
  481. 21.28 s >
  482. 21.28 s > test result: FAILED. 0 passed; 1 failed; 0 ignored; 0 measured; 240 filtered out; finished in 0.00s
  483. 21.28 s >
  484. 21.28 s > stderr ---
  485. 21.28 s >
  486. 21.28 s > thread 'color::test::form_reference::metric_contraction_respects_antisymmetric_normalization' (339) panicked at crates/idenso/src/color/test/form_reference.rs:171:5:
  487. 21.28 s > assertion `left == right` failed
  488. 21.28 s > left: "-1*f(coad(8,standalone_metric_j),coad(8,standalone_metric_s),coad(8,standalone_metric_u))"
  489. 21.28 s > right: "f(coad(8,standalone_metric_j),coad(8,standalone_metric_s),coad(8,standalone_metric_u))"
  490. 21.28 s > stack backtrace:
  491. 21.28 s > 0: __rustc::rust_begin_unwind
  492. 21.28 s > 1: core::panicking::panic_fmt
  493. 21.28 s > 2: core::panicking::assert_failed_inner
  494. 21.28 s > 3: core::panicking::assert_failed::<alloc::string::String, alloc::string::String>
  495. 21.28 s > 4: idenso::color::test::form_reference::metric_contraction_respects_antisymmetric_normalization
  496. 21.28 s > 5: <idenso::color::test::form_reference::metric_contraction_respects_antisymmetric_normalization::{closure#0} as core::ops::function::FnOnce<()>>::call_once
  497. 21.28 s > note: Some details are omitted, run with `RUST_BACKTRACE=full` for a verbose backtrace.
  498. 21.28 s >
  499. 21.28 s > FAIL [ 0.056s] (220/224) idenso tensor::tests::parsing::infinite_execution
  500. 21.28 s > stdout ---
  501. 21.28 s >
  502. 21.28 s > running 1 test
  503. 21.28 s > ━━━━━━━━━━━━━━━━━━━━━━━━━━━━━━━ Snapshot Summary ━━━━━━━━━━━━━━━━━━━━━━━━━━━━━━━
  504. 21.28 s > Snapshot: infinite_execution
  505. 21.28 s > Source: crates/idenso/src/tensor/tests/parsing.rs:910
  506. 21.28 s > ────────────────────────────────────────────────────────────────────────────────
  507. 21.28 s > Expression: net_iter.snapshot_dot()
  508. 21.28 s > ────────────────────────────────────────────────────────────────────────────────
  509. 21.28 s > -old snapshot
  510. 21.28 s > +new results
  511. 21.28 s > ────────────┬───────────────────────────────────────────────────────────────────
  512. 21.28 s > 8 8 │ 0:0:s -> ext0 [id=0 color="red"];
  513. 21.28 s > 9 9 │ ext1 [style=invis];
  514. 21.28 s > 10 10 │ 0:5:s -> ext1 [id=1 dir=none color="red" label="mink4|l_0"];
  515. 21.28 s > 11 11 │ ext2 [style=invis];
  516. 21.28 s > 12 │- 0:4:s -> ext2 [id=2 dir=none color="red" label="bis4|l_2"];
  517. 21.28 s > 12 │+ 0:3:s -> ext2 [id=2 dir=none color="red" label="mink4|l_1"];
  518. 21.28 s > 13 13 │ ext3 [style=invis];
  519. 21.28 s > 14 │- 0:3:s -> ext3 [id=3 dir=none color="red" label="bis4|l_3"];
  520. 21.28 s > 14 │+ 0:1:s -> ext3 [id=3 dir=none color="red" label="bis4|l_2"];
  521. 21.28 s > 15 15 │ ext4 [style=invis];
  522. 21.28 s > 16 │- 0:1:s -> ext4 [id=4 dir=none color="red" label="mink4|l_1"];
  523. 21.28 s > 16 │+ 0:2:s -> ext4 [id=4 dir=none color="red" label="mink4|l_4"];
  524. 21.28 s > 17 17 │ ext5 [style=invis];
  525. 21.28 s > 18 │- 0:2:s -> ext5 [id=5 dir=none color="red" label="mink4|l_4"];
  526. 21.28 s > 18 │+ 0:4:s -> ext5 [id=5 dir=none color="red" label="bis4|l_3"];
  527. 21.28 s > 19 19 │ }
  528. 21.28 s > ────────────┴───────────────────────────────────────────────────────────────────
  529. 21.28 s > To update snapshots run `cargo insta review`
  530. 21.28 s > Stopped on the first failure. Run `cargo insta test` to run all snapshots.
  531. 21.28 s > test tensor::tests::parsing::infinite_execution ... FAILED
  532. 21.28 s >
  533. 21.28 s > failures:
  534. 21.28 s >
  535. 21.28 s > failures:
  536. 21.28 s > tensor::tests::parsing::infinite_execution
  537. 21.28 s >
  538. 21.28 s > test result: FAILED. 0 passed; 1 failed; 0 ignored; 0 measured; 240 filtered out; finished in 0.05s
  539. 21.28 s >
  540. 21.28 s > stderr ---
  541. 21.28 s >
  542. 21.28 s > thread 'tensor::tests::parsing::infinite_execution' (836) panicked at /nix/store/hvwd4qqiaadc4s871lfyylxrciqrvlgs-vendor-cargo-deps/c19b7c6f923b580ac259164a89f2577984ad5ab09ee9d583b888f934adbbe8d0/insta-1.47.2/src/runtime.rs:719:13:
  543. 21.28 s > snapshot assertion for 'infinite_execution' failed in line 910
  544. 21.28 s > stack backtrace:
  545. 21.28 s > 0: __rustc::rust_begin_unwind
  546. 21.28 s > 1: core::panicking::panic_fmt
  547. 21.28 s > 2: insta::runtime::assert_snapshot
  548. 21.28 s > 3: idenso::tensor::tests::parsing::infinite_execution
  549. 21.28 s > 4: <idenso::tensor::tests::parsing::infinite_execution::{closure#0} as core::ops::function::FnOnce<()>>::call_once
  550. 21.28 s > note: Some details are omitted, run with `RUST_BACKTRACE=full` for a verbose backtrace.
  551. 21.28 s >
  552. 21.28 s > error: test run failed
  553. 21.28 s >
  554. 21.28 s > ========== nextest test summary ==========
  555. 21.28 s > report: target/nextest/ci_gammaloop/junit.xml
  556. 21.28 s > tests: 224, failures: 2, errors: 0
  557. 21.28 s >
  558. 21.28 s > 1. idenso::color::test::form_reference::metric_contraction_respects_antisymmetric_normalization
  559. 21.28 s > failure: test failure with exit code 101
  560. 21.28 s > thread 'color::test::form_reference::metric_contraction_respects_antisymmetric_normalization' (339) panicked at crates/idenso/src/color/test/form_reference.rs:171:5:
  561. 21.28 s > assertion `left == right` failed
  562. 21.28 s > left: "-1*f(coad(8,standalone_metric_j),coad(8,standalone_metric_s),coad(8,standalone_metric_u))"
  563. 21.28 s > right: "f(coad(8,standalone_metric_j),coad(8,standalone_metric_s),coad(8,standalone_metric_u))"
  564. 21.28 s > stack backtrace:
  565. 21.28 s > 0: __rustc::rust_begin_unwind
  566. 21.28 s > 1: core::panicking::panic_fmt
  567. 21.28 s > 2: core::panicking::assert_failed_inner
  568. 21.28 s > 3: core::panicking::assert_failed::<alloc::string::String, alloc::string::String>
  569. 21.28 s > 4: idenso::color::test::form_reference::metric_contraction_respects_antisymmetric_normalization
  570. 21.28 s > 5: <idenso::color::test::form_reference::metric_contraction_respects_antisymmetric_normalization::{closure#0} as core::ops::function::FnOnce<()>>::call_once
  571. 21.28 s > note: Some details are omitted, run with `RUST_BACKTRACE=full` for a verbose backtrace.
  572. 21.28 s > system-out
  573. 21.28 s > running 1 test
  574. 21.28 s > test color::test::form_reference::metric_contraction_respects_antisymmetric_normalization ... FAILED
  575. 21.28 s >
  576. 21.28 s > failures:
  577. 21.28 s >
  578. 21.28 s > failures:
  579. 21.28 s > color::test::form_reference::metric_contraction_respects_antisymmetric_normalization
  580. 21.28 s >
  581. 21.28 s > test result: FAILED. 0 passed; 1 failed; 0 ignored; 0 measured; 240 filtered out; finished in 0.00s
  582. 21.28 s > system-err
  583. 21.28 s > thread 'color::test::form_reference::metric_contraction_respects_antisymmetric_normalization' (339) panicked at crates/idenso/src/color/test/form_reference.rs:171:5:
  584. 21.28 s > assertion `left == right` failed
  585. 21.28 s > left: "-1*f(coad(8,standalone_metric_j),coad(8,standalone_metric_s),coad(8,standalone_metric_u))"
  586. 21.28 s > right: "f(coad(8,standalone_metric_j),coad(8,standalone_metric_s),coad(8,standalone_metric_u))"
  587. 21.28 s > stack backtrace:
  588. 21.28 s > 0: __rustc::rust_begin_unwind
  589. 21.28 s > 1: core::panicking::panic_fmt
  590. 21.28 s > 2: core::panicking::assert_failed_inner
  591. 21.28 s > 3: core::panicking::assert_failed::<alloc::string::String, alloc::string::String>
  592. 21.28 s > 4: idenso::color::test::form_reference::metric_contraction_respects_antisymmetric_normalization
  593. 21.28 s > 5: <idenso::color::test::form_reference::metric_contraction_respects_antisymmetric_normalization::{closure#0} as core::ops::function::FnOnce<()>>::call_once
  594. 21.28 s > note: Some details are omitted, run with `RUST_BACKTRACE=full` for a verbose backtrace.
  595. 21.28 s >
  596. 21.28 s > 2. idenso::tensor::tests::parsing::infinite_execution
  597. 21.28 s > failure: test failure with exit code 101
  598. 21.28 s > thread 'tensor::tests::parsing::infinite_execution' (836) panicked at /nix/store/hvwd4qqiaadc4s871lfyylxrciqrvlgs-vendor-cargo-deps/c19b7c6f923b580ac259164a89f2577984ad5ab09ee9d583b888f934adbbe8d0/insta-1.47.2/src/runtime.rs:719:13:
  599. 21.28 s > snapshot assertion for 'infinite_execution' failed in line 910
  600. 21.28 s > stack backtrace:
  601. 21.28 s > 0: __rustc::rust_begin_unwind
  602. 21.28 s > 1: core::panicking::panic_fmt
  603. 21.28 s > 2: insta::runtime::assert_snapshot
  604. 21.28 s > 3: idenso::tensor::tests::parsing::infinite_execution
  605. 21.28 s > 4: <idenso::tensor::tests::parsing::infinite_execution::{closure#0} as core::ops::function::FnOnce<()>>::call_once
  606. 21.28 s > note: Some details are omitted, run with `RUST_BACKTRACE=full` for a verbose backtrace.
  607. 21.28 s > system-out
  608. 21.28 s > running 1 test
  609. 21.28 s > ━━━━━━━━━━━━━━━━━━━━━━━━━━━━━━━ Snapshot Summary ━━━━━━━━━━━━━━━━━━━━━━━━━━━━━━━
  610. 21.28 s > Snapshot: infinite_execution
  611. 21.28 s > Source: crates/idenso/src/tensor/tests/parsing.rs:910
  612. 21.28 s > ────────────────────────────────────────────────────────────────────────────────
  613. 21.28 s > Expression: net_iter.snapshot_dot()
  614. 21.28 s > ────────────────────────────────────────────────────────────────────────────────
  615. 21.28 s > -old snapshot
  616. 21.28 s > +new results
  617. 21.28 s > ────────────┬───────────────────────────────────────────────────────────────────
  618. 21.28 s > 8 8 │ 0:0:s-> ext0 [id=0 color="red"];
  619. 21.28 s > 9 9 │ ext1 [style=invis];
  620. 21.28 s > 10 10 │ 0:5:s-> ext1 [id=1 dir=none color="red" label="mink4|l_0"];
  621. 21.28 s > 11 11 │ ext2 [style=invis];
  622. 21.28 s > 12 │- 0:4:s-> ext2 [id=2 dir=none color="red" label="bis4|l_2"];
  623. 21.28 s > 12 │+ 0:3:s-> ext2 [id=2 dir=none color="red" label="mink4|l_1"];
  624. 21.28 s > 13 13 │ ext3 [style=invis];
  625. 21.28 s > 14 │- 0:3:s-> ext3 [id=3 dir=none color="red" label="bis4|l_3"];
  626. 21.28 s > 14 │+ 0:1:s-> ext3 [id=3 dir=none color="red" label="bis4|l_2"];
  627. 21.28 s > 15 15 │ ext4 [style=invis];
  628. 21.28 s > 16 │- 0:1:s-> ext4 [id=4 dir=none color="red" label="mink4|l_1"];
  629. 21.28 s > 16 │+ 0:2:s-> ext4 [id=4 dir=none color="red" label="mink4|l_4"];
  630. 21.28 s > 17 17 │ ext5 [style=invis];
  631. 21.28 s > 18 │- 0:2:s-> ext5 [id=5 dir=none color="red" label="mink4|l_4"];
  632. 21.28 s > 18 │+ 0:4:s-> ext5 [id=5 dir=none color="red" label="bis4|l_3"];
  633. 21.28 s > 19 19 │ }
  634. 21.28 s > ────────────┴───────────────────────────────────────────────────────────────────
  635. 21.28 s > To update snapshots run `cargo insta review`
  636. 21.28 s > Stopped on the first failure. Run `cargo insta test` to run all snapshots.
  637. 21.28 s > test tensor::tests::parsing::infinite_execution ... FAILED
  638. 21.28 s >
  639. 21.28 s > failures:
  640. 21.28 s >
  641. 21.28 s > failures:
  642. 21.28 s > tensor::tests::parsing::infinite_execution
  643. 21.28 s >
  644. 21.28 s > test result: FAILED. 0 passed; 1 failed; 0 ignored; 0 measured; 240 filtered out; finished in 0.05s
  645. 21.28 s > system-err
  646. 21.28 s > thread 'tensor::tests::parsing::infinite_execution' (836) panicked at /nix/store/hvwd4qqiaadc4s871lfyylxrciqrvlgs-vendor-cargo-deps/c19b7c6f923b580ac259164a89f2577984ad5ab09ee9d583b888f934adbbe8d0/insta-1.47.2/src/runtime.rs:719:13:
  647. 21.28 s > snapshot assertion for 'infinite_execution' failed in line 910
  648. 21.28 s > stack backtrace:
  649. 21.28 s > 0: __rustc::rust_begin_unwind
  650. 21.28 s > 1: core::panicking::panic_fmt
  651. 21.28 s > 2: insta::runtime::assert_snapshot
  652. 21.28 s > 3: idenso::tensor::tests::parsing::infinite_execution
  653. 21.28 s > 4: <idenso::tensor::tests::parsing::infinite_execution::{closure#0} as core::ops::function::FnOnce<()>>::call_once
  654. 21.28 s > note: Some details are omitted, run with `RUST_BACKTRACE=full` for a verbose backtrace.
  655. 21.28 s > =========================================
  656. 21.28 s > Extracting 2 binaries and 1 linked path to /build/nextest-archive-RfDvIO
  657. 21.28 s > Extracted 8 files to /build/nextest-archive-RfDvIO in 0.07s
  658. 21.28 s > ------------
  659. 21.28 s > Nextest run ID c8acedad-09f0-457d-95cc-4612f47d64e8 with nextest profile: ci_gammaloop
  660. 21.28 s > Starting 135 tests across 2 binaries
  661. 21.28 s > ------------
  662. 21.28 s > Summary [ 0.074s] 135 tests run: 135 passed, 0 skipped
  663. 21.28 s >
  664. 21.28 s > ========== nextest test summary ==========
  665. 21.28 s > report: target/nextest/ci_gammaloop/junit.xml
  666. 21.28 s > tests: 135, failures: 0, errors: 0
  667. 21.28 s > No failing testcases found.
  668. 21.28 s > =========================================
  669. 21.28 s > Extracting 5 binaries and 2 linked paths to /build/nextest-archive-KiQPjm
  670. 21.28 s > Extracted 19 files to /build/nextest-archive-KiQPjm in 0.19s
  671. 21.28 s > ------------
  672. 21.28 s > Nextest run ID b37bf9f3-6d1a-4fd5-893d-afa50cc21ea7 with nextest profile: ci_gammaloop
  673. 21.28 s > Starting 25 tests across 5 binaries (1 test skipped via profile.ci_gammaloop.default-filter)
  674. 21.28 s > ------------
  675. 21.28 s > Summary [ 0.181s] 25 tests run: 25 passed, 1 skipped
  676. 21.28 s >
  677. 21.28 s > ========== nextest test summary ==========
  678. 21.28 s > report: target/nextest/ci_gammaloop/junit.xml
  679. 21.28 s > tests: 25, failures: 0, errors: 0
  680. 21.28 s > No failing testcases found.
  681. 21.28 s > =========================================
  682. 21.28 s > Extracting 2 binaries and 1 linked path to /build/nextest-archive-Zp1flR
  683. 21.28 s > Extracted 8 files to /build/nextest-archive-Zp1flR in 0.05s
  684. 21.28 s > ------------
  685. 21.28 s > Nextest run ID a19144a5-be18-4449-a2af-5984319a3999 with nextest profile: ci_gammaloop
  686. 21.28 s > Starting 1 test across 2 binaries
  687. 21.28 s > ------------
  688. 21.28 s > Summary [ 0.004s] 1 test run: 1 passed, 0 skipped
  689. 21.28 s >
  690. 21.28 s > ========== nextest test summary ==========
  691. 21.28 s > report: target/nextest/ci_gammaloop/junit.xml
  692. 21.28 s > tests: 1, failures: 0, errors: 0
  693. 21.28 s > No failing testcases found.
  694. 21.28 s > =========================================
  695. 21.28 s > Extracting 1 binary and 1 linked path to /build/nextest-archive-llLy9d
  696. 21.28 s > Extracted 7 files to /build/nextest-archive-llLy9d in 0.05s
  697. 21.28 s > ------------
  698. 21.28 s > Nextest run ID 63821ce8-51f1-4f4f-a873-7857066839c5 with nextest profile: ci_gammaloop
  699. 21.28 s > Starting 0 tests across 1 binary
  700. 21.28 s > ------------
  701. 21.28 s > Summary [ 0.000s] 0 tests run: 0 passed, 0 skipped
  702. 21.28 s >
  703. 21.28 s > ========== nextest test summary ==========
  704. 21.28 s > report: target/nextest/ci_gammaloop/junit.xml
  705. 21.28 s > tests: 0, failures: 0, errors: 0
  706. 21.28 s > No failing testcases found.
  707. 21.28 s > =========================================
  708. 21.28 s For full logs, run:
  709. 21.28 s nix log /nix/store/ajh0inglfjv92dj2wayik39a1nhpnyss-gammaloop-nextest-spenso.drv
  710. 21.37 s [0 built (1 failed), 0.0Run failed.