1. 0.70 s $ /nix/store/9ypz3flqsrl5xl495mm8h645gadjsxi1-coreutils-9.11/bin/timeout --kill-after=15s 7200s /nix/store/23zk8sgzamrbmj1fday15szf7f2279s8-nix-2.34.7/bin/nix --extra-experimental-features nix-command --extra-experimental-features flakes flake clone git+https://github.com/alphal00p/gammaloop --dest /tmp/nix-ci-worker/stable-pwd/repo/
  2. 0.71 s Cloning into '/tmp/nix-ci-worker/stable-pwd/repo'...
  3. 0.71 s remote: Enumerating objects: 65289, done.
  4. 0.82 s remote: Counting objects: 0% (1/7940) remote: Counting objects: 1% (80/7940) remote: Counting objects: 2% (159/7940) remote: Counting objects: 3% (239/7940) remote: Counting objects: 4% (318/7940) remote: Counting objects: 5% (397/7940) remote: Counting objects: 6% (477/7940) remote: Counting objects: 7% (556/7940) remote: Counting objects: 8% (636/7940) remote: Counting objects: 9% (715/7940) remote: Counting objects: 10% (794/7940) remote: Counting objects: 11% (874/7940) remote: Counting objects: 12% (953/7940) remote: Counting objects: 13% (1033/7940) remote: Counting objects: 14% (1112/7940) remote: Counting objects: 15% (1191/7940) remote: Counting objects: 16% (1271/7940) remote: Counting objects: 17% (1350/7940) remote: Counting objects: 18% (1430/7940) remote: Counting objects: 19% (1509/7940) remote: Counting objects: 20% (1588/7940) remote: Counting objects: 21% (1668/7940) remote: Counting objects: 22% (1747/7940) remote: Counting objects: 23% (1827/7940) remote: Counting objects: 24% (1906/7940) remote: Counting objects: 25% (1985/7940) remote: Counting objects: 26% (2065/7940) remote: Counting objects: 27% (2144/7940) remote: Counting objects: 28% (2224/7940) remote: Counting objects: 29% (2303/7940) remote: Counting objects: 30% (2382/7940) remote: Counting objects: 31% (2462/7940) remote: Counting objects: 32% (2541/7940) remote: Counting objects: 33% (2621/7940) remote: Counting objects: 34% (2700/7940) remote: Counting objects: 35% (2779/7940) remote: Counting objects: 36% (2859/7940) remote: Counting objects: 37% (2938/7940) remote: Counting objects: 38% (3018/7940) remote: Counting objects: 39% (3097/7940) remote: Counting objects: 40% (3176/7940) remote: Counting objects: 41% (3256/7940) remote: Counting objects: 42% (3335/7940) remote: Counting objects: 43% (3415/7940) remote: Counting objects: 44% (3494/7940) remote: Counting objects: 45% (3573/7940) remote: Counting objects: 46% (3653/7940) remote: Counting objects: 47% (3732/7940) remote: Counting objects: 48% (3812/7940) remote: Counting objects: 49% (3891/7940) remote: Counting objects: 50% (3970/7940) remote: Counting objects: 51% (4050/7940) remote: Counting objects: 52% (4129/7940) remote: Counting objects: 53% (4209/7940) remote: Counting objects: 54% (4288/7940) remote: Counting objects: 55% (4367/7940) remote: Counting objects: 56% (4447/7940) remote: Counting objects: 57% (4526/7940) remote: Counting objects: 58% (4606/7940) remote: Counting objects: 59% (4685/7940) remote: Counting objects: 60% (4764/7940) remote: Counting objects: 61% (4844/7940) remote: Counting objects: 62% (4923/7940) remote: Counting objects: 63% (5003/7940) remote: Counting objects: 64% (5082/7940) remote: Counting objects: 65% (5161/7940) remote: Counting objects: 66% (5241/7940) remote: Counting objects: 67% (5320/7940) remote: Counting objects: 68% (5400/7940) remote: Counting objects: 69% (5479/7940) remote: Counting objects: 70% (5558/7940) remote: Counting objects: 71% (5638/7940) remote: Counting objects: 72% (5717/7940) remote: Counting objects: 73% (5797/7940) remote: Counting objects: 74% (5876/7940) remote: Counting objects: 75% (5955/7940) remote: Counting objects: 76% (6035/7940) remote: Counting objects: 77% (6114/7940) remote: Counting objects: 78% (6194/7940) remote: Counting objects: 79% (6273/7940) remote: Counting objects: 80% (6352/7940) remote: Counting objects: 81% (6432/7940) remote: Counting objects: 82% (6511/7940) remote: Counting objects: 83% (6591/7940) remote: Counting objects: 84% (6670/7940) remote: Counting objects: 85% (6749/7940) remote: Counting objects: 86% (6829/7940) remote: Counting objects: 87% (6908/7940) remote: Counting objects: 88% (6988/7940) remote: Counting objects: 89% (7067/7940) remote: Counting objects: 90% (7146/7940) remote: Counting objects: 91% (7226/7940) remote: Counting objects: 92% (7305/7940) remote: Counting objects: 93% (7385/7940) remote: Counting objects: 94% (7464/7940) remote: Counting objects: 95% (7543/7940) remote: Counting objects: 96% (7623/7940) remote: Counting objects: 97% (7702/7940) remote: Counting objects: 98% (7782/7940) remote: Counting objects: 99% (7861/7940) remote: Counting objects: 100% (7940/7940) remote: Counting objects: 100% (7940/7940), done.
  5. 2.29 s remote: Compressing objects: 0% (1/1606) remote: Compressing objects: 1% (17/1606) remote: Compressing objects: 2% (33/1606) remote: Compressing objects: 3% (49/1606) remote: Compressing objects: 4% (65/1606) remote: Compressing objects: 5% (81/1606) remote: Compressing objects: 6% (97/1606) remote: Compressing objects: 7% (113/1606) remote: Compressing objects: 8% (129/1606) remote: Compressing objects: 9% (145/1606) remote: Compressing objects: 10% (161/1606) remote: Compressing objects: 11% (177/1606) remote: Compressing objects: 12% (193/1606) remote: Compressing objects: 13% (209/1606) remote: Compressing objects: 14% (225/1606) remote: Compressing objects: 15% (241/1606) remote: Compressing objects: 16% (257/1606) remote: Compressing objects: 16% (259/1606) remote: Compressing objects: 17% (274/1606) remote: Compressing objects: 18% (290/1606) remote: Compressing objects: 19% (306/1606) remote: Compressing objects: 20% (322/1606) remote: Compressing objects: 21% (338/1606) remote: Compressing objects: 22% (354/1606) remote: Compressing objects: 23% (370/1606) remote: Compressing objects: 24% (386/1606) remote: Compressing objects: 25% (402/1606) remote: Compressing objects: 26% (418/1606) remote: Compressing objects: 27% (434/1606) remote: Compressing objects: 28% (450/1606) remote: Compressing objects: 29% (466/1606) remote: Compressing objects: 30% (482/1606) remote: Compressing objects: 31% (498/1606) remote: Compressing objects: 32% (514/1606) remote: Compressing objects: 33% (530/1606) remote: Compressing objects: 34% (547/1606) remote: Compressing objects: 35% (563/1606) remote: Compressing objects: 36% (579/1606) remote: Compressing objects: 37% (595/1606) remote: Compressing objects: 38% (611/1606) remote: Compressing objects: 39% (627/1606) remote: Compressing objects: 40% (643/1606) remote: Compressing objects: 41% (659/1606) remote: Compressing objects: 42% (675/1606) remote: Compressing objects: 43% (691/1606) remote: Compressing objects: 44% (707/1606) remote: Compressing objects: 45% (723/1606) remote: Compressing objects: 46% (739/1606) remote: Compressing objects: 47% (755/1606) remote: Compressing objects: 48% (771/1606) remote: Compressing objects: 49% (787/1606) remote: Compressing objects: 50% (803/1606) remote: Compressing objects: 51% (820/1606) remote: Compressing objects: 52% (836/1606) remote: Compressing objects: 53% (852/1606) remote: Compressing objects: 54% (868/1606) remote: Compressing objects: 55% (884/1606) remote: Compressing objects: 56% (900/1606) remote: Compressing objects: 57% (916/1606) remote: Compressing objects: 58% (932/1606) remote: Compressing objects: 59% (948/1606) remote: Compressing objects: 60% (964/1606) remote: Compressing objects: 61% (980/1606) remote: Compressing objects: 62% (996/1606) remote: Compressing objects: 63% (1012/1606) remote: Compressing objects: 64% (1028/1606) remote: Compressing objects: 65% (1044/1606) remote: Compressing objects: 66% (1060/1606) remote: Compressing objects: 67% (1077/1606) remote: Compressing objects: 68% (1093/1606) remote: Compressing objects: 69% (1109/1606) remote: Compressing objects: 70% (1125/1606) remote: Compressing objects: 71% (1141/1606) remote: Compressing objects: 72% (1157/1606) remote: Compressing objects: 73% (1173/1606) remote: Compressing objects: 74% (1189/1606) remote: Compressing objects: 75% (1205/1606) remote: Compressing objects: 76% (1221/1606) remote: Compressing objects: 77% (1237/1606) remote: Compressing objects: 78% (1253/1606) remote: Compressing objects: 79% (1269/1606) remote: Compressing objects: 80% (1285/1606) remote: Compressing objects: 81% (1301/1606) remote: Compressing objects: 82% (1317/1606) remote: Compressing objects: 83% (1333/1606) remote: Compressing objects: 84% (1350/1606) remote: Compressing objects: 85% (1366/1606) remote: Compressing objects: 86% (1382/1606) remote: Compressing objects: 87% (1398/1606) remote: Compressing objects: 88% (1414/1606) remote: Compressing objects: 89% (1430/1606) remote: Compressing objects: 90% (1446/1606) remote: Compressing objects: 91% (1462/1606) remote: Compressing objects: 92% (1478/1606) remote: Compressing objects: 93% (1494/1606) remote: Compressing objects: 94% (1510/1606) remote: Compressing objects: 95% (1526/1606) remote: Compressing objects: 96% (1542/1606) remote: Compressing objects: 97% (1558/1606) remote: Compressing objects: 98% (1574/1606) remote: Compressing objects: 99% (1590/1606) remote: Compressing objects: 100% (1606/1606) remote: Compressing objects: 100% (1606/1606), done.
  6. 4.89 s Receiving objects: 0% (1/65289) Receiving objects: 1% (653/65289) Receiving objects: 2% (1306/65289) Receiving objects: 3% (1959/65289) Receiving objects: 4% (2612/65289) Receiving objects: 5% (3265/65289) Receiving objects: 6% (3918/65289) Receiving objects: 7% (4571/65289) Receiving objects: 8% (5224/65289) Receiving objects: 9% (5877/65289) Receiving objects: 10% (6529/65289) Receiving objects: 11% (7182/65289) Receiving objects: 12% (7835/65289), 16.15 MiB | 32.28 MiB/s Receiving objects: 13% (8488/65289), 16.15 MiB | 32.28 MiB/s Receiving objects: 14% (9141/65289), 16.15 MiB | 32.28 MiB/s Receiving objects: 15% (9794/65289), 16.15 MiB | 32.28 MiB/s Receiving objects: 16% (10447/65289), 16.15 MiB | 32.28 MiB/s Receiving objects: 17% (11100/65289), 16.15 MiB | 32.28 MiB/s Receiving objects: 18% (11753/65289), 16.15 MiB | 32.28 MiB/s Receiving objects: 19% (12405/65289), 16.15 MiB | 32.28 MiB/s Receiving objects: 20% (13058/65289), 16.15 MiB | 32.28 MiB/s Receiving objects: 21% (13711/65289), 16.15 MiB | 32.28 MiB/s Receiving objects: 22% (14364/65289), 16.15 MiB | 32.28 MiB/s Receiving objects: 23% (15017/65289), 16.15 MiB | 32.28 MiB/s Receiving objects: 24% (15670/65289), 16.15 MiB | 32.28 MiB/s Receiving objects: 25% (16323/65289), 16.15 MiB | 32.28 MiB/s Receiving objects: 26% (16976/65289), 16.15 MiB | 32.28 MiB/s Receiving objects: 27% (17629/65289), 16.15 MiB | 32.28 MiB/s Receiving objects: 28% (18281/65289), 16.15 MiB | 32.28 MiB/s Receiving objects: 29% (18934/65289), 16.15 MiB | 32.28 MiB/s Receiving objects: 30% (19587/65289), 16.15 MiB | 32.28 MiB/s Receiving objects: 31% (20240/65289), 16.15 MiB | 32.28 MiB/s Receiving objects: 32% (20893/65289), 16.15 MiB | 32.28 MiB/s Receiving objects: 33% (21546/65289), 16.15 MiB | 32.28 MiB/s Receiving objects: 34% (22199/65289), 16.15 MiB | 32.28 MiB/s Receiving objects: 35% (22852/65289), 16.15 MiB | 32.28 MiB/s Receiving objects: 36% (23505/65289), 16.15 MiB | 32.28 MiB/s Receiving objects: 37% (24157/65289), 16.15 MiB | 32.28 MiB/s Receiving objects: 38% (24810/65289), 16.15 MiB | 32.28 MiB/s Receiving objects: 39% (25463/65289), 16.15 MiB | 32.28 MiB/s Receiving objects: 40% (26116/65289), 16.15 MiB | 32.28 MiB/s Receiving objects: 41% (26769/65289), 16.15 MiB | 32.28 MiB/s Receiving objects: 42% (27422/65289), 16.15 MiB | 32.28 MiB/s Receiving objects: 43% (28075/65289), 16.15 MiB | 32.28 MiB/s Receiving objects: 44% (28728/65289), 16.15 MiB | 32.28 MiB/s Receiving objects: 45% (29381/65289), 16.15 MiB | 32.28 MiB/s Receiving objects: 46% (30033/65289), 16.15 MiB | 32.28 MiB/s Receiving objects: 47% (30686/65289), 16.15 MiB | 32.28 MiB/s Receiving objects: 48% (31339/65289), 16.15 MiB | 32.28 MiB/s Receiving objects: 49% (31992/65289), 16.15 MiB | 32.28 MiB/s Receiving objects: 50% (32645/65289), 16.15 MiB | 32.28 MiB/s Receiving objects: 51% (33298/65289), 16.15 MiB | 32.28 MiB/s Receiving objects: 52% (33951/65289), 16.15 MiB | 32.28 MiB/s Receiving objects: 52% (34502/65289), 33.07 MiB | 33.06 MiB/s Receiving objects: 53% (34604/65289), 33.07 MiB | 33.06 MiB/s Receiving objects: 54% (35257/65289), 33.07 MiB | 33.06 MiB/s Receiving objects: 55% (35909/65289), 33.07 MiB | 33.06 MiB/s Receiving objects: 56% (36562/65289), 33.07 MiB | 33.06 MiB/s Receiving objects: 57% (37215/65289), 33.07 MiB | 33.06 MiB/s Receiving objects: 58% (37868/65289), 33.07 MiB | 33.06 MiB/s Receiving objects: 59% (38521/65289), 33.07 MiB | 33.06 MiB/s Receiving objects: 60% (39174/65289), 33.07 MiB | 33.06 MiB/s Receiving objects: 61% (39827/65289), 33.07 MiB | 33.06 MiB/s Receiving objects: 62% (40480/65289), 33.07 MiB | 33.06 MiB/s Receiving objects: 63% (41133/65289), 33.07 MiB | 33.06 MiB/s Receiving objects: 64% (41785/65289), 33.07 MiB | 33.06 MiB/s Receiving objects: 65% (42438/65289), 33.07 MiB | 33.06 MiB/s Receiving objects: 66% (43091/65289), 50.83 MiB | 33.49 MiB/s Receiving objects: 67% (43744/65289), 50.83 MiB | 33.49 MiB/s Receiving objects: 68% (44397/65289), 50.83 MiB | 33.49 MiB/s Receiving objects: 69% (45050/65289), 50.83 MiB | 33.49 MiB/s Receiving objects: 70% (45703/65289), 50.83 MiB | 33.49 MiB/s Receiving objects: 71% (46356/65289), 50.83 MiB | 33.49 MiB/s Receiving objects: 72% (47009/65289), 50.83 MiB | 33.49 MiB/s Receiving objects: 73% (47661/65289), 50.83 MiB | 33.49 MiB/s Receiving objects: 74% (48314/65289), 50.83 MiB | 33.49 MiB/s Receiving objects: 75% (48967/65289), 50.83 MiB | 33.49 MiB/s Receiving objects: 75% (49108/65289), 50.83 MiB | 33.49 MiB/s Receiving objects: 76% (49620/65289), 68.02 MiB | 33.71 MiB/s Receiving objects: 77% (50273/65289), 68.02 MiB | 33.71 MiB/s Receiving objects: 78% (50926/65289), 68.02 MiB | 33.71 MiB/s Receiving objects: 79% (51579/65289), 68.02 MiB | 33.71 MiB/s Receiving objects: 80% (52232/65289), 68.02 MiB | 33.71 MiB/s Receiving objects: 81% (52885/65289), 68.02 MiB | 33.71 MiB/s Receiving objects: 82% (53537/65289), 68.02 MiB | 33.71 MiB/s Receiving objects: 83% (54190/65289), 68.02 MiB | 33.71 MiB/s Receiving objects: 84% (54843/65289), 68.02 MiB | 33.71 MiB/s Receiving objects: 85% (55496/65289), 68.02 MiB | 33.71 MiB/s Receiving objects: 86% (56149/65289), 68.02 MiB | 33.71 MiB/s Receiving objects: 87% (56802/65289), 68.02 MiB | 33.71 MiB/s Receiving objects: 88% (57455/65289), 68.02 MiB | 33.71 MiB/s Receiving objects: 89% (58108/65289), 68.02 MiB | 33.71 MiB/s Receiving objects: 90% (58761/65289), 68.02 MiB | 33.71 MiB/s Receiving objects: 91% (59413/65289), 68.02 MiB | 33.71 MiB/s Receiving objects: 92% (60066/65289), 68.02 MiB | 33.71 MiB/s Receiving objects: 93% (60719/65289), 68.02 MiB | 33.71 MiB/s Receiving objects: 94% (61372/65289), 68.02 MiB | 33.71 MiB/s Receiving objects: 95% (62025/65289), 68.02 MiB | 33.71 MiB/s Receiving objects: 96% (62678/65289), 85.06 MiB | 33.78 MiB/s Receiving objects: 97% (63331/65289), 85.06 MiB | 33.78 MiB/s Receiving objects: 98% (63984/65289), 85.06 MiB | 33.78 MiB/s Receiving objects: 99% (64637/65289), 85.06 MiB | 33.78 MiB/s remote: Total 65289 (delta 6881), reused 6422 (delta 6324), pack-reused 57349 (from 1)
  7. 4.89 s Receiving objects: 100% (65289/65289), 85.06 MiB | 33.78 MiB/s Receiving objects: 100% (65289/65289), 87.61 MiB | 33.79 MiB/s, done.
  8. 5.53 s Resolving deltas: 0% (0/45999) Resolving deltas: 1% (460/45999) Resolving deltas: 2% (920/45999) Resolving deltas: 3% (1380/45999) Resolving deltas: 4% (1840/45999) Resolving deltas: 5% (2300/45999) Resolving deltas: 6% (2760/45999) Resolving deltas: 7% (3220/45999) Resolving deltas: 8% (3683/45999) Resolving deltas: 9% (4143/45999) Resolving deltas: 10% (4604/45999) Resolving deltas: 11% (5060/45999) Resolving deltas: 12% (5521/45999) Resolving deltas: 13% (5980/45999) Resolving deltas: 14% (6440/45999) Resolving deltas: 15% (6900/45999) Resolving deltas: 16% (7360/45999) Resolving deltas: 17% (7820/45999) Resolving deltas: 18% (8280/45999) Resolving deltas: 19% (8741/45999) Resolving deltas: 20% (9200/45999) Resolving deltas: 21% (9660/45999) Resolving deltas: 22% (10120/45999) Resolving deltas: 23% (10581/45999) Resolving deltas: 24% (11040/45999) Resolving deltas: 25% (11500/45999) Resolving deltas: 26% (11960/45999) Resolving deltas: 27% (12420/45999) Resolving deltas: 28% (12880/45999) Resolving deltas: 29% (13340/45999) Resolving deltas: 30% (13800/45999) Resolving deltas: 31% (14260/45999) Resolving deltas: 32% (14720/45999) Resolving deltas: 33% (15180/45999) Resolving deltas: 34% (15640/45999) Resolving deltas: 35% (16100/45999) Resolving deltas: 36% (16560/45999) Resolving deltas: 37% (17020/45999) Resolving deltas: 38% (17480/45999) Resolving deltas: 39% (17941/45999) Resolving deltas: 40% (18400/45999) Resolving deltas: 41% (18860/45999) Resolving deltas: 42% (19320/45999) Resolving deltas: 43% (19780/45999) Resolving deltas: 44% (20240/45999) Resolving deltas: 45% (20700/45999) Resolving deltas: 46% (21162/45999) Resolving deltas: 47% (21621/45999) Resolving deltas: 48% (22080/45999) Resolving deltas: 49% (22540/45999) Resolving deltas: 50% (23000/45999) Resolving deltas: 51% (23460/45999) Resolving deltas: 52% (23920/45999) Resolving deltas: 53% (24380/45999) Resolving deltas: 54% (24840/45999) Resolving deltas: 55% (25300/45999) Resolving deltas: 56% (25760/45999) Resolving deltas: 57% (26220/45999) Resolving deltas: 58% (26682/45999) Resolving deltas: 59% (27140/45999) Resolving deltas: 60% (27601/45999) Resolving deltas: 61% (28060/45999) Resolving deltas: 62% (28520/45999) Resolving deltas: 63% (28980/45999) Resolving deltas: 64% (29440/45999) Resolving deltas: 65% (29900/45999) Resolving deltas: 66% (30360/45999) Resolving deltas: 67% (30820/45999) Resolving deltas: 68% (31280/45999) Resolving deltas: 69% (31740/45999) Resolving deltas: 70% (32200/45999) Resolving deltas: 71% (32660/45999) Resolving deltas: 72% (33120/45999) Resolving deltas: 73% (33580/45999) Resolving deltas: 74% (34040/45999) Resolving deltas: 75% (34500/45999) Resolving deltas: 76% (34960/45999) Resolving deltas: 77% (35420/45999) Resolving deltas: 78% (35880/45999) Resolving deltas: 79% (36340/45999) Resolving deltas: 80% (36801/45999) Resolving deltas: 81% (37260/45999) Resolving deltas: 82% (37720/45999) Resolving deltas: 83% (38180/45999) Resolving deltas: 84% (38640/45999) Resolving deltas: 85% (39100/45999) Resolving deltas: 86% (39560/45999) Resolving deltas: 87% (40020/45999) Resolving deltas: 88% (40480/45999) Resolving deltas: 89% (40940/45999) Resolving deltas: 90% (41400/45999) Resolving deltas: 91% (41861/45999) Resolving deltas: 92% (42320/45999) Resolving deltas: 93% (42780/45999) Resolving deltas: 94% (43241/45999) Resolving deltas: 95% (43700/45999) Resolving deltas: 96% (44160/45999) Resolving deltas: 97% (44620/45999) Resolving deltas: 98% (45080/45999) Resolving deltas: 99% (45540/45999) Resolving deltas: 100% (45999/45999) Resolving deltas: 100% (45999/45999), done.
  9. 5.83 s Fetching commit f59a0308f0232540279438aa697f28160f090069 for vakint_rustred ...
  10. 5.85 s $ /nix/store/bcnisk3ydfgv26v2gw3zlky24g00yww2-git-2.54.0/bin/git fetch origin f59a0308f0232540279438aa697f28160f090069
  11. 6.25 s From https://github.com/alphal00p/gammaloop
  12. 6.25 s * branch f59a0308f0232540279438aa697f28160f090069 -> FETCH_HEAD
  13. 6.26 s $ /nix/store/9ypz3flqsrl5xl495mm8h645gadjsxi1-coreutils-9.11/bin/timeout --kill-after=15s 7200s /nix/store/bcnisk3ydfgv26v2gw3zlky24g00yww2-git-2.54.0/bin/git -c advice.detachedHead=false checkout f59a0308f0232540279438aa697f28160f090069
  14. 6.42 s HEAD is now at f59a0308 Add offline MATAD oracle for K6 closure diagnostics
  15. 6.43 s $ /nix/store/9ypz3flqsrl5xl495mm8h645gadjsxi1-coreutils-9.11/bin/timeout --kill-after=15s 7200s /nix/store/23zk8sgzamrbmj1fday15szf7f2279s8-nix-2.34.7/bin/nix --extra-experimental-features nix-command --extra-experimental-features flakes --log-format internal-json run .#packages.x86_64-linux.nix-ci-check-gammaloop-nextest-spenso --print-build-logs
  16. 10.90 s
  17. 10.94 s Downloading cached gammaloop-nextest-binaries-spenso-idenso from https://cache.nix-ci.com
  18. 10.95 s Downloading cached gammaloop-nextest-binaries-spenso-spenso from https://cache.nix-ci.com
  19. 10.95 s Downloading cached gammaloop-nextest-binaries-spenso-spenso-hep-lib from https://cache.nix-ci.com
  20. 10.95 s Downloading cached gammaloop-nextest-binaries-spenso-spenso-macros from https://cache.nix-ci.com
  21. 10.95 s Downloading cached gammaloop-nextest-binaries-spenso-symbolica-utils from https://cache.nix-ci.com
  22. 11.12 s Downloaded cached gammaloop-nextest-binaries-spenso-symbolica-utils (6.3 MiB) in 166ms
  23. 11.12 s Progress: 0 of 1 built, 1 of 7 downloaded from cache (4 downloading)
  24. 11.13 s Downloaded cached gammaloop-nextest-binaries-spenso-spenso-macros (6.5 MiB) in 178ms
  25. 11.13 s Progress: 0 of 1 built, 2 of 7 downloaded from cache (3 downloading)
  26. 11.19 s Downloaded cached gammaloop-nextest-binaries-spenso-spenso (10.2 MiB) in 235ms
  27. 11.19 s Progress: 0 of 1 built, 3 of 7 downloaded from cache (2 downloading)
  28. 11.40 s Downloaded cached gammaloop-nextest-binaries-spenso-idenso (29.3 MiB) in 455ms
  29. 11.40 s Progress: 0 of 1 built, 4 of 7 downloaded from cache (1 downloading)
  30. 11.43 s Downloaded cached gammaloop-nextest-binaries-spenso-spenso-hep-lib (34 MiB) in 471ms
  31. 11.43 s Progress: 0 of 1 built, 5 of 7 downloaded from cache
  32. 11.43 s Downloading cached gammaloop-nextest-binaries-spenso from https://cache.nix-ci.com
  33. 11.43 s Downloaded cached gammaloop-nextest-binaries-spenso (1920 B) in 2ms
  34. 11.43 s Progress: 0 of 1 built, 6 of 7 downloaded from cache
  35. 11.43 s Downloading cached nix-ci-check-gammaloop-nextest-spenso from https://cache.nix-ci.com
  36. 11.43 s Downloaded cached nix-ci-check-gammaloop-nextest-spenso (1016 B) in 2ms
  37. 11.43 s Progress: 0 of 1 built, 7 of 7 downloaded from cache
  38. 16.26 s evaluating derivation 'g copying '/nix/store/irp0 evaluating derivation 'g copying '/nix/store/irp0 evaluating derivation 'g copying '/nix/store/irp0 evaluating derivation 'g querying gammaloop-nexte [0/1 built, 0.0 KiB DL] [1/0/1 built, 0.0 KiB DLgammaloop-nextest-spenso> Extracting 5 binaries and 2 linked paths to /build/nextest-archive-mVkCD3
  39. 16.42 s gammaloop-nextest-spenso> Extracted 19 files to /build/nextest-archive-mVkCD3 in 0.16s
  40. 16.43 s gammaloop-nextest-spenso> ------------
  41. 16.43 s gammaloop-nextest-spenso> Nextest run ID ae9495f6-6565-4f69-a252-cdc9fdded156 with nextest profile: ci_gammaloop
  42. 16.43 s gammaloop-nextest-spenso> Starting 224 tests across 5 binaries (26 tests skipped, including 2 tests via profile.ci_gammaloop.default-filter)
  43. 16.50 s gammaloop-nextest-spenso> FAIL [ 0.011s] ( 48/224) idenso color::test::form_reference::metric_contraction_respects_antisymmetric_normalization
  44. 16.50 s gammaloop-nextest-spenso> stdout ---
  45. 16.50 s gammaloop-nextest-spenso>
  46. 16.50 s gammaloop-nextest-spenso> running 1 test
  47. 16.50 s gammaloop-nextest-spenso> test color::test::form_reference::metric_contraction_respects_antisymmetric_normalization ... FAILED
  48. 16.50 s gammaloop-nextest-spenso>
  49. 16.50 s gammaloop-nextest-spenso> failures:
  50. 16.50 s gammaloop-nextest-spenso>
  51. 16.50 s gammaloop-nextest-spenso> failures:
  52. 16.50 s gammaloop-nextest-spenso> color::test::form_reference::metric_contraction_respects_antisymmetric_normalization
  53. 16.50 s gammaloop-nextest-spenso>
  54. 16.50 s gammaloop-nextest-spenso> test result: FAILED. 0 passed; 1 failed; 0 ignored; 0 measured; 240 filtered out; finished in 0.00s
  55. 16.50 s gammaloop-nextest-spenso>
  56. 16.50 s gammaloop-nextest-spenso> stderr ---
  57. 16.50 s gammaloop-nextest-spenso>
  58. 16.50 s gammaloop-nextest-spenso> thread 'color::test::form_reference::metric_contraction_respects_antisymmetric_normalization' (337) panicked at crates/idenso/src/color/test/form_reference.rs:171:5:
  59. 16.50 s gammaloop-nextest-spenso> assertion `left == right` failed
  60. 16.50 s gammaloop-nextest-spenso> left: "-1*f(coad(8,standalone_metric_j),coad(8,standalone_metric_s),coad(8,standalone_metric_u))"
  61. 16.50 s gammaloop-nextest-spenso> right: "f(coad(8,standalone_metric_j),coad(8,standalone_metric_s),coad(8,standalone_metric_u))"
  62. 16.50 s gammaloop-nextest-spenso> stack backtrace:
  63. 16.50 s gammaloop-nextest-spenso> 0: __rustc::rust_begin_unwind
  64. 16.50 s gammaloop-nextest-spenso> 1: core::panicking::panic_fmt
  65. 16.50 s gammaloop-nextest-spenso> 2: core::panicking::assert_failed_inner
  66. 16.50 s gammaloop-nextest-spenso> 3: core::panicking::assert_failed::<alloc::string::String, alloc::string::String>
  67. 16.50 s gammaloop-nextest-spenso> 4: idenso::color::test::form_reference::metric_contraction_respects_antisymmetric_normalization
  68. 16.50 s gammaloop-nextest-spenso> 5: <idenso::color::test::form_reference::metric_contraction_respects_antisymmetric_normalization::{closure#0} as core::ops::function::FnOnce<()>>::call_once
  69. 16.50 s gammaloop-nextest-spenso> note: Some details are omitted, run with `RUST_BACKTRACE=full` for a verbose backtrace.
  70. 16.50 s gammaloop-nextest-spenso>
  71. 16.71 s gammaloop-nextest-spenso> FAIL [ 0.036s] (220/224) idenso tensor::tests::parsing::infinite_execution
  72. 16.71 s gammaloop-nextest-spenso> stdout ---
  73. 16.71 s gammaloop-nextest-spenso>
  74. 16.71 s gammaloop-nextest-spenso> running 1 test
  75. 16.71 s gammaloop-nextest-spenso> ━━━━━━━━━━━━━━━━━━━━━━━━━━━━━━━ Snapshot Summary ━━━━━━━━━━━━━━━━━━━━━━━━━━━━━━━
  76. 16.71 s gammaloop-nextest-spenso> Snapshot: infinite_execution
  77. 16.71 s gammaloop-nextest-spenso> Source: crates/idenso/src/tensor/tests/parsing.rs:910
  78. 16.71 s gammaloop-nextest-spenso> ────────────────────────────────────────────────────────────────────────────────
  79. 16.71 s gammaloop-nextest-spenso> Expression: net_iter.snapshot_dot()
  80. 16.71 s gammaloop-nextest-spenso> ────────────────────────────────────────────────────────────────────────────────
  81. 16.71 s gammaloop-nextest-spenso> -old snapshot
  82. 16.71 s gammaloop-nextest-spenso> +new results
  83. 16.71 s gammaloop-nextest-spenso> ────────────┬───────────────────────────────────────────────────────────────────
  84. 16.71 s gammaloop-nextest-spenso> 8 8 │ 0:0:s -> ext0 [id=0 color="red"];
  85. 16.71 s gammaloop-nextest-spenso> 9 9 │ ext1 [style=invis];
  86. 16.71 s gammaloop-nextest-spenso> 10 10 │ 0:5:s -> ext1 [id=1 dir=none color="red" label="mink4|l_0"];
  87. 16.71 s gammaloop-nextest-spenso> 11 11 │ ext2 [style=invis];
  88. 16.71 s gammaloop-nextest-spenso> 12 │- 0:4:s -> ext2 [id=2 dir=none color="red" label="bis4|l_2"];
  89. 16.71 s gammaloop-nextest-spenso> 12 │+ 0:3:s -> ext2 [id=2 dir=none color="red" label="mink4|l_1"];
  90. 16.71 s gammaloop-nextest-spenso> 13 13 │ ext3 [style=invis];
  91. 16.71 s gammaloop-nextest-spenso> 14 │- 0:3:s -> ext3 [id=3 dir=none color="red" label="bis4|l_3"];
  92. 16.71 s gammaloop-nextest-spenso> 14 │+ 0:1:s -> ext3 [id=3 dir=none color="red" label="bis4|l_2"];
  93. 16.71 s gammaloop-nextest-spenso> 15 15 │ ext4 [style=invis];
  94. 16.71 s gammaloop-nextest-spenso> 16 │- 0:1:s -> ext4 [id=4 dir=none color="red" label="mink4|l_1"];
  95. 16.71 s gammaloop-nextest-spenso> 16 │+ 0:2:s -> ext4 [id=4 dir=none color="red" label="mink4|l_4"];
  96. 16.71 s gammaloop-nextest-spenso> 17 17 │ ext5 [style=invis];
  97. 16.71 s gammaloop-nextest-spenso> 18 │- 0:2:s -> ext5 [id=5 dir=none color="red" label="mink4|l_4"];
  98. 16.71 s gammaloop-nextest-spenso> 18 │+ 0:4:s -> ext5 [id=5 dir=none color="red" label="bis4|l_3"];
  99. 16.71 s gammaloop-nextest-spenso> 19 19 │ }
  100. 16.71 s gammaloop-nextest-spenso> ────────────┴───────────────────────────────────────────────────────────────────
  101. 16.71 s gammaloop-nextest-spenso> To update snapshots run `cargo insta review`
  102. 16.71 s gammaloop-nextest-spenso> Stopped on the first failure. Run `cargo insta test` to run all snapshots.
  103. 16.71 s gammaloop-nextest-spenso> test tensor::tests::parsing::infinite_execution ... FAILED
  104. 16.71 s gammaloop-nextest-spenso>
  105. 16.71 s gammaloop-nextest-spenso> failures:
  106. 16.71 s gammaloop-nextest-spenso>
  107. 16.71 s gammaloop-nextest-spenso> failures:
  108. 16.71 s gammaloop-nextest-spenso> tensor::tests::parsing::infinite_execution
  109. 16.71 s gammaloop-nextest-spenso>
  110. 16.71 s gammaloop-nextest-spenso> test result: FAILED. 0 passed; 1 failed; 0 ignored; 0 measured; 240 filtered out; finished in 0.03s
  111. 16.71 s gammaloop-nextest-spenso>
  112. 16.71 s gammaloop-nextest-spenso> stderr ---
  113. 16.71 s gammaloop-nextest-spenso>
  114. 16.71 s gammaloop-nextest-spenso> thread 'tensor::tests::parsing::infinite_execution' (841) panicked at /nix/store/hvwd4qqiaadc4s871lfyylxrciqrvlgs-vendor-cargo-deps/c19b7c6f923b580ac259164a89f2577984ad5ab09ee9d583b888f934adbbe8d0/insta-1.47.2/src/runtime.rs:719:13:
  115. 16.71 s gammaloop-nextest-spenso> snapshot assertion for 'infinite_execution' failed in line 910
  116. 16.71 s gammaloop-nextest-spenso> stack backtrace:
  117. 16.71 s gammaloop-nextest-spenso> 0: __rustc::rust_begin_unwind
  118. 16.71 s gammaloop-nextest-spenso> 1: core::panicking::panic_fmt
  119. 16.71 s gammaloop-nextest-spenso> 2: insta::runtime::assert_snapshot
  120. 16.71 s gammaloop-nextest-spenso> 3: idenso::tensor::tests::parsing::infinite_execution
  121. 16.71 s gammaloop-nextest-spenso> 4: <idenso::tensor::tests::parsing::infinite_execution::{closure#0} as core::ops::function::FnOnce<()>>::call_once
  122. 16.71 s gammaloop-nextest-spenso> note: Some details are omitted, run with `RUST_BACKTRACE=full` for a verbose backtrace.
  123. 16.71 s gammaloop-nextest-spenso>
  124. 17.98 s gammaloop-nextest-spenso> ------------
  125. 17.98 s gammaloop-nextest-spenso> Summary [ 1.555s] 224 tests run: 222 passed, 2 failed, 26 skipped
  126. 17.98 s gammaloop-nextest-spenso> FAIL [ 0.011s] ( 48/224) idenso color::test::form_reference::metric_contraction_respects_antisymmetric_normalization
  127. 17.98 s gammaloop-nextest-spenso> stdout ---
  128. 17.98 s gammaloop-nextest-spenso>
  129. 17.98 s gammaloop-nextest-spenso> running 1 test
  130. 17.98 s gammaloop-nextest-spenso> test color::test::form_reference::metric_contraction_respects_antisymmetric_normalization ... FAILED
  131. 17.98 s gammaloop-nextest-spenso>
  132. 17.98 s gammaloop-nextest-spenso> failures:
  133. 17.98 s gammaloop-nextest-spenso>
  134. 17.98 s gammaloop-nextest-spenso> failures:
  135. 17.98 s gammaloop-nextest-spenso> color::test::form_reference::metric_contraction_respects_antisymmetric_normalization
  136. 17.98 s gammaloop-nextest-spenso>
  137. 17.98 s gammaloop-nextest-spenso> test result: FAILED. 0 passed; 1 failed; 0 ignored; 0 measured; 240 filtered out; finished in 0.00s
  138. 17.98 s gammaloop-nextest-spenso>
  139. 17.98 s gammaloop-nextest-spenso> stderr ---
  140. 17.98 s gammaloop-nextest-spenso>
  141. 17.98 s gammaloop-nextest-spenso> thread 'color::test::form_reference::metric_contraction_respects_antisymmetric_normalization' (337) panicked at crates/idenso/src/color/test/form_reference.rs:171:5:
  142. 17.98 s gammaloop-nextest-spenso> assertion `left == right` failed
  143. 17.98 s gammaloop-nextest-spenso> left: "-1*f(coad(8,standalone_metric_j),coad(8,standalone_metric_s),coad(8,standalone_metric_u))"
  144. 17.98 s gammaloop-nextest-spenso> right: "f(coad(8,standalone_metric_j),coad(8,standalone_metric_s),coad(8,standalone_metric_u))"
  145. 17.98 s gammaloop-nextest-spenso> stack backtrace:
  146. 17.98 s gammaloop-nextest-spenso> 0: __rustc::rust_begin_unwind
  147. 17.98 s gammaloop-nextest-spenso> 1: core::panicking::panic_fmt
  148. 17.98 s gammaloop-nextest-spenso> 2: core::panicking::assert_failed_inner
  149. 17.98 s gammaloop-nextest-spenso> 3: core::panicking::assert_failed::<alloc::string::String, alloc::string::String>
  150. 17.98 s gammaloop-nextest-spenso> 4: idenso::color::test::form_reference::metric_contraction_respects_antisymmetric_normalization
  151. 17.98 s gammaloop-nextest-spenso> 5: <idenso::color::test::form_reference::metric_contraction_respects_antisymmetric_normalization::{closure#0} as core::ops::function::FnOnce<()>>::call_once
  152. 17.98 s gammaloop-nextest-spenso> note: Some details are omitted, run with `RUST_BACKTRACE=full` for a verbose backtrace.
  153. 17.98 s gammaloop-nextest-spenso>
  154. 17.98 s gammaloop-nextest-spenso> FAIL [ 0.036s] (220/224) idenso tensor::tests::parsing::infinite_execution
  155. 17.98 s gammaloop-nextest-spenso> stdout ---
  156. 17.98 s gammaloop-nextest-spenso>
  157. 17.98 s gammaloop-nextest-spenso> running 1 test
  158. 17.98 s gammaloop-nextest-spenso> ━━━━━━━━━━━━━━━━━━━━━━━━━━━━━━━ Snapshot Summary ━━━━━━━━━━━━━━━━━━━━━━━━━━━━━━━
  159. 17.98 s gammaloop-nextest-spenso> Snapshot: infinite_execution
  160. 17.98 s gammaloop-nextest-spenso> Source: crates/idenso/src/tensor/tests/parsing.rs:910
  161. 17.98 s gammaloop-nextest-spenso> ────────────────────────────────────────────────────────────────────────────────
  162. 17.98 s gammaloop-nextest-spenso> Expression: net_iter.snapshot_dot()
  163. 17.98 s gammaloop-nextest-spenso> ────────────────────────────────────────────────────────────────────────────────
  164. 17.98 s gammaloop-nextest-spenso> -old snapshot
  165. 17.98 s gammaloop-nextest-spenso> +new results
  166. 17.98 s gammaloop-nextest-spenso> ────────────┬───────────────────────────────────────────────────────────────────
  167. 17.98 s gammaloop-nextest-spenso> 8 8 │ 0:0:s -> ext0 [id=0 color="red"];
  168. 17.98 s gammaloop-nextest-spenso> 9 9 │ ext1 [style=invis];
  169. 17.98 s gammaloop-nextest-spenso> 10 10 │ 0:5:s -> ext1 [id=1 dir=none color="red" label="mink4|l_0"];
  170. 17.98 s gammaloop-nextest-spenso> 11 11 │ ext2 [style=invis];
  171. 17.98 s gammaloop-nextest-spenso> 12 │- 0:4:s -> ext2 [id=2 dir=none color="red" label="bis4|l_2"];
  172. 17.98 s gammaloop-nextest-spenso> 12 │+ 0:3:s -> ext2 [id=2 dir=none color="red" label="mink4|l_1"];
  173. 17.98 s gammaloop-nextest-spenso> 13 13 │ ext3 [style=invis];
  174. 17.98 s gammaloop-nextest-spenso> 14 │- 0:3:s -> ext3 [id=3 dir=none color="red" label="bis4|l_3"];
  175. 17.98 s gammaloop-nextest-spenso> 14 │+ 0:1:s -> ext3 [id=3 dir=none color="red" label="bis4|l_2"];
  176. 17.98 s gammaloop-nextest-spenso> 15 15 │ ext4 [style=invis];
  177. 17.98 s gammaloop-nextest-spenso> 16 │- 0:1:s -> ext4 [id=4 dir=none color="red" label="mink4|l_1"];
  178. 17.98 s gammaloop-nextest-spenso> 16 │+ 0:2:s -> ext4 [id=4 dir=none color="red" label="mink4|l_4"];
  179. 17.98 s gammaloop-nextest-spenso> 17 17 │ ext5 [style=invis];
  180. 17.98 s gammaloop-nextest-spenso> 18 │- 0:2:s -> ext5 [id=5 dir=none color="red" label="mink4|l_4"];
  181. 17.98 s gammaloop-nextest-spenso> 18 │+ 0:4:s -> ext5 [id=5 dir=none color="red" label="bis4|l_3"];
  182. 17.98 s gammaloop-nextest-spenso> 19 19 │ }
  183. 17.98 s gammaloop-nextest-spenso> ────────────┴───────────────────────────────────────────────────────────────────
  184. 17.98 s gammaloop-nextest-spenso> To update snapshots run `cargo insta review`
  185. 17.98 s gammaloop-nextest-spenso> Stopped on the first failure. Run `cargo insta test` to run all snapshots.
  186. 17.98 s gammaloop-nextest-spenso> test tensor::tests::parsing::infinite_execution ... FAILED
  187. 17.98 s gammaloop-nextest-spenso>
  188. 17.98 s gammaloop-nextest-spenso> failures:
  189. 17.98 s gammaloop-nextest-spenso>
  190. 17.98 s gammaloop-nextest-spenso> failures:
  191. 17.98 s gammaloop-nextest-spenso> tensor::tests::parsing::infinite_execution
  192. 17.98 s gammaloop-nextest-spenso>
  193. 17.98 s gammaloop-nextest-spenso> test result: FAILED. 0 passed; 1 failed; 0 ignored; 0 measured; 240 filtered out; finished in 0.03s
  194. 17.98 s gammaloop-nextest-spenso>
  195. 17.98 s gammaloop-nextest-spenso> stderr ---
  196. 17.98 s gammaloop-nextest-spenso>
  197. 17.98 s gammaloop-nextest-spenso> thread 'tensor::tests::parsing::infinite_execution' (841) panicked at /nix/store/hvwd4qqiaadc4s871lfyylxrciqrvlgs-vendor-cargo-deps/c19b7c6f923b580ac259164a89f2577984ad5ab09ee9d583b888f934adbbe8d0/insta-1.47.2/src/runtime.rs:719:13:
  198. 17.98 s gammaloop-nextest-spenso> snapshot assertion for 'infinite_execution' failed in line 910
  199. 17.98 s gammaloop-nextest-spenso> stack backtrace:
  200. 17.98 s gammaloop-nextest-spenso> 0: __rustc::rust_begin_unwind
  201. 17.98 s gammaloop-nextest-spenso> 1: core::panicking::panic_fmt
  202. 17.98 s gammaloop-nextest-spenso> 2: insta::runtime::assert_snapshot
  203. 17.98 s gammaloop-nextest-spenso> 3: idenso::tensor::tests::parsing::infinite_execution
  204. 17.98 s gammaloop-nextest-spenso> 4: <idenso::tensor::tests::parsing::infinite_execution::{closure#0} as core::ops::function::FnOnce<()>>::call_once
  205. 17.98 s gammaloop-nextest-spenso> note: Some details are omitted, run with `RUST_BACKTRACE=full` for a verbose backtrace.
  206. 17.98 s gammaloop-nextest-spenso>
  207. 18.01 s gammaloop-nextest-spenso> error: test run failed
  208. 18.03 s gammaloop-nextest-spenso>
  209. 18.03 s gammaloop-nextest-spenso> ========== nextest test summary ==========
  210. 18.03 s gammaloop-nextest-spenso> report: target/nextest/ci_gammaloop/junit.xml
  211. 18.03 s gammaloop-nextest-spenso> tests: 224, failures: 2, errors: 0
  212. 18.03 s gammaloop-nextest-spenso>
  213. 18.03 s gammaloop-nextest-spenso> 1. idenso::color::test::form_reference::metric_contraction_respects_antisymmetric_normalization
  214. 18.03 s gammaloop-nextest-spenso> failure: test failure with exit code 101
  215. 18.03 s gammaloop-nextest-spenso> thread 'color::test::form_reference::metric_contraction_respects_antisymmetric_normalization' (337) panicked at crates/idenso/src/color/test/form_reference.rs:171:5:
  216. 18.03 s gammaloop-nextest-spenso> assertion `left == right` failed
  217. 18.03 s gammaloop-nextest-spenso> left: "-1*f(coad(8,standalone_metric_j),coad(8,standalone_metric_s),coad(8,standalone_metric_u))"
  218. 18.03 s gammaloop-nextest-spenso> right: "f(coad(8,standalone_metric_j),coad(8,standalone_metric_s),coad(8,standalone_metric_u))"
  219. 18.03 s gammaloop-nextest-spenso> stack backtrace:
  220. 18.03 s gammaloop-nextest-spenso> 0: __rustc::rust_begin_unwind
  221. 18.03 s gammaloop-nextest-spenso> 1: core::panicking::panic_fmt
  222. 18.03 s gammaloop-nextest-spenso> 2: core::panicking::assert_failed_inner
  223. 18.03 s gammaloop-nextest-spenso> 3: core::panicking::assert_failed::<alloc::string::String, alloc::string::String>
  224. 18.03 s gammaloop-nextest-spenso> 4: idenso::color::test::form_reference::metric_contraction_respects_antisymmetric_normalization
  225. 18.03 s gammaloop-nextest-spenso> 5: <idenso::color::test::form_reference::metric_contraction_respects_antisymmetric_normalization::{closure#0} as core::ops::function::FnOnce<()>>::call_once
  226. 18.03 s gammaloop-nextest-spenso> note: Some details are omitted, run with `RUST_BACKTRACE=full` for a verbose backtrace.
  227. 18.03 s gammaloop-nextest-spenso> system-out
  228. 18.03 s gammaloop-nextest-spenso> running 1 test
  229. 18.03 s gammaloop-nextest-spenso> test color::test::form_reference::metric_contraction_respects_antisymmetric_normalization ... FAILED
  230. 18.03 s gammaloop-nextest-spenso>
  231. 18.03 s gammaloop-nextest-spenso> failures:
  232. 18.03 s gammaloop-nextest-spenso>
  233. 18.03 s gammaloop-nextest-spenso> failures:
  234. 18.03 s gammaloop-nextest-spenso> color::test::form_reference::metric_contraction_respects_antisymmetric_normalization
  235. 18.03 s gammaloop-nextest-spenso>
  236. 18.03 s gammaloop-nextest-spenso> test result: FAILED. 0 passed; 1 failed; 0 ignored; 0 measured; 240 filtered out; finished in 0.00s
  237. 18.03 s gammaloop-nextest-spenso> system-err
  238. 18.03 s gammaloop-nextest-spenso> thread 'color::test::form_reference::metric_contraction_respects_antisymmetric_normalization' (337) panicked at crates/idenso/src/color/test/form_reference.rs:171:5:
  239. 18.03 s gammaloop-nextest-spenso> assertion `left == right` failed
  240. 18.03 s gammaloop-nextest-spenso> left: "-1*f(coad(8,standalone_metric_j),coad(8,standalone_metric_s),coad(8,standalone_metric_u))"
  241. 18.03 s gammaloop-nextest-spenso> right: "f(coad(8,standalone_metric_j),coad(8,standalone_metric_s),coad(8,standalone_metric_u))"
  242. 18.03 s gammaloop-nextest-spenso> stack backtrace:
  243. 18.03 s gammaloop-nextest-spenso> 0: __rustc::rust_begin_unwind
  244. 18.03 s gammaloop-nextest-spenso> 1: core::panicking::panic_fmt
  245. 18.03 s gammaloop-nextest-spenso> 2: core::panicking::assert_failed_inner
  246. 18.03 s gammaloop-nextest-spenso> 3: core::panicking::assert_failed::<alloc::string::String, alloc::string::String>
  247. 18.03 s gammaloop-nextest-spenso> 4: idenso::color::test::form_reference::metric_contraction_respects_antisymmetric_normalization
  248. 18.03 s gammaloop-nextest-spenso> 5: <idenso::color::test::form_reference::metric_contraction_respects_antisymmetric_normalization::{closure#0} as core::ops::function::FnOnce<()>>::call_once
  249. 18.03 s gammaloop-nextest-spenso> note: Some details are omitted, run with `RUST_BACKTRACE=full` for a verbose backtrace.
  250. 18.03 s gammaloop-nextest-spenso>
  251. 18.03 s gammaloop-nextest-spenso> 2. idenso::tensor::tests::parsing::infinite_execution
  252. 18.03 s gammaloop-nextest-spenso> failure: test failure with exit code 101
  253. 18.03 s gammaloop-nextest-spenso> thread 'tensor::tests::parsing::infinite_execution' (841) panicked at /nix/store/hvwd4qqiaadc4s871lfyylxrciqrvlgs-vendor-cargo-deps/c19b7c6f923b580ac259164a89f2577984ad5ab09ee9d583b888f934adbbe8d0/insta-1.47.2/src/runtime.rs:719:13:
  254. 18.03 s gammaloop-nextest-spenso> snapshot assertion for 'infinite_execution' failed in line 910
  255. 18.03 s gammaloop-nextest-spenso> stack backtrace:
  256. 18.03 s gammaloop-nextest-spenso> 0: __rustc::rust_begin_unwind
  257. 18.03 s gammaloop-nextest-spenso> 1: core::panicking::panic_fmt
  258. 18.03 s gammaloop-nextest-spenso> 2: insta::runtime::assert_snapshot
  259. 18.03 s gammaloop-nextest-spenso> 3: idenso::tensor::tests::parsing::infinite_execution
  260. 18.03 s gammaloop-nextest-spenso> 4: <idenso::tensor::tests::parsing::infinite_execution::{closure#0} as core::ops::function::FnOnce<()>>::call_once
  261. 18.03 s gammaloop-nextest-spenso> note: Some details are omitted, run with `RUST_BACKTRACE=full` for a verbose backtrace.
  262. 18.03 s gammaloop-nextest-spenso> system-out
  263. 18.03 s gammaloop-nextest-spenso> running 1 test
  264. 18.03 s gammaloop-nextest-spenso> ━━━━━━━━━━━━━━━━━━━━━━━━━━━━━━━ Snapshot Summary ━━━━━━━━━━━━━━━━━━━━━━━━━━━━━━━
  265. 18.03 s gammaloop-nextest-spenso> Snapshot: infinite_execution
  266. 18.03 s gammaloop-nextest-spenso> Source: crates/idenso/src/tensor/tests/parsing.rs:910
  267. 18.03 s gammaloop-nextest-spenso> ────────────────────────────────────────────────────────────────────────────────
  268. 18.03 s gammaloop-nextest-spenso> Expression: net_iter.snapshot_dot()
  269. 18.03 s gammaloop-nextest-spenso> ────────────────────────────────────────────────────────────────────────────────
  270. 18.03 s gammaloop-nextest-spenso> -old snapshot
  271. 18.03 s gammaloop-nextest-spenso> +new results
  272. 18.03 s gammaloop-nextest-spenso> ────────────┬───────────────────────────────────────────────────────────────────
  273. 18.03 s gammaloop-nextest-spenso> 8 8 │ 0:0:s-> ext0 [id=0 color="red"];
  274. 18.03 s gammaloop-nextest-spenso> 9 9 │ ext1 [style=invis];
  275. 18.03 s gammaloop-nextest-spenso> 10 10 │ 0:5:s-> ext1 [id=1 dir=none color="red" label="mink4|l_0"];
  276. 18.03 s gammaloop-nextest-spenso> 11 11 │ ext2 [style=invis];
  277. 18.03 s gammaloop-nextest-spenso> 12 │- 0:4:s-> ext2 [id=2 dir=none color="red" label="bis4|l_2"];
  278. 18.03 s gammaloop-nextest-spenso> 12 │+ 0:3:s-> ext2 [id=2 dir=none color="red" label="mink4|l_1"];
  279. 18.03 s gammaloop-nextest-spenso> 13 13 │ ext3 [style=invis];
  280. 18.03 s gammaloop-nextest-spenso> 14 │- 0:3:s-> ext3 [id=3 dir=none color="red" label="bis4|l_3"];
  281. 18.03 s gammaloop-nextest-spenso> 14 │+ 0:1:s-> ext3 [id=3 dir=none color="red" label="bis4|l_2"];
  282. 18.03 s gammaloop-nextest-spenso> 15 15 │ ext4 [style=invis];
  283. 18.03 s gammaloop-nextest-spenso> 16 │- 0:1:s-> ext4 [id=4 dir=none color="red" label="mink4|l_1"];
  284. 18.03 s gammaloop-nextest-spenso> 16 │+ 0:2:s-> ext4 [id=4 dir=none color="red" label="mink4|l_4"];
  285. 18.03 s gammaloop-nextest-spenso> 17 17 │ ext5 [style=invis];
  286. 18.03 s gammaloop-nextest-spenso> 18 │- 0:2:s-> ext5 [id=5 dir=none color="red" label="mink4|l_4"];
  287. 18.03 s gammaloop-nextest-spenso> 18 │+ 0:4:s-> ext5 [id=5 dir=none color="red" label="bis4|l_3"];
  288. 18.03 s gammaloop-nextest-spenso> 19 19 │ }
  289. 18.03 s gammaloop-nextest-spenso> ────────────┴───────────────────────────────────────────────────────────────────
  290. 18.03 s gammaloop-nextest-spenso> To update snapshots run `cargo insta review`
  291. 18.03 s gammaloop-nextest-spenso> Stopped on the first failure. Run `cargo insta test` to run all snapshots.
  292. 18.03 s gammaloop-nextest-spenso> test tensor::tests::parsing::infinite_execution ... FAILED
  293. 18.03 s gammaloop-nextest-spenso>
  294. 18.03 s gammaloop-nextest-spenso> failures:
  295. 18.03 s gammaloop-nextest-spenso>
  296. 18.03 s gammaloop-nextest-spenso> failures:
  297. 18.03 s gammaloop-nextest-spenso> tensor::tests::parsing::infinite_execution
  298. 18.03 s gammaloop-nextest-spenso>
  299. 18.03 s gammaloop-nextest-spenso> test result: FAILED. 0 passed; 1 failed; 0 ignored; 0 measured; 240 filtered out; finished in 0.03s
  300. 18.03 s gammaloop-nextest-spenso> system-err
  301. 18.03 s gammaloop-nextest-spenso> thread 'tensor::tests::parsing::infinite_execution' (841) panicked at /nix/store/hvwd4qqiaadc4s871lfyylxrciqrvlgs-vendor-cargo-deps/c19b7c6f923b580ac259164a89f2577984ad5ab09ee9d583b888f934adbbe8d0/insta-1.47.2/src/runtime.rs:719:13:
  302. 18.03 s gammaloop-nextest-spenso> snapshot assertion for 'infinite_execution' failed in line 910
  303. 18.03 s gammaloop-nextest-spenso> stack backtrace:
  304. 18.03 s gammaloop-nextest-spenso> 0: __rustc::rust_begin_unwind
  305. 18.03 s gammaloop-nextest-spenso> 1: core::panicking::panic_fmt
  306. 18.03 s gammaloop-nextest-spenso> 2: insta::runtime::assert_snapshot
  307. 18.03 s gammaloop-nextest-spenso> 3: idenso::tensor::tests::parsing::infinite_execution
  308. 18.03 s gammaloop-nextest-spenso> 4: <idenso::tensor::tests::parsing::infinite_execution::{closure#0} as core::ops::function::FnOnce<()>>::call_once
  309. 18.03 s gammaloop-nextest-spenso> note: Some details are omitted, run with `RUST_BACKTRACE=full` for a verbose backtrace.
  310. 18.03 s gammaloop-nextest-spenso> =========================================
  311. 18.04 s gammaloop-nextest-spenso> Extracting 2 binaries and 1 linked path to /build/nextest-archive-Nr3G4G
  312. 18.11 s gammaloop-nextest-spenso> Extracted 8 files to /build/nextest-archive-Nr3G4G in 0.07s
  313. 18.12 s gammaloop-nextest-spenso> ------------
  314. 18.12 s gammaloop-nextest-spenso> Nextest run ID 32b537be-3bde-4de0-b2df-7fc5f5940fdd with nextest profile: ci_gammaloop
  315. 18.12 s gammaloop-nextest-spenso> Starting 135 tests across 2 binaries
  316. 18.19 s gammaloop-nextest-spenso> ------------
  317. 18.19 s gammaloop-nextest-spenso> Summary [ 0.074s] 135 tests run: 135 passed, 0 skipped
  318. 18.23 s gammaloop-nextest-spenso>
  319. 18.23 s gammaloop-nextest-spenso> ========== nextest test summary ==========
  320. 18.23 s gammaloop-nextest-spenso> report: target/nextest/ci_gammaloop/junit.xml
  321. 18.23 s gammaloop-nextest-spenso> tests: 135, failures: 0, errors: 0
  322. 18.23 s gammaloop-nextest-spenso> No failing testcases found.
  323. 18.23 s gammaloop-nextest-spenso> =========================================
  324. 18.24 s gammaloop-nextest-spenso> Extracting 5 binaries and 2 linked paths to /build/nextest-archive-OfYzTa
  325. 18.43 s gammaloop-nextest-spenso> Extracted 19 files to /build/nextest-archive-OfYzTa in 0.19s
  326. 18.44 s gammaloop-nextest-spenso> ------------
  327. 18.44 s gammaloop-nextest-spenso> Nextest run ID 151bfc6f-b2cc-4f30-a6ad-f86b66ff66e8 with nextest profile: ci_gammaloop
  328. 18.44 s gammaloop-nextest-spenso> Starting 25 tests across 5 binaries (1 test skipped via profile.ci_gammaloop.default-filter)
  329. 18.63 s gammaloop-nextest-spenso> ------------
  330. 18.63 s gammaloop-nextest-spenso> Summary [ 0.188s] 25 tests run: 25 passed, 1 skipped
  331. 18.68 s gammaloop-nextest-spenso>
  332. 18.68 s gammaloop-nextest-spenso> ========== nextest test summary ==========
  333. 18.68 s gammaloop-nextest-spenso> report: target/nextest/ci_gammaloop/junit.xml
  334. 18.68 s gammaloop-nextest-spenso> tests: 25, failures: 0, errors: 0
  335. 18.68 s gammaloop-nextest-spenso> No failing testcases found.
  336. 18.68 s gammaloop-nextest-spenso> =========================================
  337. 18.69 s gammaloop-nextest-spenso> Extracting 2 binaries and 1 linked path to /build/nextest-archive-zIEIMw
  338. 18.74 s gammaloop-nextest-spenso> Extracted 8 files to /build/nextest-archive-zIEIMw in 0.05s
  339. 18.75 s gammaloop-nextest-spenso> ------------
  340. 18.75 s gammaloop-nextest-spenso> Nextest run ID ab1c83f0-8a5a-418c-bb8d-b6f64abbb3d6 with nextest profile: ci_gammaloop
  341. 18.75 s gammaloop-nextest-spenso> Starting 1 test across 2 binaries
  342. 18.75 s gammaloop-nextest-spenso> ------------
  343. 18.75 s gammaloop-nextest-spenso> Summary [ 0.005s] 1 test run: 1 passed, 0 skipped
  344. 18.79 s gammaloop-nextest-spenso>
  345. 18.79 s gammaloop-nextest-spenso> ========== nextest test summary ==========
  346. 18.79 s gammaloop-nextest-spenso> report: target/nextest/ci_gammaloop/junit.xml
  347. 18.79 s gammaloop-nextest-spenso> tests: 1, failures: 0, errors: 0
  348. 18.79 s gammaloop-nextest-spenso> No failing testcases found.
  349. 18.79 s gammaloop-nextest-spenso> =========================================
  350. 18.80 s gammaloop-nextest-spenso> Extracting 1 binary and 1 linked path to /build/nextest-archive-BTs2v3
  351. 18.85 s gammaloop-nextest-spenso> Extracted 7 files to /build/nextest-archive-BTs2v3 in 0.05s
  352. 18.86 s gammaloop-nextest-spenso> ------------
  353. 18.86 s gammaloop-nextest-spenso> Nextest run ID e15d2b48-ea0b-4d2a-8c0b-59857bab6182 with nextest profile: ci_gammaloop
  354. 18.86 s gammaloop-nextest-spenso> Starting 0 tests across 1 binary
  355. 18.86 s gammaloop-nextest-spenso> ------------
  356. 18.86 s gammaloop-nextest-spenso> Summary [ 0.000s] 0 tests run: 0 passed, 0 skipped
  357. 18.89 s gammaloop-nextest-spenso>
  358. 18.89 s gammaloop-nextest-spenso> ========== nextest test summary ==========
  359. 18.89 s gammaloop-nextest-spenso> report: target/nextest/ci_gammaloop/junit.xml
  360. 18.89 s gammaloop-nextest-spenso> tests: 0, failures: 0, errors: 0
  361. 18.89 s gammaloop-nextest-spenso> No failing testcases found.
  362. 18.89 s gammaloop-nextest-spenso> =========================================
  363. 18.92 s error: Cannot build '/nix/store/ajh0inglfjv92dj2wayik39a1nhpnyss-gammaloop-nextest-spenso.drv'.
  364. 18.92 s Reason: builder failed with exit code 100.
  365. 18.92 s Output paths:
  366. 18.92 s /nix/store/72a4m9x9qi6rgavfi53ygk515kxybbbl-gammaloop-nextest-spenso
  367. 18.92 s Last 325 log lines:
  368. 18.92 s > Extracting 5 binaries and 2 linked paths to /build/nextest-archive-mVkCD3
  369. 18.92 s > Extracted 19 files to /build/nextest-archive-mVkCD3 in 0.16s
  370. 18.92 s > ------------
  371. 18.92 s > Nextest run ID ae9495f6-6565-4f69-a252-cdc9fdded156 with nextest profile: ci_gammaloop
  372. 18.92 s > Starting 224 tests across 5 binaries (26 tests skipped, including 2 tests via profile.ci_gammaloop.default-filter)
  373. 18.92 s > FAIL [ 0.011s] ( 48/224) idenso color::test::form_reference::metric_contraction_respects_antisymmetric_normalization
  374. 18.92 s > stdout ---
  375. 18.92 s >
  376. 18.92 s > running 1 test
  377. 18.92 s > test color::test::form_reference::metric_contraction_respects_antisymmetric_normalization ... FAILED
  378. 18.92 s >
  379. 18.92 s > failures:
  380. 18.92 s >
  381. 18.92 s > failures:
  382. 18.92 s > color::test::form_reference::metric_contraction_respects_antisymmetric_normalization
  383. 18.92 s >
  384. 18.92 s > test result: FAILED. 0 passed; 1 failed; 0 ignored; 0 measured; 240 filtered out; finished in 0.00s
  385. 18.92 s >
  386. 18.92 s > stderr ---
  387. 18.92 s >
  388. 18.92 s > thread 'color::test::form_reference::metric_contraction_respects_antisymmetric_normalization' (337) panicked at crates/idenso/src/color/test/form_reference.rs:171:5:
  389. 18.92 s > assertion `left == right` failed
  390. 18.92 s > left: "-1*f(coad(8,standalone_metric_j),coad(8,standalone_metric_s),coad(8,standalone_metric_u))"
  391. 18.92 s > right: "f(coad(8,standalone_metric_j),coad(8,standalone_metric_s),coad(8,standalone_metric_u))"
  392. 18.92 s > stack backtrace:
  393. 18.92 s > 0: __rustc::rust_begin_unwind
  394. 18.92 s > 1: core::panicking::panic_fmt
  395. 18.92 s > 2: core::panicking::assert_failed_inner
  396. 18.92 s > 3: core::panicking::assert_failed::<alloc::string::String, alloc::string::String>
  397. 18.92 s > 4: idenso::color::test::form_reference::metric_contraction_respects_antisymmetric_normalization
  398. 18.92 s > 5: <idenso::color::test::form_reference::metric_contraction_respects_antisymmetric_normalization::{closure#0} as core::ops::function::FnOnce<()>>::call_once
  399. 18.92 s > note: Some details are omitted, run with `RUST_BACKTRACE=full` for a verbose backtrace.
  400. 18.92 s >
  401. 18.92 s > FAIL [ 0.036s] (220/224) idenso tensor::tests::parsing::infinite_execution
  402. 18.92 s > stdout ---
  403. 18.92 s >
  404. 18.92 s > running 1 test
  405. 18.92 s > ━━━━━━━━━━━━━━━━━━━━━━━━━━━━━━━ Snapshot Summary ━━━━━━━━━━━━━━━━━━━━━━━━━━━━━━━
  406. 18.92 s > Snapshot: infinite_execution
  407. 18.92 s > Source: crates/idenso/src/tensor/tests/parsing.rs:910
  408. 18.92 s > ────────────────────────────────────────────────────────────────────────────────
  409. 18.92 s > Expression: net_iter.snapshot_dot()
  410. 18.92 s > ────────────────────────────────────────────────────────────────────────────────
  411. 18.92 s > -old snapshot
  412. 18.92 s > +new results
  413. 18.92 s > ────────────┬───────────────────────────────────────────────────────────────────
  414. 18.92 s > 8 8 │ 0:0:s -> ext0 [id=0 color="red"];
  415. 18.92 s > 9 9 │ ext1 [style=invis];
  416. 18.92 s > 10 10 │ 0:5:s -> ext1 [id=1 dir=none color="red" label="mink4|l_0"];
  417. 18.92 s > 11 11 │ ext2 [style=invis];
  418. 18.92 s > 12 │- 0:4:s -> ext2 [id=2 dir=none color="red" label="bis4|l_2"];
  419. 18.92 s > 12 │+ 0:3:s -> ext2 [id=2 dir=none color="red" label="mink4|l_1"];
  420. 18.92 s > 13 13 │ ext3 [style=invis];
  421. 18.92 s > 14 │- 0:3:s -> ext3 [id=3 dir=none color="red" label="bis4|l_3"];
  422. 18.92 s > 14 │+ 0:1:s -> ext3 [id=3 dir=none color="red" label="bis4|l_2"];
  423. 18.92 s > 15 15 │ ext4 [style=invis];
  424. 18.92 s > 16 │- 0:1:s -> ext4 [id=4 dir=none color="red" label="mink4|l_1"];
  425. 18.92 s > 16 │+ 0:2:s -> ext4 [id=4 dir=none color="red" label="mink4|l_4"];
  426. 18.92 s > 17 17 │ ext5 [style=invis];
  427. 18.92 s > 18 │- 0:2:s -> ext5 [id=5 dir=none color="red" label="mink4|l_4"];
  428. 18.92 s > 18 │+ 0:4:s -> ext5 [id=5 dir=none color="red" label="bis4|l_3"];
  429. 18.92 s > 19 19 │ }
  430. 18.92 s > ────────────┴───────────────────────────────────────────────────────────────────
  431. 18.92 s > To update snapshots run `cargo insta review`
  432. 18.92 s > Stopped on the first failure. Run `cargo insta test` to run all snapshots.
  433. 18.92 s > test tensor::tests::parsing::infinite_execution ... FAILED
  434. 18.92 s >
  435. 18.92 s > failures:
  436. 18.92 s >
  437. 18.92 s > failures:
  438. 18.92 s > tensor::tests::parsing::infinite_execution
  439. 18.92 s >
  440. 18.92 s > test result: FAILED. 0 passed; 1 failed; 0 ignored; 0 measured; 240 filtered out; finished in 0.03s
  441. 18.92 s >
  442. 18.92 s > stderr ---
  443. 18.92 s >
  444. 18.92 s > thread 'tensor::tests::parsing::infinite_execution' (841) panicked at /nix/store/hvwd4qqiaadc4s871lfyylxrciqrvlgs-vendor-cargo-deps/c19b7c6f923b580ac259164a89f2577984ad5ab09ee9d583b888f934adbbe8d0/insta-1.47.2/src/runtime.rs:719:13:
  445. 18.92 s > snapshot assertion for 'infinite_execution' failed in line 910
  446. 18.92 s > stack backtrace:
  447. 18.92 s > 0: __rustc::rust_begin_unwind
  448. 18.92 s > 1: core::panicking::panic_fmt
  449. 18.92 s > 2: insta::runtime::assert_snapshot
  450. 18.92 s > 3: idenso::tensor::tests::parsing::infinite_execution
  451. 18.92 s > 4: <idenso::tensor::tests::parsing::infinite_execution::{closure#0} as core::ops::function::FnOnce<()>>::call_once
  452. 18.92 s > note: Some details are omitted, run with `RUST_BACKTRACE=full` for a verbose backtrace.
  453. 18.92 s >
  454. 18.92 s > ------------
  455. 18.92 s > Summary [ 1.555s] 224 tests run: 222 passed, 2 failed, 26 skipped
  456. 18.92 s > FAIL [ 0.011s] ( 48/224) idenso color::test::form_reference::metric_contraction_respects_antisymmetric_normalization
  457. 18.92 s > stdout ---
  458. 18.92 s >
  459. 18.92 s > running 1 test
  460. 18.92 s > test color::test::form_reference::metric_contraction_respects_antisymmetric_normalization ... FAILED
  461. 18.92 s >
  462. 18.92 s > failures:
  463. 18.92 s >
  464. 18.92 s > failures:
  465. 18.92 s > color::test::form_reference::metric_contraction_respects_antisymmetric_normalization
  466. 18.92 s >
  467. 18.92 s > test result: FAILED. 0 passed; 1 failed; 0 ignored; 0 measured; 240 filtered out; finished in 0.00s
  468. 18.92 s >
  469. 18.92 s > stderr ---
  470. 18.92 s >
  471. 18.92 s > thread 'color::test::form_reference::metric_contraction_respects_antisymmetric_normalization' (337) panicked at crates/idenso/src/color/test/form_reference.rs:171:5:
  472. 18.92 s > assertion `left == right` failed
  473. 18.92 s > left: "-1*f(coad(8,standalone_metric_j),coad(8,standalone_metric_s),coad(8,standalone_metric_u))"
  474. 18.92 s > right: "f(coad(8,standalone_metric_j),coad(8,standalone_metric_s),coad(8,standalone_metric_u))"
  475. 18.92 s > stack backtrace:
  476. 18.92 s > 0: __rustc::rust_begin_unwind
  477. 18.92 s > 1: core::panicking::panic_fmt
  478. 18.92 s > 2: core::panicking::assert_failed_inner
  479. 18.92 s > 3: core::panicking::assert_failed::<alloc::string::String, alloc::string::String>
  480. 18.92 s > 4: idenso::color::test::form_reference::metric_contraction_respects_antisymmetric_normalization
  481. 18.92 s > 5: <idenso::color::test::form_reference::metric_contraction_respects_antisymmetric_normalization::{closure#0} as core::ops::function::FnOnce<()>>::call_once
  482. 18.92 s > note: Some details are omitted, run with `RUST_BACKTRACE=full` for a verbose backtrace.
  483. 18.92 s >
  484. 18.92 s > FAIL [ 0.036s] (220/224) idenso tensor::tests::parsing::infinite_execution
  485. 18.92 s > stdout ---
  486. 18.92 s >
  487. 18.92 s > running 1 test
  488. 18.92 s > ━━━━━━━━━━━━━━━━━━━━━━━━━━━━━━━ Snapshot Summary ━━━━━━━━━━━━━━━━━━━━━━━━━━━━━━━
  489. 18.92 s > Snapshot: infinite_execution
  490. 18.92 s > Source: crates/idenso/src/tensor/tests/parsing.rs:910
  491. 18.92 s > ────────────────────────────────────────────────────────────────────────────────
  492. 18.92 s > Expression: net_iter.snapshot_dot()
  493. 18.92 s > ────────────────────────────────────────────────────────────────────────────────
  494. 18.92 s > -old snapshot
  495. 18.92 s > +new results
  496. 18.92 s > ────────────┬───────────────────────────────────────────────────────────────────
  497. 18.92 s > 8 8 │ 0:0:s -> ext0 [id=0 color="red"];
  498. 18.92 s > 9 9 │ ext1 [style=invis];
  499. 18.92 s > 10 10 │ 0:5:s -> ext1 [id=1 dir=none color="red" label="mink4|l_0"];
  500. 18.92 s > 11 11 │ ext2 [style=invis];
  501. 18.92 s > 12 │- 0:4:s -> ext2 [id=2 dir=none color="red" label="bis4|l_2"];
  502. 18.92 s > 12 │+ 0:3:s -> ext2 [id=2 dir=none color="red" label="mink4|l_1"];
  503. 18.92 s > 13 13 │ ext3 [style=invis];
  504. 18.92 s > 14 │- 0:3:s -> ext3 [id=3 dir=none color="red" label="bis4|l_3"];
  505. 18.92 s > 14 │+ 0:1:s -> ext3 [id=3 dir=none color="red" label="bis4|l_2"];
  506. 18.92 s > 15 15 │ ext4 [style=invis];
  507. 18.92 s > 16 │- 0:1:s -> ext4 [id=4 dir=none color="red" label="mink4|l_1"];
  508. 18.92 s > 16 │+ 0:2:s -> ext4 [id=4 dir=none color="red" label="mink4|l_4"];
  509. 18.92 s > 17 17 │ ext5 [style=invis];
  510. 18.92 s > 18 │- 0:2:s -> ext5 [id=5 dir=none color="red" label="mink4|l_4"];
  511. 18.92 s > 18 │+ 0:4:s -> ext5 [id=5 dir=none color="red" label="bis4|l_3"];
  512. 18.92 s > 19 19 │ }
  513. 18.92 s > ────────────┴───────────────────────────────────────────────────────────────────
  514. 18.92 s > To update snapshots run `cargo insta review`
  515. 18.92 s > Stopped on the first failure. Run `cargo insta test` to run all snapshots.
  516. 18.92 s > test tensor::tests::parsing::infinite_execution ... FAILED
  517. 18.92 s >
  518. 18.92 s > failures:
  519. 18.92 s >
  520. 18.92 s > failures:
  521. 18.92 s > tensor::tests::parsing::infinite_execution
  522. 18.92 s >
  523. 18.92 s > test result: FAILED. 0 passed; 1 failed; 0 ignored; 0 measured; 240 filtered out; finished in 0.03s
  524. 18.92 s >
  525. 18.92 s > stderr ---
  526. 18.92 s >
  527. 18.92 s > thread 'tensor::tests::parsing::infinite_execution' (841) panicked at /nix/store/hvwd4qqiaadc4s871lfyylxrciqrvlgs-vendor-cargo-deps/c19b7c6f923b580ac259164a89f2577984ad5ab09ee9d583b888f934adbbe8d0/insta-1.47.2/src/runtime.rs:719:13:
  528. 18.92 s > snapshot assertion for 'infinite_execution' failed in line 910
  529. 18.92 s > stack backtrace:
  530. 18.92 s > 0: __rustc::rust_begin_unwind
  531. 18.92 s > 1: core::panicking::panic_fmt
  532. 18.92 s > 2: insta::runtime::assert_snapshot
  533. 18.92 s > 3: idenso::tensor::tests::parsing::infinite_execution
  534. 18.92 s > 4: <idenso::tensor::tests::parsing::infinite_execution::{closure#0} as core::ops::function::FnOnce<()>>::call_once
  535. 18.92 s > note: Some details are omitted, run with `RUST_BACKTRACE=full` for a verbose backtrace.
  536. 18.92 s >
  537. 18.92 s > error: test run failed
  538. 18.92 s >
  539. 18.92 s > ========== nextest test summary ==========
  540. 18.92 s > report: target/nextest/ci_gammaloop/junit.xml
  541. 18.92 s > tests: 224, failures: 2, errors: 0
  542. 18.92 s >
  543. 18.92 s > 1. idenso::color::test::form_reference::metric_contraction_respects_antisymmetric_normalization
  544. 18.92 s > failure: test failure with exit code 101
  545. 18.92 s > thread 'color::test::form_reference::metric_contraction_respects_antisymmetric_normalization' (337) panicked at crates/idenso/src/color/test/form_reference.rs:171:5:
  546. 18.92 s > assertion `left == right` failed
  547. 18.92 s > left: "-1*f(coad(8,standalone_metric_j),coad(8,standalone_metric_s),coad(8,standalone_metric_u))"
  548. 18.92 s > right: "f(coad(8,standalone_metric_j),coad(8,standalone_metric_s),coad(8,standalone_metric_u))"
  549. 18.92 s > stack backtrace:
  550. 18.92 s > 0: __rustc::rust_begin_unwind
  551. 18.92 s > 1: core::panicking::panic_fmt
  552. 18.92 s > 2: core::panicking::assert_failed_inner
  553. 18.92 s > 3: core::panicking::assert_failed::<alloc::string::String, alloc::string::String>
  554. 18.92 s > 4: idenso::color::test::form_reference::metric_contraction_respects_antisymmetric_normalization
  555. 18.92 s > 5: <idenso::color::test::form_reference::metric_contraction_respects_antisymmetric_normalization::{closure#0} as core::ops::function::FnOnce<()>>::call_once
  556. 18.92 s > note: Some details are omitted, run with `RUST_BACKTRACE=full` for a verbose backtrace.
  557. 18.92 s > system-out
  558. 18.92 s > running 1 test
  559. 18.92 s > test color::test::form_reference::metric_contraction_respects_antisymmetric_normalization ... FAILED
  560. 18.92 s >
  561. 18.92 s > failures:
  562. 18.92 s >
  563. 18.92 s > failures:
  564. 18.92 s > color::test::form_reference::metric_contraction_respects_antisymmetric_normalization
  565. 18.92 s >
  566. 18.92 s > test result: FAILED. 0 passed; 1 failed; 0 ignored; 0 measured; 240 filtered out; finished in 0.00s
  567. 18.92 s > system-err
  568. 18.92 s > thread 'color::test::form_reference::metric_contraction_respects_antisymmetric_normalization' (337) panicked at crates/idenso/src/color/test/form_reference.rs:171:5:
  569. 18.92 s > assertion `left == right` failed
  570. 18.92 s > left: "-1*f(coad(8,standalone_metric_j),coad(8,standalone_metric_s),coad(8,standalone_metric_u))"
  571. 18.92 s > right: "f(coad(8,standalone_metric_j),coad(8,standalone_metric_s),coad(8,standalone_metric_u))"
  572. 18.92 s > stack backtrace:
  573. 18.92 s > 0: __rustc::rust_begin_unwind
  574. 18.92 s > 1: core::panicking::panic_fmt
  575. 18.92 s > 2: core::panicking::assert_failed_inner
  576. 18.92 s > 3: core::panicking::assert_failed::<alloc::string::String, alloc::string::String>
  577. 18.92 s > 4: idenso::color::test::form_reference::metric_contraction_respects_antisymmetric_normalization
  578. 18.92 s > 5: <idenso::color::test::form_reference::metric_contraction_respects_antisymmetric_normalization::{closure#0} as core::ops::function::FnOnce<()>>::call_once
  579. 18.92 s > note: Some details are omitted, run with `RUST_BACKTRACE=full` for a verbose backtrace.
  580. 18.92 s >
  581. 18.92 s > 2. idenso::tensor::tests::parsing::infinite_execution
  582. 18.92 s > failure: test failure with exit code 101
  583. 18.92 s > thread 'tensor::tests::parsing::infinite_execution' (841) panicked at /nix/store/hvwd4qqiaadc4s871lfyylxrciqrvlgs-vendor-cargo-deps/c19b7c6f923b580ac259164a89f2577984ad5ab09ee9d583b888f934adbbe8d0/insta-1.47.2/src/runtime.rs:719:13:
  584. 18.92 s > snapshot assertion for 'infinite_execution' failed in line 910
  585. 18.92 s > stack backtrace:
  586. 18.92 s > 0: __rustc::rust_begin_unwind
  587. 18.92 s > 1: core::panicking::panic_fmt
  588. 18.92 s > 2: insta::runtime::assert_snapshot
  589. 18.92 s > 3: idenso::tensor::tests::parsing::infinite_execution
  590. 18.92 s > 4: <idenso::tensor::tests::parsing::infinite_execution::{closure#0} as core::ops::function::FnOnce<()>>::call_once
  591. 18.92 s > note: Some details are omitted, run with `RUST_BACKTRACE=full` for a verbose backtrace.
  592. 18.92 s > system-out
  593. 18.92 s > running 1 test
  594. 18.92 s > ━━━━━━━━━━━━━━━━━━━━━━━━━━━━━━━ Snapshot Summary ━━━━━━━━━━━━━━━━━━━━━━━━━━━━━━━
  595. 18.92 s > Snapshot: infinite_execution
  596. 18.92 s > Source: crates/idenso/src/tensor/tests/parsing.rs:910
  597. 18.92 s > ────────────────────────────────────────────────────────────────────────────────
  598. 18.92 s > Expression: net_iter.snapshot_dot()
  599. 18.92 s > ────────────────────────────────────────────────────────────────────────────────
  600. 18.92 s > -old snapshot
  601. 18.92 s > +new results
  602. 18.92 s > ────────────┬───────────────────────────────────────────────────────────────────
  603. 18.92 s > 8 8 │ 0:0:s-> ext0 [id=0 color="red"];
  604. 18.92 s > 9 9 │ ext1 [style=invis];
  605. 18.92 s > 10 10 │ 0:5:s-> ext1 [id=1 dir=none color="red" label="mink4|l_0"];
  606. 18.92 s > 11 11 │ ext2 [style=invis];
  607. 18.92 s > 12 │- 0:4:s-> ext2 [id=2 dir=none color="red" label="bis4|l_2"];
  608. 18.92 s > 12 │+ 0:3:s-> ext2 [id=2 dir=none color="red" label="mink4|l_1"];
  609. 18.92 s > 13 13 │ ext3 [style=invis];
  610. 18.92 s > 14 │- 0:3:s-> ext3 [id=3 dir=none color="red" label="bis4|l_3"];
  611. 18.92 s > 14 │+ 0:1:s-> ext3 [id=3 dir=none color="red" label="bis4|l_2"];
  612. 18.92 s > 15 15 │ ext4 [style=invis];
  613. 18.92 s > 16 │- 0:1:s-> ext4 [id=4 dir=none color="red" label="mink4|l_1"];
  614. 18.92 s > 16 │+ 0:2:s-> ext4 [id=4 dir=none color="red" label="mink4|l_4"];
  615. 18.92 s > 17 17 │ ext5 [style=invis];
  616. 18.92 s > 18 │- 0:2:s-> ext5 [id=5 dir=none color="red" label="mink4|l_4"];
  617. 18.92 s > 18 │+ 0:4:s-> ext5 [id=5 dir=none color="red" label="bis4|l_3"];
  618. 18.92 s > 19 19 │ }
  619. 18.92 s > ────────────┴───────────────────────────────────────────────────────────────────
  620. 18.92 s > To update snapshots run `cargo insta review`
  621. 18.92 s > Stopped on the first failure. Run `cargo insta test` to run all snapshots.
  622. 18.92 s > test tensor::tests::parsing::infinite_execution ... FAILED
  623. 18.92 s >
  624. 18.92 s > failures:
  625. 18.92 s >
  626. 18.92 s > failures:
  627. 18.92 s > tensor::tests::parsing::infinite_execution
  628. 18.92 s >
  629. 18.92 s > test result: FAILED. 0 passed; 1 failed; 0 ignored; 0 measured; 240 filtered out; finished in 0.03s
  630. 18.92 s > system-err
  631. 18.92 s > thread 'tensor::tests::parsing::infinite_execution' (841) panicked at /nix/store/hvwd4qqiaadc4s871lfyylxrciqrvlgs-vendor-cargo-deps/c19b7c6f923b580ac259164a89f2577984ad5ab09ee9d583b888f934adbbe8d0/insta-1.47.2/src/runtime.rs:719:13:
  632. 18.92 s > snapshot assertion for 'infinite_execution' failed in line 910
  633. 18.92 s > stack backtrace:
  634. 18.92 s > 0: __rustc::rust_begin_unwind
  635. 18.92 s > 1: core::panicking::panic_fmt
  636. 18.92 s > 2: insta::runtime::assert_snapshot
  637. 18.92 s > 3: idenso::tensor::tests::parsing::infinite_execution
  638. 18.92 s > 4: <idenso::tensor::tests::parsing::infinite_execution::{closure#0} as core::ops::function::FnOnce<()>>::call_once
  639. 18.92 s > note: Some details are omitted, run with `RUST_BACKTRACE=full` for a verbose backtrace.
  640. 18.92 s > =========================================
  641. 18.92 s > Extracting 2 binaries and 1 linked path to /build/nextest-archive-Nr3G4G
  642. 18.92 s > Extracted 8 files to /build/nextest-archive-Nr3G4G in 0.07s
  643. 18.92 s > ------------
  644. 18.92 s > Nextest run ID 32b537be-3bde-4de0-b2df-7fc5f5940fdd with nextest profile: ci_gammaloop
  645. 18.92 s > Starting 135 tests across 2 binaries
  646. 18.92 s > ------------
  647. 18.92 s > Summary [ 0.074s] 135 tests run: 135 passed, 0 skipped
  648. 18.92 s >
  649. 18.92 s > ========== nextest test summary ==========
  650. 18.92 s > report: target/nextest/ci_gammaloop/junit.xml
  651. 18.92 s > tests: 135, failures: 0, errors: 0
  652. 18.92 s > No failing testcases found.
  653. 18.92 s > =========================================
  654. 18.92 s > Extracting 5 binaries and 2 linked paths to /build/nextest-archive-OfYzTa
  655. 18.92 s > Extracted 19 files to /build/nextest-archive-OfYzTa in 0.19s
  656. 18.92 s > ------------
  657. 18.92 s > Nextest run ID 151bfc6f-b2cc-4f30-a6ad-f86b66ff66e8 with nextest profile: ci_gammaloop
  658. 18.92 s > Starting 25 tests across 5 binaries (1 test skipped via profile.ci_gammaloop.default-filter)
  659. 18.92 s > ------------
  660. 18.92 s > Summary [ 0.188s] 25 tests run: 25 passed, 1 skipped
  661. 18.92 s >
  662. 18.92 s > ========== nextest test summary ==========
  663. 18.92 s > report: target/nextest/ci_gammaloop/junit.xml
  664. 18.92 s > tests: 25, failures: 0, errors: 0
  665. 18.92 s > No failing testcases found.
  666. 18.92 s > =========================================
  667. 18.92 s > Extracting 2 binaries and 1 linked path to /build/nextest-archive-zIEIMw
  668. 18.92 s > Extracted 8 files to /build/nextest-archive-zIEIMw in 0.05s
  669. 18.92 s > ------------
  670. 18.92 s > Nextest run ID ab1c83f0-8a5a-418c-bb8d-b6f64abbb3d6 with nextest profile: ci_gammaloop
  671. 18.92 s > Starting 1 test across 2 binaries
  672. 18.92 s > ------------
  673. 18.92 s > Summary [ 0.005s] 1 test run: 1 passed, 0 skipped
  674. 18.92 s >
  675. 18.92 s > ========== nextest test summary ==========
  676. 18.92 s > report: target/nextest/ci_gammaloop/junit.xml
  677. 18.92 s > tests: 1, failures: 0, errors: 0
  678. 18.92 s > No failing testcases found.
  679. 18.92 s > =========================================
  680. 18.92 s > Extracting 1 binary and 1 linked path to /build/nextest-archive-BTs2v3
  681. 18.92 s > Extracted 7 files to /build/nextest-archive-BTs2v3 in 0.05s
  682. 18.92 s > ------------
  683. 18.92 s > Nextest run ID e15d2b48-ea0b-4d2a-8c0b-59857bab6182 with nextest profile: ci_gammaloop
  684. 18.92 s > Starting 0 tests across 1 binary
  685. 18.92 s > ------------
  686. 18.92 s > Summary [ 0.000s] 0 tests run: 0 passed, 0 skipped
  687. 18.92 s >
  688. 18.92 s > ========== nextest test summary ==========
  689. 18.92 s > report: target/nextest/ci_gammaloop/junit.xml
  690. 18.92 s > tests: 0, failures: 0, errors: 0
  691. 18.92 s > No failing testcases found.
  692. 18.92 s > =========================================
  693. 18.92 s For full logs, run:
  694. 18.92 s nix log /nix/store/ajh0inglfjv92dj2wayik39a1nhpnyss-gammaloop-nextest-spenso.drv
  695. 19.01 s [0 built (1 failed), 0.0Run failed.