1. 0.02 s $ /nix/store/9ypz3flqsrl5xl495mm8h645gadjsxi1-coreutils-9.11/bin/timeout --kill-after=15s 7200s /nix/store/23zk8sgzamrbmj1fday15szf7f2279s8-nix-2.34.7/bin/nix --extra-experimental-features nix-command --extra-experimental-features flakes flake clone git+https://github.com/alphal00p/gammaloop --dest /tmp/nix-ci-worker/stable-pwd/repo/
  2. 0.27 s Cloning into '/tmp/nix-ci-worker/stable-pwd/repo'...
  3. 1.17 s remote: Enumerating objects: 82005, done.
  4. 1.40 s remote: Counting objects: 0% (1/8202) remote: Counting objects: 1% (83/8202) remote: Counting objects: 2% (165/8202) remote: Counting objects: 3% (247/8202) remote: Counting objects: 4% (329/8202) remote: Counting objects: 5% (411/8202) remote: Counting objects: 6% (493/8202) remote: Counting objects: 7% (575/8202) remote: Counting objects: 8% (657/8202) remote: Counting objects: 9% (739/8202) remote: Counting objects: 10% (821/8202) remote: Counting objects: 11% (903/8202) remote: Counting objects: 12% (985/8202) remote: Counting objects: 13% (1067/8202) remote: Counting objects: 14% (1149/8202) remote: Counting objects: 15% (1231/8202) remote: Counting objects: 16% (1313/8202) remote: Counting objects: 17% (1395/8202) remote: Counting objects: 18% (1477/8202) remote: Counting objects: 19% (1559/8202) remote: Counting objects: 20% (1641/8202) remote: Counting objects: 21% (1723/8202) remote: Counting objects: 22% (1805/8202) remote: Counting objects: 23% (1887/8202) remote: Counting objects: 24% (1969/8202) remote: Counting objects: 25% (2051/8202) remote: Counting objects: 26% (2133/8202) remote: Counting objects: 27% (2215/8202) remote: Counting objects: 28% (2297/8202) remote: Counting objects: 29% (2379/8202) remote: Counting objects: 30% (2461/8202) remote: Counting objects: 31% (2543/8202) remote: Counting objects: 32% (2625/8202) remote: Counting objects: 33% (2707/8202) remote: Counting objects: 34% (2789/8202) remote: Counting objects: 35% (2871/8202) remote: Counting objects: 36% (2953/8202) remote: Counting objects: 37% (3035/8202) remote: Counting objects: 38% (3117/8202) remote: Counting objects: 39% (3199/8202) remote: Counting objects: 40% (3281/8202) remote: Counting objects: 41% (3363/8202) remote: Counting objects: 42% (3445/8202) remote: Counting objects: 43% (3527/8202) remote: Counting objects: 44% (3609/8202) remote: Counting objects: 45% (3691/8202) remote: Counting objects: 46% (3773/8202) remote: Counting objects: 47% (3855/8202) remote: Counting objects: 48% (3937/8202) remote: Counting objects: 49% (4019/8202) remote: Counting objects: 50% (4101/8202) remote: Counting objects: 51% (4184/8202) remote: Counting objects: 52% (4266/8202) remote: Counting objects: 53% (4348/8202) remote: Counting objects: 54% (4430/8202) remote: Counting objects: 55% (4512/8202) remote: Counting objects: 56% (4594/8202) remote: Counting objects: 57% (4676/8202) remote: Counting objects: 58% (4758/8202) remote: Counting objects: 59% (4840/8202) remote: Counting objects: 60% (4922/8202) remote: Counting objects: 61% (5004/8202) remote: Counting objects: 62% (5086/8202) remote: Counting objects: 63% (5168/8202) remote: Counting objects: 64% (5250/8202) remote: Counting objects: 65% (5332/8202) remote: Counting objects: 66% (5414/8202) remote: Counting objects: 67% (5496/8202) remote: Counting objects: 68% (5578/8202) remote: Counting objects: 69% (5660/8202) remote: Counting objects: 70% (5742/8202) remote: Counting objects: 71% (5824/8202) remote: Counting objects: 72% (5906/8202) remote: Counting objects: 73% (5988/8202) remote: Counting objects: 74% (6070/8202) remote: Counting objects: 75% (6152/8202) remote: Counting objects: 76% (6234/8202) remote: Counting objects: 77% (6316/8202) remote: Counting objects: 78% (6398/8202) remote: Counting objects: 79% (6480/8202) remote: Counting objects: 80% (6562/8202) remote: Counting objects: 81% (6644/8202) remote: Counting objects: 82% (6726/8202) remote: Counting objects: 83% (6808/8202) remote: Counting objects: 84% (6890/8202) remote: Counting objects: 85% (6972/8202) remote: Counting objects: 86% (7054/8202) remote: Counting objects: 87% (7136/8202) remote: Counting objects: 88% (7218/8202) remote: Counting objects: 89% (7300/8202) remote: Counting objects: 90% (7382/8202) remote: Counting objects: 91% (7464/8202) remote: Counting objects: 92% (7546/8202) remote: Counting objects: 93% (7628/8202) remote: Counting objects: 94% (7710/8202) remote: Counting objects: 95% (7792/8202) remote: Counting objects: 96% (7874/8202) remote: Counting objects: 97% (7956/8202) remote: Counting objects: 98% (8038/8202) remote: Counting objects: 99% (8120/8202) remote: Counting objects: 100% (8202/8202) remote: Counting objects: 100% (8202/8202), done.
  5. 2.84 s remote: Compressing objects: 0% (1/1555) remote: Compressing objects: 1% (16/1555) remote: Compressing objects: 2% (32/1555) remote: Compressing objects: 3% (47/1555) remote: Compressing objects: 4% (63/1555) remote: Compressing objects: 5% (78/1555) remote: Compressing objects: 6% (94/1555) remote: Compressing objects: 7% (109/1555) remote: Compressing objects: 8% (125/1555) remote: Compressing objects: 9% (140/1555) remote: Compressing objects: 10% (156/1555) remote: Compressing objects: 10% (160/1555) remote: Compressing objects: 11% (172/1555) remote: Compressing objects: 12% (187/1555) remote: Compressing objects: 13% (203/1555) remote: Compressing objects: 14% (218/1555) remote: Compressing objects: 15% (234/1555) remote: Compressing objects: 16% (249/1555) remote: Compressing objects: 17% (265/1555) remote: Compressing objects: 18% (280/1555) remote: Compressing objects: 19% (296/1555) remote: Compressing objects: 20% (311/1555) remote: Compressing objects: 21% (327/1555) remote: Compressing objects: 22% (343/1555) remote: Compressing objects: 23% (358/1555) remote: Compressing objects: 24% (374/1555) remote: Compressing objects: 25% (389/1555) remote: Compressing objects: 26% (405/1555) remote: Compressing objects: 27% (420/1555) remote: Compressing objects: 28% (436/1555) remote: Compressing objects: 29% (451/1555) remote: Compressing objects: 30% (467/1555) remote: Compressing objects: 31% (483/1555) remote: Compressing objects: 32% (498/1555) remote: Compressing objects: 33% (514/1555) remote: Compressing objects: 34% (529/1555) remote: Compressing objects: 35% (545/1555) remote: Compressing objects: 36% (560/1555) remote: Compressing objects: 37% (576/1555) remote: Compressing objects: 38% (591/1555) remote: Compressing objects: 39% (607/1555) remote: Compressing objects: 40% (622/1555) remote: Compressing objects: 41% (638/1555) remote: Compressing objects: 42% (654/1555) remote: Compressing objects: 43% (669/1555) remote: Compressing objects: 44% (685/1555) remote: Compressing objects: 45% (700/1555) remote: Compressing objects: 46% (716/1555) remote: Compressing objects: 47% (731/1555) remote: Compressing objects: 48% (747/1555) remote: Compressing objects: 49% (762/1555) remote: Compressing objects: 50% (778/1555) remote: Compressing objects: 51% (794/1555) remote: Compressing objects: 52% (809/1555) remote: Compressing objects: 53% (825/1555) remote: Compressing objects: 54% (840/1555) remote: Compressing objects: 55% (856/1555) remote: Compressing objects: 56% (871/1555) remote: Compressing objects: 57% (887/1555) remote: Compressing objects: 58% (902/1555) remote: Compressing objects: 59% (918/1555) remote: Compressing objects: 60% (933/1555) remote: Compressing objects: 61% (949/1555) remote: Compressing objects: 62% (965/1555) remote: Compressing objects: 63% (980/1555) remote: Compressing objects: 64% (996/1555) remote: Compressing objects: 65% (1011/1555) remote: Compressing objects: 66% (1027/1555) remote: Compressing objects: 67% (1042/1555) remote: Compressing objects: 68% (1058/1555) remote: Compressing objects: 69% (1073/1555) remote: Compressing objects: 70% (1089/1555) remote: Compressing objects: 71% (1105/1555) remote: Compressing objects: 72% (1120/1555) remote: Compressing objects: 73% (1136/1555) remote: Compressing objects: 74% (1151/1555) remote: Compressing objects: 75% (1167/1555) remote: Compressing objects: 76% (1182/1555) remote: Compressing objects: 77% (1198/1555) remote: Compressing objects: 78% (1213/1555) remote: Compressing objects: 79% (1229/1555) remote: Compressing objects: 80% (1244/1555) remote: Compressing objects: 81% (1260/1555) remote: Compressing objects: 82% (1276/1555) remote: Compressing objects: 83% (1291/1555) remote: Compressing objects: 84% (1307/1555) remote: Compressing objects: 85% (1322/1555) remote: Compressing objects: 86% (1338/1555) remote: Compressing objects: 87% (1353/1555) remote: Compressing objects: 88% (1369/1555) remote: Compressing objects: 89% (1384/1555) remote: Compressing objects: 90% (1400/1555) remote: Compressing objects: 91% (1416/1555) remote: Compressing objects: 92% (1431/1555) remote: Compressing objects: 93% (1447/1555) remote: Compressing objects: 94% (1462/1555) remote: Compressing objects: 95% (1478/1555) remote: Compressing objects: 96% (1493/1555) remote: Compressing objects: 97% (1509/1555) remote: Compressing objects: 98% (1524/1555) remote: Compressing objects: 99% (1540/1555) remote: Compressing objects: 100% (1555/1555) remote: Compressing objects: 100% (1555/1555), done.
  6. 6.84 s Receiving objects: 0% (1/82005) Receiving objects: 1% (821/82005) Receiving objects: 2% (1641/82005) Receiving objects: 3% (2461/82005) Receiving objects: 4% (3281/82005) Receiving objects: 5% (4101/82005) Receiving objects: 6% (4921/82005) Receiving objects: 7% (5741/82005) Receiving objects: 8% (6561/82005) Receiving objects: 9% (7381/82005), 10.33 MiB | 20.65 MiB/s Receiving objects: 10% (8201/82005), 10.33 MiB | 20.65 MiB/s Receiving objects: 11% (9021/82005), 10.33 MiB | 20.65 MiB/s Receiving objects: 12% (9841/82005), 10.33 MiB | 20.65 MiB/s Receiving objects: 13% (10661/82005), 10.33 MiB | 20.65 MiB/s Receiving objects: 14% (11481/82005), 10.33 MiB | 20.65 MiB/s Receiving objects: 15% (12301/82005), 10.33 MiB | 20.65 MiB/s Receiving objects: 16% (13121/82005), 10.33 MiB | 20.65 MiB/s Receiving objects: 17% (13941/82005), 10.33 MiB | 20.65 MiB/s Receiving objects: 18% (14761/82005), 10.33 MiB | 20.65 MiB/s Receiving objects: 19% (15581/82005), 10.33 MiB | 20.65 MiB/s Receiving objects: 20% (16401/82005), 10.33 MiB | 20.65 MiB/s Receiving objects: 21% (17222/82005), 10.33 MiB | 20.65 MiB/s Receiving objects: 22% (18042/82005), 10.33 MiB | 20.65 MiB/s Receiving objects: 23% (18862/82005), 10.33 MiB | 20.65 MiB/s Receiving objects: 24% (19682/82005), 10.33 MiB | 20.65 MiB/s Receiving objects: 25% (20502/82005), 10.33 MiB | 20.65 MiB/s Receiving objects: 26% (21322/82005), 10.33 MiB | 20.65 MiB/s Receiving objects: 27% (22142/82005), 10.33 MiB | 20.65 MiB/s Receiving objects: 28% (22962/82005), 10.33 MiB | 20.65 MiB/s Receiving objects: 29% (23782/82005), 10.33 MiB | 20.65 MiB/s Receiving objects: 30% (24602/82005), 10.33 MiB | 20.65 MiB/s Receiving objects: 31% (25422/82005), 10.33 MiB | 20.65 MiB/s Receiving objects: 32% (26242/82005), 10.33 MiB | 20.65 MiB/s Receiving objects: 33% (27062/82005), 10.33 MiB | 20.65 MiB/s Receiving objects: 34% (27882/82005), 10.33 MiB | 20.65 MiB/s Receiving objects: 35% (28702/82005), 10.33 MiB | 20.65 MiB/s Receiving objects: 36% (29522/82005), 10.33 MiB | 20.65 MiB/s Receiving objects: 37% (30342/82005), 10.33 MiB | 20.65 MiB/s Receiving objects: 38% (31162/82005), 10.33 MiB | 20.65 MiB/s Receiving objects: 38% (31890/82005), 10.33 MiB | 20.65 MiB/s Receiving objects: 39% (31982/82005), 29.61 MiB | 29.60 MiB/s Receiving objects: 40% (32802/82005), 29.61 MiB | 29.60 MiB/s Receiving objects: 41% (33623/82005), 29.61 MiB | 29.60 MiB/s Receiving objects: 42% (34443/82005), 29.61 MiB | 29.60 MiB/s Receiving objects: 43% (35263/82005), 29.61 MiB | 29.60 MiB/s Receiving objects: 44% (36083/82005), 29.61 MiB | 29.60 MiB/s Receiving objects: 45% (36903/82005), 29.61 MiB | 29.60 MiB/s Receiving objects: 46% (37723/82005), 29.61 MiB | 29.60 MiB/s Receiving objects: 47% (38543/82005), 29.61 MiB | 29.60 MiB/s Receiving objects: 48% (39363/82005), 29.61 MiB | 29.60 MiB/s Receiving objects: 49% (40183/82005), 45.42 MiB | 30.28 MiB/s Receiving objects: 50% (41003/82005), 45.42 MiB | 30.28 MiB/s Receiving objects: 51% (41823/82005), 45.42 MiB | 30.28 MiB/s Receiving objects: 52% (42643/82005), 45.42 MiB | 30.28 MiB/s Receiving objects: 53% (43463/82005), 45.42 MiB | 30.28 MiB/s Receiving objects: 54% (44283/82005), 45.42 MiB | 30.28 MiB/s Receiving objects: 55% (45103/82005), 45.42 MiB | 30.28 MiB/s Receiving objects: 56% (45923/82005), 45.42 MiB | 30.28 MiB/s Receiving objects: 57% (46743/82005), 45.42 MiB | 30.28 MiB/s Receiving objects: 58% (47563/82005), 45.42 MiB | 30.28 MiB/s Receiving objects: 59% (48383/82005), 45.42 MiB | 30.28 MiB/s Receiving objects: 59% (48725/82005), 62.29 MiB | 31.13 MiB/s Receiving objects: 60% (49203/82005), 62.29 MiB | 31.13 MiB/s Receiving objects: 61% (50024/82005), 62.29 MiB | 31.13 MiB/s Receiving objects: 62% (50844/82005), 62.29 MiB | 31.13 MiB/s Receiving objects: 63% (51664/82005), 62.29 MiB | 31.13 MiB/s Receiving objects: 64% (52484/82005), 62.29 MiB | 31.13 MiB/s Receiving objects: 65% (53304/82005), 62.29 MiB | 31.13 MiB/s Receiving objects: 66% (54124/82005), 62.29 MiB | 31.13 MiB/s Receiving objects: 67% (54944/82005), 79.12 MiB | 31.49 MiB/s Receiving objects: 68% (55764/82005), 79.12 MiB | 31.49 MiB/s Receiving objects: 69% (56584/82005), 79.12 MiB | 31.49 MiB/s Receiving objects: 70% (57404/82005), 79.12 MiB | 31.49 MiB/s Receiving objects: 71% (58224/82005), 79.12 MiB | 31.49 MiB/s Receiving objects: 72% (59044/82005), 79.12 MiB | 31.49 MiB/s Receiving objects: 73% (59864/82005), 79.12 MiB | 31.49 MiB/s Receiving objects: 74% (60684/82005), 79.12 MiB | 31.49 MiB/s Receiving objects: 75% (61504/82005), 79.12 MiB | 31.49 MiB/s Receiving objects: 75% (62140/82005), 79.12 MiB | 31.49 MiB/s Receiving objects: 76% (62324/82005), 79.12 MiB | 31.49 MiB/s Receiving objects: 77% (63144/82005), 96.00 MiB | 31.86 MiB/s Receiving objects: 78% (63964/82005), 96.00 MiB | 31.86 MiB/s Receiving objects: 79% (64784/82005), 96.00 MiB | 31.86 MiB/s Receiving objects: 80% (65604/82005), 96.00 MiB | 31.86 MiB/s Receiving objects: 81% (66425/82005), 96.00 MiB | 31.86 MiB/s Receiving objects: 82% (67245/82005), 112.83 MiB | 32.02 MiB/s Receiving objects: 83% (68065/82005), 112.83 MiB | 32.02 MiB/s Receiving objects: 84% (68885/82005), 112.83 MiB | 32.02 MiB/s Receiving objects: 85% (69705/82005), 112.83 MiB | 32.02 MiB/s Receiving objects: 86% (70525/82005), 112.83 MiB | 32.02 MiB/s Receiving objects: 87% (71345/82005), 112.83 MiB | 32.02 MiB/s Receiving objects: 88% (72165/82005), 112.83 MiB | 32.02 MiB/s Receiving objects: 89% (72985/82005), 112.83 MiB | 32.02 MiB/s Receiving objects: 90% (73805/82005), 112.83 MiB | 32.02 MiB/s Receiving objects: 91% (74625/82005), 112.83 MiB | 32.02 MiB/s Receiving objects: 92% (75445/82005), 112.83 MiB | 32.02 MiB/s Receiving objects: 93% (76265/82005), 112.83 MiB | 32.02 MiB/s Receiving objects: 94% (77085/82005), 112.83 MiB | 32.02 MiB/s Receiving objects: 95% (77905/82005), 112.83 MiB | 32.02 MiB/s Receiving objects: 96% (78725/82005), 112.83 MiB | 32.02 MiB/s Receiving objects: 97% (79545/82005), 112.83 MiB | 32.02 MiB/s Receiving objects: 98% (80365/82005), 112.83 MiB | 32.02 MiB/s Receiving objects: 99% (81185/82005), 112.83 MiB | 32.02 MiB/s remote: Total 82005 (delta 7212), reused 6647 (delta 6647), pack-reused 73803 (from 3)
  7. 6.84 s Receiving objects: 100% (82005/82005), 112.83 MiB | 32.02 MiB/s Receiving objects: 100% (82005/82005), 127.98 MiB | 32.21 MiB/s, done.
  8. 9.24 s Resolving deltas: 0% (0/55486) Resolving deltas: 1% (555/55486) Resolving deltas: 2% (1110/55486) Resolving deltas: 3% (1667/55486) Resolving deltas: 4% (2220/55486) Resolving deltas: 5% (2775/55486) Resolving deltas: 6% (3330/55486) Resolving deltas: 7% (3885/55486) Resolving deltas: 8% (4439/55486) Resolving deltas: 9% (4994/55486) Resolving deltas: 10% (5549/55486) Resolving deltas: 11% (6104/55486) Resolving deltas: 12% (6659/55486) Resolving deltas: 13% (7214/55486) Resolving deltas: 14% (7769/55486) Resolving deltas: 15% (8323/55486) Resolving deltas: 16% (8878/55486) Resolving deltas: 17% (9433/55486) Resolving deltas: 18% (9988/55486) Resolving deltas: 19% (10543/55486) Resolving deltas: 20% (11098/55486) Resolving deltas: 21% (11653/55486) Resolving deltas: 22% (12207/55486) Resolving deltas: 23% (12762/55486) Resolving deltas: 24% (13317/55486) Resolving deltas: 25% (13874/55486) Resolving deltas: 26% (14427/55486) Resolving deltas: 27% (14982/55486) Resolving deltas: 28% (15537/55486) Resolving deltas: 29% (16092/55486) Resolving deltas: 30% (16646/55486) Resolving deltas: 31% (17201/55486) Resolving deltas: 32% (17756/55486) Resolving deltas: 33% (18311/55486) Resolving deltas: 34% (18866/55486) Resolving deltas: 35% (19421/55486) Resolving deltas: 36% (19975/55486) Resolving deltas: 37% (20532/55486) Resolving deltas: 38% (21085/55486) Resolving deltas: 39% (21640/55486) Resolving deltas: 40% (22195/55486) Resolving deltas: 41% (22750/55486) Resolving deltas: 42% (23305/55486) Resolving deltas: 43% (23859/55486) Resolving deltas: 44% (24414/55486) Resolving deltas: 45% (24969/55486) Resolving deltas: 46% (25524/55486) Resolving deltas: 47% (26079/55486) Resolving deltas: 48% (26634/55486) Resolving deltas: 49% (27189/55486) Resolving deltas: 50% (27743/55486) Resolving deltas: 51% (28298/55486) Resolving deltas: 52% (28853/55486) Resolving deltas: 53% (29408/55486) Resolving deltas: 54% (29963/55486) Resolving deltas: 55% (30519/55486) Resolving deltas: 55% (30644/55486) Resolving deltas: 56% (31075/55486) Resolving deltas: 57% (31628/55486) Resolving deltas: 58% (32182/55486) Resolving deltas: 59% (32737/55486) Resolving deltas: 60% (33292/55486) Resolving deltas: 61% (33847/55486) Resolving deltas: 62% (34402/55486) Resolving deltas: 63% (34957/55486) Resolving deltas: 64% (35512/55486) Resolving deltas: 65% (36066/55486) Resolving deltas: 66% (36621/55486) Resolving deltas: 67% (37176/55486) Resolving deltas: 68% (37731/55486) Resolving deltas: 69% (38286/55486) Resolving deltas: 70% (38841/55486) Resolving deltas: 71% (39396/55486) Resolving deltas: 72% (39950/55486) Resolving deltas: 73% (40505/55486) Resolving deltas: 74% (41060/55486) Resolving deltas: 75% (41615/55486) Resolving deltas: 76% (42170/55486) Resolving deltas: 77% (42725/55486) Resolving deltas: 78% (43280/55486) Resolving deltas: 79% (43834/55486) Resolving deltas: 80% (44389/55486) Resolving deltas: 81% (44944/55486) Resolving deltas: 81% (45039/55486) Resolving deltas: 82% (45499/55486) Resolving deltas: 83% (46054/55486) Resolving deltas: 84% (46609/55486) Resolving deltas: 85% (47165/55486) Resolving deltas: 86% (47718/55486) Resolving deltas: 87% (48273/55486) Resolving deltas: 88% (48828/55486) Resolving deltas: 89% (49383/55486) Resolving deltas: 90% (49940/55486) Resolving deltas: 91% (50493/55486) Resolving deltas: 92% (51049/55486) Resolving deltas: 93% (51602/55486) Resolving deltas: 94% (52157/55486) Resolving deltas: 95% (52712/55486) Resolving deltas: 96% (53267/55486) Resolving deltas: 97% (53822/55486) Resolving deltas: 98% (54377/55486) Resolving deltas: 99% (54932/55486) Resolving deltas: 100% (55486/55486) Resolving deltas: 100% (55486/55486), done.
  9. 9.78 s Fetching commit 3ac50f3815c6073e4c79182c5d6ad6bb9b59126b for wip/native-symbolica-hyperbolics ...
  10. 9.78 s $ /nix/store/bcnisk3ydfgv26v2gw3zlky24g00yww2-git-2.54.0/bin/git fetch origin 3ac50f3815c6073e4c79182c5d6ad6bb9b59126b
  11. 10.45 s From https://github.com/alphal00p/gammaloop
  12. 10.45 s * branch 3ac50f3815c6073e4c79182c5d6ad6bb9b59126b -> FETCH_HEAD
  13. 10.49 s $ /nix/store/9ypz3flqsrl5xl495mm8h645gadjsxi1-coreutils-9.11/bin/timeout --kill-after=15s 7200s /nix/store/bcnisk3ydfgv26v2gw3zlky24g00yww2-git-2.54.0/bin/git -c advice.detachedHead=false checkout 3ac50f3815c6073e4c79182c5d6ad6bb9b59126b
  14. 10.80 s HEAD is now at 3ac50f381 Adjust CFF test tolerances and comments
  15. 10.82 s $ /nix/store/9ypz3flqsrl5xl495mm8h645gadjsxi1-coreutils-9.11/bin/timeout --kill-after=15s 7200s /nix/store/23zk8sgzamrbmj1fday15szf7f2279s8-nix-2.34.7/bin/nix --extra-experimental-features nix-command --extra-experimental-features flakes --log-format internal-json run .#packages.x86_64-linux.nix-ci-check-gammaloop-nextest-core --print-build-logs
  16. 11.10 s
  17. 17.08 s evaluating derivation 'g copying '/nix/store/6cs6 evaluating derivation 'g copying '/nix/store/6cs6 evaluating derivation 'g copying '/nix/store/6cs6 evaluating derivation 'g copying '/nix/store/6cs6 evaluating derivation 'g copying '/nix/store/6cs6 evaluating derivation 'g copying '/nix/store/6cs6 evaluating derivation 'g copying '/nix/store/6cs6 evaluating derivation 'g [0/1 built] [1/0/1 built] building ggammaloop-nextest-core> Extracting 3 binaries (including 1 non-test binary), 1 build script output directory, and 2 linked paths to /build/nextest-archive-rNA2RA
  18. 17.57 s gammaloop-nextest-core> Extracted 18 files to /build/nextest-archive-rNA2RA in 0.49s
  19. 17.61 s gammaloop-nextest-core> ------------
  20. 17.61 s gammaloop-nextest-core> Nextest run ID 6b4c322d-2d50-4895-9545-09a87885f880 with nextest profile: ci_gammaloop
  21. 17.61 s gammaloop-nextest-core> Starting 339 tests across 2 binaries
  22. 18.56 s gammaloop-nextest-core> ------------
  23. 18.56 s gammaloop-nextest-core> Summary [ 0.951s] 339 tests run: 339 passed, 0 skipped
  24. 18.66 s gammaloop-nextest-core>
  25. 18.66 s gammaloop-nextest-core> ========== nextest test summary ==========
  26. 18.66 s gammaloop-nextest-core> report: target/nextest/ci_gammaloop/junit.xml
  27. 18.66 s gammaloop-nextest-core> tests: 339, failures: 0, errors: 0
  28. 18.66 s gammaloop-nextest-core> No failing testcases found.
  29. 18.66 s gammaloop-nextest-core> =========================================
  30. 18.69 s gammaloop-nextest-core> Extracting 1 binary and 1 linked path to /build/nextest-archive-RPuCAC
  31. 18.76 s gammaloop-nextest-core> Extracted 7 files to /build/nextest-archive-RPuCAC in 0.08s
  32. 18.79 s gammaloop-nextest-core> ------------
  33. 18.79 s gammaloop-nextest-core> Nextest run ID 8f14d312-4c9a-4622-b5bf-3b2335b5ee7e with nextest profile: ci_gammaloop
  34. 18.79 s gammaloop-nextest-core> Starting 19 tests across 1 binary
  35. 18.83 s gammaloop-nextest-core> ------------
  36. 18.84 s gammaloop-nextest-core> Summary [ 0.050s] 19 tests run: 19 passed, 0 skipped
  37. 18.90 s gammaloop-nextest-core>
  38. 18.90 s gammaloop-nextest-core> ========== nextest test summary ==========
  39. 18.90 s gammaloop-nextest-core> report: target/nextest/ci_gammaloop/junit.xml
  40. 18.90 s gammaloop-nextest-core> tests: 19, failures: 0, errors: 0
  41. 18.90 s gammaloop-nextest-core> No failing testcases found.
  42. 18.90 s gammaloop-nextest-core> =========================================
  43. 18.94 s gammaloop-nextest-core> Extracting 1 binary to /build/nextest-archive-twT5Bn
  44. 19.01 s gammaloop-nextest-core> Extracted 4 files to /build/nextest-archive-twT5Bn in 0.07s
  45. 19.05 s gammaloop-nextest-core> ------------
  46. 19.05 s gammaloop-nextest-core> Nextest run ID d5e5c925-e1a0-4ad2-aa6c-012e1625b76c with nextest profile: ci_gammaloop
  47. 19.05 s gammaloop-nextest-core> Starting 0 tests across 1 binary
  48. 19.05 s gammaloop-nextest-core> ------------
  49. 19.05 s gammaloop-nextest-core> Summary [ 0.007s] 0 tests run: 0 passed, 0 skipped
  50. 19.13 s gammaloop-nextest-core>
  51. 19.13 s gammaloop-nextest-core> ========== nextest test summary ==========
  52. 19.13 s gammaloop-nextest-core> report: target/nextest/ci_gammaloop/junit.xml
  53. 19.13 s gammaloop-nextest-core> tests: 0, failures: 0, errors: 0
  54. 19.13 s gammaloop-nextest-core> No failing testcases found.
  55. 19.13 s gammaloop-nextest-core> =========================================
  56. 19.17 s gammaloop-nextest-core> Extracting 4 binaries, 1 build script output directory, and 2 linked paths to /build/nextest-archive-GbyUpt
  57. 19.89 s gammaloop-nextest-core> Extracted 18 files to /build/nextest-archive-GbyUpt in 0.73s
  58. 19.95 s gammaloop-nextest-core> ------------
  59. 19.95 s gammaloop-nextest-core> Nextest run ID 75ff0a77-7ab1-48e3-9cc1-d18ec1fc9b71 with nextest profile: ci_gammaloop
  60. 19.95 s gammaloop-nextest-core> Starting 488 tests across 4 binaries (61 tests skipped, including 60 tests via profile.ci_gammaloop.default-filter)
  61. 21.51 s gammaloop-nextest-core> FAIL [ 1.419s] (394/488) gammalooprs graph::feynman_graph::tests::native_thermal_distributions
  62. 21.51 s gammaloop-nextest-core> stdout ---
  63. 21.51 s gammaloop-nextest-core>
  64. 21.51 s gammaloop-nextest-core> running 1 test
  65. 21.51 s gammaloop-nextest-core> test graph::feynman_graph::tests::native_thermal_distributions ... FAILED
  66. 21.51 s gammaloop-nextest-core>
  67. 21.51 s gammaloop-nextest-core> failures:
  68. 21.51 s gammaloop-nextest-core>
  69. 21.51 s gammaloop-nextest-core> failures:
  70. 21.51 s gammaloop-nextest-core> graph::feynman_graph::tests::native_thermal_distributions
  71. 21.51 s gammaloop-nextest-core>
  72. 21.51 s gammaloop-nextest-core> test result: FAILED. 0 passed; 1 failed; 0 ignored; 0 measured; 540 filtered out; finished in 1.40s
  73. 21.51 s gammaloop-nextest-core>
  74. 21.51 s gammaloop-nextest-core> stderr ---
  75. 21.51 s gammaloop-nextest-core> The application panicked (crashed).
  76. 21.51 s gammaloop-nextest-core> Message: called `Result::unwrap()` on an `Err` value: Custom { kind: Other, error: "Could not compile code: g++ -shared -O3 -fPIC -ffast-math -funsafe-math-optimizations -march=native -o /build/gammaloop-native-thermal-1340/thermal_0_0.so /build/gammaloop-native-thermal-1340/thermal_0_0.cpp\nwarning: Skipping impure flag -march=native because NIX_ENFORCE_NO_NATIVE is set\n/build/gammaloop-native-thermal-1340/thermal_0_0.cpp: In function 'void thermal_realf64(const double*, double*, double*)':\n/build/gammaloop-native-thermal-1340/thermal_0_0.cpp:27:16: error: 'symbolica_tanh' was not declared in this scope\n 27 | Z[6] = symbolica_tanh(Z[6]);\n | ^~~~~~~~~~~~~~\n" }
  77. 21.51 s gammaloop-nextest-core> Location: crates/gammalooprs/src/graph/feynman_graph.rs:937
  78. 21.51 s gammaloop-nextest-core>
  79. 21.51 s gammaloop-nextest-core> ━━━━━━━━━━━━━━━━━━━━━━━━━━━━━━━━━━ BACKTRACE ━━━━━━━━━━━━━━━━━━━━━━━━━━━━━━━━━━━
  80. 21.51 s gammaloop-nextest-core> 1: <color_eyre[b0c9e66060e883b2]::config::PanicHook>::panic_report<unknown>
  81. 21.51 s gammaloop-nextest-core> at <unknown source file>:<unknown line>
  82. 21.51 s gammaloop-nextest-core> 2: <color_eyre[b0c9e66060e883b2]::config::PanicHook>::into_panic_hook::{closure#0}<unknown>
  83. 21.51 s gammaloop-nextest-core> at <unknown source file>:<unknown line>
  84. 21.51 s gammaloop-nextest-core> 3: std[bcb96dfbba0ab899]::panicking::panic_with_hook<unknown>
  85. 21.51 s gammaloop-nextest-core> at <unknown source file>:<unknown line>
  86. 21.51 s gammaloop-nextest-core> 4: std[bcb96dfbba0ab899]::panicking::panic_handler::{closure#0}<unknown>
  87. 21.51 s gammaloop-nextest-core> at <unknown source file>:<unknown line>
  88. 21.51 s gammaloop-nextest-core> 5: std[bcb96dfbba0ab899]::sys::backtrace::__rust_end_short_backtrace::<std[bcb96dfbba0ab899]::panicking::panic_handler::{closure#0}, !><unknown>
  89. 21.51 s gammaloop-nextest-core> at <unknown source file>:<unknown line>
  90. 21.51 s gammaloop-nextest-core> 6: __rustc[6c289b9f9c454d21]::rust_begin_unwind<unknown>
  91. 21.51 s gammaloop-nextest-core> at <unknown source file>:<unknown line>
  92. 21.51 s gammaloop-nextest-core> 7: core[940e698046960fd5]::panicking::panic_fmt<unknown>
  93. 21.51 s gammaloop-nextest-core> at <unknown source file>:<unknown line>
  94. 21.51 s gammaloop-nextest-core> 8: core[940e698046960fd5]::result::unwrap_failed<unknown>
  95. 21.51 s gammaloop-nextest-core> at <unknown source file>:<unknown line>
  96. 21.51 s gammaloop-nextest-core> 9: gammalooprs[f21b74aec46f5289]::graph::feynman_graph::tests::native_thermal_distributions<unknown>
  97. 21.51 s gammaloop-nextest-core> at <unknown source file>:<unknown line>
  98. 21.51 s gammaloop-nextest-core> 10: <gammalooprs[f21b74aec46f5289]::graph::feynman_graph::tests::native_thermal_distributions::{closure#0} as core[940e698046960fd5]::ops::function::FnOnce<()>>::call_once<unknown>
  99. 21.51 s gammaloop-nextest-core> at <unknown source file>:<unknown line>
  100. 21.51 s gammaloop-nextest-core> 11: test[75d6903177b1d7e9]::__rust_begin_short_backtrace::<core[940e698046960fd5]::result::Result<(), alloc[2ea6bcb46fca0c42]::string::String>, fn() -> core[940e698046960fd5]::result::Result<(), alloc[2ea6bcb46fca0c42]::string::String>><unknown>
  101. 21.51 s gammaloop-nextest-core> at <unknown source file>:<unknown line>
  102. 21.51 s gammaloop-nextest-core> 12: test[75d6903177b1d7e9]::run_test::{closure#0}<unknown>
  103. 21.51 s gammaloop-nextest-core> at <unknown source file>:<unknown line>
  104. 21.51 s gammaloop-nextest-core> 13: std[bcb96dfbba0ab899]::sys::backtrace::__rust_begin_short_backtrace::<test[75d6903177b1d7e9]::run_test::{closure#1}, ()><unknown>
  105. 21.51 s gammaloop-nextest-core> at <unknown source file>:<unknown line>
  106. 21.51 s gammaloop-nextest-core> 14: <std[bcb96dfbba0ab899]::thread::lifecycle::spawn_unchecked<test[75d6903177b1d7e9]::run_test::{closure#1}, ()>::{closure#1} as core[940e698046960fd5]::ops::function::FnOnce<()>>::call_once::{shim:vtable#0}<unknown>
  107. 21.51 s gammaloop-nextest-core> at <unknown source file>:<unknown line>
  108. 21.51 s gammaloop-nextest-core> 15: <std[bcb96dfbba0ab899]::sys::thread::unix::Thread>::new::thread_start<unknown>
  109. 21.51 s gammaloop-nextest-core> at <unknown source file>:<unknown line>
  110. 21.51 s gammaloop-nextest-core> 16: start_thread<unknown>
  111. 21.51 s gammaloop-nextest-core> at <unknown source file>:<unknown line>
  112. 21.51 s gammaloop-nextest-core> 17: __clone3<unknown>
  113. 21.51 s gammaloop-nextest-core> at <unknown source file>:<unknown line>
  114. 21.51 s gammaloop-nextest-core>
  115. 21.51 s gammaloop-nextest-core> Run with COLORBT_SHOW_HIDDEN=1 environment variable to disable frame filtering.
  116. 21.51 s gammaloop-nextest-core> Run with RUST_BACKTRACE=full to include source snippets.
  117. 21.51 s gammaloop-nextest-core>
  118. 34.39 s gammaloop-nextest-core> ------------
  119. 34.39 s gammaloop-nextest-core> Summary [ 14.428s] 488 tests run: 487 passed, 1 failed, 61 skipped
  120. 34.39 s gammaloop-nextest-core> FAIL [ 1.419s] (394/488) gammalooprs graph::feynman_graph::tests::native_thermal_distributions
  121. 34.39 s gammaloop-nextest-core> stdout ---
  122. 34.39 s gammaloop-nextest-core>
  123. 34.39 s gammaloop-nextest-core> running 1 test
  124. 34.39 s gammaloop-nextest-core> test graph::feynman_graph::tests::native_thermal_distributions ... FAILED
  125. 34.39 s gammaloop-nextest-core>
  126. 34.39 s gammaloop-nextest-core> failures:
  127. 34.39 s gammaloop-nextest-core>
  128. 34.39 s gammaloop-nextest-core> failures:
  129. 34.39 s gammaloop-nextest-core> graph::feynman_graph::tests::native_thermal_distributions
  130. 34.39 s gammaloop-nextest-core>
  131. 34.39 s gammaloop-nextest-core> test result: FAILED. 0 passed; 1 failed; 0 ignored; 0 measured; 540 filtered out; finished in 1.40s
  132. 34.39 s gammaloop-nextest-core>
  133. 34.39 s gammaloop-nextest-core> stderr ---
  134. 34.39 s gammaloop-nextest-core> The application panicked (crashed).
  135. 34.39 s gammaloop-nextest-core> Message: called `Result::unwrap()` on an `Err` value: Custom { kind: Other, error: "Could not compile code: g++ -shared -O3 -fPIC -ffast-math -funsafe-math-optimizations -march=native -o /build/gammaloop-native-thermal-1340/thermal_0_0.so /build/gammaloop-native-thermal-1340/thermal_0_0.cpp\nwarning: Skipping impure flag -march=native because NIX_ENFORCE_NO_NATIVE is set\n/build/gammaloop-native-thermal-1340/thermal_0_0.cpp: In function 'void thermal_realf64(const double*, double*, double*)':\n/build/gammaloop-native-thermal-1340/thermal_0_0.cpp:27:16: error: 'symbolica_tanh' was not declared in this scope\n 27 | Z[6] = symbolica_tanh(Z[6]);\n | ^~~~~~~~~~~~~~\n" }
  136. 34.39 s gammaloop-nextest-core> Location: crates/gammalooprs/src/graph/feynman_graph.rs:937
  137. 34.39 s gammaloop-nextest-core>
  138. 34.39 s gammaloop-nextest-core> ━━━━━━━━━━━━━━━━━━━━━━━━━━━━━━━━━━ BACKTRACE ━━━━━━━━━━━━━━━━━━━━━━━━━━━━━━━━━━━
  139. 34.39 s gammaloop-nextest-core> 1: <color_eyre[b0c9e66060e883b2]::config::PanicHook>::panic_report<unknown>
  140. 34.39 s gammaloop-nextest-core> at <unknown source file>:<unknown line>
  141. 34.39 s gammaloop-nextest-core> 2: <color_eyre[b0c9e66060e883b2]::config::PanicHook>::into_panic_hook::{closure#0}<unknown>
  142. 34.39 s gammaloop-nextest-core> at <unknown source file>:<unknown line>
  143. 34.39 s gammaloop-nextest-core> 3: std[bcb96dfbba0ab899]::panicking::panic_with_hook<unknown>
  144. 34.39 s gammaloop-nextest-core> at <unknown source file>:<unknown line>
  145. 34.39 s gammaloop-nextest-core> 4: std[bcb96dfbba0ab899]::panicking::panic_handler::{closure#0}<unknown>
  146. 34.39 s gammaloop-nextest-core> at <unknown source file>:<unknown line>
  147. 34.39 s gammaloop-nextest-core> 5: std[bcb96dfbba0ab899]::sys::backtrace::__rust_end_short_backtrace::<std[bcb96dfbba0ab899]::panicking::panic_handler::{closure#0}, !><unknown>
  148. 34.39 s gammaloop-nextest-core> at <unknown source file>:<unknown line>
  149. 34.39 s gammaloop-nextest-core> 6: __rustc[6c289b9f9c454d21]::rust_begin_unwind<unknown>
  150. 34.39 s gammaloop-nextest-core> at <unknown source file>:<unknown line>
  151. 34.39 s gammaloop-nextest-core> 7: core[940e698046960fd5]::panicking::panic_fmt<unknown>
  152. 34.39 s gammaloop-nextest-core> at <unknown source file>:<unknown line>
  153. 34.39 s gammaloop-nextest-core> 8: core[940e698046960fd5]::result::unwrap_failed<unknown>
  154. 34.39 s gammaloop-nextest-core> at <unknown source file>:<unknown line>
  155. 34.39 s gammaloop-nextest-core> 9: gammalooprs[f21b74aec46f5289]::graph::feynman_graph::tests::native_thermal_distributions<unknown>
  156. 34.39 s gammaloop-nextest-core> at <unknown source file>:<unknown line>
  157. 34.39 s gammaloop-nextest-core> 10: <gammalooprs[f21b74aec46f5289]::graph::feynman_graph::tests::native_thermal_distributions::{closure#0} as core[940e698046960fd5]::ops::function::FnOnce<()>>::call_once<unknown>
  158. 34.39 s gammaloop-nextest-core> at <unknown source file>:<unknown line>
  159. 34.39 s gammaloop-nextest-core> 11: test[75d6903177b1d7e9]::__rust_begin_short_backtrace::<core[940e698046960fd5]::result::Result<(), alloc[2ea6bcb46fca0c42]::string::String>, fn() -> core[940e698046960fd5]::result::Result<(), alloc[2ea6bcb46fca0c42]::string::String>><unknown>
  160. 34.39 s gammaloop-nextest-core> at <unknown source file>:<unknown line>
  161. 34.39 s gammaloop-nextest-core> 12: test[75d6903177b1d7e9]::run_test::{closure#0}<unknown>
  162. 34.39 s gammaloop-nextest-core> at <unknown source file>:<unknown line>
  163. 34.39 s gammaloop-nextest-core> 13: std[bcb96dfbba0ab899]::sys::backtrace::__rust_begin_short_backtrace::<test[75d6903177b1d7e9]::run_test::{closure#1}, ()><unknown>
  164. 34.39 s gammaloop-nextest-core> at <unknown source file>:<unknown line>
  165. 34.39 s gammaloop-nextest-core> 14: <std[bcb96dfbba0ab899]::thread::lifecycle::spawn_unchecked<test[75d6903177b1d7e9]::run_test::{closure#1}, ()>::{closure#1} as core[940e698046960fd5]::ops::function::FnOnce<()>>::call_once::{shim:vtable#0}<unknown>
  166. 34.39 s gammaloop-nextest-core> at <unknown source file>:<unknown line>
  167. 34.39 s gammaloop-nextest-core> 15: <std[bcb96dfbba0ab899]::sys::thread::unix::Thread>::new::thread_start<unknown>
  168. 34.39 s gammaloop-nextest-core> at <unknown source file>:<unknown line>
  169. 34.39 s gammaloop-nextest-core> 16: start_thread<unknown>
  170. 34.39 s gammaloop-nextest-core> at <unknown source file>:<unknown line>
  171. 34.39 s gammaloop-nextest-core> 17: __clone3<unknown>
  172. 34.39 s gammaloop-nextest-core> at <unknown source file>:<unknown line>
  173. 34.39 s gammaloop-nextest-core>
  174. 34.39 s gammaloop-nextest-core> Run with COLORBT_SHOW_HIDDEN=1 environment variable to disable frame filtering.
  175. 34.39 s gammaloop-nextest-core> Run with RUST_BACKTRACE=full to include source snippets.
  176. 34.39 s gammaloop-nextest-core>
  177. 34.46 s gammaloop-nextest-core> error: test run failed
  178. 34.49 s gammaloop-nextest-core>
  179. 34.49 s gammaloop-nextest-core> ========== nextest test summary ==========
  180. 34.49 s gammaloop-nextest-core> report: target/nextest/ci_gammaloop/junit.xml
  181. 34.49 s gammaloop-nextest-core> tests: 488, failures: 1, errors: 0
  182. 34.49 s gammaloop-nextest-core>
  183. 34.49 s gammaloop-nextest-core> 1. gammalooprs::graph::feynman_graph::tests::native_thermal_distributions
  184. 34.49 s gammaloop-nextest-core> failure: test failure with exit code 101
  185. 34.49 s gammaloop-nextest-core> system-out
  186. 34.49 s gammaloop-nextest-core> running 1 test
  187. 34.49 s gammaloop-nextest-core> test graph::feynman_graph::tests::native_thermal_distributions ... FAILED
  188. 34.49 s gammaloop-nextest-core>
  189. 34.49 s gammaloop-nextest-core> failures:
  190. 34.49 s gammaloop-nextest-core>
  191. 34.49 s gammaloop-nextest-core> failures:
  192. 34.49 s gammaloop-nextest-core> graph::feynman_graph::tests::native_thermal_distributions
  193. 34.49 s gammaloop-nextest-core>
  194. 34.49 s gammaloop-nextest-core> test result: FAILED. 0 passed; 1 failed; 0 ignored; 0 measured; 540 filtered out; finished in 1.40s
  195. 34.49 s gammaloop-nextest-core> system-err
  196. 34.49 s gammaloop-nextest-core> The application panicked (crashed).
  197. 34.49 s gammaloop-nextest-core> Message: called `Result::unwrap()` on an `Err` value: Custom { kind: Other, error: "Could not compile code: g++ -shared -O3 -fPIC -ffast-math -funsafe-math-optimizations -march=native -o /build/gammaloop-native-thermal-1340/thermal_0_0.so /build/gammaloop-native-thermal-1340/thermal_0_0.cpp\nwarning: Skipping impure flag -march=native because NIX_ENFORCE_NO_NATIVE is set\n/build/gammaloop-native-thermal-1340/thermal_0_0.cpp: In function 'void thermal_realf64(const double*, double*, double*)':\n/build/gammaloop-native-thermal-1340/thermal_0_0.cpp:27:16: error: 'symbolica_tanh' was not declared in this scope\n 27 | Z[6] = symbolica_tanh(Z[6]);\n | ^~~~~~~~~~~~~~\n" }
  198. 34.49 s gammaloop-nextest-core> Location: crates/gammalooprs/src/graph/feynman_graph.rs:937
  199. 34.49 s gammaloop-nextest-core>
  200. 34.49 s gammaloop-nextest-core> ━━━━━━━━━━━━━━━━━━━━━━━━━━━━━━━━━━ BACKTRACE ━━━━━━━━━━━━━━━━━━━━━━━━━━━━━━━━━━━
  201. 34.49 s gammaloop-nextest-core> 1: <color_eyre[b0c9e66060e883b2]::config::PanicHook>::panic_report<unknown>
  202. 34.49 s gammaloop-nextest-core> at <unknown source file>:<unknown line>
  203. 34.49 s gammaloop-nextest-core> 2: <color_eyre[b0c9e66060e883b2]::config::PanicHook>::into_panic_hook::{closure#0}<unknown>
  204. 34.49 s gammaloop-nextest-core> at <unknown source file>:<unknown line>
  205. 34.49 s gammaloop-nextest-core> 3: std[bcb96dfbba0ab899]::panicking::panic_with_hook<unknown>
  206. 34.49 s gammaloop-nextest-core> at <unknown source file>:<unknown line>
  207. 34.49 s gammaloop-nextest-core> 4: std[bcb96dfbba0ab899]::panicking::panic_handler::{closure#0}<unknown>
  208. 34.49 s gammaloop-nextest-core> at <unknown source file>:<unknown line>
  209. 34.49 s gammaloop-nextest-core> 5: std[bcb96dfbba0ab899]::sys::backtrace::__rust_end_short_backtrace::<std[bcb96dfbba0ab899]::panicking::panic_handler::{closure#0}, !><unknown>
  210. 34.49 s gammaloop-nextest-core> at <unknown source file>:<unknown line>
  211. 34.49 s gammaloop-nextest-core> 6: __rustc[6c289b9f9c454d21]::rust_begin_unwind<unknown>
  212. 34.49 s gammaloop-nextest-core> at <unknown source file>:<unknown line>
  213. 34.49 s gammaloop-nextest-core> 7: core[940e698046960fd5]::panicking::panic_fmt<unknown>
  214. 34.49 s gammaloop-nextest-core> at <unknown source file>:<unknown line>
  215. 34.49 s gammaloop-nextest-core> 8: core[940e698046960fd5]::result::unwrap_failed<unknown>
  216. 34.49 s gammaloop-nextest-core> at <unknown source file>:<unknown line>
  217. 34.49 s gammaloop-nextest-core> 9: gammalooprs[f21b74aec46f5289]::graph::feynman_graph::tests::native_thermal_distributions<unknown>
  218. 34.49 s gammaloop-nextest-core> at <unknown source file>:<unknown line>
  219. 34.49 s gammaloop-nextest-core> 10: <gammalooprs[f21b74aec46f5289]::graph::feynman_graph::tests::native_thermal_distributions::{closure#0} as core[940e698046960fd5]::ops::function::FnOnce<()>>::call_once<unknown>
  220. 34.49 s gammaloop-nextest-core> at <unknown source file>:<unknown line>
  221. 34.49 s gammaloop-nextest-core> 11: test[75d6903177b1d7e9]::__rust_begin_short_backtrace::<core[940e698046960fd5]::result::Result<(), alloc[2ea6bcb46fca0c42]::string::String>, fn() -> core[940e698046960fd5]::result::Result<(), alloc[2ea6bcb46fca0c42]::string::String>><unknown>
  222. 34.49 s gammaloop-nextest-core> at <unknown source file>:<unknown line>
  223. 34.49 s gammaloop-nextest-core> 12: test[75d6903177b1d7e9]::run_test::{closure#0}<unknown>
  224. 34.49 s gammaloop-nextest-core> at <unknown source file>:<unknown line>
  225. 34.49 s gammaloop-nextest-core> 13: std[bcb96dfbba0ab899]::sys::backtrace::__rust_begin_short_backtrace::<test[75d6903177b1d7e9]::run_test::{closure#1}, ()><unknown>
  226. 34.49 s gammaloop-nextest-core> at <unknown source file>:<unknown line>
  227. 34.49 s gammaloop-nextest-core> 14: <std[bcb96dfbba0ab899]::thread::lifecycle::spawn_unchecked<test[75d6903177b1d7e9]::run_test::{closure#1}, ()>::{closure#1} as core[940e698046960fd5]::ops::function::FnOnce<()>>::call_once::{shim:vtable#0}<unknown>
  228. 34.49 s gammaloop-nextest-core> at <unknown source file>:<unknown line>
  229. 34.49 s gammaloop-nextest-core> 15: <std[bcb96dfbba0ab899]::sys::thread::unix::Thread>::new::thread_start<unknown>
  230. 34.49 s gammaloop-nextest-core> at <unknown source file>:<unknown line>
  231. 34.49 s gammaloop-nextest-core> 16: start_thread<unknown>
  232. 34.49 s gammaloop-nextest-core> at <unknown source file>:<unknown line>
  233. 34.49 s gammaloop-nextest-core> 17: __clone3<unknown>
  234. 34.49 s gammaloop-nextest-core> at <unknown source file>:<unknown line>
  235. 34.49 s gammaloop-nextest-core>
  236. 34.49 s gammaloop-nextest-core> Run with COLORBT_SHOW_HIDDEN=1 environment variable to disable frame filtering.
  237. 34.49 s gammaloop-nextest-core> Run with RUST_BACKTRACE=full to include source snippets.
  238. 34.49 s gammaloop-nextest-core> =========================================
  239. 34.55 s error: Cannot build '/nix/store/8l1symdjd8zyi2xi7czaml0xbwmns2xx-gammaloop-nextest-core.drv'.
  240. 34.55 s Reason: builder failed with exit code 100.
  241. 34.55 s Output paths:
  242. 34.55 s /nix/store/kfc2lx3b442mniy91bfaj913rbm8qawy-gammaloop-nextest-core
  243. 34.55 s Last 222 log lines:
  244. 34.55 s > Extracting 3 binaries (including 1 non-test binary), 1 build script output directory, and 2 linked paths to /build/nextest-archive-rNA2RA
  245. 34.55 s > Extracted 18 files to /build/nextest-archive-rNA2RA in 0.49s
  246. 34.55 s > ------------
  247. 34.55 s > Nextest run ID 6b4c322d-2d50-4895-9545-09a87885f880 with nextest profile: ci_gammaloop
  248. 34.55 s > Starting 339 tests across 2 binaries
  249. 34.55 s > ------------
  250. 34.55 s > Summary [ 0.951s] 339 tests run: 339 passed, 0 skipped
  251. 34.55 s >
  252. 34.55 s > ========== nextest test summary ==========
  253. 34.55 s > report: target/nextest/ci_gammaloop/junit.xml
  254. 34.55 s > tests: 339, failures: 0, errors: 0
  255. 34.55 s > No failing testcases found.
  256. 34.55 s > =========================================
  257. 34.55 s > Extracting 1 binary and 1 linked path to /build/nextest-archive-RPuCAC
  258. 34.55 s > Extracted 7 files to /build/nextest-archive-RPuCAC in 0.08s
  259. 34.55 s > ------------
  260. 34.55 s > Nextest run ID 8f14d312-4c9a-4622-b5bf-3b2335b5ee7e with nextest profile: ci_gammaloop
  261. 34.55 s > Starting 19 tests across 1 binary
  262. 34.55 s > ------------
  263. 34.55 s > Summary [ 0.050s] 19 tests run: 19 passed, 0 skipped
  264. 34.55 s >
  265. 34.55 s > ========== nextest test summary ==========
  266. 34.55 s > report: target/nextest/ci_gammaloop/junit.xml
  267. 34.55 s > tests: 19, failures: 0, errors: 0
  268. 34.55 s > No failing testcases found.
  269. 34.55 s > =========================================
  270. 34.55 s > Extracting 1 binary to /build/nextest-archive-twT5Bn
  271. 34.55 s > Extracted 4 files to /build/nextest-archive-twT5Bn in 0.07s
  272. 34.55 s > ------------
  273. 34.55 s > Nextest run ID d5e5c925-e1a0-4ad2-aa6c-012e1625b76c with nextest profile: ci_gammaloop
  274. 34.55 s > Starting 0 tests across 1 binary
  275. 34.55 s > ------------
  276. 34.55 s > Summary [ 0.007s] 0 tests run: 0 passed, 0 skipped
  277. 34.55 s >
  278. 34.55 s > ========== nextest test summary ==========
  279. 34.55 s > report: target/nextest/ci_gammaloop/junit.xml
  280. 34.55 s > tests: 0, failures: 0, errors: 0
  281. 34.55 s > No failing testcases found.
  282. 34.55 s > =========================================
  283. 34.55 s > Extracting 4 binaries, 1 build script output directory, and 2 linked paths to /build/nextest-archive-GbyUpt
  284. 34.55 s > Extracted 18 files to /build/nextest-archive-GbyUpt in 0.73s
  285. 34.55 s > ------------
  286. 34.55 s > Nextest run ID 75ff0a77-7ab1-48e3-9cc1-d18ec1fc9b71 with nextest profile: ci_gammaloop
  287. 34.55 s > Starting 488 tests across 4 binaries (61 tests skipped, including 60 tests via profile.ci_gammaloop.default-filter)
  288. 34.55 s > FAIL [ 1.419s] (394/488) gammalooprs graph::feynman_graph::tests::native_thermal_distributions
  289. 34.55 s > stdout ---
  290. 34.55 s >
  291. 34.55 s > running 1 test
  292. 34.55 s > test graph::feynman_graph::tests::native_thermal_distributions ... FAILED
  293. 34.55 s >
  294. 34.55 s > failures:
  295. 34.55 s >
  296. 34.55 s > failures:
  297. 34.55 s > graph::feynman_graph::tests::native_thermal_distributions
  298. 34.55 s >
  299. 34.55 s > test result: FAILED. 0 passed; 1 failed; 0 ignored; 0 measured; 540 filtered out; finished in 1.40s
  300. 34.55 s >
  301. 34.55 s > stderr ---
  302. 34.55 s > The application panicked (crashed).
  303. 34.55 s > Message: called `Result::unwrap()` on an `Err` value: Custom { kind: Other, error: "Could not compile code: g++ -shared -O3 -fPIC -ffast-math -funsafe-math-optimizations -march=native -o /build/gammaloop-native-thermal-1340/thermal_0_0.so /build/gammaloop-native-thermal-1340/thermal_0_0.cpp\nwarning: Skipping impure flag -march=native because NIX_ENFORCE_NO_NATIVE is set\n/build/gammaloop-native-thermal-1340/thermal_0_0.cpp: In function 'void thermal_realf64(const double*, double*, double*)':\n/build/gammaloop-native-thermal-1340/thermal_0_0.cpp:27:16: error: 'symbolica_tanh' was not declared in this scope\n 27 | Z[6] = symbolica_tanh(Z[6]);\n | ^~~~~~~~~~~~~~\n" }
  304. 34.55 s > Location: crates/gammalooprs/src/graph/feynman_graph.rs:937
  305. 34.55 s >
  306. 34.55 s > ━━━━━━━━━━━━━━━━━━━━━━━━━━━━━━━━━━ BACKTRACE ━━━━━━━━━━━━━━━━━━━━━━━━━━━━━━━━━━━
  307. 34.55 s > 1: <color_eyre[b0c9e66060e883b2]::config::PanicHook>::panic_report<unknown>
  308. 34.55 s > at <unknown source file>:<unknown line>
  309. 34.55 s > 2: <color_eyre[b0c9e66060e883b2]::config::PanicHook>::into_panic_hook::{closure#0}<unknown>
  310. 34.55 s > at <unknown source file>:<unknown line>
  311. 34.55 s > 3: std[bcb96dfbba0ab899]::panicking::panic_with_hook<unknown>
  312. 34.55 s > at <unknown source file>:<unknown line>
  313. 34.55 s > 4: std[bcb96dfbba0ab899]::panicking::panic_handler::{closure#0}<unknown>
  314. 34.55 s > at <unknown source file>:<unknown line>
  315. 34.55 s > 5: std[bcb96dfbba0ab899]::sys::backtrace::__rust_end_short_backtrace::<std[bcb96dfbba0ab899]::panicking::panic_handler::{closure#0}, !><unknown>
  316. 34.55 s > at <unknown source file>:<unknown line>
  317. 34.55 s > 6: __rustc[6c289b9f9c454d21]::rust_begin_unwind<unknown>
  318. 34.55 s > at <unknown source file>:<unknown line>
  319. 34.55 s > 7: core[940e698046960fd5]::panicking::panic_fmt<unknown>
  320. 34.55 s > at <unknown source file>:<unknown line>
  321. 34.55 s > 8: core[940e698046960fd5]::result::unwrap_failed<unknown>
  322. 34.55 s > at <unknown source file>:<unknown line>
  323. 34.55 s > 9: gammalooprs[f21b74aec46f5289]::graph::feynman_graph::tests::native_thermal_distributions<unknown>
  324. 34.55 s > at <unknown source file>:<unknown line>
  325. 34.55 s > 10: <gammalooprs[f21b74aec46f5289]::graph::feynman_graph::tests::native_thermal_distributions::{closure#0} as core[940e698046960fd5]::ops::function::FnOnce<()>>::call_once<unknown>
  326. 34.55 s > at <unknown source file>:<unknown line>
  327. 34.55 s > 11: test[75d6903177b1d7e9]::__rust_begin_short_backtrace::<core[940e698046960fd5]::result::Result<(), alloc[2ea6bcb46fca0c42]::string::String>, fn() -> core[940e698046960fd5]::result::Result<(), alloc[2ea6bcb46fca0c42]::string::String>><unknown>
  328. 34.55 s > at <unknown source file>:<unknown line>
  329. 34.55 s > 12: test[75d6903177b1d7e9]::run_test::{closure#0}<unknown>
  330. 34.55 s > at <unknown source file>:<unknown line>
  331. 34.55 s > 13: std[bcb96dfbba0ab899]::sys::backtrace::__rust_begin_short_backtrace::<test[75d6903177b1d7e9]::run_test::{closure#1}, ()><unknown>
  332. 34.55 s > at <unknown source file>:<unknown line>
  333. 34.55 s > 14: <std[bcb96dfbba0ab899]::thread::lifecycle::spawn_unchecked<test[75d6903177b1d7e9]::run_test::{closure#1}, ()>::{closure#1} as core[940e698046960fd5]::ops::function::FnOnce<()>>::call_once::{shim:vtable#0}<unknown>
  334. 34.55 s > at <unknown source file>:<unknown line>
  335. 34.55 s > 15: <std[bcb96dfbba0ab899]::sys::thread::unix::Thread>::new::thread_start<unknown>
  336. 34.55 s > at <unknown source file>:<unknown line>
  337. 34.55 s > 16: start_thread<unknown>
  338. 34.55 s > at <unknown source file>:<unknown line>
  339. 34.55 s > 17: __clone3<unknown>
  340. 34.55 s > at <unknown source file>:<unknown line>
  341. 34.55 s >
  342. 34.55 s > Run with COLORBT_SHOW_HIDDEN=1 environment variable to disable frame filtering.
  343. 34.55 s > Run with RUST_BACKTRACE=full to include source snippets.
  344. 34.55 s >
  345. 34.55 s > ------------
  346. 34.55 s > Summary [ 14.428s] 488 tests run: 487 passed, 1 failed, 61 skipped
  347. 34.55 s > FAIL [ 1.419s] (394/488) gammalooprs graph::feynman_graph::tests::native_thermal_distributions
  348. 34.55 s > stdout ---
  349. 34.55 s >
  350. 34.55 s > running 1 test
  351. 34.55 s > test graph::feynman_graph::tests::native_thermal_distributions ... FAILED
  352. 34.55 s >
  353. 34.55 s > failures:
  354. 34.55 s >
  355. 34.55 s > failures:
  356. 34.55 s > graph::feynman_graph::tests::native_thermal_distributions
  357. 34.55 s >
  358. 34.55 s > test result: FAILED. 0 passed; 1 failed; 0 ignored; 0 measured; 540 filtered out; finished in 1.40s
  359. 34.55 s >
  360. 34.55 s > stderr ---
  361. 34.55 s > The application panicked (crashed).
  362. 34.55 s > Message: called `Result::unwrap()` on an `Err` value: Custom { kind: Other, error: "Could not compile code: g++ -shared -O3 -fPIC -ffast-math -funsafe-math-optimizations -march=native -o /build/gammaloop-native-thermal-1340/thermal_0_0.so /build/gammaloop-native-thermal-1340/thermal_0_0.cpp\nwarning: Skipping impure flag -march=native because NIX_ENFORCE_NO_NATIVE is set\n/build/gammaloop-native-thermal-1340/thermal_0_0.cpp: In function 'void thermal_realf64(const double*, double*, double*)':\n/build/gammaloop-native-thermal-1340/thermal_0_0.cpp:27:16: error: 'symbolica_tanh' was not declared in this scope\n 27 | Z[6] = symbolica_tanh(Z[6]);\n | ^~~~~~~~~~~~~~\n" }
  363. 34.55 s > Location: crates/gammalooprs/src/graph/feynman_graph.rs:937
  364. 34.55 s >
  365. 34.55 s > ━━━━━━━━━━━━━━━━━━━━━━━━━━━━━━━━━━ BACKTRACE ━━━━━━━━━━━━━━━━━━━━━━━━━━━━━━━━━━━
  366. 34.55 s > 1: <color_eyre[b0c9e66060e883b2]::config::PanicHook>::panic_report<unknown>
  367. 34.55 s > at <unknown source file>:<unknown line>
  368. 34.55 s > 2: <color_eyre[b0c9e66060e883b2]::config::PanicHook>::into_panic_hook::{closure#0}<unknown>
  369. 34.55 s > at <unknown source file>:<unknown line>
  370. 34.55 s > 3: std[bcb96dfbba0ab899]::panicking::panic_with_hook<unknown>
  371. 34.55 s > at <unknown source file>:<unknown line>
  372. 34.55 s > 4: std[bcb96dfbba0ab899]::panicking::panic_handler::{closure#0}<unknown>
  373. 34.55 s > at <unknown source file>:<unknown line>
  374. 34.55 s > 5: std[bcb96dfbba0ab899]::sys::backtrace::__rust_end_short_backtrace::<std[bcb96dfbba0ab899]::panicking::panic_handler::{closure#0}, !><unknown>
  375. 34.55 s > at <unknown source file>:<unknown line>
  376. 34.55 s > 6: __rustc[6c289b9f9c454d21]::rust_begin_unwind<unknown>
  377. 34.55 s > at <unknown source file>:<unknown line>
  378. 34.55 s > 7: core[940e698046960fd5]::panicking::panic_fmt<unknown>
  379. 34.55 s > at <unknown source file>:<unknown line>
  380. 34.55 s > 8: core[940e698046960fd5]::result::unwrap_failed<unknown>
  381. 34.55 s > at <unknown source file>:<unknown line>
  382. 34.55 s > 9: gammalooprs[f21b74aec46f5289]::graph::feynman_graph::tests::native_thermal_distributions<unknown>
  383. 34.55 s > at <unknown source file>:<unknown line>
  384. 34.55 s > 10: <gammalooprs[f21b74aec46f5289]::graph::feynman_graph::tests::native_thermal_distributions::{closure#0} as core[940e698046960fd5]::ops::function::FnOnce<()>>::call_once<unknown>
  385. 34.55 s > at <unknown source file>:<unknown line>
  386. 34.55 s > 11: test[75d6903177b1d7e9]::__rust_begin_short_backtrace::<core[940e698046960fd5]::result::Result<(), alloc[2ea6bcb46fca0c42]::string::String>, fn() -> core[940e698046960fd5]::result::Result<(), alloc[2ea6bcb46fca0c42]::string::String>><unknown>
  387. 34.55 s > at <unknown source file>:<unknown line>
  388. 34.55 s > 12: test[75d6903177b1d7e9]::run_test::{closure#0}<unknown>
  389. 34.55 s > at <unknown source file>:<unknown line>
  390. 34.55 s > 13: std[bcb96dfbba0ab899]::sys::backtrace::__rust_begin_short_backtrace::<test[75d6903177b1d7e9]::run_test::{closure#1}, ()><unknown>
  391. 34.55 s > at <unknown source file>:<unknown line>
  392. 34.55 s > 14: <std[bcb96dfbba0ab899]::thread::lifecycle::spawn_unchecked<test[75d6903177b1d7e9]::run_test::{closure#1}, ()>::{closure#1} as core[940e698046960fd5]::ops::function::FnOnce<()>>::call_once::{shim:vtable#0}<unknown>
  393. 34.55 s > at <unknown source file>:<unknown line>
  394. 34.55 s > 15: <std[bcb96dfbba0ab899]::sys::thread::unix::Thread>::new::thread_start<unknown>
  395. 34.55 s > at <unknown source file>:<unknown line>
  396. 34.55 s > 16: start_thread<unknown>
  397. 34.55 s > at <unknown source file>:<unknown line>
  398. 34.55 s > 17: __clone3<unknown>
  399. 34.55 s > at <unknown source file>:<unknown line>
  400. 34.55 s >
  401. 34.55 s > Run with COLORBT_SHOW_HIDDEN=1 environment variable to disable frame filtering.
  402. 34.55 s > Run with RUST_BACKTRACE=full to include source snippets.
  403. 34.55 s >
  404. 34.55 s > error: test run failed
  405. 34.55 s >
  406. 34.55 s > ========== nextest test summary ==========
  407. 34.55 s > report: target/nextest/ci_gammaloop/junit.xml
  408. 34.55 s > tests: 488, failures: 1, errors: 0
  409. 34.55 s >
  410. 34.55 s > 1. gammalooprs::graph::feynman_graph::tests::native_thermal_distributions
  411. 34.55 s > failure: test failure with exit code 101
  412. 34.55 s > system-out
  413. 34.55 s > running 1 test
  414. 34.55 s > test graph::feynman_graph::tests::native_thermal_distributions ... FAILED
  415. 34.55 s >
  416. 34.55 s > failures:
  417. 34.55 s >
  418. 34.55 s > failures:
  419. 34.55 s > graph::feynman_graph::tests::native_thermal_distributions
  420. 34.55 s >
  421. 34.55 s > test result: FAILED. 0 passed; 1 failed; 0 ignored; 0 measured; 540 filtered out; finished in 1.40s
  422. 34.55 s > system-err
  423. 34.55 s > The application panicked (crashed).
  424. 34.56 s > Message: called `Result::unwrap()` on an `Err` value: Custom { kind: Other, error: "Could not compile code: g++ -shared -O3 -fPIC -ffast-math -funsafe-math-optimizations -march=native -o /build/gammaloop-native-thermal-1340/thermal_0_0.so /build/gammaloop-native-thermal-1340/thermal_0_0.cpp\nwarning: Skipping impure flag -march=native because NIX_ENFORCE_NO_NATIVE is set\n/build/gammaloop-native-thermal-1340/thermal_0_0.cpp: In function 'void thermal_realf64(const double*, double*, double*)':\n/build/gammaloop-native-thermal-1340/thermal_0_0.cpp:27:16: error: 'symbolica_tanh' was not declared in this scope\n 27 | Z[6] = symbolica_tanh(Z[6]);\n | ^~~~~~~~~~~~~~\n" }
  425. 34.56 s > Location: crates/gammalooprs/src/graph/feynman_graph.rs:937
  426. 34.56 s >
  427. 34.56 s > ━━━━━━━━━━━━━━━━━━━━━━━━━━━━━━━━━━ BACKTRACE ━━━━━━━━━━━━━━━━━━━━━━━━━━━━━━━━━━━
  428. 34.56 s > 1: <color_eyre[b0c9e66060e883b2]::config::PanicHook>::panic_report<unknown>
  429. 34.56 s > at <unknown source file>:<unknown line>
  430. 34.56 s > 2: <color_eyre[b0c9e66060e883b2]::config::PanicHook>::into_panic_hook::{closure#0}<unknown>
  431. 34.56 s > at <unknown source file>:<unknown line>
  432. 34.56 s > 3: std[bcb96dfbba0ab899]::panicking::panic_with_hook<unknown>
  433. 34.56 s > at <unknown source file>:<unknown line>
  434. 34.56 s > 4: std[bcb96dfbba0ab899]::panicking::panic_handler::{closure#0}<unknown>
  435. 34.56 s > at <unknown source file>:<unknown line>
  436. 34.56 s > 5: std[bcb96dfbba0ab899]::sys::backtrace::__rust_end_short_backtrace::<std[bcb96dfbba0ab899]::panicking::panic_handler::{closure#0}, !><unknown>
  437. 34.56 s > at <unknown source file>:<unknown line>
  438. 34.56 s > 6: __rustc[6c289b9f9c454d21]::rust_begin_unwind<unknown>
  439. 34.56 s > at <unknown source file>:<unknown line>
  440. 34.56 s > 7: core[940e698046960fd5]::panicking::panic_fmt<unknown>
  441. 34.56 s > at <unknown source file>:<unknown line>
  442. 34.56 s > 8: core[940e698046960fd5]::result::unwrap_failed<unknown>
  443. 34.56 s > at <unknown source file>:<unknown line>
  444. 34.56 s > 9: gammalooprs[f21b74aec46f5289]::graph::feynman_graph::tests::native_thermal_distributions<unknown>
  445. 34.56 s > at <unknown source file>:<unknown line>
  446. 34.56 s > 10: <gammalooprs[f21b74aec46f5289]::graph::feynman_graph::tests::native_thermal_distributions::{closure#0} as core[940e698046960fd5]::ops::function::FnOnce<()>>::call_once<unknown>
  447. 34.56 s > at <unknown source file>:<unknown line>
  448. 34.56 s > 11: test[75d6903177b1d7e9]::__rust_begin_short_backtrace::<core[940e698046960fd5]::result::Result<(), alloc[2ea6bcb46fca0c42]::string::String>, fn() -> core[940e698046960fd5]::result::Result<(), alloc[2ea6bcb46fca0c42]::string::String>><unknown>
  449. 34.56 s > at <unknown source file>:<unknown line>
  450. 34.56 s > 12: test[75d6903177b1d7e9]::run_test::{closure#0}<unknown>
  451. 34.56 s > at <unknown source file>:<unknown line>
  452. 34.56 s > 13: std[bcb96dfbba0ab899]::sys::backtrace::__rust_begin_short_backtrace::<test[75d6903177b1d7e9]::run_test::{closure#1}, ()><unknown>
  453. 34.56 s > at <unknown source file>:<unknown line>
  454. 34.56 s > 14: <std[bcb96dfbba0ab899]::thread::lifecycle::spawn_unchecked<test[75d6903177b1d7e9]::run_test::{closure#1}, ()>::{closure#1} as core[940e698046960fd5]::ops::function::FnOnce<()>>::call_once::{shim:vtable#0}<unknown>
  455. 34.56 s > at <unknown source file>:<unknown line>
  456. 34.56 s > 15: <std[bcb96dfbba0ab899]::sys::thread::unix::Thread>::new::thread_start<unknown>
  457. 34.56 s > at <unknown source file>:<unknown line>
  458. 34.56 s > 16: start_thread<unknown>
  459. 34.56 s > at <unknown source file>:<unknown line>
  460. 34.56 s > 17: __clone3<unknown>
  461. 34.56 s > at <unknown source file>:<unknown line>
  462. 34.56 s >
  463. 34.56 s > Run with COLORBT_SHOW_HIDDEN=1 environment variable to disable frame filtering.
  464. 34.56 s > Run with RUST_BACKTRACE=full to include source snippets.
  465. 34.56 s > =========================================
  466. 34.56 s For full logs, run:
  467. 34.56 s nix log /nix/store/8l1symdjd8zyi2xi7czaml0xbwmns2xx-gammaloop-nextest-core.drv
  468. 34.72 s [0 built (1 failed)]Run failed.