0.00 s
$ /nix/store/9ypz3flqsrl5xl495mm8h645gadjsxi1-coreutils-9.11/bin/timeout --kill-after=15s 7200s /nix/store/23zk8sgzamrbmj1fday15szf7f2279s8-nix-2.34.7/bin/nix --extra-experimental-features nix-command --extra-experimental-features flakes flake clone git+https://github.com/alphal00p/gammaloop --dest /tmp/nix-ci-worker/stable-pwd/repo/
0.42 s
Cloning into '/tmp/nix-ci-worker/stable-pwd/repo'...
2.18 s
remote: Enumerating objects: 82005, done.
2.41 s
remote: Counting objects: 0% (1/8202)
remote: Counting objects: 1% (83/8202)
remote: Counting objects: 2% (165/8202)
remote: Counting objects: 3% (247/8202)
remote: Counting objects: 4% (329/8202)
remote: Counting objects: 5% (411/8202)
remote: Counting objects: 6% (493/8202)
remote: Counting objects: 7% (575/8202)
remote: Counting objects: 8% (657/8202)
remote: Counting objects: 9% (739/8202)
remote: Counting objects: 10% (821/8202)
remote: Counting objects: 11% (903/8202)
remote: Counting objects: 12% (985/8202)
remote: Counting objects: 13% (1067/8202)
remote: Counting objects: 14% (1149/8202)
remote: Counting objects: 15% (1231/8202)
remote: Counting objects: 16% (1313/8202)
remote: Counting objects: 17% (1395/8202)
remote: Counting objects: 18% (1477/8202)
remote: Counting objects: 19% (1559/8202)
remote: Counting objects: 20% (1641/8202)
remote: Counting objects: 21% (1723/8202)
remote: Counting objects: 22% (1805/8202)
remote: Counting objects: 23% (1887/8202)
remote: Counting objects: 24% (1969/8202)
remote: Counting objects: 25% (2051/8202)
remote: Counting objects: 26% (2133/8202)
remote: Counting objects: 27% (2215/8202)
remote: Counting objects: 28% (2297/8202)
remote: Counting objects: 29% (2379/8202)
remote: Counting objects: 30% (2461/8202)
remote: Counting objects: 31% (2543/8202)
remote: Counting objects: 32% (2625/8202)
remote: Counting objects: 33% (2707/8202)
remote: Counting objects: 34% (2789/8202)
remote: Counting objects: 35% (2871/8202)
remote: Counting objects: 36% (2953/8202)
remote: Counting objects: 37% (3035/8202)
remote: Counting objects: 38% (3117/8202)
remote: Counting objects: 39% (3199/8202)
remote: Counting objects: 40% (3281/8202)
remote: Counting objects: 41% (3363/8202)
remote: Counting objects: 42% (3445/8202)
remote: Counting objects: 43% (3527/8202)
remote: Counting objects: 44% (3609/8202)
remote: Counting objects: 45% (3691/8202)
remote: Counting objects: 46% (3773/8202)
remote: Counting objects: 47% (3855/8202)
remote: Counting objects: 48% (3937/8202)
remote: Counting objects: 49% (4019/8202)
remote: Counting objects: 50% (4101/8202)
remote: Counting objects: 51% (4184/8202)
remote: Counting objects: 52% (4266/8202)
remote: Counting objects: 53% (4348/8202)
remote: Counting objects: 54% (4430/8202)
remote: Counting objects: 55% (4512/8202)
remote: Counting objects: 56% (4594/8202)
remote: Counting objects: 57% (4676/8202)
remote: Counting objects: 58% (4758/8202)
remote: Counting objects: 59% (4840/8202)
remote: Counting objects: 60% (4922/8202)
remote: Counting objects: 61% (5004/8202)
remote: Counting objects: 62% (5086/8202)
remote: Counting objects: 63% (5168/8202)
remote: Counting objects: 64% (5250/8202)
remote: Counting objects: 65% (5332/8202)
remote: Counting objects: 66% (5414/8202)
remote: Counting objects: 67% (5496/8202)
remote: Counting objects: 68% (5578/8202)
remote: Counting objects: 69% (5660/8202)
remote: Counting objects: 70% (5742/8202)
remote: Counting objects: 71% (5824/8202)
remote: Counting objects: 72% (5906/8202)
remote: Counting objects: 73% (5988/8202)
remote: Counting objects: 74% (6070/8202)
remote: Counting objects: 75% (6152/8202)
remote: Counting objects: 76% (6234/8202)
remote: Counting objects: 77% (6316/8202)
remote: Counting objects: 78% (6398/8202)
remote: Counting objects: 79% (6480/8202)
remote: Counting objects: 80% (6562/8202)
remote: Counting objects: 81% (6644/8202)
remote: Counting objects: 82% (6726/8202)
remote: Counting objects: 83% (6808/8202)
remote: Counting objects: 84% (6890/8202)
remote: Counting objects: 85% (6972/8202)
remote: Counting objects: 86% (7054/8202)
remote: Counting objects: 87% (7136/8202)
remote: Counting objects: 88% (7218/8202)
remote: Counting objects: 89% (7300/8202)
remote: Counting objects: 90% (7382/8202)
remote: Counting objects: 91% (7464/8202)
remote: Counting objects: 92% (7546/8202)
remote: Counting objects: 93% (7628/8202)
remote: Counting objects: 94% (7710/8202)
remote: Counting objects: 95% (7792/8202)
remote: Counting objects: 96% (7874/8202)
remote: Counting objects: 97% (7956/8202)
remote: Counting objects: 98% (8038/8202)
remote: Counting objects: 99% (8120/8202)
remote: Counting objects: 100% (8202/8202)
remote: Counting objects: 100% (8202/8202), done.
3.88 s
remote: Compressing objects: 0% (1/1555)
remote: Compressing objects: 1% (16/1555)
remote: Compressing objects: 2% (32/1555)
remote: Compressing objects: 3% (47/1555)
remote: Compressing objects: 4% (63/1555)
remote: Compressing objects: 5% (78/1555)
remote: Compressing objects: 6% (94/1555)
remote: Compressing objects: 7% (109/1555)
remote: Compressing objects: 8% (125/1555)
remote: Compressing objects: 9% (140/1555)
remote: Compressing objects: 10% (156/1555)
remote: Compressing objects: 10% (161/1555)
remote: Compressing objects: 11% (172/1555)
remote: Compressing objects: 12% (187/1555)
remote: Compressing objects: 13% (203/1555)
remote: Compressing objects: 14% (218/1555)
remote: Compressing objects: 15% (234/1555)
remote: Compressing objects: 16% (249/1555)
remote: Compressing objects: 17% (265/1555)
remote: Compressing objects: 18% (280/1555)
remote: Compressing objects: 19% (296/1555)
remote: Compressing objects: 20% (311/1555)
remote: Compressing objects: 21% (327/1555)
remote: Compressing objects: 22% (343/1555)
remote: Compressing objects: 23% (358/1555)
remote: Compressing objects: 24% (374/1555)
remote: Compressing objects: 25% (389/1555)
remote: Compressing objects: 26% (405/1555)
remote: Compressing objects: 27% (420/1555)
remote: Compressing objects: 28% (436/1555)
remote: Compressing objects: 29% (451/1555)
remote: Compressing objects: 30% (467/1555)
remote: Compressing objects: 31% (483/1555)
remote: Compressing objects: 32% (498/1555)
remote: Compressing objects: 33% (514/1555)
remote: Compressing objects: 34% (529/1555)
remote: Compressing objects: 35% (545/1555)
remote: Compressing objects: 36% (560/1555)
remote: Compressing objects: 37% (576/1555)
remote: Compressing objects: 38% (591/1555)
remote: Compressing objects: 39% (607/1555)
remote: Compressing objects: 40% (622/1555)
remote: Compressing objects: 41% (638/1555)
remote: Compressing objects: 42% (654/1555)
remote: Compressing objects: 43% (669/1555)
remote: Compressing objects: 44% (685/1555)
remote: Compressing objects: 45% (700/1555)
remote: Compressing objects: 46% (716/1555)
remote: Compressing objects: 47% (731/1555)
remote: Compressing objects: 48% (747/1555)
remote: Compressing objects: 49% (762/1555)
remote: Compressing objects: 50% (778/1555)
remote: Compressing objects: 51% (794/1555)
remote: Compressing objects: 52% (809/1555)
remote: Compressing objects: 53% (825/1555)
remote: Compressing objects: 54% (840/1555)
remote: Compressing objects: 55% (856/1555)
remote: Compressing objects: 56% (871/1555)
remote: Compressing objects: 57% (887/1555)
remote: Compressing objects: 58% (902/1555)
remote: Compressing objects: 59% (918/1555)
remote: Compressing objects: 60% (933/1555)
remote: Compressing objects: 61% (949/1555)
remote: Compressing objects: 62% (965/1555)
remote: Compressing objects: 63% (980/1555)
remote: Compressing objects: 64% (996/1555)
remote: Compressing objects: 65% (1011/1555)
remote: Compressing objects: 66% (1027/1555)
remote: Compressing objects: 67% (1042/1555)
remote: Compressing objects: 68% (1058/1555)
remote: Compressing objects: 69% (1073/1555)
remote: Compressing objects: 70% (1089/1555)
remote: Compressing objects: 71% (1105/1555)
remote: Compressing objects: 72% (1120/1555)
remote: Compressing objects: 73% (1136/1555)
remote: Compressing objects: 74% (1151/1555)
remote: Compressing objects: 75% (1167/1555)
remote: Compressing objects: 76% (1182/1555)
remote: Compressing objects: 77% (1198/1555)
remote: Compressing objects: 78% (1213/1555)
remote: Compressing objects: 79% (1229/1555)
remote: Compressing objects: 80% (1244/1555)
remote: Compressing objects: 81% (1260/1555)
remote: Compressing objects: 82% (1276/1555)
remote: Compressing objects: 83% (1291/1555)
remote: Compressing objects: 84% (1307/1555)
remote: Compressing objects: 85% (1322/1555)
remote: Compressing objects: 86% (1338/1555)
remote: Compressing objects: 87% (1353/1555)
remote: Compressing objects: 88% (1369/1555)
remote: Compressing objects: 89% (1384/1555)
remote: Compressing objects: 90% (1400/1555)
remote: Compressing objects: 91% (1416/1555)
remote: Compressing objects: 92% (1431/1555)
remote: Compressing objects: 93% (1447/1555)
remote: Compressing objects: 94% (1462/1555)
remote: Compressing objects: 95% (1478/1555)
remote: Compressing objects: 96% (1493/1555)
remote: Compressing objects: 97% (1509/1555)
remote: Compressing objects: 98% (1524/1555)
remote: Compressing objects: 99% (1540/1555)
remote: Compressing objects: 100% (1555/1555)
remote: Compressing objects: 100% (1555/1555), done.
7.93 s
Receiving objects: 0% (1/82005)
Receiving objects: 1% (821/82005)
Receiving objects: 2% (1641/82005)
Receiving objects: 3% (2461/82005)
Receiving objects: 4% (3281/82005)
Receiving objects: 5% (4101/82005)
Receiving objects: 6% (4921/82005), 9.33 MiB | 18.64 MiB/s
Receiving objects: 7% (5741/82005), 9.33 MiB | 18.64 MiB/s
Receiving objects: 8% (6561/82005), 9.33 MiB | 18.64 MiB/s
Receiving objects: 9% (7381/82005), 9.33 MiB | 18.64 MiB/s
Receiving objects: 10% (8201/82005), 9.33 MiB | 18.64 MiB/s
Receiving objects: 11% (9021/82005), 9.33 MiB | 18.64 MiB/s
Receiving objects: 12% (9841/82005), 9.33 MiB | 18.64 MiB/s
Receiving objects: 13% (10661/82005), 9.33 MiB | 18.64 MiB/s
Receiving objects: 14% (11481/82005), 9.33 MiB | 18.64 MiB/s
Receiving objects: 15% (12301/82005), 9.33 MiB | 18.64 MiB/s
Receiving objects: 16% (13121/82005), 9.33 MiB | 18.64 MiB/s
Receiving objects: 17% (13941/82005), 9.33 MiB | 18.64 MiB/s
Receiving objects: 18% (14761/82005), 9.33 MiB | 18.64 MiB/s
Receiving objects: 19% (15581/82005), 9.33 MiB | 18.64 MiB/s
Receiving objects: 20% (16401/82005), 9.33 MiB | 18.64 MiB/s
Receiving objects: 21% (17222/82005), 9.33 MiB | 18.64 MiB/s
Receiving objects: 22% (18042/82005), 9.33 MiB | 18.64 MiB/s
Receiving objects: 23% (18862/82005), 9.33 MiB | 18.64 MiB/s
Receiving objects: 24% (19682/82005), 9.33 MiB | 18.64 MiB/s
Receiving objects: 25% (20502/82005), 9.33 MiB | 18.64 MiB/s
Receiving objects: 26% (21322/82005), 9.33 MiB | 18.64 MiB/s
Receiving objects: 27% (22142/82005), 9.33 MiB | 18.64 MiB/s
Receiving objects: 28% (22962/82005), 9.33 MiB | 18.64 MiB/s
Receiving objects: 29% (23782/82005), 9.33 MiB | 18.64 MiB/s
Receiving objects: 30% (24602/82005), 9.33 MiB | 18.64 MiB/s
Receiving objects: 31% (25422/82005), 9.33 MiB | 18.64 MiB/s
Receiving objects: 32% (26242/82005), 9.33 MiB | 18.64 MiB/s
Receiving objects: 33% (27062/82005), 9.33 MiB | 18.64 MiB/s
Receiving objects: 34% (27882/82005), 9.33 MiB | 18.64 MiB/s
Receiving objects: 35% (28702/82005), 9.33 MiB | 18.64 MiB/s
Receiving objects: 36% (29522/82005), 9.33 MiB | 18.64 MiB/s
Receiving objects: 37% (30342/82005), 9.33 MiB | 18.64 MiB/s
Receiving objects: 38% (31162/82005), 9.33 MiB | 18.64 MiB/s
Receiving objects: 39% (31982/82005), 9.33 MiB | 18.64 MiB/s
Receiving objects: 39% (32642/82005), 29.94 MiB | 29.90 MiB/s
Receiving objects: 40% (32802/82005), 29.94 MiB | 29.90 MiB/s
Receiving objects: 41% (33623/82005), 29.94 MiB | 29.90 MiB/s
Receiving objects: 42% (34443/82005), 29.94 MiB | 29.90 MiB/s
Receiving objects: 43% (35263/82005), 29.94 MiB | 29.90 MiB/s
Receiving objects: 44% (36083/82005), 29.94 MiB | 29.90 MiB/s
Receiving objects: 45% (36903/82005), 29.94 MiB | 29.90 MiB/s
Receiving objects: 46% (37723/82005), 29.94 MiB | 29.90 MiB/s
Receiving objects: 47% (38543/82005), 29.94 MiB | 29.90 MiB/s
Receiving objects: 48% (39363/82005), 29.94 MiB | 29.90 MiB/s
Receiving objects: 49% (40183/82005), 45.82 MiB | 30.32 MiB/s
Receiving objects: 50% (41003/82005), 45.82 MiB | 30.32 MiB/s
Receiving objects: 51% (41823/82005), 45.82 MiB | 30.32 MiB/s
Receiving objects: 52% (42643/82005), 45.82 MiB | 30.32 MiB/s
Receiving objects: 53% (43463/82005), 45.82 MiB | 30.32 MiB/s
Receiving objects: 54% (44283/82005), 45.82 MiB | 30.32 MiB/s
Receiving objects: 55% (45103/82005), 45.82 MiB | 30.32 MiB/s
Receiving objects: 56% (45923/82005), 45.82 MiB | 30.32 MiB/s
Receiving objects: 57% (46743/82005), 45.82 MiB | 30.32 MiB/s
Receiving objects: 58% (47563/82005), 45.82 MiB | 30.32 MiB/s
Receiving objects: 59% (48383/82005), 45.82 MiB | 30.32 MiB/s
Receiving objects: 59% (48725/82005), 62.38 MiB | 31.02 MiB/s
Receiving objects: 60% (49203/82005), 62.38 MiB | 31.02 MiB/s
Receiving objects: 61% (50024/82005), 62.38 MiB | 31.02 MiB/s
Receiving objects: 62% (50844/82005), 62.38 MiB | 31.02 MiB/s
Receiving objects: 63% (51664/82005), 62.38 MiB | 31.02 MiB/s
Receiving objects: 64% (52484/82005), 62.38 MiB | 31.02 MiB/s
Receiving objects: 65% (53304/82005), 62.38 MiB | 31.02 MiB/s
Receiving objects: 66% (54124/82005), 79.01 MiB | 31.48 MiB/s
Receiving objects: 67% (54944/82005), 79.01 MiB | 31.48 MiB/s
Receiving objects: 68% (55764/82005), 79.01 MiB | 31.48 MiB/s
Receiving objects: 69% (56584/82005), 79.01 MiB | 31.48 MiB/s
Receiving objects: 70% (57404/82005), 79.01 MiB | 31.48 MiB/s
Receiving objects: 71% (58224/82005), 79.01 MiB | 31.48 MiB/s
Receiving objects: 72% (59044/82005), 79.01 MiB | 31.48 MiB/s
Receiving objects: 73% (59864/82005), 79.01 MiB | 31.48 MiB/s
Receiving objects: 74% (60684/82005), 79.01 MiB | 31.48 MiB/s
Receiving objects: 75% (61504/82005), 79.01 MiB | 31.48 MiB/s
Receiving objects: 75% (61830/82005), 79.01 MiB | 31.48 MiB/s
Receiving objects: 76% (62324/82005), 95.05 MiB | 31.58 MiB/s
Receiving objects: 77% (63144/82005), 95.05 MiB | 31.58 MiB/s
Receiving objects: 78% (63964/82005), 95.05 MiB | 31.58 MiB/s
Receiving objects: 79% (64784/82005), 95.05 MiB | 31.58 MiB/s
Receiving objects: 80% (65604/82005), 95.05 MiB | 31.58 MiB/s
Receiving objects: 81% (66425/82005), 95.05 MiB | 31.58 MiB/s
Receiving objects: 82% (67245/82005), 111.19 MiB | 31.60 MiB/s
Receiving objects: 83% (68065/82005), 111.19 MiB | 31.60 MiB/s
Receiving objects: 84% (68885/82005), 111.19 MiB | 31.60 MiB/s
Receiving objects: 85% (69705/82005), 111.19 MiB | 31.60 MiB/s
Receiving objects: 86% (70525/82005), 111.19 MiB | 31.60 MiB/s
Receiving objects: 87% (71345/82005), 111.19 MiB | 31.60 MiB/s
Receiving objects: 88% (72165/82005), 111.19 MiB | 31.60 MiB/s
Receiving objects: 89% (72985/82005), 111.19 MiB | 31.60 MiB/s
Receiving objects: 90% (73805/82005), 111.19 MiB | 31.60 MiB/s
Receiving objects: 91% (74625/82005), 111.19 MiB | 31.60 MiB/s
Receiving objects: 92% (75445/82005), 111.19 MiB | 31.60 MiB/s
Receiving objects: 93% (76265/82005), 111.19 MiB | 31.60 MiB/s
Receiving objects: 94% (77085/82005), 111.19 MiB | 31.60 MiB/s
Receiving objects: 95% (77905/82005), 111.19 MiB | 31.60 MiB/s
Receiving objects: 96% (78725/82005), 111.19 MiB | 31.60 MiB/s
Receiving objects: 97% (79545/82005), 111.19 MiB | 31.60 MiB/s
Receiving objects: 98% (80365/82005), 111.19 MiB | 31.60 MiB/s
Receiving objects: 99% (81185/82005), 111.19 MiB | 31.60 MiB/s
Receiving objects: 99% (81429/82005), 111.19 MiB | 31.60 MiB/s
remote: Total 82005 (delta 7212), reused 6647 (delta 6647), pack-reused 73803 (from 3)
7.94 s
Receiving objects: 100% (82005/82005), 127.54 MiB | 31.74 MiB/s
Receiving objects: 100% (82005/82005), 127.98 MiB | 31.75 MiB/s, done.
10.31 s
Resolving deltas: 0% (0/55486)
Resolving deltas: 1% (555/55486)
Resolving deltas: 2% (1110/55486)
Resolving deltas: 3% (1666/55486)
Resolving deltas: 4% (2220/55486)
Resolving deltas: 5% (2775/55486)
Resolving deltas: 6% (3330/55486)
Resolving deltas: 7% (3885/55486)
Resolving deltas: 8% (4439/55486)
Resolving deltas: 9% (4994/55486)
Resolving deltas: 10% (5549/55486)
Resolving deltas: 11% (6104/55486)
Resolving deltas: 12% (6659/55486)
Resolving deltas: 13% (7215/55486)
Resolving deltas: 14% (7769/55486)
Resolving deltas: 15% (8323/55486)
Resolving deltas: 16% (8878/55486)
Resolving deltas: 17% (9433/55486)
Resolving deltas: 18% (9988/55486)
Resolving deltas: 19% (10543/55486)
Resolving deltas: 20% (11098/55486)
Resolving deltas: 21% (11653/55486)
Resolving deltas: 22% (12207/55486)
Resolving deltas: 23% (12762/55486)
Resolving deltas: 24% (13317/55486)
Resolving deltas: 25% (13872/55486)
Resolving deltas: 26% (14429/55486)
Resolving deltas: 27% (14982/55486)
Resolving deltas: 28% (15539/55486)
Resolving deltas: 29% (16091/55486)
Resolving deltas: 30% (16646/55486)
Resolving deltas: 31% (17201/55486)
Resolving deltas: 32% (17756/55486)
Resolving deltas: 33% (18311/55486)
Resolving deltas: 34% (18866/55486)
Resolving deltas: 35% (19421/55486)
Resolving deltas: 36% (19975/55486)
Resolving deltas: 37% (20530/55486)
Resolving deltas: 38% (21085/55486)
Resolving deltas: 39% (21640/55486)
Resolving deltas: 40% (22195/55486)
Resolving deltas: 41% (22750/55486)
Resolving deltas: 42% (23305/55486)
Resolving deltas: 43% (23859/55486)
Resolving deltas: 44% (24414/55486)
Resolving deltas: 45% (24969/55486)
Resolving deltas: 46% (25524/55486)
Resolving deltas: 47% (26079/55486)
Resolving deltas: 48% (26634/55486)
Resolving deltas: 49% (27189/55486)
Resolving deltas: 50% (27743/55486)
Resolving deltas: 51% (28298/55486)
Resolving deltas: 52% (28853/55486)
Resolving deltas: 53% (29408/55486)
Resolving deltas: 54% (29963/55486)
Resolving deltas: 55% (30518/55486)
Resolving deltas: 56% (31073/55486)
Resolving deltas: 56% (31505/55486)
Resolving deltas: 57% (31628/55486)
Resolving deltas: 58% (32182/55486)
Resolving deltas: 59% (32737/55486)
Resolving deltas: 60% (33292/55486)
Resolving deltas: 61% (33847/55486)
Resolving deltas: 62% (34403/55486)
Resolving deltas: 63% (34957/55486)
Resolving deltas: 64% (35512/55486)
Resolving deltas: 65% (36066/55486)
Resolving deltas: 66% (36621/55486)
Resolving deltas: 67% (37176/55486)
Resolving deltas: 68% (37731/55486)
Resolving deltas: 69% (38286/55486)
Resolving deltas: 70% (38841/55486)
Resolving deltas: 71% (39396/55486)
Resolving deltas: 72% (39950/55486)
Resolving deltas: 73% (40505/55486)
Resolving deltas: 74% (41060/55486)
Resolving deltas: 75% (41615/55486)
Resolving deltas: 76% (42170/55486)
Resolving deltas: 77% (42725/55486)
Resolving deltas: 78% (43280/55486)
Resolving deltas: 79% (43834/55486)
Resolving deltas: 80% (44389/55486)
Resolving deltas: 81% (44944/55486)
Resolving deltas: 82% (45499/55486)
Resolving deltas: 83% (46054/55486)
Resolving deltas: 83% (46226/55486)
Resolving deltas: 84% (46611/55486)
Resolving deltas: 85% (47164/55486)
Resolving deltas: 86% (47719/55486)
Resolving deltas: 87% (48273/55486)
Resolving deltas: 88% (48828/55486)
Resolving deltas: 89% (49383/55486)
Resolving deltas: 90% (49938/55486)
Resolving deltas: 91% (50493/55486)
Resolving deltas: 92% (51048/55486)
Resolving deltas: 93% (51602/55486)
Resolving deltas: 94% (52157/55486)
Resolving deltas: 95% (52712/55486)
Resolving deltas: 96% (53267/55486)
Resolving deltas: 97% (53822/55486)
Resolving deltas: 98% (54377/55486)
Resolving deltas: 99% (54932/55486)
Resolving deltas: 100% (55486/55486)
Resolving deltas: 100% (55486/55486), done.
10.83 s
Fetching commit 3ac50f3815c6073e4c79182c5d6ad6bb9b59126b for wip/native-symbolica-hyperbolics ...
10.84 s
$ /nix/store/bcnisk3ydfgv26v2gw3zlky24g00yww2-git-2.54.0/bin/git fetch origin 3ac50f3815c6073e4c79182c5d6ad6bb9b59126b
11.47 s
From https://github.com/alphal00p/gammaloop
11.47 s
* branch 3ac50f3815c6073e4c79182c5d6ad6bb9b59126b -> FETCH_HEAD
11.52 s
$ /nix/store/9ypz3flqsrl5xl495mm8h645gadjsxi1-coreutils-9.11/bin/timeout --kill-after=15s 7200s /nix/store/bcnisk3ydfgv26v2gw3zlky24g00yww2-git-2.54.0/bin/git -c advice.detachedHead=false checkout 3ac50f3815c6073e4c79182c5d6ad6bb9b59126b
11.79 s
HEAD is now at 3ac50f381 Adjust CFF test tolerances and comments
11.81 s
$ /nix/store/9ypz3flqsrl5xl495mm8h645gadjsxi1-coreutils-9.11/bin/timeout --kill-after=15s 7200s /nix/store/23zk8sgzamrbmj1fday15szf7f2279s8-nix-2.34.7/bin/nix --extra-experimental-features nix-command --extra-experimental-features flakes --log-format internal-json run .#packages.x86_64-linux.nix-ci-check-gammaloop-nextest-core --print-build-logs
17.20 s
24.13 s
evaluating derivation 'g
copying '/nix/store/6cs6
evaluating derivation 'g
copying '/nix/store/6cs6
evaluating derivation 'g
copying '/nix/store/6cs6
evaluating derivation 'g
copying '/nix/store/6cs6
evaluating derivation 'g
copying '/nix/store/6cs6
evaluating derivation 'g
copying '/nix/store/6cs6
evaluating derivation 'g
copying '/nix/store/6cs6
evaluating derivation 'g
copying '/nix/store/6cs6
evaluating derivation 'g
copying '/nix/store/6cs6
evaluating derivation 'g
querying gammaloop-nexte
[0 /1 built, 0.0 KiB DL]
[1 /0 /1 built, 0.0 KiB DLgammaloop-nextest-core> Extracting 3 binaries (including 1 non-test binary), 1 build script output directory, and 2 linked paths to /build/nextest-archive-106veQ
24.79 s
gammaloop-nextest-core> Extracted 18 files to /build/nextest-archive-106veQ in 0.66s
24.84 s
gammaloop-nextest-core> ------------
24.84 s
gammaloop-nextest-core> Nextest run ID e802c22d-893a-4b1b-8309-3110808ba440 with nextest profile: ci_gammaloop
24.84 s
gammaloop-nextest-core> Starting 339 tests across 2 binaries
25.72 s
gammaloop-nextest-core> ------------
25.72 s
gammaloop-nextest-core> Summary [ 0.878s] 339 tests run: 339 passed , 0 skipped
25.84 s
gammaloop-nextest-core>
25.84 s
gammaloop-nextest-core> ========== nextest test summary ==========
25.84 s
gammaloop-nextest-core> report: target/nextest/ci_gammaloop/junit.xml
25.84 s
gammaloop-nextest-core> tests: 339, failures: 0, errors: 0
25.84 s
gammaloop-nextest-core> No failing testcases found.
25.84 s
gammaloop-nextest-core> =========================================
25.87 s
gammaloop-nextest-core> Extracting 1 binary and 1 linked path to /build/nextest-archive-vqDYln
25.94 s
gammaloop-nextest-core> Extracted 7 files to /build/nextest-archive-vqDYln in 0.07s
25.97 s
gammaloop-nextest-core> ------------
25.97 s
gammaloop-nextest-core> Nextest run ID d917154a-1b4c-4e68-b001-ef64655c6224 with nextest profile: ci_gammaloop
25.97 s
gammaloop-nextest-core> Starting 19 tests across 1 binary
26.03 s
gammaloop-nextest-core> ------------
26.03 s
gammaloop-nextest-core> Summary [ 0.057s] 19 tests run: 19 passed , 0 skipped
26.09 s
gammaloop-nextest-core>
26.09 s
gammaloop-nextest-core> ========== nextest test summary ==========
26.09 s
gammaloop-nextest-core> report: target/nextest/ci_gammaloop/junit.xml
26.09 s
gammaloop-nextest-core> tests: 19, failures: 0, errors: 0
26.09 s
gammaloop-nextest-core> No failing testcases found.
26.09 s
gammaloop-nextest-core> =========================================
26.12 s
gammaloop-nextest-core> Extracting 1 binary to /build/nextest-archive-RIbB8d
26.17 s
gammaloop-nextest-core> Extracted 4 files to /build/nextest-archive-RIbB8d in 0.06s
26.20 s
gammaloop-nextest-core> ------------
26.20 s
gammaloop-nextest-core> Nextest run ID 92153dc2-4c93-4e77-9c01-4cbba6c135d0 with nextest profile: ci_gammaloop
26.20 s
gammaloop-nextest-core> Starting 0 tests across 1 binary
26.20 s
gammaloop-nextest-core> ------------
26.20 s
gammaloop-nextest-core> Summary [ 0.001s] 0 tests run: 0 passed , 0 skipped
26.25 s
gammaloop-nextest-core>
26.25 s
gammaloop-nextest-core> ========== nextest test summary ==========
26.25 s
gammaloop-nextest-core> report: target/nextest/ci_gammaloop/junit.xml
26.25 s
gammaloop-nextest-core> tests: 0, failures: 0, errors: 0
26.25 s
gammaloop-nextest-core> No failing testcases found.
26.25 s
gammaloop-nextest-core> =========================================
26.29 s
gammaloop-nextest-core> Extracting 4 binaries, 1 build script output directory, and 2 linked paths to /build/nextest-archive-M8Hzxx
26.80 s
gammaloop-nextest-core> Extracted 18 files to /build/nextest-archive-M8Hzxx in 0.52s
26.85 s
gammaloop-nextest-core> ------------
26.85 s
gammaloop-nextest-core> Nextest run ID f56f621a-aac0-4067-9119-fa7e30b1da21 with nextest profile: ci_gammaloop
26.85 s
gammaloop-nextest-core> Starting 488 tests across 4 binaries (61 tests skipped , including 60 tests via profile.ci_gammaloop.default-filter )
29.27 s
gammaloop-nextest-core> FAIL [ 2.303s] (459/488) gammalooprs graph::feynman_graph::tests :: native_thermal_distributions
29.27 s
gammaloop-nextest-core> stdout ---
29.27 s
gammaloop-nextest-core>
29.27 s
gammaloop-nextest-core> running 1 test
29.27 s
gammaloop-nextest-core> test graph::feynman_graph::tests::native_thermal_distributions ... FAILED
29.27 s
gammaloop-nextest-core>
29.27 s
gammaloop-nextest-core> failures:
29.27 s
gammaloop-nextest-core>
29.27 s
gammaloop-nextest-core> failures:
29.27 s
gammaloop-nextest-core> graph::feynman_graph::tests::native_thermal_distributions
29.27 s
gammaloop-nextest-core>
29.27 s
gammaloop-nextest-core> test result: FAILED. 0 passed; 1 failed; 0 ignored; 0 measured; 540 filtered out; finished in 2.28s
29.27 s
gammaloop-nextest-core>
29.27 s
gammaloop-nextest-core> stderr ---
29.27 s
gammaloop-nextest-core> The application panicked (crashed).
29.27 s
gammaloop-nextest-core> Message: called `Result::unwrap()` on an `Err` value: Custom { kind: Other, error: "Could not compile code: g++ -shared -O3 -fPIC -ffast-math -funsafe-math-optimizations -march=native -o /build/gammaloop-native-thermal-1345/thermal_0_0.so /build/gammaloop-native-thermal-1345/thermal_0_0.cpp\nwarning: Skipping impure flag -march=native because NIX_ENFORCE_NO_NATIVE is set\n/build/gammaloop-native-thermal-1345/thermal_0_0.cpp: In function 'void thermal_realf64(const double*, double*, double*)':\n/build/gammaloop-native-thermal-1345/thermal_0_0.cpp:27:16: error: 'symbolica_tanh' was not declared in this scope\n 27 | Z[6] = symbolica_tanh(Z[6]);\n | ^~~~~~~~~~~~~~\n" }
29.27 s
gammaloop-nextest-core> Location: crates/gammalooprs/src/graph/feynman_graph.rs :937
29.27 s
gammaloop-nextest-core>
29.27 s
gammaloop-nextest-core> ━━━━━━━━━━━━━━━━━━━━━━━━━━━━━━━━━━ BACKTRACE ━━━━━━━━━━━━━━━━━━━━━━━━━━━━━━━━━━━
29.27 s
gammaloop-nextest-core> 1: <color_eyre[b0c9e66060e883b2]::config::PanicHook>::panic_report <unknown>
29.27 s
gammaloop-nextest-core> at <unknown source file> :<unknown line>
29.27 s
gammaloop-nextest-core> 2: <color_eyre[b0c9e66060e883b2]::config::PanicHook>::into_panic_hook::{closure#0} <unknown>
29.27 s
gammaloop-nextest-core> at <unknown source file> :<unknown line>
29.27 s
gammaloop-nextest-core> 3: std[bcb96dfbba0ab899]::panicking::panic_with_hook <unknown>
29.27 s
gammaloop-nextest-core> at <unknown source file> :<unknown line>
29.27 s
gammaloop-nextest-core> 4: std[bcb96dfbba0ab899]::panicking::panic_handler::{closure#0} <unknown>
29.27 s
gammaloop-nextest-core> at <unknown source file> :<unknown line>
29.27 s
gammaloop-nextest-core> 5: std[bcb96dfbba0ab899]::sys::backtrace::__rust_end_short_backtrace::<std[bcb96dfbba0ab899]::panicking::panic_handler::{closure#0}, !> <unknown>
29.27 s
gammaloop-nextest-core> at <unknown source file> :<unknown line>
29.27 s
gammaloop-nextest-core> 6: __rustc[6c289b9f9c454d21]::rust_begin_unwind <unknown>
29.27 s
gammaloop-nextest-core> at <unknown source file> :<unknown line>
29.27 s
gammaloop-nextest-core> 7: core[940e698046960fd5]::panicking::panic_fmt <unknown>
29.27 s
gammaloop-nextest-core> at <unknown source file> :<unknown line>
29.27 s
gammaloop-nextest-core> 8: core[940e698046960fd5]::result::unwrap_failed <unknown>
29.27 s
gammaloop-nextest-core> at <unknown source file> :<unknown line>
29.27 s
gammaloop-nextest-core> 9: gammalooprs[f21b74aec46f5289]::graph::feynman_graph::tests::native_thermal_distributions <unknown>
29.27 s
gammaloop-nextest-core> at <unknown source file> :<unknown line>
29.27 s
gammaloop-nextest-core> 10: <gammalooprs[f21b74aec46f5289]::graph::feynman_graph::tests::native_thermal_distributions::{closure#0} as core[940e698046960fd5]::ops::function::FnOnce<()>>::call_once <unknown>
29.27 s
gammaloop-nextest-core> at <unknown source file> :<unknown line>
29.27 s
gammaloop-nextest-core> 11: test[75d6903177b1d7e9]::__rust_begin_short_backtrace::<core[940e698046960fd5]::result::Result<(), alloc[2ea6bcb46fca0c42]::string::String>, fn() -> core[940e698046960fd5]::result::Result<(), alloc[2ea6bcb46fca0c42]::string::String>> <unknown>
29.27 s
gammaloop-nextest-core> at <unknown source file> :<unknown line>
29.27 s
gammaloop-nextest-core> 12: test[75d6903177b1d7e9]::run_test::{closure#0} <unknown>
29.27 s
gammaloop-nextest-core> at <unknown source file> :<unknown line>
29.27 s
gammaloop-nextest-core> 13: std[bcb96dfbba0ab899]::sys::backtrace::__rust_begin_short_backtrace::<test[75d6903177b1d7e9]::run_test::{closure#1}, ()> <unknown>
29.27 s
gammaloop-nextest-core> at <unknown source file> :<unknown line>
29.27 s
gammaloop-nextest-core> 14: <std[bcb96dfbba0ab899]::thread::lifecycle::spawn_unchecked<test[75d6903177b1d7e9]::run_test::{closure#1}, ()>::{closure#1} as core[940e698046960fd5]::ops::function::FnOnce<()>>::call_once::{shim:vtable#0} <unknown>
29.27 s
gammaloop-nextest-core> at <unknown source file> :<unknown line>
29.27 s
gammaloop-nextest-core> 15: <std[bcb96dfbba0ab899]::sys::thread::unix::Thread>::new::thread_start <unknown>
29.27 s
gammaloop-nextest-core> at <unknown source file> :<unknown line>
29.27 s
gammaloop-nextest-core> 16: start_thread <unknown>
29.27 s
gammaloop-nextest-core> at <unknown source file> :<unknown line>
29.27 s
gammaloop-nextest-core> 17: __clone3 <unknown>
29.27 s
gammaloop-nextest-core> at <unknown source file> :<unknown line>
29.27 s
gammaloop-nextest-core>
29.27 s
gammaloop-nextest-core> Run with COLORBT_SHOW_HIDDEN=1 environment variable to disable frame filtering.
29.27 s
gammaloop-nextest-core> Run with RUST_BACKTRACE=full to include source snippets.
29.27 s
gammaloop-nextest-core>
41.80 s
gammaloop-nextest-core> ------------
41.80 s
gammaloop-nextest-core> Summary [ 14.947s] 488 tests run: 487 passed , 1 failed , 61 skipped
41.80 s
gammaloop-nextest-core> FAIL [ 2.303s] (459/488) gammalooprs graph::feynman_graph::tests :: native_thermal_distributions
41.80 s
gammaloop-nextest-core> stdout ---
41.80 s
gammaloop-nextest-core>
41.80 s
gammaloop-nextest-core> running 1 test
41.80 s
gammaloop-nextest-core> test graph::feynman_graph::tests::native_thermal_distributions ... FAILED
41.80 s
gammaloop-nextest-core>
41.80 s
gammaloop-nextest-core> failures:
41.80 s
gammaloop-nextest-core>
41.80 s
gammaloop-nextest-core> failures:
41.80 s
gammaloop-nextest-core> graph::feynman_graph::tests::native_thermal_distributions
41.80 s
gammaloop-nextest-core>
41.80 s
gammaloop-nextest-core> test result: FAILED. 0 passed; 1 failed; 0 ignored; 0 measured; 540 filtered out; finished in 2.28s
41.80 s
gammaloop-nextest-core>
41.80 s
gammaloop-nextest-core> stderr ---
41.80 s
gammaloop-nextest-core> The application panicked (crashed).
41.80 s
gammaloop-nextest-core> Message: called `Result::unwrap()` on an `Err` value: Custom { kind: Other, error: "Could not compile code: g++ -shared -O3 -fPIC -ffast-math -funsafe-math-optimizations -march=native -o /build/gammaloop-native-thermal-1345/thermal_0_0.so /build/gammaloop-native-thermal-1345/thermal_0_0.cpp\nwarning: Skipping impure flag -march=native because NIX_ENFORCE_NO_NATIVE is set\n/build/gammaloop-native-thermal-1345/thermal_0_0.cpp: In function 'void thermal_realf64(const double*, double*, double*)':\n/build/gammaloop-native-thermal-1345/thermal_0_0.cpp:27:16: error: 'symbolica_tanh' was not declared in this scope\n 27 | Z[6] = symbolica_tanh(Z[6]);\n | ^~~~~~~~~~~~~~\n" }
41.80 s
gammaloop-nextest-core> Location: crates/gammalooprs/src/graph/feynman_graph.rs :937
41.80 s
gammaloop-nextest-core>
41.80 s
gammaloop-nextest-core> ━━━━━━━━━━━━━━━━━━━━━━━━━━━━━━━━━━ BACKTRACE ━━━━━━━━━━━━━━━━━━━━━━━━━━━━━━━━━━━
41.80 s
gammaloop-nextest-core> 1: <color_eyre[b0c9e66060e883b2]::config::PanicHook>::panic_report <unknown>
41.80 s
gammaloop-nextest-core> at <unknown source file> :<unknown line>
41.80 s
gammaloop-nextest-core> 2: <color_eyre[b0c9e66060e883b2]::config::PanicHook>::into_panic_hook::{closure#0} <unknown>
41.80 s
gammaloop-nextest-core> at <unknown source file> :<unknown line>
41.80 s
gammaloop-nextest-core> 3: std[bcb96dfbba0ab899]::panicking::panic_with_hook <unknown>
41.80 s
gammaloop-nextest-core> at <unknown source file> :<unknown line>
41.80 s
gammaloop-nextest-core> 4: std[bcb96dfbba0ab899]::panicking::panic_handler::{closure#0} <unknown>
41.80 s
gammaloop-nextest-core> at <unknown source file> :<unknown line>
41.80 s
gammaloop-nextest-core> 5: std[bcb96dfbba0ab899]::sys::backtrace::__rust_end_short_backtrace::<std[bcb96dfbba0ab899]::panicking::panic_handler::{closure#0}, !> <unknown>
41.80 s
gammaloop-nextest-core> at <unknown source file> :<unknown line>
41.80 s
gammaloop-nextest-core> 6: __rustc[6c289b9f9c454d21]::rust_begin_unwind <unknown>
41.80 s
gammaloop-nextest-core> at <unknown source file> :<unknown line>
41.80 s
gammaloop-nextest-core> 7: core[940e698046960fd5]::panicking::panic_fmt <unknown>
41.80 s
gammaloop-nextest-core> at <unknown source file> :<unknown line>
41.80 s
gammaloop-nextest-core> 8: core[940e698046960fd5]::result::unwrap_failed <unknown>
41.80 s
gammaloop-nextest-core> at <unknown source file> :<unknown line>
41.80 s
gammaloop-nextest-core> 9: gammalooprs[f21b74aec46f5289]::graph::feynman_graph::tests::native_thermal_distributions <unknown>
41.80 s
gammaloop-nextest-core> at <unknown source file> :<unknown line>
41.80 s
gammaloop-nextest-core> 10: <gammalooprs[f21b74aec46f5289]::graph::feynman_graph::tests::native_thermal_distributions::{closure#0} as core[940e698046960fd5]::ops::function::FnOnce<()>>::call_once <unknown>
41.80 s
gammaloop-nextest-core> at <unknown source file> :<unknown line>
41.80 s
gammaloop-nextest-core> 11: test[75d6903177b1d7e9]::__rust_begin_short_backtrace::<core[940e698046960fd5]::result::Result<(), alloc[2ea6bcb46fca0c42]::string::String>, fn() -> core[940e698046960fd5]::result::Result<(), alloc[2ea6bcb46fca0c42]::string::String>> <unknown>
41.80 s
gammaloop-nextest-core> at <unknown source file> :<unknown line>
41.80 s
gammaloop-nextest-core> 12: test[75d6903177b1d7e9]::run_test::{closure#0} <unknown>
41.80 s
gammaloop-nextest-core> at <unknown source file> :<unknown line>
41.80 s
gammaloop-nextest-core> 13: std[bcb96dfbba0ab899]::sys::backtrace::__rust_begin_short_backtrace::<test[75d6903177b1d7e9]::run_test::{closure#1}, ()> <unknown>
41.80 s
gammaloop-nextest-core> at <unknown source file> :<unknown line>
41.80 s
gammaloop-nextest-core> 14: <std[bcb96dfbba0ab899]::thread::lifecycle::spawn_unchecked<test[75d6903177b1d7e9]::run_test::{closure#1}, ()>::{closure#1} as core[940e698046960fd5]::ops::function::FnOnce<()>>::call_once::{shim:vtable#0} <unknown>
41.80 s
gammaloop-nextest-core> at <unknown source file> :<unknown line>
41.80 s
gammaloop-nextest-core> 15: <std[bcb96dfbba0ab899]::sys::thread::unix::Thread>::new::thread_start <unknown>
41.80 s
gammaloop-nextest-core> at <unknown source file> :<unknown line>
41.80 s
gammaloop-nextest-core> 16: start_thread <unknown>
41.80 s
gammaloop-nextest-core> at <unknown source file> :<unknown line>
41.80 s
gammaloop-nextest-core> 17: __clone3 <unknown>
41.80 s
gammaloop-nextest-core> at <unknown source file> :<unknown line>
41.80 s
gammaloop-nextest-core>
41.80 s
gammaloop-nextest-core> Run with COLORBT_SHOW_HIDDEN=1 environment variable to disable frame filtering.
41.80 s
gammaloop-nextest-core> Run with RUST_BACKTRACE=full to include source snippets.
41.80 s
gammaloop-nextest-core>
41.88 s
gammaloop-nextest-core> error : test run failed
41.91 s
gammaloop-nextest-core>
41.91 s
gammaloop-nextest-core> ========== nextest test summary ==========
41.91 s
gammaloop-nextest-core> report: target/nextest/ci_gammaloop/junit.xml
41.91 s
gammaloop-nextest-core> tests: 488, failures: 1, errors: 0
41.91 s
gammaloop-nextest-core>
41.91 s
gammaloop-nextest-core> 1. gammalooprs::graph::feynman_graph::tests::native_thermal_distributions
41.91 s
gammaloop-nextest-core> failure: test failure with exit code 101
41.91 s
gammaloop-nextest-core> system-out
41.91 s
gammaloop-nextest-core> running 1 test
41.91 s
gammaloop-nextest-core> test graph::feynman_graph::tests::native_thermal_distributions ... FAILED
41.91 s
gammaloop-nextest-core>
41.91 s
gammaloop-nextest-core> failures:
41.91 s
gammaloop-nextest-core>
41.91 s
gammaloop-nextest-core> failures:
41.91 s
gammaloop-nextest-core> graph::feynman_graph::tests::native_thermal_distributions
41.91 s
gammaloop-nextest-core>
41.91 s
gammaloop-nextest-core> test result: FAILED. 0 passed; 1 failed; 0 ignored; 0 measured; 540 filtered out; finished in 2.28s
41.91 s
gammaloop-nextest-core> system-err
41.91 s
gammaloop-nextest-core> The application panicked (crashed).
41.91 s
gammaloop-nextest-core> Message: called `Result::unwrap()` on an `Err` value: Custom { kind: Other, error: "Could not compile code: g++ -shared -O3 -fPIC -ffast-math -funsafe-math-optimizations -march=native -o /build/gammaloop-native-thermal-1345/thermal_0_0.so /build/gammaloop-native-thermal-1345/thermal_0_0.cpp\nwarning: Skipping impure flag -march=native because NIX_ENFORCE_NO_NATIVE is set\n/build/gammaloop-native-thermal-1345/thermal_0_0.cpp: In function 'void thermal_realf64(const double*, double*, double*)':\n/build/gammaloop-native-thermal-1345/thermal_0_0.cpp:27:16: error: 'symbolica_tanh' was not declared in this scope\n 27 | Z[6] = symbolica_tanh(Z[6]);\n | ^~~~~~~~~~~~~~\n" }
41.91 s
gammaloop-nextest-core> Location: crates/gammalooprs/src/graph/feynman_graph.rs:937
41.91 s
gammaloop-nextest-core>
41.91 s
gammaloop-nextest-core> ━━━━━━━━━━━━━━━━━━━━━━━━━━━━━━━━━━ BACKTRACE ━━━━━━━━━━━━━━━━━━━━━━━━━━━━━━━━━━━
41.91 s
gammaloop-nextest-core> 1: <color_eyre[b0c9e66060e883b2]::config::PanicHook>::panic_report<unknown>
41.91 s
gammaloop-nextest-core> at <unknown source file>:<unknown line>
41.91 s
gammaloop-nextest-core> 2: <color_eyre[b0c9e66060e883b2]::config::PanicHook>::into_panic_hook::{closure#0}<unknown>
41.91 s
gammaloop-nextest-core> at <unknown source file>:<unknown line>
41.91 s
gammaloop-nextest-core> 3: std[bcb96dfbba0ab899]::panicking::panic_with_hook<unknown>
41.91 s
gammaloop-nextest-core> at <unknown source file>:<unknown line>
41.91 s
gammaloop-nextest-core> 4: std[bcb96dfbba0ab899]::panicking::panic_handler::{closure#0}<unknown>
41.91 s
gammaloop-nextest-core> at <unknown source file>:<unknown line>
41.91 s
gammaloop-nextest-core> 5: std[bcb96dfbba0ab899]::sys::backtrace::__rust_end_short_backtrace::<std[bcb96dfbba0ab899]::panicking::panic_handler::{closure#0}, !><unknown>
41.91 s
gammaloop-nextest-core> at <unknown source file>:<unknown line>
41.91 s
gammaloop-nextest-core> 6: __rustc[6c289b9f9c454d21]::rust_begin_unwind<unknown>
41.91 s
gammaloop-nextest-core> at <unknown source file>:<unknown line>
41.91 s
gammaloop-nextest-core> 7: core[940e698046960fd5]::panicking::panic_fmt<unknown>
41.91 s
gammaloop-nextest-core> at <unknown source file>:<unknown line>
41.91 s
gammaloop-nextest-core> 8: core[940e698046960fd5]::result::unwrap_failed<unknown>
41.91 s
gammaloop-nextest-core> at <unknown source file>:<unknown line>
41.91 s
gammaloop-nextest-core> 9: gammalooprs[f21b74aec46f5289]::graph::feynman_graph::tests::native_thermal_distributions<unknown>
41.91 s
gammaloop-nextest-core> at <unknown source file>:<unknown line>
41.91 s
gammaloop-nextest-core> 10: <gammalooprs[f21b74aec46f5289]::graph::feynman_graph::tests::native_thermal_distributions::{closure#0} as core[940e698046960fd5]::ops::function::FnOnce<()>>::call_once<unknown>
41.91 s
gammaloop-nextest-core> at <unknown source file>:<unknown line>
41.91 s
gammaloop-nextest-core> 11: test[75d6903177b1d7e9]::__rust_begin_short_backtrace::<core[940e698046960fd5]::result::Result<(), alloc[2ea6bcb46fca0c42]::string::String>, fn() -> core[940e698046960fd5]::result::Result<(), alloc[2ea6bcb46fca0c42]::string::String>><unknown>
41.91 s
gammaloop-nextest-core> at <unknown source file>:<unknown line>
41.91 s
gammaloop-nextest-core> 12: test[75d6903177b1d7e9]::run_test::{closure#0}<unknown>
41.91 s
gammaloop-nextest-core> at <unknown source file>:<unknown line>
41.91 s
gammaloop-nextest-core> 13: std[bcb96dfbba0ab899]::sys::backtrace::__rust_begin_short_backtrace::<test[75d6903177b1d7e9]::run_test::{closure#1}, ()><unknown>
41.91 s
gammaloop-nextest-core> at <unknown source file>:<unknown line>
41.91 s
gammaloop-nextest-core> 14: <std[bcb96dfbba0ab899]::thread::lifecycle::spawn_unchecked<test[75d6903177b1d7e9]::run_test::{closure#1}, ()>::{closure#1} as core[940e698046960fd5]::ops::function::FnOnce<()>>::call_once::{shim:vtable#0}<unknown>
41.91 s
gammaloop-nextest-core> at <unknown source file>:<unknown line>
41.91 s
gammaloop-nextest-core> 15: <std[bcb96dfbba0ab899]::sys::thread::unix::Thread>::new::thread_start<unknown>
41.91 s
gammaloop-nextest-core> at <unknown source file>:<unknown line>
41.91 s
gammaloop-nextest-core> 16: start_thread<unknown>
41.91 s
gammaloop-nextest-core> at <unknown source file>:<unknown line>
41.91 s
gammaloop-nextest-core> 17: __clone3<unknown>
41.91 s
gammaloop-nextest-core> at <unknown source file>:<unknown line>
41.91 s
gammaloop-nextest-core>
41.91 s
gammaloop-nextest-core> Run with COLORBT_SHOW_HIDDEN=1 environment variable to disable frame filtering.
41.91 s
gammaloop-nextest-core> Run with RUST_BACKTRACE=full to include source snippets.
41.91 s
gammaloop-nextest-core> =========================================
41.98 s
error: Cannot build '/nix/store/8l1symdjd8zyi2xi7czaml0xbwmns2xx-gammaloop-nextest-core.drv '.
41.98 s
Reason: builder failed with exit code 100 .
41.98 s
Output paths:
41.98 s
/nix/store/kfc2lx3b442mniy91bfaj913rbm8qawy-gammaloop-nextest-core
41.98 s
Last 222 log lines:
41.98 s
> Extracting 3 binaries (including 1 non-test binary), 1 build script output directory, and 2 linked paths to /build/nextest-archive-106veQ
41.98 s
> Extracted 18 files to /build/nextest-archive-106veQ in 0.66s
41.98 s
> ------------
41.98 s
> Nextest run ID e802c22d-893a-4b1b-8309-3110808ba440 with nextest profile: ci_gammaloop
41.98 s
> Starting 339 tests across 2 binaries
41.98 s
> ------------
41.98 s
> Summary [ 0.878s] 339 tests run: 339 passed , 0 skipped
41.98 s
>
41.98 s
> ========== nextest test summary ==========
41.98 s
> report: target/nextest/ci_gammaloop/junit.xml
41.98 s
> tests: 339, failures: 0, errors: 0
41.98 s
> No failing testcases found.
41.98 s
> =========================================
41.98 s
> Extracting 1 binary and 1 linked path to /build/nextest-archive-vqDYln
41.98 s
> Extracted 7 files to /build/nextest-archive-vqDYln in 0.07s
41.98 s
> ------------
41.98 s
> Nextest run ID d917154a-1b4c-4e68-b001-ef64655c6224 with nextest profile: ci_gammaloop
41.98 s
> Starting 19 tests across 1 binary
41.98 s
> ------------
41.98 s
> Summary [ 0.057s] 19 tests run: 19 passed , 0 skipped
41.98 s
>
41.98 s
> ========== nextest test summary ==========
41.98 s
> report: target/nextest/ci_gammaloop/junit.xml
41.98 s
> tests: 19, failures: 0, errors: 0
41.98 s
> No failing testcases found.
41.98 s
> =========================================
41.98 s
> Extracting 1 binary to /build/nextest-archive-RIbB8d
41.98 s
> Extracted 4 files to /build/nextest-archive-RIbB8d in 0.06s
41.98 s
> ------------
41.98 s
> Nextest run ID 92153dc2-4c93-4e77-9c01-4cbba6c135d0 with nextest profile: ci_gammaloop
41.98 s
> Starting 0 tests across 1 binary
41.98 s
> ------------
41.98 s
> Summary [ 0.001s] 0 tests run: 0 passed , 0 skipped
41.98 s
>
41.98 s
> ========== nextest test summary ==========
41.98 s
> report: target/nextest/ci_gammaloop/junit.xml
41.98 s
> tests: 0, failures: 0, errors: 0
41.98 s
> No failing testcases found.
41.98 s
> =========================================
41.98 s
> Extracting 4 binaries, 1 build script output directory, and 2 linked paths to /build/nextest-archive-M8Hzxx
41.98 s
> Extracted 18 files to /build/nextest-archive-M8Hzxx in 0.52s
41.98 s
> ------------
41.98 s
> Nextest run ID f56f621a-aac0-4067-9119-fa7e30b1da21 with nextest profile: ci_gammaloop
41.98 s
> Starting 488 tests across 4 binaries (61 tests skipped , including 60 tests via profile.ci_gammaloop.default-filter )
41.98 s
> FAIL [ 2.303s] (459/488) gammalooprs graph::feynman_graph::tests :: native_thermal_distributions
41.98 s
> stdout ---
41.98 s
>
41.98 s
> running 1 test
41.98 s
> test graph::feynman_graph::tests::native_thermal_distributions ... FAILED
41.98 s
>
41.98 s
> failures:
41.98 s
>
41.98 s
> failures:
41.98 s
> graph::feynman_graph::tests::native_thermal_distributions
41.98 s
>
41.98 s
> test result: FAILED. 0 passed; 1 failed; 0 ignored; 0 measured; 540 filtered out; finished in 2.28s
41.98 s
>
41.98 s
> stderr ---
41.98 s
> The application panicked (crashed).
41.98 s
> Message: called `Result::unwrap()` on an `Err` value: Custom { kind: Other, error: "Could not compile code: g++ -shared -O3 -fPIC -ffast-math -funsafe-math-optimizations -march=native -o /build/gammaloop-native-thermal-1345/thermal_0_0.so /build/gammaloop-native-thermal-1345/thermal_0_0.cpp\nwarning: Skipping impure flag -march=native because NIX_ENFORCE_NO_NATIVE is set\n/build/gammaloop-native-thermal-1345/thermal_0_0.cpp: In function 'void thermal_realf64(const double*, double*, double*)':\n/build/gammaloop-native-thermal-1345/thermal_0_0.cpp:27:16: error: 'symbolica_tanh' was not declared in this scope\n 27 | Z[6] = symbolica_tanh(Z[6]);\n | ^~~~~~~~~~~~~~\n" }
41.98 s
> Location: crates/gammalooprs/src/graph/feynman_graph.rs :937
41.98 s
>
41.98 s
> ━━━━━━━━━━━━━━━━━━━━━━━━━━━━━━━━━━ BACKTRACE ━━━━━━━━━━━━━━━━━━━━━━━━━━━━━━━━━━━
41.98 s
> 1: <color_eyre[b0c9e66060e883b2]::config::PanicHook>::panic_report <unknown>
41.98 s
> at <unknown source file> :<unknown line>
41.98 s
> 2: <color_eyre[b0c9e66060e883b2]::config::PanicHook>::into_panic_hook::{closure#0} <unknown>
41.98 s
> at <unknown source file> :<unknown line>
41.98 s
> 3: std[bcb96dfbba0ab899]::panicking::panic_with_hook <unknown>
41.98 s
> at <unknown source file> :<unknown line>
41.98 s
> 4: std[bcb96dfbba0ab899]::panicking::panic_handler::{closure#0} <unknown>
41.98 s
> at <unknown source file> :<unknown line>
41.98 s
> 5: std[bcb96dfbba0ab899]::sys::backtrace::__rust_end_short_backtrace::<std[bcb96dfbba0ab899]::panicking::panic_handler::{closure#0}, !> <unknown>
41.98 s
> at <unknown source file> :<unknown line>
41.98 s
> 6: __rustc[6c289b9f9c454d21]::rust_begin_unwind <unknown>
41.98 s
> at <unknown source file> :<unknown line>
41.98 s
> 7: core[940e698046960fd5]::panicking::panic_fmt <unknown>
41.98 s
> at <unknown source file> :<unknown line>
41.98 s
> 8: core[940e698046960fd5]::result::unwrap_failed <unknown>
41.98 s
> at <unknown source file> :<unknown line>
41.98 s
> 9: gammalooprs[f21b74aec46f5289]::graph::feynman_graph::tests::native_thermal_distributions <unknown>
41.98 s
> at <unknown source file> :<unknown line>
41.98 s
> 10: <gammalooprs[f21b74aec46f5289]::graph::feynman_graph::tests::native_thermal_distributions::{closure#0} as core[940e698046960fd5]::ops::function::FnOnce<()>>::call_once <unknown>
41.98 s
> at <unknown source file> :<unknown line>
41.98 s
> 11: test[75d6903177b1d7e9]::__rust_begin_short_backtrace::<core[940e698046960fd5]::result::Result<(), alloc[2ea6bcb46fca0c42]::string::String>, fn() -> core[940e698046960fd5]::result::Result<(), alloc[2ea6bcb46fca0c42]::string::String>> <unknown>
41.98 s
> at <unknown source file> :<unknown line>
41.98 s
> 12: test[75d6903177b1d7e9]::run_test::{closure#0} <unknown>
41.98 s
> at <unknown source file> :<unknown line>
41.98 s
> 13: std[bcb96dfbba0ab899]::sys::backtrace::__rust_begin_short_backtrace::<test[75d6903177b1d7e9]::run_test::{closure#1}, ()> <unknown>
41.98 s
> at <unknown source file> :<unknown line>
41.98 s
> 14: <std[bcb96dfbba0ab899]::thread::lifecycle::spawn_unchecked<test[75d6903177b1d7e9]::run_test::{closure#1}, ()>::{closure#1} as core[940e698046960fd5]::ops::function::FnOnce<()>>::call_once::{shim:vtable#0} <unknown>
41.98 s
> at <unknown source file> :<unknown line>
41.98 s
> 15: <std[bcb96dfbba0ab899]::sys::thread::unix::Thread>::new::thread_start <unknown>
41.98 s
> at <unknown source file> :<unknown line>
41.98 s
> 16: start_thread <unknown>
41.98 s
> at <unknown source file> :<unknown line>
41.98 s
> 17: __clone3 <unknown>
41.98 s
> at <unknown source file> :<unknown line>
41.98 s
>
41.98 s
> Run with COLORBT_SHOW_HIDDEN=1 environment variable to disable frame filtering.
41.98 s
> Run with RUST_BACKTRACE=full to include source snippets.
41.98 s
>
41.98 s
> ------------
41.98 s
> Summary [ 14.947s] 488 tests run: 487 passed , 1 failed , 61 skipped
41.98 s
> FAIL [ 2.303s] (459/488) gammalooprs graph::feynman_graph::tests :: native_thermal_distributions
41.98 s
> stdout ---
41.98 s
>
41.98 s
> running 1 test
41.98 s
> test graph::feynman_graph::tests::native_thermal_distributions ... FAILED
41.98 s
>
41.98 s
> failures:
41.98 s
>
41.98 s
> failures:
41.98 s
> graph::feynman_graph::tests::native_thermal_distributions
41.98 s
>
41.98 s
> test result: FAILED. 0 passed; 1 failed; 0 ignored; 0 measured; 540 filtered out; finished in 2.28s
41.98 s
>
41.98 s
> stderr ---
41.98 s
> The application panicked (crashed).
41.98 s
> Message: called `Result::unwrap()` on an `Err` value: Custom { kind: Other, error: "Could not compile code: g++ -shared -O3 -fPIC -ffast-math -funsafe-math-optimizations -march=native -o /build/gammaloop-native-thermal-1345/thermal_0_0.so /build/gammaloop-native-thermal-1345/thermal_0_0.cpp\nwarning: Skipping impure flag -march=native because NIX_ENFORCE_NO_NATIVE is set\n/build/gammaloop-native-thermal-1345/thermal_0_0.cpp: In function 'void thermal_realf64(const double*, double*, double*)':\n/build/gammaloop-native-thermal-1345/thermal_0_0.cpp:27:16: error: 'symbolica_tanh' was not declared in this scope\n 27 | Z[6] = symbolica_tanh(Z[6]);\n | ^~~~~~~~~~~~~~\n" }
41.98 s
> Location: crates/gammalooprs/src/graph/feynman_graph.rs :937
41.98 s
>
41.98 s
> ━━━━━━━━━━━━━━━━━━━━━━━━━━━━━━━━━━ BACKTRACE ━━━━━━━━━━━━━━━━━━━━━━━━━━━━━━━━━━━
41.98 s
> 1: <color_eyre[b0c9e66060e883b2]::config::PanicHook>::panic_report <unknown>
41.98 s
> at <unknown source file> :<unknown line>
41.98 s
> 2: <color_eyre[b0c9e66060e883b2]::config::PanicHook>::into_panic_hook::{closure#0} <unknown>
41.98 s
> at <unknown source file> :<unknown line>
41.98 s
> 3: std[bcb96dfbba0ab899]::panicking::panic_with_hook <unknown>
41.98 s
> at <unknown source file> :<unknown line>
41.98 s
> 4: std[bcb96dfbba0ab899]::panicking::panic_handler::{closure#0} <unknown>
41.98 s
> at <unknown source file> :<unknown line>
41.98 s
> 5: std[bcb96dfbba0ab899]::sys::backtrace::__rust_end_short_backtrace::<std[bcb96dfbba0ab899]::panicking::panic_handler::{closure#0}, !> <unknown>
41.98 s
> at <unknown source file> :<unknown line>
41.98 s
> 6: __rustc[6c289b9f9c454d21]::rust_begin_unwind <unknown>
41.98 s
> at <unknown source file> :<unknown line>
41.98 s
> 7: core[940e698046960fd5]::panicking::panic_fmt <unknown>
41.98 s
> at <unknown source file> :<unknown line>
41.98 s
> 8: core[940e698046960fd5]::result::unwrap_failed <unknown>
41.98 s
> at <unknown source file> :<unknown line>
41.98 s
> 9: gammalooprs[f21b74aec46f5289]::graph::feynman_graph::tests::native_thermal_distributions <unknown>
41.98 s
> at <unknown source file> :<unknown line>
41.98 s
> 10: <gammalooprs[f21b74aec46f5289]::graph::feynman_graph::tests::native_thermal_distributions::{closure#0} as core[940e698046960fd5]::ops::function::FnOnce<()>>::call_once <unknown>
41.98 s
> at <unknown source file> :<unknown line>
41.98 s
> 11: test[75d6903177b1d7e9]::__rust_begin_short_backtrace::<core[940e698046960fd5]::result::Result<(), alloc[2ea6bcb46fca0c42]::string::String>, fn() -> core[940e698046960fd5]::result::Result<(), alloc[2ea6bcb46fca0c42]::string::String>> <unknown>
41.98 s
> at <unknown source file> :<unknown line>
41.98 s
> 12: test[75d6903177b1d7e9]::run_test::{closure#0} <unknown>
41.98 s
> at <unknown source file> :<unknown line>
41.98 s
> 13: std[bcb96dfbba0ab899]::sys::backtrace::__rust_begin_short_backtrace::<test[75d6903177b1d7e9]::run_test::{closure#1}, ()> <unknown>
41.98 s
> at <unknown source file> :<unknown line>
41.98 s
> 14: <std[bcb96dfbba0ab899]::thread::lifecycle::spawn_unchecked<test[75d6903177b1d7e9]::run_test::{closure#1}, ()>::{closure#1} as core[940e698046960fd5]::ops::function::FnOnce<()>>::call_once::{shim:vtable#0} <unknown>
41.98 s
> at <unknown source file> :<unknown line>
41.98 s
> 15: <std[bcb96dfbba0ab899]::sys::thread::unix::Thread>::new::thread_start <unknown>
41.98 s
> at <unknown source file> :<unknown line>
41.98 s
> 16: start_thread <unknown>
41.98 s
> at <unknown source file> :<unknown line>
41.98 s
> 17: __clone3 <unknown>
41.98 s
> at <unknown source file> :<unknown line>
41.98 s
>
41.98 s
> Run with COLORBT_SHOW_HIDDEN=1 environment variable to disable frame filtering.
41.98 s
> Run with RUST_BACKTRACE=full to include source snippets.
41.98 s
>
41.98 s
> error : test run failed
41.98 s
>
41.98 s
> ========== nextest test summary ==========
41.98 s
> report: target/nextest/ci_gammaloop/junit.xml
41.98 s
> tests: 488, failures: 1, errors: 0
41.98 s
>
41.98 s
> 1. gammalooprs::graph::feynman_graph::tests::native_thermal_distributions
41.98 s
> failure: test failure with exit code 101
41.98 s
> system-out
41.98 s
> running 1 test
41.98 s
> test graph::feynman_graph::tests::native_thermal_distributions ... FAILED
41.98 s
>
41.98 s
> failures:
41.98 s
>
41.98 s
> failures:
41.98 s
> graph::feynman_graph::tests::native_thermal_distributions
41.98 s
>
41.98 s
> test result: FAILED. 0 passed; 1 failed; 0 ignored; 0 measured; 540 filtered out; finished in 2.28s
41.98 s
> system-err
41.98 s
> The application panicked (crashed).
41.98 s
> Message: called `Result::unwrap()` on an `Err` value: Custom { kind: Other, error: "Could not compile code: g++ -shared -O3 -fPIC -ffast-math -funsafe-math-optimizations -march=native -o /build/gammaloop-native-thermal-1345/thermal_0_0.so /build/gammaloop-native-thermal-1345/thermal_0_0.cpp\nwarning: Skipping impure flag -march=native because NIX_ENFORCE_NO_NATIVE is set\n/build/gammaloop-native-thermal-1345/thermal_0_0.cpp: In function 'void thermal_realf64(const double*, double*, double*)':\n/build/gammaloop-native-thermal-1345/thermal_0_0.cpp:27:16: error: 'symbolica_tanh' was not declared in this scope\n 27 | Z[6] = symbolica_tanh(Z[6]);\n | ^~~~~~~~~~~~~~\n" }
41.98 s
> Location: crates/gammalooprs/src/graph/feynman_graph.rs:937
41.98 s
>
41.98 s
> ━━━━━━━━━━━━━━━━━━━━━━━━━━━━━━━━━━ BACKTRACE ━━━━━━━━━━━━━━━━━━━━━━━━━━━━━━━━━━━
41.98 s
> 1: <color_eyre[b0c9e66060e883b2]::config::PanicHook>::panic_report<unknown>
41.98 s
> at <unknown source file>:<unknown line>
41.98 s
> 2: <color_eyre[b0c9e66060e883b2]::config::PanicHook>::into_panic_hook::{closure#0}<unknown>
41.98 s
> at <unknown source file>:<unknown line>
41.98 s
> 3: std[bcb96dfbba0ab899]::panicking::panic_with_hook<unknown>
41.98 s
> at <unknown source file>:<unknown line>
41.98 s
> 4: std[bcb96dfbba0ab899]::panicking::panic_handler::{closure#0}<unknown>
41.98 s
> at <unknown source file>:<unknown line>
41.98 s
> 5: std[bcb96dfbba0ab899]::sys::backtrace::__rust_end_short_backtrace::<std[bcb96dfbba0ab899]::panicking::panic_handler::{closure#0}, !><unknown>
41.98 s
> at <unknown source file>:<unknown line>
41.98 s
> 6: __rustc[6c289b9f9c454d21]::rust_begin_unwind<unknown>
41.98 s
> at <unknown source file>:<unknown line>
41.98 s
> 7: core[940e698046960fd5]::panicking::panic_fmt<unknown>
41.98 s
> at <unknown source file>:<unknown line>
41.98 s
> 8: core[940e698046960fd5]::result::unwrap_failed<unknown>
41.98 s
> at <unknown source file>:<unknown line>
41.98 s
> 9: gammalooprs[f21b74aec46f5289]::graph::feynman_graph::tests::native_thermal_distributions<unknown>
41.98 s
> at <unknown source file>:<unknown line>
41.98 s
> 10: <gammalooprs[f21b74aec46f5289]::graph::feynman_graph::tests::native_thermal_distributions::{closure#0} as core[940e698046960fd5]::ops::function::FnOnce<()>>::call_once<unknown>
41.98 s
> at <unknown source file>:<unknown line>
41.98 s
> 11: test[75d6903177b1d7e9]::__rust_begin_short_backtrace::<core[940e698046960fd5]::result::Result<(), alloc[2ea6bcb46fca0c42]::string::String>, fn() -> core[940e698046960fd5]::result::Result<(), alloc[2ea6bcb46fca0c42]::string::String>><unknown>
41.98 s
> at <unknown source file>:<unknown line>
41.98 s
> 12: test[75d6903177b1d7e9]::run_test::{closure#0}<unknown>
41.98 s
> at <unknown source file>:<unknown line>
41.98 s
> 13: std[bcb96dfbba0ab899]::sys::backtrace::__rust_begin_short_backtrace::<test[75d6903177b1d7e9]::run_test::{closure#1}, ()><unknown>
41.98 s
> at <unknown source file>:<unknown line>
41.98 s
> 14: <std[bcb96dfbba0ab899]::thread::lifecycle::spawn_unchecked<test[75d6903177b1d7e9]::run_test::{closure#1}, ()>::{closure#1} as core[940e698046960fd5]::ops::function::FnOnce<()>>::call_once::{shim:vtable#0}<unknown>
41.98 s
> at <unknown source file>:<unknown line>
41.98 s
> 15: <std[bcb96dfbba0ab899]::sys::thread::unix::Thread>::new::thread_start<unknown>
41.98 s
> at <unknown source file>:<unknown line>
41.98 s
> 16: start_thread<unknown>
41.98 s
> at <unknown source file>:<unknown line>
41.98 s
> 17: __clone3<unknown>
41.98 s
> at <unknown source file>:<unknown line>
41.98 s
>
41.98 s
> Run with COLORBT_SHOW_HIDDEN=1 environment variable to disable frame filtering.
41.98 s
> Run with RUST_BACKTRACE=full to include source snippets.
41.98 s
> =========================================
41.98 s
For full logs, run:
41.98 s
nix log /nix/store/8l1symdjd8zyi2xi7czaml0xbwmns2xx-gammaloop-nextest-core.drv
42.11 s
[0 built (1 failed ), 0.0 Run failed.