0.05 s
$ /nix/store/9ypz3flqsrl5xl495mm8h645gadjsxi1-coreutils-9.11/bin/timeout --kill-after=15s 7200s /nix/store/23zk8sgzamrbmj1fday15szf7f2279s8-nix-2.34.7/bin/nix --extra-experimental-features nix-command --extra-experimental-features flakes flake clone git+https://github.com/alphal00p/gammaloop --dest /tmp/nix-ci-worker/stable-pwd/repo/
0.15 s
Cloning into '/tmp/nix-ci-worker/stable-pwd/repo'...
0.90 s
remote: Enumerating objects: 82005, done.
1.00 s
remote: Counting objects: 0% (1/8202)
remote: Counting objects: 1% (83/8202)
remote: Counting objects: 2% (165/8202)
remote: Counting objects: 3% (247/8202)
remote: Counting objects: 4% (329/8202)
remote: Counting objects: 5% (411/8202)
remote: Counting objects: 6% (493/8202)
remote: Counting objects: 7% (575/8202)
remote: Counting objects: 8% (657/8202)
remote: Counting objects: 9% (739/8202)
remote: Counting objects: 10% (821/8202)
remote: Counting objects: 11% (903/8202)
remote: Counting objects: 12% (985/8202)
remote: Counting objects: 13% (1067/8202)
remote: Counting objects: 14% (1149/8202)
remote: Counting objects: 15% (1231/8202)
remote: Counting objects: 16% (1313/8202)
remote: Counting objects: 17% (1395/8202)
remote: Counting objects: 18% (1477/8202)
remote: Counting objects: 19% (1559/8202)
remote: Counting objects: 20% (1641/8202)
remote: Counting objects: 21% (1723/8202)
remote: Counting objects: 22% (1805/8202)
remote: Counting objects: 23% (1887/8202)
remote: Counting objects: 24% (1969/8202)
remote: Counting objects: 25% (2051/8202)
remote: Counting objects: 26% (2133/8202)
remote: Counting objects: 27% (2215/8202)
remote: Counting objects: 28% (2297/8202)
remote: Counting objects: 29% (2379/8202)
remote: Counting objects: 30% (2461/8202)
remote: Counting objects: 31% (2543/8202)
remote: Counting objects: 32% (2625/8202)
remote: Counting objects: 33% (2707/8202)
remote: Counting objects: 34% (2789/8202)
remote: Counting objects: 35% (2871/8202)
remote: Counting objects: 36% (2953/8202)
remote: Counting objects: 37% (3035/8202)
remote: Counting objects: 38% (3117/8202)
remote: Counting objects: 39% (3199/8202)
remote: Counting objects: 40% (3281/8202)
remote: Counting objects: 41% (3363/8202)
remote: Counting objects: 42% (3445/8202)
remote: Counting objects: 43% (3527/8202)
remote: Counting objects: 44% (3609/8202)
remote: Counting objects: 45% (3691/8202)
remote: Counting objects: 46% (3773/8202)
remote: Counting objects: 47% (3855/8202)
remote: Counting objects: 48% (3937/8202)
remote: Counting objects: 49% (4019/8202)
remote: Counting objects: 50% (4101/8202)
remote: Counting objects: 51% (4184/8202)
remote: Counting objects: 52% (4266/8202)
remote: Counting objects: 53% (4348/8202)
remote: Counting objects: 54% (4430/8202)
remote: Counting objects: 55% (4512/8202)
remote: Counting objects: 56% (4594/8202)
remote: Counting objects: 57% (4676/8202)
remote: Counting objects: 58% (4758/8202)
remote: Counting objects: 59% (4840/8202)
remote: Counting objects: 60% (4922/8202)
remote: Counting objects: 61% (5004/8202)
remote: Counting objects: 62% (5086/8202)
remote: Counting objects: 63% (5168/8202)
remote: Counting objects: 64% (5250/8202)
remote: Counting objects: 65% (5332/8202)
remote: Counting objects: 66% (5414/8202)
remote: Counting objects: 67% (5496/8202)
remote: Counting objects: 68% (5578/8202)
remote: Counting objects: 69% (5660/8202)
remote: Counting objects: 70% (5742/8202)
remote: Counting objects: 71% (5824/8202)
remote: Counting objects: 72% (5906/8202)
remote: Counting objects: 73% (5988/8202)
remote: Counting objects: 74% (6070/8202)
remote: Counting objects: 75% (6152/8202)
remote: Counting objects: 76% (6234/8202)
remote: Counting objects: 77% (6316/8202)
remote: Counting objects: 78% (6398/8202)
remote: Counting objects: 79% (6480/8202)
remote: Counting objects: 80% (6562/8202)
remote: Counting objects: 81% (6644/8202)
remote: Counting objects: 82% (6726/8202)
remote: Counting objects: 83% (6808/8202)
remote: Counting objects: 84% (6890/8202)
remote: Counting objects: 85% (6972/8202)
remote: Counting objects: 86% (7054/8202)
remote: Counting objects: 87% (7136/8202)
remote: Counting objects: 88% (7218/8202)
remote: Counting objects: 89% (7300/8202)
remote: Counting objects: 90% (7382/8202)
remote: Counting objects: 91% (7464/8202)
remote: Counting objects: 92% (7546/8202)
remote: Counting objects: 93% (7628/8202)
remote: Counting objects: 94% (7710/8202)
remote: Counting objects: 95% (7792/8202)
remote: Counting objects: 96% (7874/8202)
remote: Counting objects: 97% (7956/8202)
remote: Counting objects: 98% (8038/8202)
remote: Counting objects: 99% (8120/8202)
remote: Counting objects: 100% (8202/8202)
remote: Counting objects: 100% (8202/8202), done.
2.58 s
remote: Compressing objects: 0% (1/1555)
remote: Compressing objects: 1% (16/1555)
remote: Compressing objects: 2% (32/1555)
remote: Compressing objects: 3% (47/1555)
remote: Compressing objects: 4% (63/1555)
remote: Compressing objects: 5% (78/1555)
remote: Compressing objects: 6% (94/1555)
remote: Compressing objects: 7% (109/1555)
remote: Compressing objects: 8% (125/1555)
remote: Compressing objects: 9% (140/1555)
remote: Compressing objects: 10% (156/1555)
remote: Compressing objects: 10% (159/1555)
remote: Compressing objects: 11% (172/1555)
remote: Compressing objects: 12% (187/1555)
remote: Compressing objects: 13% (203/1555)
remote: Compressing objects: 14% (218/1555)
remote: Compressing objects: 15% (234/1555)
remote: Compressing objects: 16% (249/1555)
remote: Compressing objects: 17% (265/1555)
remote: Compressing objects: 18% (280/1555)
remote: Compressing objects: 19% (296/1555)
remote: Compressing objects: 20% (311/1555)
remote: Compressing objects: 21% (327/1555)
remote: Compressing objects: 22% (343/1555)
remote: Compressing objects: 23% (358/1555)
remote: Compressing objects: 24% (374/1555)
remote: Compressing objects: 25% (389/1555)
remote: Compressing objects: 26% (405/1555)
remote: Compressing objects: 27% (420/1555)
remote: Compressing objects: 28% (436/1555)
remote: Compressing objects: 29% (451/1555)
remote: Compressing objects: 30% (467/1555)
remote: Compressing objects: 31% (483/1555)
remote: Compressing objects: 32% (498/1555)
remote: Compressing objects: 33% (514/1555)
remote: Compressing objects: 34% (529/1555)
remote: Compressing objects: 35% (545/1555)
remote: Compressing objects: 36% (560/1555)
remote: Compressing objects: 37% (576/1555)
remote: Compressing objects: 38% (591/1555)
remote: Compressing objects: 39% (607/1555)
remote: Compressing objects: 40% (622/1555)
remote: Compressing objects: 41% (638/1555)
remote: Compressing objects: 42% (654/1555)
remote: Compressing objects: 43% (669/1555)
remote: Compressing objects: 44% (685/1555)
remote: Compressing objects: 45% (700/1555)
remote: Compressing objects: 46% (716/1555)
remote: Compressing objects: 47% (731/1555)
remote: Compressing objects: 48% (747/1555)
remote: Compressing objects: 49% (762/1555)
remote: Compressing objects: 50% (778/1555)
remote: Compressing objects: 51% (794/1555)
remote: Compressing objects: 52% (809/1555)
remote: Compressing objects: 53% (825/1555)
remote: Compressing objects: 54% (840/1555)
remote: Compressing objects: 55% (856/1555)
remote: Compressing objects: 56% (871/1555)
remote: Compressing objects: 57% (887/1555)
remote: Compressing objects: 58% (902/1555)
remote: Compressing objects: 59% (918/1555)
remote: Compressing objects: 60% (933/1555)
remote: Compressing objects: 61% (949/1555)
remote: Compressing objects: 62% (965/1555)
remote: Compressing objects: 63% (980/1555)
remote: Compressing objects: 64% (996/1555)
remote: Compressing objects: 65% (1011/1555)
remote: Compressing objects: 66% (1027/1555)
remote: Compressing objects: 67% (1042/1555)
remote: Compressing objects: 68% (1058/1555)
remote: Compressing objects: 69% (1073/1555)
remote: Compressing objects: 70% (1089/1555)
remote: Compressing objects: 71% (1105/1555)
remote: Compressing objects: 72% (1120/1555)
remote: Compressing objects: 73% (1136/1555)
remote: Compressing objects: 74% (1151/1555)
remote: Compressing objects: 75% (1167/1555)
remote: Compressing objects: 76% (1182/1555)
remote: Compressing objects: 77% (1198/1555)
remote: Compressing objects: 78% (1213/1555)
remote: Compressing objects: 79% (1229/1555)
remote: Compressing objects: 80% (1244/1555)
remote: Compressing objects: 81% (1260/1555)
remote: Compressing objects: 82% (1276/1555)
remote: Compressing objects: 83% (1291/1555)
remote: Compressing objects: 84% (1307/1555)
remote: Compressing objects: 85% (1322/1555)
remote: Compressing objects: 86% (1338/1555)
remote: Compressing objects: 87% (1353/1555)
remote: Compressing objects: 88% (1369/1555)
remote: Compressing objects: 89% (1384/1555)
remote: Compressing objects: 90% (1400/1555)
remote: Compressing objects: 91% (1416/1555)
remote: Compressing objects: 92% (1431/1555)
remote: Compressing objects: 93% (1447/1555)
remote: Compressing objects: 94% (1462/1555)
remote: Compressing objects: 95% (1478/1555)
remote: Compressing objects: 96% (1493/1555)
remote: Compressing objects: 97% (1509/1555)
remote: Compressing objects: 98% (1524/1555)
remote: Compressing objects: 99% (1540/1555)
remote: Compressing objects: 100% (1555/1555)
remote: Compressing objects: 100% (1555/1555), done.
6.31 s
Receiving objects: 0% (1/82005)
Receiving objects: 1% (821/82005)
Receiving objects: 2% (1641/82005)
Receiving objects: 3% (2461/82005)
Receiving objects: 4% (3281/82005)
Receiving objects: 5% (4101/82005)
Receiving objects: 6% (4921/82005), 9.02 MiB | 18.02 MiB/s
Receiving objects: 7% (5741/82005), 9.02 MiB | 18.02 MiB/s
Receiving objects: 8% (6561/82005), 9.02 MiB | 18.02 MiB/s
Receiving objects: 9% (7381/82005), 9.02 MiB | 18.02 MiB/s
Receiving objects: 10% (8201/82005), 9.02 MiB | 18.02 MiB/s
Receiving objects: 11% (9021/82005), 9.02 MiB | 18.02 MiB/s
Receiving objects: 12% (9841/82005), 9.02 MiB | 18.02 MiB/s
Receiving objects: 13% (10661/82005), 9.02 MiB | 18.02 MiB/s
Receiving objects: 14% (11481/82005), 9.02 MiB | 18.02 MiB/s
Receiving objects: 15% (12301/82005), 9.02 MiB | 18.02 MiB/s
Receiving objects: 16% (13121/82005), 9.02 MiB | 18.02 MiB/s
Receiving objects: 17% (13941/82005), 9.02 MiB | 18.02 MiB/s
Receiving objects: 18% (14761/82005), 9.02 MiB | 18.02 MiB/s
Receiving objects: 19% (15581/82005), 9.02 MiB | 18.02 MiB/s
Receiving objects: 20% (16401/82005), 9.02 MiB | 18.02 MiB/s
Receiving objects: 21% (17222/82005), 9.02 MiB | 18.02 MiB/s
Receiving objects: 22% (18042/82005), 9.02 MiB | 18.02 MiB/s
Receiving objects: 23% (18862/82005), 9.02 MiB | 18.02 MiB/s
Receiving objects: 24% (19682/82005), 9.02 MiB | 18.02 MiB/s
Receiving objects: 25% (20502/82005), 9.02 MiB | 18.02 MiB/s
Receiving objects: 26% (21322/82005), 9.02 MiB | 18.02 MiB/s
Receiving objects: 27% (22142/82005), 9.02 MiB | 18.02 MiB/s
Receiving objects: 28% (22962/82005), 9.02 MiB | 18.02 MiB/s
Receiving objects: 29% (23782/82005), 9.02 MiB | 18.02 MiB/s
Receiving objects: 30% (24602/82005), 9.02 MiB | 18.02 MiB/s
Receiving objects: 30% (24852/82005), 9.02 MiB | 18.02 MiB/s
Receiving objects: 31% (25422/82005), 9.02 MiB | 18.02 MiB/s
Receiving objects: 32% (26242/82005), 26.25 MiB | 26.25 MiB/s
Receiving objects: 33% (27062/82005), 26.25 MiB | 26.25 MiB/s
Receiving objects: 34% (27882/82005), 26.25 MiB | 26.25 MiB/s
Receiving objects: 35% (28702/82005), 26.25 MiB | 26.25 MiB/s
Receiving objects: 36% (29522/82005), 26.25 MiB | 26.25 MiB/s
Receiving objects: 37% (30342/82005), 26.25 MiB | 26.25 MiB/s
Receiving objects: 38% (31162/82005), 26.25 MiB | 26.25 MiB/s
Receiving objects: 39% (31982/82005), 26.25 MiB | 26.25 MiB/s
Receiving objects: 40% (32802/82005), 26.25 MiB | 26.25 MiB/s
Receiving objects: 41% (33623/82005), 26.25 MiB | 26.25 MiB/s
Receiving objects: 42% (34443/82005), 26.25 MiB | 26.25 MiB/s
Receiving objects: 43% (35263/82005), 26.25 MiB | 26.25 MiB/s
Receiving objects: 44% (36083/82005), 26.25 MiB | 26.25 MiB/s
Receiving objects: 45% (36903/82005), 26.25 MiB | 26.25 MiB/s
Receiving objects: 46% (37723/82005), 26.25 MiB | 26.25 MiB/s
Receiving objects: 47% (38543/82005), 26.25 MiB | 26.25 MiB/s
Receiving objects: 48% (39363/82005), 26.25 MiB | 26.25 MiB/s
Receiving objects: 49% (40183/82005), 26.25 MiB | 26.25 MiB/s
Receiving objects: 50% (41003/82005), 48.95 MiB | 32.52 MiB/s
Receiving objects: 51% (41823/82005), 48.95 MiB | 32.52 MiB/s
Receiving objects: 52% (42643/82005), 48.95 MiB | 32.52 MiB/s
Receiving objects: 53% (43463/82005), 48.95 MiB | 32.52 MiB/s
Receiving objects: 54% (44283/82005), 48.95 MiB | 32.52 MiB/s
Receiving objects: 55% (45103/82005), 48.95 MiB | 32.52 MiB/s
Receiving objects: 56% (45923/82005), 48.95 MiB | 32.52 MiB/s
Receiving objects: 57% (46743/82005), 48.95 MiB | 32.52 MiB/s
Receiving objects: 58% (47563/82005), 48.95 MiB | 32.52 MiB/s
Receiving objects: 59% (48383/82005), 48.95 MiB | 32.52 MiB/s
Receiving objects: 59% (48725/82005), 65.99 MiB | 32.91 MiB/s
Receiving objects: 60% (49203/82005), 65.99 MiB | 32.91 MiB/s
Receiving objects: 61% (50024/82005), 65.99 MiB | 32.91 MiB/s
Receiving objects: 62% (50844/82005), 65.99 MiB | 32.91 MiB/s
Receiving objects: 63% (51664/82005), 65.99 MiB | 32.91 MiB/s
Receiving objects: 64% (52484/82005), 65.99 MiB | 32.91 MiB/s
Receiving objects: 65% (53304/82005), 65.99 MiB | 32.91 MiB/s
Receiving objects: 66% (54124/82005), 65.99 MiB | 32.91 MiB/s
Receiving objects: 67% (54944/82005), 65.99 MiB | 32.91 MiB/s
Receiving objects: 68% (55764/82005), 65.99 MiB | 32.91 MiB/s
Receiving objects: 69% (56584/82005), 65.99 MiB | 32.91 MiB/s
Receiving objects: 70% (57404/82005), 65.99 MiB | 32.91 MiB/s
Receiving objects: 71% (58224/82005), 83.86 MiB | 33.49 MiB/s
Receiving objects: 72% (59044/82005), 83.86 MiB | 33.49 MiB/s
Receiving objects: 73% (59864/82005), 83.86 MiB | 33.49 MiB/s
Receiving objects: 74% (60684/82005), 83.86 MiB | 33.49 MiB/s
Receiving objects: 75% (61504/82005), 83.86 MiB | 33.49 MiB/s
Receiving objects: 76% (62324/82005), 83.86 MiB | 33.49 MiB/s
Receiving objects: 77% (63144/82005), 83.86 MiB | 33.49 MiB/s
Receiving objects: 78% (63964/82005), 83.86 MiB | 33.49 MiB/s
Receiving objects: 79% (64784/82005), 83.86 MiB | 33.49 MiB/s
Receiving objects: 80% (65604/82005), 83.86 MiB | 33.49 MiB/s
Receiving objects: 80% (65612/82005), 83.86 MiB | 33.49 MiB/s
Receiving objects: 81% (66425/82005), 102.41 MiB | 33.83 MiB/s
Receiving objects: 82% (67245/82005), 102.41 MiB | 33.83 MiB/s
Receiving objects: 83% (68065/82005), 102.41 MiB | 33.83 MiB/s
Receiving objects: 84% (68885/82005), 102.41 MiB | 33.83 MiB/s
Receiving objects: 85% (69705/82005), 102.41 MiB | 33.83 MiB/s
Receiving objects: 86% (70525/82005), 102.41 MiB | 33.83 MiB/s
Receiving objects: 87% (71345/82005), 102.41 MiB | 33.83 MiB/s
Receiving objects: 88% (72165/82005), 121.23 MiB | 34.37 MiB/s
Receiving objects: 89% (72985/82005), 121.23 MiB | 34.37 MiB/s
Receiving objects: 90% (73805/82005), 121.23 MiB | 34.37 MiB/s
Receiving objects: 91% (74625/82005), 121.23 MiB | 34.37 MiB/s
Receiving objects: 92% (75445/82005), 121.23 MiB | 34.37 MiB/s
Receiving objects: 93% (76265/82005), 121.23 MiB | 34.37 MiB/s
Receiving objects: 94% (77085/82005), 121.23 MiB | 34.37 MiB/s
Receiving objects: 95% (77905/82005), 121.23 MiB | 34.37 MiB/s
Receiving objects: 96% (78725/82005), 121.23 MiB | 34.37 MiB/s
Receiving objects: 97% (79545/82005), 121.23 MiB | 34.37 MiB/s
Receiving objects: 98% (80365/82005), 121.23 MiB | 34.37 MiB/s
Receiving objects: 99% (81185/82005), 121.23 MiB | 34.37 MiB/s
remote: Total 82005 (delta 7212), reused 6647 (delta 6647), pack-reused 73803 (from 3)
6.32 s
Receiving objects: 100% (82005/82005), 121.23 MiB | 34.37 MiB/s
Receiving objects: 100% (82005/82005), 127.98 MiB | 34.24 MiB/s, done.
7.63 s
Resolving deltas: 0% (0/55486)
Resolving deltas: 1% (555/55486)
Resolving deltas: 2% (1110/55486)
Resolving deltas: 3% (1665/55486)
Resolving deltas: 4% (2220/55486)
Resolving deltas: 5% (2775/55486)
Resolving deltas: 6% (3330/55486)
Resolving deltas: 7% (3885/55486)
Resolving deltas: 8% (4439/55486)
Resolving deltas: 9% (4994/55486)
Resolving deltas: 10% (5550/55486)
Resolving deltas: 11% (6110/55486)
Resolving deltas: 12% (6659/55486)
Resolving deltas: 13% (7214/55486)
Resolving deltas: 14% (7769/55486)
Resolving deltas: 15% (8323/55486)
Resolving deltas: 16% (8878/55486)
Resolving deltas: 17% (9433/55486)
Resolving deltas: 18% (9988/55486)
Resolving deltas: 19% (10543/55486)
Resolving deltas: 20% (11098/55486)
Resolving deltas: 21% (11653/55486)
Resolving deltas: 22% (12207/55486)
Resolving deltas: 23% (12762/55486)
Resolving deltas: 24% (13322/55486)
Resolving deltas: 25% (13873/55486)
Resolving deltas: 26% (14427/55486)
Resolving deltas: 27% (14982/55486)
Resolving deltas: 28% (15537/55486)
Resolving deltas: 29% (16091/55486)
Resolving deltas: 30% (16646/55486)
Resolving deltas: 31% (17206/55486)
Resolving deltas: 32% (17756/55486)
Resolving deltas: 33% (18311/55486)
Resolving deltas: 34% (18866/55486)
Resolving deltas: 35% (19421/55486)
Resolving deltas: 36% (19975/55486)
Resolving deltas: 37% (20530/55486)
Resolving deltas: 38% (21085/55486)
Resolving deltas: 39% (21641/55486)
Resolving deltas: 40% (22195/55486)
Resolving deltas: 41% (22751/55486)
Resolving deltas: 42% (23305/55486)
Resolving deltas: 43% (23859/55486)
Resolving deltas: 44% (24414/55486)
Resolving deltas: 45% (24969/55486)
Resolving deltas: 46% (25524/55486)
Resolving deltas: 47% (26079/55486)
Resolving deltas: 48% (26634/55486)
Resolving deltas: 49% (27189/55486)
Resolving deltas: 50% (27743/55486)
Resolving deltas: 51% (28298/55486)
Resolving deltas: 52% (28853/55486)
Resolving deltas: 53% (29408/55486)
Resolving deltas: 54% (29964/55486)
Resolving deltas: 55% (30518/55486)
Resolving deltas: 56% (31073/55486)
Resolving deltas: 57% (31628/55486)
Resolving deltas: 58% (32183/55486)
Resolving deltas: 59% (32738/55486)
Resolving deltas: 60% (33292/55486)
Resolving deltas: 61% (33847/55486)
Resolving deltas: 62% (34402/55486)
Resolving deltas: 63% (34957/55486)
Resolving deltas: 64% (35512/55486)
Resolving deltas: 65% (36066/55486)
Resolving deltas: 66% (36622/55486)
Resolving deltas: 67% (37180/55486)
Resolving deltas: 68% (37732/55486)
Resolving deltas: 69% (38287/55486)
Resolving deltas: 70% (38841/55486)
Resolving deltas: 71% (39397/55486)
Resolving deltas: 72% (39950/55486)
Resolving deltas: 73% (40505/55486)
Resolving deltas: 74% (41060/55486)
Resolving deltas: 75% (41615/55486)
Resolving deltas: 76% (42171/55486)
Resolving deltas: 76% (42628/55486)
Resolving deltas: 77% (42725/55486)
Resolving deltas: 78% (43280/55486)
Resolving deltas: 79% (43834/55486)
Resolving deltas: 80% (44389/55486)
Resolving deltas: 81% (44944/55486)
Resolving deltas: 82% (45499/55486)
Resolving deltas: 83% (46055/55486)
Resolving deltas: 84% (46610/55486)
Resolving deltas: 85% (47164/55486)
Resolving deltas: 86% (47718/55486)
Resolving deltas: 87% (48273/55486)
Resolving deltas: 88% (48828/55486)
Resolving deltas: 89% (49383/55486)
Resolving deltas: 90% (49938/55486)
Resolving deltas: 91% (50495/55486)
Resolving deltas: 92% (51048/55486)
Resolving deltas: 93% (51602/55486)
Resolving deltas: 94% (52157/55486)
Resolving deltas: 95% (52712/55486)
Resolving deltas: 96% (53267/55486)
Resolving deltas: 97% (53822/55486)
Resolving deltas: 98% (54377/55486)
Resolving deltas: 99% (54932/55486)
Resolving deltas: 100% (55486/55486)
Resolving deltas: 100% (55486/55486), done.
8.15 s
Fetching commit 3ac50f3815c6073e4c79182c5d6ad6bb9b59126b for wip/native-symbolica-hyperbolics ...
8.15 s
$ /nix/store/bcnisk3ydfgv26v2gw3zlky24g00yww2-git-2.54.0/bin/git fetch origin 3ac50f3815c6073e4c79182c5d6ad6bb9b59126b
8.59 s
From https://github.com/alphal00p/gammaloop
8.59 s
* branch 3ac50f3815c6073e4c79182c5d6ad6bb9b59126b -> FETCH_HEAD
8.60 s
$ /nix/store/9ypz3flqsrl5xl495mm8h645gadjsxi1-coreutils-9.11/bin/timeout --kill-after=15s 7200s /nix/store/bcnisk3ydfgv26v2gw3zlky24g00yww2-git-2.54.0/bin/git -c advice.detachedHead=false checkout 3ac50f3815c6073e4c79182c5d6ad6bb9b59126b
8.82 s
HEAD is now at 3ac50f381 Adjust CFF test tolerances and comments
8.83 s
$ /nix/store/9ypz3flqsrl5xl495mm8h645gadjsxi1-coreutils-9.11/bin/timeout --kill-after=15s 7200s /nix/store/23zk8sgzamrbmj1fday15szf7f2279s8-nix-2.34.7/bin/nix --extra-experimental-features nix-command --extra-experimental-features flakes --log-format internal-json run .#packages.x86_64-linux.nix-ci-check-gammaloop-nextest-integration --print-build-logs
9.36 s
9.90 s
Downloading cached source from https://cache.nix-ci.com
18.27 s
Downloaded cached source (199.4 MiB) in 8.3s
18.27 s
Progress: 1 of 1 downloaded from cache
26.54 s
fetching Git repository 'https://github.com/symbolica-dev/symbolica'
27.25 s
remote: Enumerating objects: 9552, done.
27.25 s
remote: Counting objects: 0% (1/528)
remote: Counting objects: 1% (6/528)
remote: Counting objects: 2% (11/528)
remote: Counting objects: 3% (16/528)
remote: Counting objects: 4% (22/528)
remote: Counting objects: 5% (27/528)
remote: Counting objects: 6% (32/528)
remote: Counting objects: 7% (37/528)
remote: Counting objects: 8% (43/528)
remote: Counting objects: 9% (48/528)
remote: Counting objects: 10% (53/528)
remote: Counting objects: 11% (59/528)
remote: Counting objects: 12% (64/528)
remote: Counting objects: 13% (69/528)
remote: Counting objects: 14% (74/528)
remote: Counting objects: 15% (80/528)
remote: Counting objects: 16% (85/528)
remote: Counting objects: 17% (90/528)
remote: Counting objects: 18% (96/528)
remote: Counting objects: 19% (101/528)
remote: Counting objects: 20% (106/528)
remote: Counting objects: 21% (111/528)
remote: Counting objects: 22% (117/528)
remote: Counting objects: 23% (122/528)
remote: Counting objects: 24% (127/528)
remote: Counting objects: 25% (132/528)
remote: Counting objects: 26% (138/528)
remote: Counting objects: 27% (143/528)
remote: Counting objects: 28% (148/528)
remote: Counting objects: 29% (154/528)
remote: Counting objects: 30% (159/528)
remote: Counting objects: 31% (164/528)
remote: Counting objects: 32% (169/528)
remote: Counting objects: 33% (175/528)
remote: Counting objects: 34% (180/528)
remote: Counting objects: 35% (185/528)
remote: Counting objects: 36% (191/528)
remote: Counting objects: 37% (196/528)
remote: Counting objects: 38% (201/528)
remote: Counting objects: 39% (206/528)
remote: Counting objects: 40% (212/528)
remote: Counting objects: 41% (217/528)
remote: Counting objects: 42% (222/528)
remote: Counting objects: 43% (228/528)
remote: Counting objects: 44% (233/528)
remote: Counting objects: 45% (238/528)
remote: Counting objects: 46% (243/528)
remote: Counting objects: 47% (249/528)
remote: Counting objects: 48% (254/528)
remote: Counting objects: 49% (259/528)
remote: Counting objects: 50% (264/528)
remote: Counting objects: 51% (270/528)
remote: Counting objects: 52% (275/528)
remote: Counting objects: 53% (280/528)
remote: Counting objects: 54% (286/528)
remote: Counting objects: 55% (291/528)
remote: Counting objects: 56% (296/528)
remote: Counting objects: 57% (301/528)
remote: Counting objects: 58% (307/528)
remote: Counting objects: 59% (312/528)
remote: Counting objects: 60% (317/528)
remote: Counting objects: 61% (323/528)
remote: Counting objects: 62% (328/528)
remote: Counting objects: 63% (333/528)
remote: Counting objects: 64% (338/528)
remote: Counting objects: 65% (344/528)
remote: Counting objects: 66% (349/528)
remote: Counting objects: 67% (354/528)
remote: Counting objects: 68% (360/528)
remote: Counting objects: 69% (365/528)
remote: Counting objects: 70% (370/528)
remote: Counting objects: 71% (375/528)
remote: Counting objects: 72% (381/528)
remote: Counting objects: 73% (386/528)
remote: Counting objects: 74% (391/528)
remote: Counting objects: 75% (396/528)
remote: Counting objects: 76% (402/528)
remote: Counting objects: 77% (407/528)
remote: Counting objects: 78% (412/528)
remote: Counting objects: 79% (418/528)
remote: Counting objects: 80% (423/528)
remote: Counting objects: 81% (428/528)
remote: Counting objects: 82% (433/528)
remote: Counting objects: 83% (439/528)
remote: Counting objects: 84% (444/528)
remote: Counting objects: 85% (449/528)
remote: Counting objects: 86% (455/528)
remote: Counting objects: 87% (460/528)
remote: Counting objects: 88% (465/528)
remote: Counting objects: 89% (470/528)
remote: Counting objects: 90% (476/528)
remote: Counting objects: 91% (481/528)
remote: Counting objects: 92% (486/528)
remote: Counting objects: 93% (492/528)
remote: Counting objects: 94% (497/528)
remote: Counting objects: 95% (502/528)
remote: Counting objects: 96% (507/528)
remote: Counting objects: 97% (513/528)
remote: Counting objects: 98% (518/528)
remote: Counting objects: 99% (523/528)
remote: Counting objects: 100% (528/528)
remote: Counting objects: 100% (528/528), done.
27.69 s
remote: Compressing objects: 0% (1/103)
remote: Compressing objects: 1% (2/103)
remote: Compressing objects: 2% (3/103)
remote: Compressing objects: 3% (4/103)
remote: Compressing objects: 4% (5/103)
remote: Compressing objects: 5% (6/103)
remote: Compressing objects: 6% (7/103)
remote: Compressing objects: 7% (8/103)
remote: Compressing objects: 8% (9/103)
remote: Compressing objects: 9% (10/103)
remote: Compressing objects: 10% (11/103)
remote: Compressing objects: 11% (12/103)
remote: Compressing objects: 12% (13/103)
remote: Compressing objects: 13% (14/103)
remote: Compressing objects: 14% (15/103)
remote: Compressing objects: 15% (16/103)
remote: Compressing objects: 16% (17/103)
remote: Compressing objects: 17% (18/103)
remote: Compressing objects: 18% (19/103)
remote: Compressing objects: 19% (20/103)
remote: Compressing objects: 20% (21/103)
remote: Compressing objects: 21% (22/103)
remote: Compressing objects: 22% (23/103)
remote: Compressing objects: 23% (24/103)
remote: Compressing objects: 24% (25/103)
remote: Compressing objects: 25% (26/103)
remote: Compressing objects: 26% (27/103)
remote: Compressing objects: 27% (28/103)
remote: Compressing objects: 28% (29/103)
remote: Compressing objects: 29% (30/103)
remote: Compressing objects: 30% (31/103)
remote: Compressing objects: 31% (32/103)
remote: Compressing objects: 32% (33/103)
remote: Compressing objects: 33% (34/103)
remote: Compressing objects: 34% (36/103)
remote: Compressing objects: 35% (37/103)
remote: Compressing objects: 36% (38/103)
remote: Compressing objects: 37% (39/103)
remote: Compressing objects: 38% (40/103)
remote: Compressing objects: 39% (41/103)
remote: Compressing objects: 40% (42/103)
remote: Compressing objects: 41% (43/103)
remote: Compressing objects: 42% (44/103)
remote: Compressing objects: 43% (45/103)
remote: Compressing objects: 44% (46/103)
remote: Compressing objects: 45% (47/103)
remote: Compressing objects: 46% (48/103)
remote: Compressing objects: 47% (49/103)
remote: Compressing objects: 48% (50/103)
remote: Compressing objects: 49% (51/103)
remote: Compressing objects: 50% (52/103)
remote: Compressing objects: 51% (53/103)
remote: Compressing objects: 52% (54/103)
remote: Compressing objects: 53% (55/103)
remote: Compressing objects: 54% (56/103)
remote: Compressing objects: 55% (57/103)
remote: Compressing objects: 56% (58/103)
remote: Compressing objects: 57% (59/103)
remote: Compressing objects: 58% (60/103)
remote: Compressing objects: 59% (61/103)
remote: Compressing objects: 60% (62/103)
remote: Compressing objects: 61% (63/103)
remote: Compressing objects: 62% (64/103)
remote: Compressing objects: 63% (65/103)
remote: Compressing objects: 64% (66/103)
remote: Compressing objects: 65% (67/103)
remote: Compressing objects: 66% (68/103)
remote: Compressing objects: 67% (70/103)
remote: Compressing objects: 68% (71/103)
remote: Compressing objects: 69% (72/103)
remote: Compressing objects: 70% (73/103)
remote: Compressing objects: 71% (74/103)
remote: Compressing objects: 72% (75/103)
remote: Compressing objects: 73% (76/103)
remote: Compressing objects: 74% (77/103)
remote: Compressing objects: 75% (78/103)
remote: Compressing objects: 76% (79/103)
remote: Compressing objects: 77% (80/103)
remote: Compressing objects: 78% (81/103)
remote: Compressing objects: 79% (82/103)
remote: Compressing objects: 80% (83/103)
remote: Compressing objects: 81% (84/103)
remote: Compressing objects: 82% (85/103)
remote: Compressing objects: 83% (86/103)
remote: Compressing objects: 84% (87/103)
remote: Compressing objects: 85% (88/103)
remote: Compressing objects: 86% (89/103)
remote: Compressing objects: 87% (90/103)
remote: Compressing objects: 88% (91/103)
remote: Compressing objects: 89% (92/103)
remote: Compressing objects: 90% (93/103)
remote: Compressing objects: 91% (94/103)
remote: Compressing objects: 92% (95/103)
remote: Compressing objects: 93% (96/103)
remote: Compressing objects: 94% (97/103)
remote: Compressing objects: 95% (98/103)
remote: Compressing objects: 96% (99/103)
remote: Compressing objects: 97% (100/103)
remote: Compressing objects: 98% (101/103)
remote: Compressing objects: 99% (102/103)
remote: Compressing objects: 100% (103/103)
remote: Compressing objects: 100% (103/103), done.
28.09 s
Receiving objects: 0% (1/9552)
Receiving objects: 1% (96/9552)
Receiving objects: 2% (192/9552)
Receiving objects: 3% (287/9552)
Receiving objects: 4% (383/9552)
Receiving objects: 5% (478/9552)
Receiving objects: 6% (574/9552)
Receiving objects: 7% (669/9552)
Receiving objects: 8% (765/9552)
Receiving objects: 9% (860/9552)
Receiving objects: 10% (956/9552)
Receiving objects: 11% (1051/9552)
Receiving objects: 12% (1147/9552)
Receiving objects: 13% (1242/9552)
Receiving objects: 14% (1338/9552)
Receiving objects: 15% (1433/9552)
Receiving objects: 16% (1529/9552)
Receiving objects: 17% (1624/9552)
Receiving objects: 18% (1720/9552)
Receiving objects: 19% (1815/9552)
Receiving objects: 20% (1911/9552)
Receiving objects: 21% (2006/9552)
Receiving objects: 22% (2102/9552)
Receiving objects: 23% (2197/9552)
Receiving objects: 24% (2293/9552)
Receiving objects: 25% (2388/9552)
Receiving objects: 26% (2484/9552)
Receiving objects: 27% (2580/9552)
Receiving objects: 28% (2675/9552)
Receiving objects: 29% (2771/9552)
Receiving objects: 30% (2866/9552)
Receiving objects: 31% (2962/9552)
Receiving objects: 32% (3057/9552)
Receiving objects: 33% (3153/9552)
Receiving objects: 34% (3248/9552)
Receiving objects: 35% (3344/9552)
Receiving objects: 36% (3439/9552)
Receiving objects: 37% (3535/9552)
Receiving objects: 38% (3630/9552)
Receiving objects: 39% (3726/9552)
Receiving objects: 40% (3821/9552)
Receiving objects: 41% (3917/9552)
Receiving objects: 42% (4012/9552)
Receiving objects: 43% (4108/9552)
Receiving objects: 44% (4203/9552)
Receiving objects: 45% (4299/9552)
Receiving objects: 46% (4394/9552)
Receiving objects: 47% (4490/9552)
Receiving objects: 48% (4585/9552)
Receiving objects: 49% (4681/9552)
Receiving objects: 50% (4776/9552)
Receiving objects: 51% (4872/9552)
Receiving objects: 52% (4968/9552)
Receiving objects: 53% (5063/9552)
Receiving objects: 54% (5159/9552)
Receiving objects: 55% (5254/9552)
Receiving objects: 56% (5350/9552)
Receiving objects: 57% (5445/9552)
Receiving objects: 58% (5541/9552)
Receiving objects: 59% (5636/9552)
Receiving objects: 60% (5732/9552)
Receiving objects: 61% (5827/9552)
Receiving objects: 62% (5923/9552)
Receiving objects: 63% (6018/9552)
Receiving objects: 64% (6114/9552)
Receiving objects: 65% (6209/9552)
Receiving objects: 66% (6305/9552)
Receiving objects: 67% (6400/9552)
Receiving objects: 68% (6496/9552)
Receiving objects: 69% (6591/9552)
Receiving objects: 70% (6687/9552)
Receiving objects: 71% (6782/9552)
Receiving objects: 72% (6878/9552)
Receiving objects: 73% (6973/9552)
Receiving objects: 74% (7069/9552)
Receiving objects: 75% (7164/9552)
Receiving objects: 76% (7260/9552)
Receiving objects: 77% (7356/9552)
Receiving objects: 78% (7451/9552)
Receiving objects: 79% (7547/9552)
Receiving objects: 80% (7642/9552)
Receiving objects: 81% (7738/9552)
Receiving objects: 82% (7833/9552)
Receiving objects: 83% (7929/9552)
Receiving objects: 84% (8024/9552)
Receiving objects: 85% (8120/9552)
Receiving objects: 86% (8215/9552)
Receiving objects: 87% (8311/9552)
Receiving objects: 88% (8406/9552)
Receiving objects: 89% (8502/9552)
Receiving objects: 90% (8597/9552)
Receiving objects: 91% (8693/9552)
Receiving objects: 92% (8788/9552)
Receiving objects: 93% (8884/9552)
Receiving objects: 94% (8979/9552)
Receiving objects: 95% (9075/9552)
Receiving objects: 96% (9170/9552)
Receiving objects: 97% (9266/9552)
Receiving objects: 98% (9361/9552)
Receiving objects: 99% (9457/9552)
remote: Total 9552 (delta 468), reused 425 (delta 425), pack-reused 9024 (from 2)
28.09 s
Receiving objects: 100% (9552/9552)
Receiving objects: 100% (9552/9552), 5.79 MiB | 14.71 MiB/s, done.
28.25 s
Resolving deltas: 0% (0/7517)
Resolving deltas: 1% (76/7517)
Resolving deltas: 2% (152/7517)
Resolving deltas: 3% (226/7517)
Resolving deltas: 4% (301/7517)
Resolving deltas: 5% (376/7517)
Resolving deltas: 6% (453/7517)
Resolving deltas: 7% (527/7517)
Resolving deltas: 8% (602/7517)
Resolving deltas: 9% (678/7517)
Resolving deltas: 10% (752/7517)
Resolving deltas: 11% (827/7517)
Resolving deltas: 12% (903/7517)
Resolving deltas: 13% (978/7517)
Resolving deltas: 14% (1053/7517)
Resolving deltas: 15% (1128/7517)
Resolving deltas: 16% (1203/7517)
Resolving deltas: 17% (1278/7517)
Resolving deltas: 18% (1354/7517)
Resolving deltas: 19% (1429/7517)
Resolving deltas: 20% (1506/7517)
Resolving deltas: 21% (1580/7517)
Resolving deltas: 22% (1654/7517)
Resolving deltas: 23% (1729/7517)
Resolving deltas: 24% (1805/7517)
Resolving deltas: 25% (1880/7517)
Resolving deltas: 26% (1957/7517)
Resolving deltas: 27% (2030/7517)
Resolving deltas: 28% (2107/7517)
Resolving deltas: 29% (2181/7517)
Resolving deltas: 30% (2256/7517)
Resolving deltas: 31% (2332/7517)
Resolving deltas: 32% (2406/7517)
Resolving deltas: 33% (2482/7517)
Resolving deltas: 34% (2556/7517)
Resolving deltas: 35% (2631/7517)
Resolving deltas: 36% (2707/7517)
Resolving deltas: 37% (2782/7517)
Resolving deltas: 38% (2858/7517)
Resolving deltas: 39% (2932/7517)
Resolving deltas: 40% (3007/7517)
Resolving deltas: 41% (3082/7517)
Resolving deltas: 42% (3158/7517)
Resolving deltas: 43% (3233/7517)
Resolving deltas: 44% (3308/7517)
Resolving deltas: 45% (3383/7517)
Resolving deltas: 46% (3458/7517)
Resolving deltas: 47% (3533/7517)
Resolving deltas: 48% (3610/7517)
Resolving deltas: 49% (3684/7517)
Resolving deltas: 50% (3759/7517)
Resolving deltas: 51% (3834/7517)
Resolving deltas: 52% (3909/7517)
Resolving deltas: 53% (3985/7517)
Resolving deltas: 54% (4060/7517)
Resolving deltas: 55% (4135/7517)
Resolving deltas: 56% (4210/7517)
Resolving deltas: 57% (4286/7517)
Resolving deltas: 58% (4360/7517)
Resolving deltas: 59% (4436/7517)
Resolving deltas: 60% (4511/7517)
Resolving deltas: 61% (4586/7517)
Resolving deltas: 62% (4661/7517)
Resolving deltas: 63% (4738/7517)
Resolving deltas: 64% (4811/7517)
Resolving deltas: 65% (4887/7517)
Resolving deltas: 66% (4962/7517)
Resolving deltas: 67% (5037/7517)
Resolving deltas: 68% (5112/7517)
Resolving deltas: 69% (5188/7517)
Resolving deltas: 70% (5262/7517)
Resolving deltas: 71% (5338/7517)
Resolving deltas: 72% (5413/7517)
Resolving deltas: 73% (5488/7517)
Resolving deltas: 74% (5563/7517)
Resolving deltas: 75% (5640/7517)
Resolving deltas: 76% (5713/7517)
Resolving deltas: 77% (5789/7517)
Resolving deltas: 78% (5864/7517)
Resolving deltas: 79% (5939/7517)
Resolving deltas: 80% (6014/7517)
Resolving deltas: 81% (6091/7517)
Resolving deltas: 82% (6164/7517)
Resolving deltas: 83% (6240/7517)
Resolving deltas: 84% (6316/7517)
Resolving deltas: 85% (6390/7517)
Resolving deltas: 86% (6465/7517)
Resolving deltas: 87% (6541/7517)
Resolving deltas: 88% (6615/7517)
Resolving deltas: 89% (6692/7517)
Resolving deltas: 90% (6767/7517)
Resolving deltas: 91% (6841/7517)
Resolving deltas: 92% (6916/7517)
Resolving deltas: 93% (6991/7517)
Resolving deltas: 94% (7066/7517)
Resolving deltas: 95% (7142/7517)
Resolving deltas: 96% (7219/7517)
Resolving deltas: 97% (7293/7517)
Resolving deltas: 98% (7367/7517)
Resolving deltas: 99% (7442/7517)
Resolving deltas: 100% (7517/7517)
Resolving deltas: 100% (7517/7517), done.
28.28 s
From https://github.com/symbolica-dev/symbolica
28.28 s
* branch 0441bd7a511209dce2ca99925fe87f8b18e4bf03 -> FETCH_HEAD
30.28 s
30.29 s
Downloading cached gammaloop-nextest-binaries-integration-gammaloop-integration-tests from https://cache.nix-ci.com
30.29 s
Downloading cached xgcc-15.2.0-libgcc from https://cache.nix-ci.com
30.29 s
Downloading cached busybox from https://cache.nix-ci.com
30.29 s
Downloading cached gcc-15.2.0-libgcc from https://cache.nix-ci.com
30.29 s
Downloading cached libunistring from https://cache.nix-ci.com
30.30 s
Downloading cached publicsuffix-list-0-unstable-2026-05 from https://cache.nix-ci.com
30.31 s
Downloaded cached xgcc-15.2.0-libgcc (193 KiB) in 15ms
30.31 s
Progress: 0 of 1 built, 1 of 68 downloaded from cache (5 downloading)
30.31 s
Downloaded cached gcc-15.2.0-libgcc (193 KiB) in 17ms
30.31 s
Progress: 0 of 1 built, 2 of 68 downloaded from cache (4 downloading)
30.31 s
Downloaded cached busybox (230 KiB) in 17ms
30.31 s
Progress: 0 of 1 built, 3 of 68 downloaded from cache (3 downloading)
30.31 s
Downloaded cached publicsuffix-list-0-unstable-2026-05 (329 KiB) in 16ms
30.31 s
Progress: 0 of 1 built, 4 of 68 downloaded from cache (2 downloading)
30.33 s
Downloaded cached libunistring (2 MiB) in 39ms
30.33 s
Progress: 0 of 1 built, 5 of 68 downloaded from cache (1 downloading)
30.33 s
Downloading cached libidn2 from https://cache.nix-ci.com
30.36 s
Downloaded cached libidn2 (359 KiB) in 22ms
30.36 s
Progress: 0 of 1 built, 6 of 68 downloaded from cache (1 downloading)
30.36 s
Downloading cached glibc-2.42 from https://cache.nix-ci.com
30.76 s
Downloaded cached glibc-2.42 (33.5 MiB) in 400ms
30.76 s
Progress: 0 of 1 built, 7 of 68 downloaded from cache (1 downloading)
30.76 s
Downloading cached attr from https://cache.nix-ci.com
30.76 s
Downloading cached aws-c-common from https://cache.nix-ci.com
30.76 s
Downloading cached bzip2 from https://cache.nix-ci.com
30.76 s
Downloading cached bash from https://cache.nix-ci.com
30.76 s
Downloading cached editline-1.17.1-unstable-2025-05 from https://cache.nix-ci.com
30.76 s
Downloading cached brotli-1.2.0-lib from https://cache.nix-ci.com
30.76 s
Downloading cached gcc-15.2.0-lib from https://cache.nix-ci.com
30.76 s
Downloading cached keyutils-1.6.3-lib from https://cache.nix-ci.com
30.76 s
Downloading cached libcpuid from https://cache.nix-ci.com
30.76 s
Downloading cached libpsl from https://cache.nix-ci.com
30.76 s
Downloading cached libseccomp-2.6.0-lib from https://cache.nix-ci.com
30.76 s
Downloading cached libsodium-1.0.22-unstable-2026-04 from https://cache.nix-ci.com
30.76 s
Downloading cached libxml2 from https://cache.nix-ci.com
30.76 s
Downloading cached llhttp from https://cache.nix-ci.com
30.76 s
Downloading cached hwloc-2.14.0-lib from https://cache.nix-ci.com
30.78 s
Downloaded cached bzip2 (86 KiB) in 23ms
30.78 s
Progress: 0 of 1 built, 8 of 68 downloaded from cache (15 downloading)
30.78 s
Downloading cached lowdown-3.0.1-lib from https://cache.nix-ci.com
30.79 s
Downloaded cached attr (90 KiB) in 28ms
30.79 s
Progress: 0 of 1 built, 9 of 68 downloaded from cache (15 downloading)
30.79 s
Downloading cached nghttp2-1.69.0-lib from https://cache.nix-ci.com
30.79 s
Downloaded cached libsodium-1.0.22-unstable-2026-04 (666 KiB) in 33ms
30.79 s
Progress: 0 of 1 built, 10 of 68 downloaded from cache (15 downloading)
30.79 s
Downloading cached acl from https://cache.nix-ci.com
30.79 s
Downloaded cached libcpuid (326 KiB) in 35ms
30.80 s
Progress: 0 of 1 built, 11 of 68 downloaded from cache (15 downloading)
30.80 s
Downloading cached nghttp3 from https://cache.nix-ci.com
30.80 s
Downloaded cached libseccomp-2.6.0-lib (193 KiB) in 36ms
30.80 s
Progress: 0 of 1 built, 12 of 68 downloaded from cache (15 downloading)
30.80 s
Downloading cached openssl from https://cache.nix-ci.com
30.80 s
Downloaded cached brotli-1.2.0-lib (961 KiB) in 40ms
30.80 s
Progress: 0 of 1 built, 13 of 68 downloaded from cache (15 downloading)
30.80 s
Downloading cached pcre2 from https://cache.nix-ci.com
30.80 s
Downloaded cached libpsl (114 KiB) in 41ms
30.80 s
Progress: 0 of 1 built, 14 of 68 downloaded from cache (15 downloading)
30.80 s
Downloading cached xz from https://cache.nix-ci.com
30.80 s
Downloaded cached llhttp (89 KiB) in 42ms
30.80 s
Progress: 0 of 1 built, 15 of 68 downloaded from cache (15 downloading)
30.80 s
Downloading cached zlib from https://cache.nix-ci.com
30.80 s
Downloaded cached keyutils-1.6.3-lib (41 KiB) in 46ms
30.80 s
Progress: 0 of 1 built, 16 of 68 downloaded from cache (15 downloading)
30.81 s
Downloaded cached hwloc-2.14.0-lib (459 KiB) in 47ms
30.81 s
Progress: 0 of 1 built, 17 of 68 downloaded from cache (14 downloading)
30.81 s
Downloaded cached editline-1.17.1-unstable-2025-05 (58 KiB) in 49ms
30.81 s
Progress: 0 of 1 built, 18 of 68 downloaded from cache (13 downloading)
30.81 s
Downloaded cached aws-c-common (1.1 MiB) in 52ms
30.81 s
Progress: 0 of 1 built, 19 of 68 downloaded from cache (12 downloading)
30.81 s
Downloading cached aws-c-sdkutils from https://cache.nix-ci.com
30.81 s
Downloading cached aws-c-compression from https://cache.nix-ci.com
30.81 s
Downloading cached aws-checksums from https://cache.nix-ci.com
30.81 s
Downloaded cached bash (1.8 MiB) in 53ms
30.81 s
Progress: 0 of 1 built, 20 of 68 downloaded from cache (14 downloading)
30.81 s
Downloaded cached libxml2 (1.4 MiB) in 53ms
30.81 s
Progress: 0 of 1 built, 21 of 68 downloaded from cache (13 downloading)
30.83 s
Downloaded cached lowdown-3.0.1-lib (341 KiB) in 52ms
30.83 s
Progress: 0 of 1 built, 22 of 68 downloaded from cache (12 downloading)
30.83 s
Downloaded cached nghttp3 (228 KiB) in 38ms
30.83 s
Downloaded cached nghttp2-1.69.0-lib (225 KiB) in 48ms
30.83 s
Progress: 0 of 1 built, 23 of 68 downloaded from cache (11 downloading)
30.83 s
Progress: 0 of 1 built, 24 of 68 downloaded from cache (10 downloading)
30.84 s
Downloaded cached acl (125 KiB) in 42ms
30.84 s
Progress: 0 of 1 built, 25 of 68 downloaded from cache (9 downloading)
30.85 s
Downloaded cached zlib (129 KiB) in 51ms
30.85 s
Progress: 0 of 1 built, 26 of 68 downloaded from cache (8 downloading)
30.85 s
Downloading cached sqlite from https://cache.nix-ci.com
30.86 s
Downloaded cached aws-c-compression (31 KiB) in 51ms
30.86 s
Progress: 0 of 1 built, 27 of 68 downloaded from cache (8 downloading)
30.87 s
Downloaded cached aws-checksums (86 KiB) in 55ms
30.87 s
Progress: 0 of 1 built, 28 of 68 downloaded from cache (7 downloading)
30.87 s
Downloaded cached xz (837 KiB) in 67ms
30.87 s
Progress: 0 of 1 built, 29 of 68 downloaded from cache (6 downloading)
30.87 s
Downloaded cached aws-c-sdkutils (155 KiB) in 56ms
30.87 s
Progress: 0 of 1 built, 30 of 68 downloaded from cache (5 downloading)
30.89 s
Downloaded cached openssl (8.9 MiB) in 87ms
30.89 s
Progress: 0 of 1 built, 31 of 68 downloaded from cache (4 downloading)
30.89 s
Downloading cached aws-c-cal from https://cache.nix-ci.com
30.89 s
Downloading cached krb5-1.22.2-lib from https://cache.nix-ci.com
30.89 s
Downloading cached libssh2 from https://cache.nix-ci.com
30.89 s
Downloading cached ngtcp2 from https://cache.nix-ci.com
30.89 s
Downloading cached s2n-tls from https://cache.nix-ci.com
30.89 s
Downloaded cached pcre2 (2 MiB) in 88ms
30.89 s
Progress: 0 of 1 built, 32 of 68 downloaded from cache (8 downloading)
30.90 s
Downloaded cached sqlite (5.7 MiB) in 49ms
30.90 s
Progress: 0 of 1 built, 33 of 68 downloaded from cache (7 downloading)
30.91 s
Downloaded cached aws-c-cal (158 KiB) in 25ms
30.91 s
Progress: 0 of 1 built, 34 of 68 downloaded from cache (6 downloading)
30.92 s
Downloaded cached libssh2 (330 KiB) in 29ms
30.92 s
Progress: 0 of 1 built, 35 of 68 downloaded from cache (5 downloading)
30.92 s
Downloading cached libgit2-1.9.4-lib from https://cache.nix-ci.com
30.92 s
Downloaded cached s2n-tls (1.3 MiB) in 37ms
30.93 s
Progress: 0 of 1 built, 36 of 68 downloaded from cache (5 downloading)
30.93 s
Downloading cached aws-c-io from https://cache.nix-ci.com
30.93 s
Downloaded cached ngtcp2 (515 KiB) in 44ms
30.93 s
Progress: 0 of 1 built, 37 of 68 downloaded from cache (5 downloading)
30.93 s
Downloaded cached gcc-15.2.0-lib (9.8 MiB) in 177ms
30.94 s
Progress: 0 of 1 built, 38 of 68 downloaded from cache (4 downloading)
30.94 s
Downloading cached boehm-gc from https://cache.nix-ci.com
30.94 s
Downloading cached icu4c from https://cache.nix-ci.com
30.94 s
Downloading cached onetbb from https://cache.nix-ci.com
30.94 s
Downloading cached zstd from https://cache.nix-ci.com
30.96 s
Downloaded cached krb5-1.22.2-lib (2.7 MiB) in 73ms
30.96 s
Progress: 0 of 1 built, 39 of 68 downloaded from cache (7 downloading)
30.97 s
Downloaded cached libgit2-1.9.4-lib (1.6 MiB) in 54ms
30.97 s
Progress: 0 of 1 built, 40 of 68 downloaded from cache (6 downloading)
30.97 s
Downloaded cached aws-c-io (648 KiB) in 49ms
30.97 s
Progress: 0 of 1 built, 41 of 68 downloaded from cache (5 downloading)
30.98 s
Downloading cached aws-c-http from https://cache.nix-ci.com
30.98 s
Downloading cached aws-c-event-stream from https://cache.nix-ci.com
31.01 s
Downloaded cached boehm-gc (312 KiB) in 75ms
31.01 s
Progress: 0 of 1 built, 42 of 68 downloaded from cache (6 downloading)
31.01 s
Downloaded cached onetbb (626 KiB) in 77ms
31.01 s
Progress: 0 of 1 built, 43 of 68 downloaded from cache (5 downloading)
31.01 s
Downloading cached libblake3 from https://cache.nix-ci.com
31.01 s
Downloaded cached zstd (1.1 MiB) in 79ms
31.01 s
Progress: 0 of 1 built, 44 of 68 downloaded from cache (5 downloading)
31.02 s
Downloading cached libarchive-3.8.8-lib from https://cache.nix-ci.com
31.02 s
Downloading cached curl from https://cache.nix-ci.com
31.03 s
Downloaded cached aws-c-event-stream (176 KiB) in 56ms
31.03 s
Progress: 0 of 1 built, 45 of 68 downloaded from cache (6 downloading)
31.04 s
Downloaded cached aws-c-http (641 KiB) in 62ms
31.04 s
Progress: 0 of 1 built, 46 of 68 downloaded from cache (5 downloading)
31.04 s
Downloading cached aws-c-auth from https://cache.nix-ci.com
31.04 s
Downloading cached aws-c-mqtt from https://cache.nix-ci.com
31.06 s
Downloaded cached libblake3 (117 KiB) in 44ms
31.06 s
Progress: 0 of 1 built, 47 of 68 downloaded from cache (6 downloading)
31.07 s
Downloaded cached libarchive-3.8.8-lib (953 KiB) in 57ms
31.07 s
Progress: 0 of 1 built, 48 of 68 downloaded from cache (5 downloading)
31.08 s
Downloaded cached curl (1.2 MiB) in 59ms
31.08 s
Progress: 0 of 1 built, 49 of 68 downloaded from cache (4 downloading)
31.09 s
Downloaded cached aws-c-auth (387 KiB) in 50ms
31.09 s
Downloaded cached aws-c-mqtt (557 KiB) in 50ms
31.09 s
Progress: 0 of 1 built, 50 of 68 downloaded from cache (3 downloading)
31.09 s
Downloading cached aws-c-s3 from https://cache.nix-ci.com
31.09 s
Progress: 0 of 1 built, 51 of 68 downloaded from cache (3 downloading)
31.12 s
Downloaded cached aws-c-s3 (384 KiB) in 28ms
31.12 s
Progress: 0 of 1 built, 52 of 68 downloaded from cache (2 downloading)
31.12 s
Downloading cached aws-crt-cpp from https://cache.nix-ci.com
31.14 s
Downloaded cached aws-crt-cpp (979 KiB) in 21ms
31.14 s
Progress: 0 of 1 built, 53 of 68 downloaded from cache (2 downloading)
31.14 s
Downloaded cached icu4c (38.2 MiB) in 208ms
31.14 s
Progress: 0 of 1 built, 54 of 68 downloaded from cache (1 downloading)
31.14 s
Downloading cached boost from https://cache.nix-ci.com
31.21 s
Downloaded cached boost (14.5 MiB) in 69ms
31.21 s
Progress: 0 of 1 built, 55 of 68 downloaded from cache (1 downloading)
31.21 s
Downloading cached nix-util from https://cache.nix-ci.com
31.24 s
Downloaded cached nix-util (2.4 MiB) in 22ms
31.24 s
Progress: 0 of 1 built, 56 of 68 downloaded from cache (1 downloading)
31.24 s
Downloading cached nix-nswrapper from https://cache.nix-ci.com
31.24 s
Downloading cached nix-store from https://cache.nix-ci.com
31.25 s
Downloaded cached nix-nswrapper (131 KiB) in 13ms
31.25 s
Progress: 0 of 1 built, 57 of 68 downloaded from cache (2 downloading)
31.28 s
Downloaded cached nix-store (5.8 MiB) in 39ms
31.28 s
Progress: 0 of 1 built, 58 of 68 downloaded from cache (1 downloading)
31.28 s
Downloading cached nix-fetchers from https://cache.nix-ci.com
31.28 s
Downloading cached nix-main from https://cache.nix-ci.com
31.30 s
Downloaded cached nix-fetchers (1.5 MiB) in 22ms
31.30 s
Progress: 0 of 1 built, 59 of 68 downloaded from cache (2 downloading)
31.30 s
Downloading cached nix-expr from https://cache.nix-ci.com
31.30 s
Downloaded cached nix-main (393 KiB) in 23ms
31.30 s
Progress: 0 of 1 built, 60 of 68 downloaded from cache (2 downloading)
31.32 s
Downloaded cached nix-expr (3.3 MiB) in 24ms
31.32 s
Progress: 0 of 1 built, 61 of 68 downloaded from cache (1 downloading)
31.32 s
Downloading cached nix-flake from https://cache.nix-ci.com
31.34 s
Downloaded cached nix-flake (956 KiB) in 18ms
31.34 s
Progress: 0 of 1 built, 62 of 68 downloaded from cache (1 downloading)
31.34 s
Downloading cached nix-cmd from https://cache.nix-ci.com
31.36 s
Downloaded cached nix-cmd (1 MiB) in 18ms
31.36 s
Progress: 0 of 1 built, 63 of 68 downloaded from cache (1 downloading)
31.36 s
Downloading cached nix from https://cache.nix-ci.com
31.39 s
Downloaded cached nix (3.9 MiB) in 28ms
31.39 s
Progress: 0 of 1 built, 64 of 68 downloaded from cache (1 downloading)
31.39 s
Downloading cached nix from https://cache.nix-ci.com
31.41 s
Downloaded cached nix (8848 B) in 16ms
31.41 s
Progress: 0 of 1 built, 65 of 68 downloaded from cache (1 downloading)
32.53 s
Downloaded cached gammaloop-nextest-binaries-integration-gammaloop-integration-tests (248.6 MiB) in 2.2s
32.53 s
Progress: 0 of 1 built, 66 of 68 downloaded from cache
32.53 s
Downloading cached gammaloop-nextest-binaries-integration from https://cache.nix-ci.com
32.53 s
Downloaded cached gammaloop-nextest-binaries-integration (528 B) in 4ms
32.53 s
Progress: 0 of 1 built, 67 of 68 downloaded from cache
32.53 s
Downloading cached nix-ci-check-gammaloop-nextest-integration from https://cache.nix-ci.com
32.54 s
Downloaded cached nix-ci-check-gammaloop-nextest-integration (1032 B) in 3ms
32.54 s
Progress: 0 of 1 built, 68 of 68 downloaded from cache
38.63 s
evaluating derivation 'g
copying '/nix/store/6cs6
evaluating derivation 'g
copying '/nix/store/6cs6
evaluating derivation 'g
copying '/nix/store/6cs6
evaluating derivation 'g
copying '/nix/store/6cs6
evaluating derivation 'g
copying '/nix/store/6cs6
evaluating derivation 'g
querying gammaloop-nexte
[5.8 KiB DL] querying ru
[15.9 KiB DL] querying u
[18.9 KiB DL] querying m
[34.2 KiB DL] querying e
[47.6 KiB DL] querying g
[0 /20 built, 16 /0 /63 cop
[0 /22 built, 16 /5 /63 cop
[0 /21 built, 16 /10 /63 co
[0 /21 built, 16 /17 /63 co
[0 /21 built, 16 /21 /63 co
[0 /18 built, 16 /28 /63 co
[0 /18 built, 16 /32 /63 co
[0 /18 built, 16 /34 /63 co
[0 /17 built, 14 /39 /63 co
[0 /16 built, 9 /44 /63 cop
[0 /16 built, 9 /46 /63 cop
[0 /16 built, 9 /47 /63 cop
[0 /15 built, 8 /49 /63 cop
[1 /0 /15 built, 8 /49 /63 c
[2 /0 /15 built, 8 /51 /63 ccrane-dummy-cargo-target.rs (post)> Uploading to the NixCI cache: /nix/store/hd50hqi25fymr09a2w4xdiy5jmb2cfl5-crane-dummy-cargo-target.rs
38.80 s
crane-dummy-cargo-target.rs (post)> warning: 'warn-short-path-literals' is deprecated, use 'lint-short-path-literals = ignore' instead
38.90 s
crane-dummy-cargo-target.rs (post)> copying 0 paths...
39.10 s
crane-dummy-cargo-target.rs (post)> warning: 'warn-short-path-literals' is deprecated, use 'lint-short-path-literals = ignore' instead
40.87 s
crane-dummy-cargo-target.rs (post)> copying 0 paths...
40.92 s
[1 /1 /15 built, 2 /57 /63 ccrane-dummy-proc-macro-cargo-target.rs (post)> Uploading to the NixCI cache: /nix/store/z0b4s6pznqwlbyw5v4bbq7k1kp721g19-crane-dummy-proc-macro-cargo-target.rs
40.98 s
crane-dummy-proc-macro-cargo-target.rs (post)> warning: 'warn-short-path-literals' is deprecated, use 'lint-short-path-literals = ignore' instead
41.02 s
crane-dummy-proc-macro-cargo-target.rs (post)> copying 0 paths...
41.09 s
crane-dummy-proc-macro-cargo-target.rs (post)> warning: 'warn-short-path-literals' is deprecated, use 'lint-short-path-literals = ignore' instead
41.16 s
crane-dummy-proc-macro-cargo-target.rs (post)> copying 0 paths...
43.52 s
[2 /10 built, 3 /58 /63 cop
[2 /9 built, 2 /59 /63 copi
[2 /8 built, 1 /61 /63 copi
[2 /7 built, 1 /62 /63 copi
[2 /2 /7 built, 1 /62 /63 co
[2 /2 /6 built, 63 copied rust-stable-with-std (post)> Uploading to the NixCI cache: /nix/store/imnwv6nazijihjlgf2h3l1qm63m7l9wk-rust-stable-with-std-2026-07-09
43.58 s
rust-stable-with-std (post)> warning: 'warn-short-path-literals' is deprecated, use 'lint-short-path-literals = ignore' instead
43.62 s
rust-stable-with-std (post)> copying 0 paths...
43.69 s
rust-stable-with-std (post)> warning: 'warn-short-path-literals' is deprecated, use 'lint-short-path-literals = ignore' instead
43.83 s
rust-stable-with-std (post)> copying 0 paths...
44.05 s
[1 /3 /7 built, 63 copied clippy-stable-with-std (post)> Uploading to the NixCI cache: /nix/store/r4bjy93lvnfma1awpi480n2mz3af0adx-clippy-stable-with-std-2026-07-09
44.11 s
clippy-stable-with-std (post)> warning: 'warn-short-path-literals' is deprecated, use 'lint-short-path-literals = ignore' instead
44.15 s
clippy-stable-with-std (post)> copying 0 paths...
44.22 s
clippy-stable-with-std (post)> warning: 'warn-short-path-literals' is deprecated, use 'lint-short-path-literals = ignore' instead
44.28 s
clippy-stable-with-std (post)> copying 0 paths...
44.40 s
[4 /7 built, 63 copied (1
[1 /4 /6 built, 63 copied rust-stable-with-components> /nix/store/imnwv6nazijihjlgf2h3l1qm63m7l9wk-rust-stable-with-std-2026-07-09/lib:
44.40 s
rust-stable-with-components> librustc_driver-a39fc8bf9e61dbb9.so: Keeping existing link to /nix/store/r4bjy93lvnfma1awpi480n2mz3af0adx-clippy-stable-with-std-2026-07-09/lib/librustc_driver-a39fc8bf9e61dbb9.so
44.40 s
rust-stable-with-components> /nix/store/imnwv6nazijihjlgf2h3l1qm63m7l9wk-rust-stable-with-std-2026-07-09/bin:
44.40 s
rust-stable-with-components> rust-gdb: Keeping existing link to /nix/store/r4bjy93lvnfma1awpi480n2mz3af0adx-clippy-stable-with-std-2026-07-09/bin/rust-gdb
44.40 s
rust-stable-with-components> rustdoc: Keeping existing link to /nix/store/r4bjy93lvnfma1awpi480n2mz3af0adx-clippy-stable-with-std-2026-07-09/bin/rustdoc
44.40 s
rust-stable-with-components> rust-gdbgui: Keeping existing link to /nix/store/r4bjy93lvnfma1awpi480n2mz3af0adx-clippy-stable-with-std-2026-07-09/bin/rust-gdbgui
44.40 s
rust-stable-with-components> rustc: Keeping existing link to /nix/store/r4bjy93lvnfma1awpi480n2mz3af0adx-clippy-stable-with-std-2026-07-09/bin/rustc
44.40 s
rust-stable-with-components> rust-lldb: Keeping existing link to /nix/store/r4bjy93lvnfma1awpi480n2mz3af0adx-clippy-stable-with-std-2026-07-09/bin/rust-lldb
45.05 s
rust-stable-with-components (post)> Uploading to the NixCI cache: /nix/store/9pb4ikjdw4gp766ayxl6gg3b7hqm6ds4-rust-stable-with-components-2026-07-09
45.11 s
rust-stable-with-components (post)> warning: 'warn-short-path-literals' is deprecated, use 'lint-short-path-literals = ignore' instead
45.15 s
rust-stable-with-components (post)> copying 0 paths...
45.22 s
rust-stable-with-components (post)> warning: 'warn-short-path-literals' is deprecated, use 'lint-short-path-literals = ignore' instead
45.29 s
rust-stable-with-components (post)> copying 0 paths...
45.77 s
[5 /7 built, 63 copied (1
[1 /5 /6 built, 63 copied gammaloop-nextest-integration> Extracting 9 binaries, 1 build script output directory, and 3 linked paths to /build/nextest-archive-1zHuEd
47.88 s
gammaloop-nextest-integration> Extracted 26 files to /build/nextest-archive-1zHuEd in 2.11s
47.90 s
gammaloop-nextest-integration> ------------
47.90 s
gammaloop-nextest-integration> Nextest run ID cda8f6af-5041-421b-91d8-ffae58f3095f with nextest profile: ci_gammaloop
47.90 s
gammaloop-nextest-integration> Starting 107 tests across 9 binaries (68 tests skipped via profile.ci_gammaloop.default-filter )
67.44 s
gammaloop-nextest-integration> FAIL [ 2.733s] ( 94/107) gammaloop-integration-tests::uv thermal_sunrise_uv
67.44 s
gammaloop-nextest-integration> stdout ---
67.44 s
gammaloop-nextest-integration>
67.44 s
gammaloop-nextest-integration> running 1 test
67.44 s
gammaloop-nextest-integration> test thermal_sunrise_uv ... FAILED
67.44 s
gammaloop-nextest-integration>
67.44 s
gammaloop-nextest-integration> failures:
67.44 s
gammaloop-nextest-integration>
67.44 s
gammaloop-nextest-integration> failures:
67.44 s
gammaloop-nextest-integration> thermal_sunrise_uv
67.44 s
gammaloop-nextest-integration>
67.44 s
gammaloop-nextest-integration> test result: FAILED. 0 passed; 1 failed; 0 ignored; 0 measured; 25 filtered out; finished in 2.71s
67.44 s
gammaloop-nextest-integration>
67.44 s
gammaloop-nextest-integration> stderr ---
67.44 s
gammaloop-nextest-integration> [2026-09-09 23:10:32.550] @gammaloop_api::se... INFO : Running command run generate
67.44 s
gammaloop-nextest-integration> [2026-09-09 23:10:32.550] @gammaloop_api::se... INFO : Starting command block generate
67.44 s
gammaloop-nextest-integration> [2026-09-09 23:10:32.551] @gammaloop_api::se... INFO : Running command import model sm-default.json
67.44 s
gammaloop-nextest-integration> [2026-09-09 23:10:32.551] @import::model INFO : Loading built-in JSON model sm-default
67.44 s
gammaloop-nextest-integration> [2026-09-09 23:10:32.583] @gammalooprs::model INFO : The following 15 external parameters were forced to zero by the restriction card:
67.44 s
gammaloop-nextest-integration> lamWS, AWS, rhoWS, etaWS, ymc, yme, ymm, MC, Me, MM, WTau, muQ, muLe, muLmu, muLtau
67.44 s
gammaloop-nextest-integration> [2026-09-09 23:10:32.583] @gammalooprs::model INFO : The following 34 vertex rules were removed by the restriction card:
67.44 s
gammaloop-nextest-integration> V_82 -> (c~, d, G+) | V_83 -> (t~, d, G+) | V_84 -> (c~, s, G+) | V_85 -> (t~, s, G+) | V_86 -> (u~, b, G+) | V_87 -> (c~, b, G+) | V_90 -> (c~, d, W+) | V_91 -> (t~, d, W+) | V_92 -> (u~, s, W+) | V_94 -> (t~, s, W+) | V_95 -> (u~, b, W+) | V_96 -> (c~, b, W+) | V_101 -> (e+, e-, G0) | V_102 -> (mu+, mu-, G0) | V_104 -> (e+, e-, H) | V_105 -> (mu+, mu-, H) | V_110 -> (ve~, e-, G+) | V_111 -> (vm~, mu-, G+) | V_116 -> (b~, u, G-) | V_117 -> (d~, c, G-) | V_118 -> (s~, c, G-) | V_119 -> (b~, c, G-) | V_120 -> (d~, t, G-) | V_121 -> (s~, t, G-) | V_124 -> (s~, u, W-) | V_125 -> (b~, u, W-) | V_126 -> (d~, c, W-) | V_128 -> (b~, c, W-) | V_129 -> (d~, t, W-) | V_130 -> (s~, t, W-) | V_138 -> (c~, c, G0) | V_140 -> (c~, c, H) | V_145 -> (e+, ve, G-) | V_146 -> (mu+, vm, G-)
67.44 s
gammaloop-nextest-integration> [2026-09-09 23:10:32.583] @gammalooprs::model INFO : The following 36 couplings were removed by the restriction card:
67.44 s
gammaloop-nextest-integration> GC_13, GC_14, GC_16, GC_17, GC_18, GC_19, GC_20, GC_22, GC_23, GC_24, GC_25, GC_26, GC_28, GC_29, GC_42, GC_43, GC_44, GC_46, GC_47, GC_48, GC_84, GC_85, GC_86, GC_87, GC_88, GC_89, GC_90, GC_91, GC_92, GC_93, GC_101, GC_102, GC_103, GC_105, GC_106, GC_107
67.44 s
gammaloop-nextest-integration> [2026-09-09 23:10:32.584] @gammaloop_api::se... INFO : Running command remove processes
67.44 s
gammaloop-nextest-integration> [2026-09-09 23:10:32.584] @gammaloop_api::se... INFO : Running command generate amp {} > {} [{2}] | g u
67.44 s
gammaloop-nextest-integration> --numerator-grouping group_identical_graphs_up_to_scalar_rescaling
67.44 s
gammaloop-nextest-integration> --max-n-bridges 0
67.44 s
gammaloop-nextest-integration> --number-of-factorized-loop-subtopologies 1 1
67.44 s
gammaloop-nextest-integration> --number-of-fermion-loops 1 1
67.44 s
gammaloop-nextest-integration> [...]
67.44 s
gammaloop-nextest-integration> [2026-09-09 23:10:32.586] @feyngen::diagram_... INFO : 0s | Δ=0s | Starting Feynman graph generation with Symbolica...
67.44 s
gammaloop-nextest-integration> [2026-09-09 23:10:32.586] @feyngen::diagram_... INFO : 0s | Δ=0s | Number of graphs resulting from Symbolica generation: 3
67.44 s
gammaloop-nextest-integration> [2026-09-09 23:10:32.586] @feyngen::diagram_... INFO : 0s | Δ=0s | Number of graphs retained after removal of vetoed topologies: 2
67.44 s
gammaloop-nextest-integration> [2026-09-09 23:10:32.589] @feyngen::diagram_... INFO : 0s | Δ=0s | Number of graphs after vertex info assignment: 2
67.44 s
gammaloop-nextest-integration> [2026-09-09 23:10:32.589] @feyngen::diagram_... INFO : 0s | Δ=0s | Number of graphs after all complete graphs filters are applied: 2
67.44 s
gammaloop-nextest-integration> [2026-09-09 23:10:32.592] @feyngen::diagram_... INFO : 0s | Δ=0s | Number of graphs after closed fermion chains analysis: 1
67.44 s
gammaloop-nextest-integration> [2026-09-09 23:10:32.592] @feyngen::diagram_... INFO : 0s | Δ=0s | Number of graphs after symmetrization of external states: 1
67.44 s
gammaloop-nextest-integration> [2026-09-09 23:10:32.594] @feyngen::diagram_... INFO : 0s | Δ=0s | Number of graphs after canonization of vertices, edges and flows (graph labels assigned here): 1
67.44 s
gammaloop-nextest-integration> [2026-09-09 23:10:32.635] @feyngen::diagram_... INFO : 0s | Δ=0s | Number of graphs after numerator-aware grouping with strategy 'up to a scalar rescaling': 1 (1 isomorphically unique graph, 0 color zero, 0 lorentz zero, 0 grouped and 0 cancellation)
67.44 s
gammaloop-nextest-integration> [2026-09-09 23:10:32.635] @feyngen::diagram_... INFO : ( Sum of the symmetry factors from each graph generated = -1/2 )
67.44 s
gammaloop-nextest-integration> [2026-09-09 23:10:32.636] @commands::generate INFO : Generated amplitude 1 graphs.
67.44 s
gammaloop-nextest-integration> [2026-09-09 23:10:32.636] @commands::generate INFO : Only diagram generation was requested, skipping integrand generation. You can generate integrands later using the 'generate existing <options> ' command.
67.44 s
gammaloop-nextest-integration> [2026-09-09 23:10:32.636] @gammaloop_api::se... INFO : Running command generate
67.44 s
gammaloop-nextest-integration> The application panicked (crashed).
67.44 s
gammaloop-nextest-integration> Message: called `Result::unwrap()` on an `Err` value: variable __Static610 not found
67.44 s
gammaloop-nextest-integration>
67.44 s
gammaloop-nextest-integration> Stack backtrace:
67.44 s
gammaloop-nextest-integration> 0: <anyhow::Error>::msg::<alloc::string::String>
67.44 s
gammaloop-nextest-integration> 1: <symjit::symjit::compiler::IndirectTranslator as symjit::symjit::composer::Composer>::compile
67.44 s
gammaloop-nextest-integration> 2: <symjit::symjit::compiler::Translator as symjit::symjit::composer::Composer>::compile
67.44 s
gammaloop-nextest-integration> 3: <numerica::domains::float::complex::Complex<f64> as symbolica::evaluate::backend::JITCompiledNumber>::jit_compile
67.44 s
gammaloop-nextest-integration> 4: <gammalooprs::integrands::process::evaluators::GenericEvaluator>::activate_symjit
67.44 s
gammaloop-nextest-integration> 5: <gammalooprs::integrands::process::amplitude::AmplitudeIntegrand>::prepare_runtime_backends_after_generation_with_compile_times
67.44 s
gammaloop-nextest-integration> 6: <gammalooprs::processes::amplitude::Amplitude>::build_integrand
67.44 s
gammaloop-nextest-integration> 7: <gammalooprs::processes::process::Process>::generate_integrands
67.44 s
gammaloop-nextest-integration> 8: <gammalooprs::processes::ProcessList>::generate_integrands
67.44 s
gammaloop-nextest-integration> 9: <gammaloop_api::state::State>::generate_integrands
67.44 s
gammaloop-nextest-integration> 10: <gammaloop_api::commands::generate::Generate>::run::<&std::path::PathBuf>
67.44 s
gammaloop-nextest-integration> 11: <gammaloop_api::commands::Commands>::run
67.44 s
gammaloop-nextest-integration> 12: <gammaloop_api::session::CliSession>::execute_prepared
67.44 s
gammaloop-nextest-integration> 13: <gammaloop_api::session::CliSession>::execute_prepared_commands
67.44 s
gammaloop-nextest-integration> 14: <gammaloop_api::session::CliSession>::execute_prepared
67.44 s
gammaloop-nextest-integration> 15: <gammaloop_api::session::CliSession>::execute_command
67.44 s
gammaloop-nextest-integration> 16: <gammaloop_integration_tests::CLIState>::run_command_flow
67.44 s
gammaloop-nextest-integration> 17: <gammaloop_integration_tests::CLIState>::run_command
67.44 s
gammaloop-nextest-integration> 18: uv::run_single_integrated_uv_case
67.44 s
gammaloop-nextest-integration> 19: <uv::thermal_sunrise_uv::{closure#0} as core::ops::function::FnOnce<()>>::call_once
67.44 s
gammaloop-nextest-integration> 20: test::__rust_begin_short_backtrace::<core::result::Result<(), alloc::string::String>, fn() -> core::result::Result<(), alloc::string::String>>
67.44 s
gammaloop-nextest-integration> 21: test::run_test::{closure#0}
67.44 s
gammaloop-nextest-integration> 22: std::sys::backtrace::__rust_begin_short_backtrace::<test::run_test::{closure#1}, ()>
67.44 s
gammaloop-nextest-integration> 23: <std::thread::lifecycle::spawn_unchecked<test::run_test::{closure#1}, ()>::{closure#1} as core::ops::function::FnOnce<()>>::call_once::{shim:vtable#0}
67.44 s
gammaloop-nextest-integration> 24: <std::sys::thread::unix::Thread>::new::thread_start
67.44 s
gammaloop-nextest-integration> 25: start_thread
67.44 s
gammaloop-nextest-integration> 26: __clone3
67.44 s
gammaloop-nextest-integration> Location: /nix/store/l5xazfnr7k6r6p8mlkn38x2afab0rygz-vendor-cargo-deps/c19b7c6f923b580ac259164a89f2577984ad5ab09ee9d583b888f934adbbe8d0/symjit-2.25.0/src/symjit/compiler.rs :883
67.44 s
gammaloop-nextest-integration>
67.44 s
gammaloop-nextest-integration> ━━━━━━━━━━━━━━━━━━━━━━━━━━━━━━━━━━ BACKTRACE ━━━━━━━━━━━━━━━━━━━━━━━━━━━━━━━━━━━
67.44 s
gammaloop-nextest-integration> 1: <color_eyre[51793ea62743adbd]::config::PanicHook>::panic_report <unknown>
67.44 s
gammaloop-nextest-integration> at <unknown source file> :<unknown line>
67.44 s
gammaloop-nextest-integration> 2: <color_eyre[51793ea62743adbd]::config::PanicHook>::into_panic_hook::{closure#0} <unknown>
67.44 s
gammaloop-nextest-integration> at <unknown source file> :<unknown line>
67.44 s
gammaloop-nextest-integration> 3: std[bcb96dfbba0ab899]::panicking::panic_with_hook <unknown>
67.44 s
gammaloop-nextest-integration> at <unknown source file> :<unknown line>
67.44 s
gammaloop-nextest-integration> 4: std[bcb96dfbba0ab899]::panicking::panic_handler::{closure#0} <unknown>
67.44 s
gammaloop-nextest-integration> at <unknown source file> :<unknown line>
67.44 s
gammaloop-nextest-integration> 5: std[bcb96dfbba0ab899]::sys::backtrace::__rust_end_short_backtrace::<std[bcb96dfbba0ab899]::panicking::panic_handler::{closure#0}, !> <unknown>
67.44 s
gammaloop-nextest-integration> at <unknown source file> :<unknown line>
67.44 s
gammaloop-nextest-integration> 6: __rustc[6c289b9f9c454d21]::rust_begin_unwind <unknown>
67.44 s
gammaloop-nextest-integration> at <unknown source file> :<unknown line>
67.44 s
gammaloop-nextest-integration> 7: core[940e698046960fd5]::panicking::panic_fmt <unknown>
67.44 s
gammaloop-nextest-integration> at <unknown source file> :<unknown line>
67.44 s
gammaloop-nextest-integration> 8: core[940e698046960fd5]::result::unwrap_failed <unknown>
67.44 s
gammaloop-nextest-integration> at <unknown source file> :<unknown line>
67.44 s
gammaloop-nextest-integration> 9: <symjit[9dfb3c17cbb79ae4]::symjit::compiler::IndirectTranslator as symjit[9dfb3c17cbb79ae4]::symjit::composer::Composer>::compile <unknown>
67.44 s
gammaloop-nextest-integration> at <unknown source file> :<unknown line>
67.44 s
gammaloop-nextest-integration> 10: <symjit[9dfb3c17cbb79ae4]::symjit::compiler::Translator as symjit[9dfb3c17cbb79ae4]::symjit::composer::Composer>::compile <unknown>
67.44 s
gammaloop-nextest-integration> at <unknown source file> :<unknown line>
67.44 s
gammaloop-nextest-integration> 11: <numerica[ca5044e7d57d1d48]::domains::float::complex::Complex<f64> as symbolica[911a260017ea9deb]::evaluate::backend::JITCompiledNumber>::jit_compile <unknown>
67.44 s
gammaloop-nextest-integration> at <unknown source file> :<unknown line>
67.44 s
gammaloop-nextest-integration> 12: <gammalooprs[61738dd440287478]::integrands::process::evaluators::GenericEvaluator>::activate_symjit <unknown>
67.44 s
gammaloop-nextest-integration> at <unknown source file> :<unknown line>
67.44 s
gammaloop-nextest-integration> 13: <gammalooprs[61738dd440287478]::integrands::process::amplitude::AmplitudeIntegrand>::prepare_runtime_backends_after_generation_with_compile_times <unknown>
67.44 s
gammaloop-nextest-integration> at <unknown source file> :<unknown line>
67.44 s
gammaloop-nextest-integration> 14: <gammalooprs[61738dd440287478]::processes::amplitude::Amplitude>::build_integrand <unknown>
67.44 s
gammaloop-nextest-integration> at <unknown source file> :<unknown line>
67.44 s
gammaloop-nextest-integration> 15: <gammalooprs[61738dd440287478]::processes::process::Process>::generate_integrands <unknown>
67.44 s
gammaloop-nextest-integration> at <unknown source file> :<unknown line>
67.44 s
gammaloop-nextest-integration> 16: <gammalooprs[61738dd440287478]::processes::ProcessList>::generate_integrands <unknown>
67.44 s
gammaloop-nextest-integration> at <unknown source file> :<unknown line>
67.44 s
gammaloop-nextest-integration> 17: <gammaloop_api[781ec552bb626e12]::state::State>::generate_integrands <unknown>
67.44 s
gammaloop-nextest-integration> at <unknown source file> :<unknown line>
67.44 s
gammaloop-nextest-integration> 18: <gammaloop_api[781ec552bb626e12]::commands::generate::Generate>::run::<&std[bcb96dfbba0ab899]::path::PathBuf> <unknown>
67.44 s
gammaloop-nextest-integration> at <unknown source file> :<unknown line>
67.44 s
gammaloop-nextest-integration> 19: <gammaloop_api[781ec552bb626e12]::commands::Commands>::run <unknown>
67.44 s
gammaloop-nextest-integration> at <unknown source file> :<unknown line>
67.44 s
gammaloop-nextest-integration> 20: <gammaloop_api[781ec552bb626e12]::session::CliSession>::execute_prepared <unknown>
67.44 s
gammaloop-nextest-integration> at <unknown source file> :<unknown line>
67.44 s
gammaloop-nextest-integration> 21: <gammaloop_api[781ec552bb626e12]::session::CliSession>::execute_prepared_commands <unknown>
67.44 s
gammaloop-nextest-integration> at <unknown source file> :<unknown line>
67.44 s
gammaloop-nextest-integration> 22: <gammaloop_api[781ec552bb626e12]::session::CliSession>::execute_prepared <unknown>
67.44 s
gammaloop-nextest-integration> at <unknown source file> :<unknown line>
67.44 s
gammaloop-nextest-integration> 23: <gammaloop_api[781ec552bb626e12]::session::CliSession>::execute_command <unknown>
67.44 s
gammaloop-nextest-integration> at <unknown source file> :<unknown line>
67.44 s
gammaloop-nextest-integration> 24: <gammaloop_integration_tests[3349793260628f2c]::CLIState>::run_command_flow <unknown>
67.44 s
gammaloop-nextest-integration> at <unknown source file> :<unknown line>
67.44 s
gammaloop-nextest-integration> 25: <gammaloop_integration_tests[3349793260628f2c]::CLIState>::run_command <unknown>
67.44 s
gammaloop-nextest-integration> at <unknown source file> :<unknown line>
67.44 s
gammaloop-nextest-integration> 26: uv[4a8ff97c1fe5666b]::run_single_integrated_uv_case <unknown>
67.44 s
gammaloop-nextest-integration> at <unknown source file> :<unknown line>
67.44 s
gammaloop-nextest-integration> 27: <uv[4a8ff97c1fe5666b]::thermal_sunrise_uv::{closure#0} as core[940e698046960fd5]::ops::function::FnOnce<()>>::call_once <unknown>
67.44 s
gammaloop-nextest-integration> at <unknown source file> :<unknown line>
67.44 s
gammaloop-nextest-integration> 28: test[75d6903177b1d7e9]::__rust_begin_short_backtrace::<core[940e698046960fd5]::result::Result<(), alloc[2ea6bcb46fca0c42]::string::String>, fn() -> core[940e698046960fd5]::result::Result<(), alloc[2ea6bcb46fca0c42]::string::String>> <unknown>
67.44 s
gammaloop-nextest-integration> at <unknown source file> :<unknown line>
67.44 s
gammaloop-nextest-integration> 29: test[75d6903177b1d7e9]::run_test::{closure#0} <unknown>
67.44 s
gammaloop-nextest-integration> at <unknown source file> :<unknown line>
67.44 s
gammaloop-nextest-integration> 30: std[bcb96dfbba0ab899]::sys::backtrace::__rust_begin_short_backtrace::<test[75d6903177b1d7e9]::run_test::{closure#1}, ()> <unknown>
67.44 s
gammaloop-nextest-integration> at <unknown source file> :<unknown line>
67.44 s
gammaloop-nextest-integration> 31: <std[bcb96dfbba0ab899]::thread::lifecycle::spawn_unchecked<test[75d6903177b1d7e9]::run_test::{closure#1}, ()>::{closure#1} as core[940e698046960fd5]::ops::function::FnOnce<()>>::call_once::{shim:vtable#0} <unknown>
67.44 s
gammaloop-nextest-integration> at <unknown source file> :<unknown line>
67.44 s
gammaloop-nextest-integration> 32: <std[bcb96dfbba0ab899]::sys::thread::unix::Thread>::new::thread_start <unknown>
67.44 s
gammaloop-nextest-integration> at <unknown source file> :<unknown line>
67.44 s
gammaloop-nextest-integration> 33: start_thread <unknown>
67.44 s
gammaloop-nextest-integration> at <unknown source file> :<unknown line>
67.44 s
gammaloop-nextest-integration> 34: __clone3 <unknown>
67.44 s
gammaloop-nextest-integration> at <unknown source file> :<unknown line>
67.44 s
gammaloop-nextest-integration>
67.44 s
gammaloop-nextest-integration> Run with COLORBT_SHOW_HIDDEN=1 environment variable to disable frame filtering.
67.44 s
gammaloop-nextest-integration> Run with RUST_BACKTRACE=full to include source snippets.
67.44 s
gammaloop-nextest-integration> Warning: SpanTrace capture is Unsupported.
67.44 s
gammaloop-nextest-integration> Ensure that you've setup a tracing-error ErrorLayer and the semver versions are compatible
67.44 s
gammaloop-nextest-integration>
182.86 s
gammaloop-nextest-integration> ------------
182.86 s
gammaloop-nextest-integration> Summary [ 134.959s] 107 tests run: 106 passed , 1 failed , 68 skipped
182.86 s
gammaloop-nextest-integration> FAIL [ 2.733s] ( 94/107) gammaloop-integration-tests::uv thermal_sunrise_uv
182.86 s
gammaloop-nextest-integration> stdout ---
182.86 s
gammaloop-nextest-integration>
182.86 s
gammaloop-nextest-integration> running 1 test
182.86 s
gammaloop-nextest-integration> test thermal_sunrise_uv ... FAILED
182.86 s
gammaloop-nextest-integration>
182.86 s
gammaloop-nextest-integration> failures:
182.86 s
gammaloop-nextest-integration>
182.86 s
gammaloop-nextest-integration> failures:
182.86 s
gammaloop-nextest-integration> thermal_sunrise_uv
182.86 s
gammaloop-nextest-integration>
182.86 s
gammaloop-nextest-integration> test result: FAILED. 0 passed; 1 failed; 0 ignored; 0 measured; 25 filtered out; finished in 2.71s
182.86 s
gammaloop-nextest-integration>
182.86 s
gammaloop-nextest-integration> stderr ---
182.86 s
gammaloop-nextest-integration> [2026-09-09 23:10:32.550] @gammaloop_api::se... INFO : Running command run generate
182.86 s
gammaloop-nextest-integration> [2026-09-09 23:10:32.550] @gammaloop_api::se... INFO : Starting command block generate
182.86 s
gammaloop-nextest-integration> [2026-09-09 23:10:32.551] @gammaloop_api::se... INFO : Running command import model sm-default.json
182.86 s
gammaloop-nextest-integration> [2026-09-09 23:10:32.551] @import::model INFO : Loading built-in JSON model sm-default
182.86 s
gammaloop-nextest-integration> [2026-09-09 23:10:32.583] @gammalooprs::model INFO : The following 15 external parameters were forced to zero by the restriction card:
182.86 s
gammaloop-nextest-integration> lamWS, AWS, rhoWS, etaWS, ymc, yme, ymm, MC, Me, MM, WTau, muQ, muLe, muLmu, muLtau
182.86 s
gammaloop-nextest-integration> [2026-09-09 23:10:32.583] @gammalooprs::model INFO : The following 34 vertex rules were removed by the restriction card:
182.86 s
gammaloop-nextest-integration> V_82 -> (c~, d, G+) | V_83 -> (t~, d, G+) | V_84 -> (c~, s, G+) | V_85 -> (t~, s, G+) | V_86 -> (u~, b, G+) | V_87 -> (c~, b, G+) | V_90 -> (c~, d, W+) | V_91 -> (t~, d, W+) | V_92 -> (u~, s, W+) | V_94 -> (t~, s, W+) | V_95 -> (u~, b, W+) | V_96 -> (c~, b, W+) | V_101 -> (e+, e-, G0) | V_102 -> (mu+, mu-, G0) | V_104 -> (e+, e-, H) | V_105 -> (mu+, mu-, H) | V_110 -> (ve~, e-, G+) | V_111 -> (vm~, mu-, G+) | V_116 -> (b~, u, G-) | V_117 -> (d~, c, G-) | V_118 -> (s~, c, G-) | V_119 -> (b~, c, G-) | V_120 -> (d~, t, G-) | V_121 -> (s~, t, G-) | V_124 -> (s~, u, W-) | V_125 -> (b~, u, W-) | V_126 -> (d~, c, W-) | V_128 -> (b~, c, W-) | V_129 -> (d~, t, W-) | V_130 -> (s~, t, W-) | V_138 -> (c~, c, G0) | V_140 -> (c~, c, H) | V_145 -> (e+, ve, G-) | V_146 -> (mu+, vm, G-)
182.86 s
gammaloop-nextest-integration> [2026-09-09 23:10:32.583] @gammalooprs::model INFO : The following 36 couplings were removed by the restriction card:
182.86 s
gammaloop-nextest-integration> GC_13, GC_14, GC_16, GC_17, GC_18, GC_19, GC_20, GC_22, GC_23, GC_24, GC_25, GC_26, GC_28, GC_29, GC_42, GC_43, GC_44, GC_46, GC_47, GC_48, GC_84, GC_85, GC_86, GC_87, GC_88, GC_89, GC_90, GC_91, GC_92, GC_93, GC_101, GC_102, GC_103, GC_105, GC_106, GC_107
182.86 s
gammaloop-nextest-integration> [2026-09-09 23:10:32.584] @gammaloop_api::se... INFO : Running command remove processes
182.86 s
gammaloop-nextest-integration> [2026-09-09 23:10:32.584] @gammaloop_api::se... INFO : Running command generate amp {} > {} [{2}] | g u
182.86 s
gammaloop-nextest-integration> --numerator-grouping group_identical_graphs_up_to_scalar_rescaling
182.86 s
gammaloop-nextest-integration> --max-n-bridges 0
182.86 s
gammaloop-nextest-integration> --number-of-factorized-loop-subtopologies 1 1
182.86 s
gammaloop-nextest-integration> --number-of-fermion-loops 1 1
182.86 s
gammaloop-nextest-integration> [...]
182.86 s
gammaloop-nextest-integration> [2026-09-09 23:10:32.586] @feyngen::diagram_... INFO : 0s | Δ=0s | Starting Feynman graph generation with Symbolica...
182.86 s
gammaloop-nextest-integration> [2026-09-09 23:10:32.586] @feyngen::diagram_... INFO : 0s | Δ=0s | Number of graphs resulting from Symbolica generation: 3
182.86 s
gammaloop-nextest-integration> [2026-09-09 23:10:32.586] @feyngen::diagram_... INFO : 0s | Δ=0s | Number of graphs retained after removal of vetoed topologies: 2
182.86 s
gammaloop-nextest-integration> [2026-09-09 23:10:32.589] @feyngen::diagram_... INFO : 0s | Δ=0s | Number of graphs after vertex info assignment: 2
182.86 s
gammaloop-nextest-integration> [2026-09-09 23:10:32.589] @feyngen::diagram_... INFO : 0s | Δ=0s | Number of graphs after all complete graphs filters are applied: 2
182.86 s
gammaloop-nextest-integration> [2026-09-09 23:10:32.592] @feyngen::diagram_... INFO : 0s | Δ=0s | Number of graphs after closed fermion chains analysis: 1
182.86 s
gammaloop-nextest-integration> [2026-09-09 23:10:32.592] @feyngen::diagram_... INFO : 0s | Δ=0s | Number of graphs after symmetrization of external states: 1
182.86 s
gammaloop-nextest-integration> [2026-09-09 23:10:32.594] @feyngen::diagram_... INFO : 0s | Δ=0s | Number of graphs after canonization of vertices, edges and flows (graph labels assigned here): 1
182.86 s
gammaloop-nextest-integration> [2026-09-09 23:10:32.635] @feyngen::diagram_... INFO : 0s | Δ=0s | Number of graphs after numerator-aware grouping with strategy 'up to a scalar rescaling': 1 (1 isomorphically unique graph, 0 color zero, 0 lorentz zero, 0 grouped and 0 cancellation)
182.86 s
gammaloop-nextest-integration> [2026-09-09 23:10:32.635] @feyngen::diagram_... INFO : ( Sum of the symmetry factors from each graph generated = -1/2 )
182.86 s
gammaloop-nextest-integration> [2026-09-09 23:10:32.636] @commands::generate INFO : Generated amplitude 1 graphs.
182.86 s
gammaloop-nextest-integration> [2026-09-09 23:10:32.636] @commands::generate INFO : Only diagram generation was requested, skipping integrand generation. You can generate integrands later using the 'generate existing <options> ' command.
182.86 s
gammaloop-nextest-integration> [2026-09-09 23:10:32.636] @gammaloop_api::se... INFO : Running command generate
182.86 s
gammaloop-nextest-integration> The application panicked (crashed).
182.86 s
gammaloop-nextest-integration> Message: called `Result::unwrap()` on an `Err` value: variable __Static610 not found
182.86 s
gammaloop-nextest-integration>
182.86 s
gammaloop-nextest-integration> Stack backtrace:
182.86 s
gammaloop-nextest-integration> 0: <anyhow::Error>::msg::<alloc::string::String>
182.86 s
gammaloop-nextest-integration> 1: <symjit::symjit::compiler::IndirectTranslator as symjit::symjit::composer::Composer>::compile
182.86 s
gammaloop-nextest-integration> 2: <symjit::symjit::compiler::Translator as symjit::symjit::composer::Composer>::compile
182.86 s
gammaloop-nextest-integration> 3: <numerica::domains::float::complex::Complex<f64> as symbolica::evaluate::backend::JITCompiledNumber>::jit_compile
182.86 s
gammaloop-nextest-integration> 4: <gammalooprs::integrands::process::evaluators::GenericEvaluator>::activate_symjit
182.86 s
gammaloop-nextest-integration> 5: <gammalooprs::integrands::process::amplitude::AmplitudeIntegrand>::prepare_runtime_backends_after_generation_with_compile_times
182.86 s
gammaloop-nextest-integration> 6: <gammalooprs::processes::amplitude::Amplitude>::build_integrand
182.86 s
gammaloop-nextest-integration> 7: <gammalooprs::processes::process::Process>::generate_integrands
182.86 s
gammaloop-nextest-integration> 8: <gammalooprs::processes::ProcessList>::generate_integrands
182.86 s
gammaloop-nextest-integration> 9: <gammaloop_api::state::State>::generate_integrands
182.86 s
gammaloop-nextest-integration> 10: <gammaloop_api::commands::generate::Generate>::run::<&std::path::PathBuf>
182.86 s
gammaloop-nextest-integration> 11: <gammaloop_api::commands::Commands>::run
182.86 s
gammaloop-nextest-integration> 12: <gammaloop_api::session::CliSession>::execute_prepared
182.86 s
gammaloop-nextest-integration> 13: <gammaloop_api::session::CliSession>::execute_prepared_commands
182.86 s
gammaloop-nextest-integration> 14: <gammaloop_api::session::CliSession>::execute_prepared
182.86 s
gammaloop-nextest-integration> 15: <gammaloop_api::session::CliSession>::execute_command
182.86 s
gammaloop-nextest-integration> 16: <gammaloop_integration_tests::CLIState>::run_command_flow
182.86 s
gammaloop-nextest-integration> 17: <gammaloop_integration_tests::CLIState>::run_command
182.86 s
gammaloop-nextest-integration> 18: uv::run_single_integrated_uv_case
182.86 s
gammaloop-nextest-integration> 19: <uv::thermal_sunrise_uv::{closure#0} as core::ops::function::FnOnce<()>>::call_once
182.86 s
gammaloop-nextest-integration> 20: test::__rust_begin_short_backtrace::<core::result::Result<(), alloc::string::String>, fn() -> core::result::Result<(), alloc::string::String>>
182.86 s
gammaloop-nextest-integration> 21: test::run_test::{closure#0}
182.86 s
gammaloop-nextest-integration> 22: std::sys::backtrace::__rust_begin_short_backtrace::<test::run_test::{closure#1}, ()>
182.86 s
gammaloop-nextest-integration> 23: <std::thread::lifecycle::spawn_unchecked<test::run_test::{closure#1}, ()>::{closure#1} as core::ops::function::FnOnce<()>>::call_once::{shim:vtable#0}
182.86 s
gammaloop-nextest-integration> 24: <std::sys::thread::unix::Thread>::new::thread_start
182.86 s
gammaloop-nextest-integration> 25: start_thread
182.86 s
gammaloop-nextest-integration> 26: __clone3
182.86 s
gammaloop-nextest-integration> Location: /nix/store/l5xazfnr7k6r6p8mlkn38x2afab0rygz-vendor-cargo-deps/c19b7c6f923b580ac259164a89f2577984ad5ab09ee9d583b888f934adbbe8d0/symjit-2.25.0/src/symjit/compiler.rs :883
182.86 s
gammaloop-nextest-integration>
182.86 s
gammaloop-nextest-integration> ━━━━━━━━━━━━━━━━━━━━━━━━━━━━━━━━━━ BACKTRACE ━━━━━━━━━━━━━━━━━━━━━━━━━━━━━━━━━━━
182.86 s
gammaloop-nextest-integration> 1: <color_eyre[51793ea62743adbd]::config::PanicHook>::panic_report <unknown>
182.86 s
gammaloop-nextest-integration> at <unknown source file> :<unknown line>
182.86 s
gammaloop-nextest-integration> 2: <color_eyre[51793ea62743adbd]::config::PanicHook>::into_panic_hook::{closure#0} <unknown>
182.86 s
gammaloop-nextest-integration> at <unknown source file> :<unknown line>
182.86 s
gammaloop-nextest-integration> 3: std[bcb96dfbba0ab899]::panicking::panic_with_hook <unknown>
182.86 s
gammaloop-nextest-integration> at <unknown source file> :<unknown line>
182.86 s
gammaloop-nextest-integration> 4: std[bcb96dfbba0ab899]::panicking::panic_handler::{closure#0} <unknown>
182.86 s
gammaloop-nextest-integration> at <unknown source file> :<unknown line>
182.86 s
gammaloop-nextest-integration> 5: std[bcb96dfbba0ab899]::sys::backtrace::__rust_end_short_backtrace::<std[bcb96dfbba0ab899]::panicking::panic_handler::{closure#0}, !> <unknown>
182.86 s
gammaloop-nextest-integration> at <unknown source file> :<unknown line>
182.86 s
gammaloop-nextest-integration> 6: __rustc[6c289b9f9c454d21]::rust_begin_unwind <unknown>
182.86 s
gammaloop-nextest-integration> at <unknown source file> :<unknown line>
182.86 s
gammaloop-nextest-integration> 7: core[940e698046960fd5]::panicking::panic_fmt <unknown>
182.86 s
gammaloop-nextest-integration> at <unknown source file> :<unknown line>
182.86 s
gammaloop-nextest-integration> 8: core[940e698046960fd5]::result::unwrap_failed <unknown>
182.86 s
gammaloop-nextest-integration> at <unknown source file> :<unknown line>
182.86 s
gammaloop-nextest-integration> 9: <symjit[9dfb3c17cbb79ae4]::symjit::compiler::IndirectTranslator as symjit[9dfb3c17cbb79ae4]::symjit::composer::Composer>::compile <unknown>
182.86 s
gammaloop-nextest-integration> at <unknown source file> :<unknown line>
182.86 s
gammaloop-nextest-integration> 10: <symjit[9dfb3c17cbb79ae4]::symjit::compiler::Translator as symjit[9dfb3c17cbb79ae4]::symjit::composer::Composer>::compile <unknown>
182.86 s
gammaloop-nextest-integration> at <unknown source file> :<unknown line>
182.86 s
gammaloop-nextest-integration> 11: <numerica[ca5044e7d57d1d48]::domains::float::complex::Complex<f64> as symbolica[911a260017ea9deb]::evaluate::backend::JITCompiledNumber>::jit_compile <unknown>
182.86 s
gammaloop-nextest-integration> at <unknown source file> :<unknown line>
182.86 s
gammaloop-nextest-integration> 12: <gammalooprs[61738dd440287478]::integrands::process::evaluators::GenericEvaluator>::activate_symjit <unknown>
182.86 s
gammaloop-nextest-integration> at <unknown source file> :<unknown line>
182.86 s
gammaloop-nextest-integration> 13: <gammalooprs[61738dd440287478]::integrands::process::amplitude::AmplitudeIntegrand>::prepare_runtime_backends_after_generation_with_compile_times <unknown>
182.86 s
gammaloop-nextest-integration> at <unknown source file> :<unknown line>
182.86 s
gammaloop-nextest-integration> 14: <gammalooprs[61738dd440287478]::processes::amplitude::Amplitude>::build_integrand <unknown>
182.86 s
gammaloop-nextest-integration> at <unknown source file> :<unknown line>
182.86 s
gammaloop-nextest-integration> 15: <gammalooprs[61738dd440287478]::processes::process::Process>::generate_integrands <unknown>
182.86 s
gammaloop-nextest-integration> at <unknown source file> :<unknown line>
182.86 s
gammaloop-nextest-integration> 16: <gammalooprs[61738dd440287478]::processes::ProcessList>::generate_integrands <unknown>
182.86 s
gammaloop-nextest-integration> at <unknown source file> :<unknown line>
182.86 s
gammaloop-nextest-integration> 17: <gammaloop_api[781ec552bb626e12]::state::State>::generate_integrands <unknown>
182.86 s
gammaloop-nextest-integration> at <unknown source file> :<unknown line>
182.86 s
gammaloop-nextest-integration> 18: <gammaloop_api[781ec552bb626e12]::commands::generate::Generate>::run::<&std[bcb96dfbba0ab899]::path::PathBuf> <unknown>
182.86 s
gammaloop-nextest-integration> at <unknown source file> :<unknown line>
182.86 s
gammaloop-nextest-integration> 19: <gammaloop_api[781ec552bb626e12]::commands::Commands>::run <unknown>
182.86 s
gammaloop-nextest-integration> at <unknown source file> :<unknown line>
182.86 s
gammaloop-nextest-integration> 20: <gammaloop_api[781ec552bb626e12]::session::CliSession>::execute_prepared <unknown>
182.86 s
gammaloop-nextest-integration> at <unknown source file> :<unknown line>
182.86 s
gammaloop-nextest-integration> 21: <gammaloop_api[781ec552bb626e12]::session::CliSession>::execute_prepared_commands <unknown>
182.86 s
gammaloop-nextest-integration> at <unknown source file> :<unknown line>
182.86 s
gammaloop-nextest-integration> 22: <gammaloop_api[781ec552bb626e12]::session::CliSession>::execute_prepared <unknown>
182.86 s
gammaloop-nextest-integration> at <unknown source file> :<unknown line>
182.86 s
gammaloop-nextest-integration> 23: <gammaloop_api[781ec552bb626e12]::session::CliSession>::execute_command <unknown>
182.86 s
gammaloop-nextest-integration> at <unknown source file> :<unknown line>
182.86 s
gammaloop-nextest-integration> 24: <gammaloop_integration_tests[3349793260628f2c]::CLIState>::run_command_flow <unknown>
182.86 s
gammaloop-nextest-integration> at <unknown source file> :<unknown line>
182.86 s
gammaloop-nextest-integration> 25: <gammaloop_integration_tests[3349793260628f2c]::CLIState>::run_command <unknown>
182.86 s
gammaloop-nextest-integration> at <unknown source file> :<unknown line>
182.86 s
gammaloop-nextest-integration> 26: uv[4a8ff97c1fe5666b]::run_single_integrated_uv_case <unknown>
182.86 s
gammaloop-nextest-integration> at <unknown source file> :<unknown line>
182.86 s
gammaloop-nextest-integration> 27: <uv[4a8ff97c1fe5666b]::thermal_sunrise_uv::{closure#0} as core[940e698046960fd5]::ops::function::FnOnce<()>>::call_once <unknown>
182.86 s
gammaloop-nextest-integration> at <unknown source file> :<unknown line>
182.86 s
gammaloop-nextest-integration> 28: test[75d6903177b1d7e9]::__rust_begin_short_backtrace::<core[940e698046960fd5]::result::Result<(), alloc[2ea6bcb46fca0c42]::string::String>, fn() -> core[940e698046960fd5]::result::Result<(), alloc[2ea6bcb46fca0c42]::string::String>> <unknown>
182.86 s
gammaloop-nextest-integration> at <unknown source file> :<unknown line>
182.86 s
gammaloop-nextest-integration> 29: test[75d6903177b1d7e9]::run_test::{closure#0} <unknown>
182.86 s
gammaloop-nextest-integration> at <unknown source file> :<unknown line>
182.86 s
gammaloop-nextest-integration> 30: std[bcb96dfbba0ab899]::sys::backtrace::__rust_begin_short_backtrace::<test[75d6903177b1d7e9]::run_test::{closure#1}, ()> <unknown>
182.86 s
gammaloop-nextest-integration> at <unknown source file> :<unknown line>
182.86 s
gammaloop-nextest-integration> 31: <std[bcb96dfbba0ab899]::thread::lifecycle::spawn_unchecked<test[75d6903177b1d7e9]::run_test::{closure#1}, ()>::{closure#1} as core[940e698046960fd5]::ops::function::FnOnce<()>>::call_once::{shim:vtable#0} <unknown>
182.86 s
gammaloop-nextest-integration> at <unknown source file> :<unknown line>
182.86 s
gammaloop-nextest-integration> 32: <std[bcb96dfbba0ab899]::sys::thread::unix::Thread>::new::thread_start <unknown>
182.86 s
gammaloop-nextest-integration> at <unknown source file> :<unknown line>
182.86 s
gammaloop-nextest-integration> 33: start_thread <unknown>
182.86 s
gammaloop-nextest-integration> at <unknown source file> :<unknown line>
182.86 s
gammaloop-nextest-integration> 34: __clone3 <unknown>
182.86 s
gammaloop-nextest-integration> at <unknown source file> :<unknown line>
182.86 s
gammaloop-nextest-integration>
182.86 s
gammaloop-nextest-integration> Run with COLORBT_SHOW_HIDDEN=1 environment variable to disable frame filtering.
182.86 s
gammaloop-nextest-integration> Run with RUST_BACKTRACE=full to include source snippets.
182.86 s
gammaloop-nextest-integration> Warning: SpanTrace capture is Unsupported.
182.86 s
gammaloop-nextest-integration> Ensure that you've setup a tracing-error ErrorLayer and the semver versions are compatible
182.86 s
gammaloop-nextest-integration>
183.00 s
gammaloop-nextest-integration> error : test run failed
183.03 s
gammaloop-nextest-integration>
183.03 s
gammaloop-nextest-integration> ========== nextest test summary ==========
183.03 s
gammaloop-nextest-integration> report: target/nextest/ci_gammaloop/junit.xml
183.03 s
gammaloop-nextest-integration> tests: 107, failures: 1, errors: 0
183.03 s
gammaloop-nextest-integration>
183.03 s
gammaloop-nextest-integration> 1. gammaloop-integration-tests::uv::thermal_sunrise_uv
183.03 s
gammaloop-nextest-integration> failure: test failure with exit code 101
183.03 s
gammaloop-nextest-integration> system-out
183.03 s
gammaloop-nextest-integration> running 1 test
183.03 s
gammaloop-nextest-integration> test thermal_sunrise_uv ... FAILED
183.03 s
gammaloop-nextest-integration>
183.03 s
gammaloop-nextest-integration> failures:
183.03 s
gammaloop-nextest-integration>
183.03 s
gammaloop-nextest-integration> failures:
183.03 s
gammaloop-nextest-integration> thermal_sunrise_uv
183.03 s
gammaloop-nextest-integration>
183.03 s
gammaloop-nextest-integration> test result: FAILED. 0 passed; 1 failed; 0 ignored; 0 measured; 25 filtered out; finished in 2.71s
183.03 s
gammaloop-nextest-integration> system-err
183.03 s
gammaloop-nextest-integration> [2026-09-09 23:10:32.550] @gammaloop_api::se... INFO : Running command run generate
183.03 s
gammaloop-nextest-integration> [2026-09-09 23:10:32.550] @gammaloop_api::se... INFO : Starting command block generate
183.03 s
gammaloop-nextest-integration> [2026-09-09 23:10:32.551] @gammaloop_api::se... INFO : Running command import model sm-default.json
183.03 s
gammaloop-nextest-integration> [2026-09-09 23:10:32.551] @import::model INFO : Loading built-in JSON model sm-default
183.03 s
gammaloop-nextest-integration> [2026-09-09 23:10:32.583] @gammalooprs::model INFO : The following 15 external parameters were forced to zero by the restriction card:
183.03 s
gammaloop-nextest-integration> lamWS, AWS, rhoWS, etaWS, ymc, yme, ymm, MC, Me, MM, WTau, muQ, muLe, muLmu, muLtau
183.03 s
gammaloop-nextest-integration> [2026-09-09 23:10:32.583] @gammalooprs::model INFO : The following 34 vertex rules were removed by the restriction card:
183.03 s
gammaloop-nextest-integration> V_82 -> (c~, d, G+) | V_83 -> (t~, d, G+) | V_84 -> (c~, s, G+) | V_85 -> (t~, s, G+) | V_86 -> (u~, b, G+) | V_87 -> (c~, b, G+) | V_90 -> (c~, d, W+) | V_91 -> (t~, d, W+) | V_92 -> (u~, s, W+) | V_94 -> (t~, s, W+) | V_95 -> (u~, b, W+) | V_96 -> (c~, b, W+) | V_101 -> (e+, e-, G0) | V_102 -> (mu+, mu-, G0) | V_104 -> (e+, e-, H) | V_105 -> (mu+, mu-, H) | V_110 -> (ve~, e-, G+) | V_111 -> (vm~, mu-, G+) | V_116 -> (b~, u, G-) | V_117 -> (d~, c, G-) | V_118 -> (s~, c, G-) | V_119 -> (b~, c, G-) | V_120 -> (d~, t, G-) | V_121 -> (s~, t, G-) | V_124 -> (s~, u, W-) | V_125 -> (b~, u, W-) | V_126 -> (d~, c, W-) | V_128 -> (b~, c, W-) | V_129 -> (d~, t, W-) | V_130 -> (s~, t, W-) | V_138 -> (c~, c, G0) | V_140 -> (c~, c, H) | V_145 -> (e+, ve, G-) | V_146 -> (mu+, vm, G-)
183.03 s
gammaloop-nextest-integration> [2026-09-09 23:10:32.583] @gammalooprs::model INFO : The following 36 couplings were removed by the restriction card:
183.03 s
gammaloop-nextest-integration> GC_13, GC_14, GC_16, GC_17, GC_18, GC_19, GC_20, GC_22, GC_23, GC_24, GC_25, GC_26, GC_28, GC_29, GC_42, GC_43, GC_44, GC_46, GC_47, GC_48, GC_84, GC_85, GC_86, GC_87, GC_88, GC_89, GC_90, GC_91, GC_92, GC_93, GC_101, GC_102, GC_103, GC_105, GC_106, GC_107
183.03 s
gammaloop-nextest-integration> [2026-09-09 23:10:32.584] @gammaloop_api::se... INFO : Running command remove processes
183.03 s
gammaloop-nextest-integration> [2026-09-09 23:10:32.584] @gammaloop_api::se... INFO : Running command generate amp {} > {} [{2}] | g u
183.03 s
gammaloop-nextest-integration> --numerator-grouping group_identical_graphs_up_to_scalar_rescaling
183.03 s
gammaloop-nextest-integration> --max-n-bridges 0
183.03 s
gammaloop-nextest-integration> --number-of-factorized-loop-subtopologies 1 1
183.03 s
gammaloop-nextest-integration> --number-of-fermion-loops 1 1
183.03 s
gammaloop-nextest-integration> [...]
183.03 s
gammaloop-nextest-integration> [2026-09-09 23:10:32.586] @feyngen::diagram_... INFO : 0s | Δ=0s | Starting Feynman graph generation with Symbolica...
183.03 s
gammaloop-nextest-integration> [2026-09-09 23:10:32.586] @feyngen::diagram_... INFO : 0s | Δ=0s | Number of graphs resulting from Symbolica generation: 3
183.03 s
gammaloop-nextest-integration> [2026-09-09 23:10:32.586] @feyngen::diagram_... INFO : 0s | Δ=0s | Number of graphs retained after removal of vetoed topologies: 2
183.03 s
gammaloop-nextest-integration> [2026-09-09 23:10:32.589] @feyngen::diagram_... INFO : 0s | Δ=0s | Number of graphs after vertex info assignment: 2
183.03 s
gammaloop-nextest-integration> [2026-09-09 23:10:32.589] @feyngen::diagram_... INFO : 0s | Δ=0s | Number of graphs after all complete graphs filters are applied: 2
183.03 s
gammaloop-nextest-integration> [2026-09-09 23:10:32.592] @feyngen::diagram_... INFO : 0s | Δ=0s | Number of graphs after closed fermion chains analysis: 1
183.03 s
gammaloop-nextest-integration> [2026-09-09 23:10:32.592] @feyngen::diagram_... INFO : 0s | Δ=0s | Number of graphs after symmetrization of external states: 1
183.03 s
gammaloop-nextest-integration> [2026-09-09 23:10:32.594] @feyngen::diagram_... INFO : 0s | Δ=0s | Number of graphs after canonization of vertices, edges and flows (graph labels assigned here): 1
183.03 s
gammaloop-nextest-integration> [2026-09-09 23:10:32.635] @feyngen::diagram_... INFO : 0s | Δ=0s | Number of graphs after numerator-aware grouping with strategy 'up to a scalar rescaling': 1 (1 isomorphically unique graph, 0 color zero, 0 lorentz zero, 0 grouped and 0 cancellation)
183.03 s
gammaloop-nextest-integration> [2026-09-09 23:10:32.635] @feyngen::diagram_... INFO : ( Sum of the symmetry factors from each graph generated = -1/2 )
183.03 s
gammaloop-nextest-integration> [2026-09-09 23:10:32.636] @commands::generate INFO : Generated amplitude 1 graphs.
183.03 s
gammaloop-nextest-integration> [2026-09-09 23:10:32.636] @commands::generate INFO : Only diagram generation was requested, skipping integrand generation. You can generate integrands later using the 'generate existing <options>' command.
183.03 s
gammaloop-nextest-integration> [2026-09-09 23:10:32.636] @gammaloop_api::se... INFO : Running command generate
183.03 s
gammaloop-nextest-integration> The application panicked (crashed).
183.03 s
gammaloop-nextest-integration> Message: called `Result::unwrap()` on an `Err` value: variable __Static610 not found
183.03 s
gammaloop-nextest-integration>
183.03 s
gammaloop-nextest-integration> Stack backtrace:
183.03 s
gammaloop-nextest-integration> 0: <anyhow::Error>::msg::<alloc::string::String>
183.03 s
gammaloop-nextest-integration> 1: <symjit::symjit::compiler::IndirectTranslator as symjit::symjit::composer::Composer>::compile
183.03 s
gammaloop-nextest-integration> 2: <symjit::symjit::compiler::Translator as symjit::symjit::composer::Composer>::compile
183.03 s
gammaloop-nextest-integration> 3: <numerica::domains::float::complex::Complex<f64> as symbolica::evaluate::backend::JITCompiledNumber>::jit_compile
183.03 s
gammaloop-nextest-integration> 4: <gammalooprs::integrands::process::evaluators::GenericEvaluator>::activate_symjit
183.03 s
gammaloop-nextest-integration> 5: <gammalooprs::integrands::process::amplitude::AmplitudeIntegrand>::prepare_runtime_backends_after_generation_with_compile_times
183.03 s
gammaloop-nextest-integration> 6: <gammalooprs::processes::amplitude::Amplitude>::build_integrand
183.03 s
gammaloop-nextest-integration> 7: <gammalooprs::processes::process::Process>::generate_integrands
183.03 s
gammaloop-nextest-integration> 8: <gammalooprs::processes::ProcessList>::generate_integrands
183.03 s
gammaloop-nextest-integration> 9: <gammaloop_api::state::State>::generate_integrands
183.03 s
gammaloop-nextest-integration> 10: <gammaloop_api::commands::generate::Generate>::run::<&std::path::PathBuf>
183.03 s
gammaloop-nextest-integration> 11: <gammaloop_api::commands::Commands>::run
183.03 s
gammaloop-nextest-integration> 12: <gammaloop_api::session::CliSession>::execute_prepared
183.03 s
gammaloop-nextest-integration> 13: <gammaloop_api::session::CliSession>::execute_prepared_commands
183.03 s
gammaloop-nextest-integration> 14: <gammaloop_api::session::CliSession>::execute_prepared
183.03 s
gammaloop-nextest-integration> 15: <gammaloop_api::session::CliSession>::execute_command
183.03 s
gammaloop-nextest-integration> 16: <gammaloop_integration_tests::CLIState>::run_command_flow
183.03 s
gammaloop-nextest-integration> 17: <gammaloop_integration_tests::CLIState>::run_command
183.03 s
gammaloop-nextest-integration> 18: uv::run_single_integrated_uv_case
183.03 s
gammaloop-nextest-integration> 19: <uv::thermal_sunrise_uv::{closure#0} as core::ops::function::FnOnce<()>>::call_once
183.03 s
gammaloop-nextest-integration> 20: test::__rust_begin_short_backtrace::<core::result::Result<(), alloc::string::String>, fn() -> core::result::Result<(), alloc::string::String>>
183.03 s
gammaloop-nextest-integration> 21: test::run_test::{closure#0}
183.03 s
gammaloop-nextest-integration> 22: std::sys::backtrace::__rust_begin_short_backtrace::<test::run_test::{closure#1}, ()>
183.03 s
gammaloop-nextest-integration> 23: <std::thread::lifecycle::spawn_unchecked<test::run_test::{closure#1}, ()>::{closure#1} as core::ops::function::FnOnce<()>>::call_once::{shim:vtable#0}
183.03 s
gammaloop-nextest-integration> 24: <std::sys::thread::unix::Thread>::new::thread_start
183.03 s
gammaloop-nextest-integration> 25: start_thread
183.03 s
gammaloop-nextest-integration> 26: __clone3
183.03 s
gammaloop-nextest-integration> Location: /nix/store/l5xazfnr7k6r6p8mlkn38x2afab0rygz-vendor-cargo-deps/c19b7c6f923b580ac259164a89f2577984ad5ab09ee9d583b888f934adbbe8d0/symjit-2.25.0/src/symjit/compiler.rs:883
183.03 s
gammaloop-nextest-integration>
183.03 s
gammaloop-nextest-integration> ━━━━━━━━━━━━━━━━━━━━━━━━━━━━━━━━━━ BACKTRACE ━━━━━━━━━━━━━━━━━━━━━━━━━━━━━━━━━━━
183.03 s
gammaloop-nextest-integration> 1: <color_eyre[51793ea62743adbd]::config::PanicHook>::panic_report<unknown>
183.03 s
gammaloop-nextest-integration> at <unknown source file>:<unknown line>
183.03 s
gammaloop-nextest-integration> 2: <color_eyre[51793ea62743adbd]::config::PanicHook>::into_panic_hook::{closure#0}<unknown>
183.03 s
gammaloop-nextest-integration> at <unknown source file>:<unknown line>
183.03 s
gammaloop-nextest-integration> 3: std[bcb96dfbba0ab899]::panicking::panic_with_hook<unknown>
183.03 s
gammaloop-nextest-integration> at <unknown source file>:<unknown line>
183.03 s
gammaloop-nextest-integration> 4: std[bcb96dfbba0ab899]::panicking::panic_handler::{closure#0}<unknown>
183.03 s
gammaloop-nextest-integration> at <unknown source file>:<unknown line>
183.03 s
gammaloop-nextest-integration> 5: std[bcb96dfbba0ab899]::sys::backtrace::__rust_end_short_backtrace::<std[bcb96dfbba0ab899]::panicking::panic_handler::{closure#0}, !><unknown>
183.03 s
gammaloop-nextest-integration> at <unknown source file>:<unknown line>
183.03 s
gammaloop-nextest-integration> 6: __rustc[6c289b9f9c454d21]::rust_begin_unwind<unknown>
183.03 s
gammaloop-nextest-integration> at <unknown source file>:<unknown line>
183.03 s
gammaloop-nextest-integration> 7: core[940e698046960fd5]::panicking::panic_fmt<unknown>
183.03 s
gammaloop-nextest-integration> at <unknown source file>:<unknown line>
183.03 s
gammaloop-nextest-integration> 8: core[940e698046960fd5]::result::unwrap_failed<unknown>
183.03 s
gammaloop-nextest-integration> at <unknown source file>:<unknown line>
183.03 s
gammaloop-nextest-integration> 9: <symjit[9dfb3c17cbb79ae4]::symjit::compiler::IndirectTranslator as symjit[9dfb3c17cbb79ae4]::symjit::composer::Composer>::compile<unknown>
183.03 s
gammaloop-nextest-integration> at <unknown source file>:<unknown line>
183.03 s
gammaloop-nextest-integration> 10: <symjit[9dfb3c17cbb79ae4]::symjit::compiler::Translator as symjit[9dfb3c17cbb79ae4]::symjit::composer::Composer>::compile<unknown>
183.03 s
gammaloop-nextest-integration> at <unknown source file>:<unknown line>
183.03 s
gammaloop-nextest-integration> 11: <numerica[ca5044e7d57d1d48]::domains::float::complex::Complex<f64> as symbolica[911a260017ea9deb]::evaluate::backend::JITCompiledNumber>::jit_compile<unknown>
183.03 s
gammaloop-nextest-integration> at <unknown source file>:<unknown line>
183.03 s
gammaloop-nextest-integration> 12: <gammalooprs[61738dd440287478]::integrands::process::evaluators::GenericEvaluator>::activate_symjit<unknown>
183.03 s
gammaloop-nextest-integration> at <unknown source file>:<unknown line>
183.03 s
gammaloop-nextest-integration> 13: <gammalooprs[61738dd440287478]::integrands::process::amplitude::AmplitudeIntegrand>::prepare_runtime_backends_after_generation_with_compile_times<unknown>
183.03 s
gammaloop-nextest-integration> at <unknown source file>:<unknown line>
183.03 s
gammaloop-nextest-integration> 14: <gammalooprs[61738dd440287478]::processes::amplitude::Amplitude>::build_integrand<unknown>
183.03 s
gammaloop-nextest-integration> at <unknown source file>:<unknown line>
183.03 s
gammaloop-nextest-integration> 15: <gammalooprs[61738dd440287478]::processes::process::Process>::generate_integrands<unknown>
183.03 s
gammaloop-nextest-integration> at <unknown source file>:<unknown line>
183.03 s
gammaloop-nextest-integration> 16: <gammalooprs[61738dd440287478]::processes::ProcessList>::generate_integrands<unknown>
183.03 s
gammaloop-nextest-integration> at <unknown source file>:<unknown line>
183.03 s
gammaloop-nextest-integration> 17: <gammaloop_api[781ec552bb626e12]::state::State>::generate_integrands<unknown>
183.03 s
gammaloop-nextest-integration> at <unknown source file>:<unknown line>
183.03 s
gammaloop-nextest-integration> 18: <gammaloop_api[781ec552bb626e12]::commands::generate::Generate>::run::<&std[bcb96dfbba0ab899]::path::PathBuf><unknown>
183.03 s
gammaloop-nextest-integration> at <unknown source file>:<unknown line>
183.03 s
gammaloop-nextest-integration> 19: <gammaloop_api[781ec552bb626e12]::commands::Commands>::run<unknown>
183.03 s
gammaloop-nextest-integration> at <unknown source file>:<unknown line>
183.03 s
gammaloop-nextest-integration> 20: <gammaloop_api[781ec552bb626e12]::session::CliSession>::execute_prepared<unknown>
183.03 s
gammaloop-nextest-integration> at <unknown source file>:<unknown line>
183.03 s
gammaloop-nextest-integration> 21: <gammaloop_api[781ec552bb626e12]::session::CliSession>::execute_prepared_commands<unknown>
183.03 s
gammaloop-nextest-integration> at <unknown source file>:<unknown line>
183.03 s
gammaloop-nextest-integration> 22: <gammaloop_api[781ec552bb626e12]::session::CliSession>::execute_prepared<unknown>
183.03 s
gammaloop-nextest-integration> at <unknown source file>:<unknown line>
183.03 s
gammaloop-nextest-integration> 23: <gammaloop_api[781ec552bb626e12]::session::CliSession>::execute_command<unknown>
183.03 s
gammaloop-nextest-integration> at <unknown source file>:<unknown line>
183.03 s
gammaloop-nextest-integration> 24: <gammaloop_integration_tests[3349793260628f2c]::CLIState>::run_command_flow<unknown>
183.03 s
gammaloop-nextest-integration> at <unknown source file>:<unknown line>
183.03 s
gammaloop-nextest-integration> 25: <gammaloop_integration_tests[3349793260628f2c]::CLIState>::run_command<unknown>
183.03 s
gammaloop-nextest-integration> at <unknown source file>:<unknown line>
183.03 s
gammaloop-nextest-integration> 26: uv[4a8ff97c1fe5666b]::run_single_integrated_uv_case<unknown>
183.03 s
gammaloop-nextest-integration> at <unknown source file>:<unknown line>
183.03 s
gammaloop-nextest-integration> 27: <uv[4a8ff97c1fe5666b]::thermal_sunrise_uv::{closure#0} as core[940e698046960fd5]::ops::function::FnOnce<()>>::call_once<unknown>
183.03 s
gammaloop-nextest-integration> at <unknown source file>:<unknown line>
183.03 s
gammaloop-nextest-integration> 28: test[75d6903177b1d7e9]::__rust_begin_short_backtrace::<core[940e698046960fd5]::result::Result<(), alloc[2ea6bcb46fca0c42]::string::String>, fn() -> core[940e698046960fd5]::result::Result<(), alloc[2ea6bcb46fca0c42]::string::String>><unknown>
183.03 s
gammaloop-nextest-integration> ... omitted 18 more lines; see full nextest output above
183.03 s
gammaloop-nextest-integration> =========================================
183.12 s
error: Cannot build '/nix/store/85r60p7hwgsrgkazjyi3fv4lbc82mrhs-gammaloop-nextest-integration.drv '.
183.12 s
Reason: builder failed with exit code 100 .
183.12 s
Output paths:
183.12 s
/nix/store/dlmhihq612414w8wpsbb5dr2npz5rgg7-gammaloop-nextest-integration
183.12 s
Last 451 log lines:
183.12 s
> Extracting 9 binaries, 1 build script output directory, and 3 linked paths to /build/nextest-archive-1zHuEd
183.12 s
> Extracted 26 files to /build/nextest-archive-1zHuEd in 2.11s
183.12 s
> ------------
183.12 s
> Nextest run ID cda8f6af-5041-421b-91d8-ffae58f3095f with nextest profile: ci_gammaloop
183.12 s
> Starting 107 tests across 9 binaries (68 tests skipped via profile.ci_gammaloop.default-filter )
183.12 s
> FAIL [ 2.733s] ( 94/107) gammaloop-integration-tests::uv thermal_sunrise_uv
183.12 s
> stdout ---
183.12 s
>
183.12 s
> running 1 test
183.12 s
> test thermal_sunrise_uv ... FAILED
183.12 s
>
183.12 s
> failures:
183.12 s
>
183.12 s
> failures:
183.12 s
> thermal_sunrise_uv
183.12 s
>
183.12 s
> test result: FAILED. 0 passed; 1 failed; 0 ignored; 0 measured; 25 filtered out; finished in 2.71s
183.12 s
>
183.12 s
> stderr ---
183.12 s
> [2026-09-09 23:10:32.550] @gammaloop_api::se... INFO : Running command run generate
183.12 s
> [2026-09-09 23:10:32.550] @gammaloop_api::se... INFO : Starting command block generate
183.12 s
> [2026-09-09 23:10:32.551] @gammaloop_api::se... INFO : Running command import model sm-default.json
183.12 s
> [2026-09-09 23:10:32.551] @import::model INFO : Loading built-in JSON model sm-default
183.12 s
> [2026-09-09 23:10:32.583] @gammalooprs::model INFO : The following 15 external parameters were forced to zero by the restriction card:
183.12 s
> lamWS, AWS, rhoWS, etaWS, ymc, yme, ymm, MC, Me, MM, WTau, muQ, muLe, muLmu, muLtau
183.12 s
> [2026-09-09 23:10:32.583] @gammalooprs::model INFO : The following 34 vertex rules were removed by the restriction card:
183.12 s
> V_82 -> (c~, d, G+) | V_83 -> (t~, d, G+) | V_84 -> (c~, s, G+) | V_85 -> (t~, s, G+) | V_86 -> (u~, b, G+) | V_87 -> (c~, b, G+) | V_90 -> (c~, d, W+) | V_91 -> (t~, d, W+) | V_92 -> (u~, s, W+) | V_94 -> (t~, s, W+) | V_95 -> (u~, b, W+) | V_96 -> (c~, b, W+) | V_101 -> (e+, e-, G0) | V_102 -> (mu+, mu-, G0) | V_104 -> (e+, e-, H) | V_105 -> (mu+, mu-, H) | V_110 -> (ve~, e-, G+) | V_111 -> (vm~, mu-, G+) | V_116 -> (b~, u, G-) | V_117 -> (d~, c, G-) | V_118 -> (s~, c, G-) | V_119 -> (b~, c, G-) | V_120 -> (d~, t, G-) | V_121 -> (s~, t, G-) | V_124 -> (s~, u, W-) | V_125 -> (b~, u, W-) | V_126 -> (d~, c, W-) | V_128 -> (b~, c, W-) | V_129 -> (d~, t, W-) | V_130 -> (s~, t, W-) | V_138 -> (c~, c, G0) | V_140 -> (c~, c, H) | V_145 -> (e+, ve, G-) | V_146 -> (mu+, vm, G-)
183.12 s
> [2026-09-09 23:10:32.583] @gammalooprs::model INFO : The following 36 couplings were removed by the restriction card:
183.12 s
> GC_13, GC_14, GC_16, GC_17, GC_18, GC_19, GC_20, GC_22, GC_23, GC_24, GC_25, GC_26, GC_28, GC_29, GC_42, GC_43, GC_44, GC_46, GC_47, GC_48, GC_84, GC_85, GC_86, GC_87, GC_88, GC_89, GC_90, GC_91, GC_92, GC_93, GC_101, GC_102, GC_103, GC_105, GC_106, GC_107
183.12 s
> [2026-09-09 23:10:32.584] @gammaloop_api::se... INFO : Running command remove processes
183.12 s
> [2026-09-09 23:10:32.584] @gammaloop_api::se... INFO : Running command generate amp {} > {} [{2}] | g u
183.12 s
> --numerator-grouping group_identical_graphs_up_to_scalar_rescaling
183.12 s
> --max-n-bridges 0
183.12 s
> --number-of-factorized-loop-subtopologies 1 1
183.12 s
> --number-of-fermion-loops 1 1
183.12 s
> [...]
183.12 s
> [2026-09-09 23:10:32.586] @feyngen::diagram_... INFO : 0s | Δ=0s | Starting Feynman graph generation with Symbolica...
183.12 s
> [2026-09-09 23:10:32.586] @feyngen::diagram_... INFO : 0s | Δ=0s | Number of graphs resulting from Symbolica generation: 3
183.12 s
> [2026-09-09 23:10:32.586] @feyngen::diagram_... INFO : 0s | Δ=0s | Number of graphs retained after removal of vetoed topologies: 2
183.12 s
> [2026-09-09 23:10:32.589] @feyngen::diagram_... INFO : 0s | Δ=0s | Number of graphs after vertex info assignment: 2
183.12 s
> [2026-09-09 23:10:32.589] @feyngen::diagram_... INFO : 0s | Δ=0s | Number of graphs after all complete graphs filters are applied: 2
183.12 s
> [2026-09-09 23:10:32.592] @feyngen::diagram_... INFO : 0s | Δ=0s | Number of graphs after closed fermion chains analysis: 1
183.12 s
> [2026-09-09 23:10:32.592] @feyngen::diagram_... INFO : 0s | Δ=0s | Number of graphs after symmetrization of external states: 1
183.12 s
> [2026-09-09 23:10:32.594] @feyngen::diagram_... INFO : 0s | Δ=0s | Number of graphs after canonization of vertices, edges and flows (graph labels assigned here): 1
183.12 s
> [2026-09-09 23:10:32.635] @feyngen::diagram_... INFO : 0s | Δ=0s | Number of graphs after numerator-aware grouping with strategy 'up to a scalar rescaling': 1 (1 isomorphically unique graph, 0 color zero, 0 lorentz zero, 0 grouped and 0 cancellation)
183.12 s
> [2026-09-09 23:10:32.635] @feyngen::diagram_... INFO : ( Sum of the symmetry factors from each graph generated = -1/2 )
183.12 s
> [2026-09-09 23:10:32.636] @commands::generate INFO : Generated amplitude 1 graphs.
183.12 s
> [2026-09-09 23:10:32.636] @commands::generate INFO : Only diagram generation was requested, skipping integrand generation. You can generate integrands later using the 'generate existing <options> ' command.
183.12 s
> [2026-09-09 23:10:32.636] @gammaloop_api::se... INFO : Running command generate
183.12 s
> The application panicked (crashed).
183.12 s
> Message: called `Result::unwrap()` on an `Err` value: variable __Static610 not found
183.12 s
>
183.12 s
> Stack backtrace:
183.12 s
> 0: <anyhow::Error>::msg::<alloc::string::String>
183.12 s
> 1: <symjit::symjit::compiler::IndirectTranslator as symjit::symjit::composer::Composer>::compile
183.12 s
> 2: <symjit::symjit::compiler::Translator as symjit::symjit::composer::Composer>::compile
183.12 s
> 3: <numerica::domains::float::complex::Complex<f64> as symbolica::evaluate::backend::JITCompiledNumber>::jit_compile
183.12 s
> 4: <gammalooprs::integrands::process::evaluators::GenericEvaluator>::activate_symjit
183.12 s
> 5: <gammalooprs::integrands::process::amplitude::AmplitudeIntegrand>::prepare_runtime_backends_after_generation_with_compile_times
183.12 s
> 6: <gammalooprs::processes::amplitude::Amplitude>::build_integrand
183.12 s
> 7: <gammalooprs::processes::process::Process>::generate_integrands
183.12 s
> 8: <gammalooprs::processes::ProcessList>::generate_integrands
183.12 s
> 9: <gammaloop_api::state::State>::generate_integrands
183.12 s
> 10: <gammaloop_api::commands::generate::Generate>::run::<&std::path::PathBuf>
183.12 s
> 11: <gammaloop_api::commands::Commands>::run
183.12 s
> 12: <gammaloop_api::session::CliSession>::execute_prepared
183.12 s
> 13: <gammaloop_api::session::CliSession>::execute_prepared_commands
183.12 s
> 14: <gammaloop_api::session::CliSession>::execute_prepared
183.12 s
> 15: <gammaloop_api::session::CliSession>::execute_command
183.12 s
> 16: <gammaloop_integration_tests::CLIState>::run_command_flow
183.12 s
> 17: <gammaloop_integration_tests::CLIState>::run_command
183.12 s
> 18: uv::run_single_integrated_uv_case
183.12 s
> 19: <uv::thermal_sunrise_uv::{closure#0} as core::ops::function::FnOnce<()>>::call_once
183.12 s
> 20: test::__rust_begin_short_backtrace::<core::result::Result<(), alloc::string::String>, fn() -> core::result::Result<(), alloc::string::String>>
183.12 s
> 21: test::run_test::{closure#0}
183.12 s
> 22: std::sys::backtrace::__rust_begin_short_backtrace::<test::run_test::{closure#1}, ()>
183.12 s
> 23: <std::thread::lifecycle::spawn_unchecked<test::run_test::{closure#1}, ()>::{closure#1} as core::ops::function::FnOnce<()>>::call_once::{shim:vtable#0}
183.12 s
> 24: <std::sys::thread::unix::Thread>::new::thread_start
183.12 s
> 25: start_thread
183.12 s
> 26: __clone3
183.12 s
> Location: /nix/store/l5xazfnr7k6r6p8mlkn38x2afab0rygz-vendor-cargo-deps/c19b7c6f923b580ac259164a89f2577984ad5ab09ee9d583b888f934adbbe8d0/symjit-2.25.0/src/symjit/compiler.rs :883
183.12 s
>
183.12 s
> ━━━━━━━━━━━━━━━━━━━━━━━━━━━━━━━━━━ BACKTRACE ━━━━━━━━━━━━━━━━━━━━━━━━━━━━━━━━━━━
183.12 s
> 1: <color_eyre[51793ea62743adbd]::config::PanicHook>::panic_report <unknown>
183.12 s
> at <unknown source file> :<unknown line>
183.12 s
> 2: <color_eyre[51793ea62743adbd]::config::PanicHook>::into_panic_hook::{closure#0} <unknown>
183.12 s
> at <unknown source file> :<unknown line>
183.12 s
> 3: std[bcb96dfbba0ab899]::panicking::panic_with_hook <unknown>
183.12 s
> at <unknown source file> :<unknown line>
183.12 s
> 4: std[bcb96dfbba0ab899]::panicking::panic_handler::{closure#0} <unknown>
183.12 s
> at <unknown source file> :<unknown line>
183.12 s
> 5: std[bcb96dfbba0ab899]::sys::backtrace::__rust_end_short_backtrace::<std[bcb96dfbba0ab899]::panicking::panic_handler::{closure#0}, !> <unknown>
183.12 s
> at <unknown source file> :<unknown line>
183.12 s
> 6: __rustc[6c289b9f9c454d21]::rust_begin_unwind <unknown>
183.12 s
> at <unknown source file> :<unknown line>
183.12 s
> 7: core[940e698046960fd5]::panicking::panic_fmt <unknown>
183.12 s
> at <unknown source file> :<unknown line>
183.12 s
> 8: core[940e698046960fd5]::result::unwrap_failed <unknown>
183.12 s
> at <unknown source file> :<unknown line>
183.12 s
> 9: <symjit[9dfb3c17cbb79ae4]::symjit::compiler::IndirectTranslator as symjit[9dfb3c17cbb79ae4]::symjit::composer::Composer>::compile <unknown>
183.12 s
> at <unknown source file> :<unknown line>
183.12 s
> 10: <symjit[9dfb3c17cbb79ae4]::symjit::compiler::Translator as symjit[9dfb3c17cbb79ae4]::symjit::composer::Composer>::compile <unknown>
183.12 s
> at <unknown source file> :<unknown line>
183.12 s
> 11: <numerica[ca5044e7d57d1d48]::domains::float::complex::Complex<f64> as symbolica[911a260017ea9deb]::evaluate::backend::JITCompiledNumber>::jit_compile <unknown>
183.12 s
> at <unknown source file> :<unknown line>
183.12 s
> 12: <gammalooprs[61738dd440287478]::integrands::process::evaluators::GenericEvaluator>::activate_symjit <unknown>
183.12 s
> at <unknown source file> :<unknown line>
183.12 s
> 13: <gammalooprs[61738dd440287478]::integrands::process::amplitude::AmplitudeIntegrand>::prepare_runtime_backends_after_generation_with_compile_times <unknown>
183.12 s
> at <unknown source file> :<unknown line>
183.12 s
> 14: <gammalooprs[61738dd440287478]::processes::amplitude::Amplitude>::build_integrand <unknown>
183.12 s
> at <unknown source file> :<unknown line>
183.12 s
> 15: <gammalooprs[61738dd440287478]::processes::process::Process>::generate_integrands <unknown>
183.12 s
> at <unknown source file> :<unknown line>
183.12 s
> 16: <gammalooprs[61738dd440287478]::processes::ProcessList>::generate_integrands <unknown>
183.12 s
> at <unknown source file> :<unknown line>
183.12 s
> 17: <gammaloop_api[781ec552bb626e12]::state::State>::generate_integrands <unknown>
183.12 s
> at <unknown source file> :<unknown line>
183.12 s
> 18: <gammaloop_api[781ec552bb626e12]::commands::generate::Generate>::run::<&std[bcb96dfbba0ab899]::path::PathBuf> <unknown>
183.12 s
> at <unknown source file> :<unknown line>
183.12 s
> 19: <gammaloop_api[781ec552bb626e12]::commands::Commands>::run <unknown>
183.12 s
> at <unknown source file> :<unknown line>
183.12 s
> 20: <gammaloop_api[781ec552bb626e12]::session::CliSession>::execute_prepared <unknown>
183.12 s
> at <unknown source file> :<unknown line>
183.12 s
> 21: <gammaloop_api[781ec552bb626e12]::session::CliSession>::execute_prepared_commands <unknown>
183.12 s
> at <unknown source file> :<unknown line>
183.12 s
> 22: <gammaloop_api[781ec552bb626e12]::session::CliSession>::execute_prepared <unknown>
183.12 s
> at <unknown source file> :<unknown line>
183.12 s
> 23: <gammaloop_api[781ec552bb626e12]::session::CliSession>::execute_command <unknown>
183.12 s
> at <unknown source file> :<unknown line>
183.12 s
> 24: <gammaloop_integration_tests[3349793260628f2c]::CLIState>::run_command_flow <unknown>
183.12 s
> at <unknown source file> :<unknown line>
183.12 s
> 25: <gammaloop_integration_tests[3349793260628f2c]::CLIState>::run_command <unknown>
183.12 s
> at <unknown source file> :<unknown line>
183.12 s
> 26: uv[4a8ff97c1fe5666b]::run_single_integrated_uv_case <unknown>
183.12 s
> at <unknown source file> :<unknown line>
183.12 s
> 27: <uv[4a8ff97c1fe5666b]::thermal_sunrise_uv::{closure#0} as core[940e698046960fd5]::ops::function::FnOnce<()>>::call_once <unknown>
183.12 s
> at <unknown source file> :<unknown line>
183.12 s
> 28: test[75d6903177b1d7e9]::__rust_begin_short_backtrace::<core[940e698046960fd5]::result::Result<(), alloc[2ea6bcb46fca0c42]::string::String>, fn() -> core[940e698046960fd5]::result::Result<(), alloc[2ea6bcb46fca0c42]::string::String>> <unknown>
183.12 s
> at <unknown source file> :<unknown line>
183.12 s
> 29: test[75d6903177b1d7e9]::run_test::{closure#0} <unknown>
183.12 s
> at <unknown source file> :<unknown line>
183.12 s
> 30: std[bcb96dfbba0ab899]::sys::backtrace::__rust_begin_short_backtrace::<test[75d6903177b1d7e9]::run_test::{closure#1}, ()> <unknown>
183.12 s
> at <unknown source file> :<unknown line>
183.12 s
> 31: <std[bcb96dfbba0ab899]::thread::lifecycle::spawn_unchecked<test[75d6903177b1d7e9]::run_test::{closure#1}, ()>::{closure#1} as core[940e698046960fd5]::ops::function::FnOnce<()>>::call_once::{shim:vtable#0} <unknown>
183.12 s
> at <unknown source file> :<unknown line>
183.12 s
> 32: <std[bcb96dfbba0ab899]::sys::thread::unix::Thread>::new::thread_start <unknown>
183.12 s
> at <unknown source file> :<unknown line>
183.12 s
> 33: start_thread <unknown>
183.12 s
> at <unknown source file> :<unknown line>
183.12 s
> 34: __clone3 <unknown>
183.12 s
> at <unknown source file> :<unknown line>
183.12 s
>
183.12 s
> Run with COLORBT_SHOW_HIDDEN=1 environment variable to disable frame filtering.
183.12 s
> Run with RUST_BACKTRACE=full to include source snippets.
183.12 s
> Warning: SpanTrace capture is Unsupported.
183.12 s
> Ensure that you've setup a tracing-error ErrorLayer and the semver versions are compatible
183.12 s
>
183.12 s
> ------------
183.12 s
> Summary [ 134.959s] 107 tests run: 106 passed , 1 failed , 68 skipped
183.12 s
> FAIL [ 2.733s] ( 94/107) gammaloop-integration-tests::uv thermal_sunrise_uv
183.12 s
> stdout ---
183.12 s
>
183.12 s
> running 1 test
183.12 s
> test thermal_sunrise_uv ... FAILED
183.12 s
>
183.12 s
> failures:
183.12 s
>
183.12 s
> failures:
183.12 s
> thermal_sunrise_uv
183.12 s
>
183.12 s
> test result: FAILED. 0 passed; 1 failed; 0 ignored; 0 measured; 25 filtered out; finished in 2.71s
183.12 s
>
183.12 s
> stderr ---
183.12 s
> [2026-09-09 23:10:32.550] @gammaloop_api::se... INFO : Running command run generate
183.12 s
> [2026-09-09 23:10:32.550] @gammaloop_api::se... INFO : Starting command block generate
183.12 s
> [2026-09-09 23:10:32.551] @gammaloop_api::se... INFO : Running command import model sm-default.json
183.12 s
> [2026-09-09 23:10:32.551] @import::model INFO : Loading built-in JSON model sm-default
183.12 s
> [2026-09-09 23:10:32.583] @gammalooprs::model INFO : The following 15 external parameters were forced to zero by the restriction card:
183.12 s
> lamWS, AWS, rhoWS, etaWS, ymc, yme, ymm, MC, Me, MM, WTau, muQ, muLe, muLmu, muLtau
183.12 s
> [2026-09-09 23:10:32.583] @gammalooprs::model INFO : The following 34 vertex rules were removed by the restriction card:
183.12 s
> V_82 -> (c~, d, G+) | V_83 -> (t~, d, G+) | V_84 -> (c~, s, G+) | V_85 -> (t~, s, G+) | V_86 -> (u~, b, G+) | V_87 -> (c~, b, G+) | V_90 -> (c~, d, W+) | V_91 -> (t~, d, W+) | V_92 -> (u~, s, W+) | V_94 -> (t~, s, W+) | V_95 -> (u~, b, W+) | V_96 -> (c~, b, W+) | V_101 -> (e+, e-, G0) | V_102 -> (mu+, mu-, G0) | V_104 -> (e+, e-, H) | V_105 -> (mu+, mu-, H) | V_110 -> (ve~, e-, G+) | V_111 -> (vm~, mu-, G+) | V_116 -> (b~, u, G-) | V_117 -> (d~, c, G-) | V_118 -> (s~, c, G-) | V_119 -> (b~, c, G-) | V_120 -> (d~, t, G-) | V_121 -> (s~, t, G-) | V_124 -> (s~, u, W-) | V_125 -> (b~, u, W-) | V_126 -> (d~, c, W-) | V_128 -> (b~, c, W-) | V_129 -> (d~, t, W-) | V_130 -> (s~, t, W-) | V_138 -> (c~, c, G0) | V_140 -> (c~, c, H) | V_145 -> (e+, ve, G-) | V_146 -> (mu+, vm, G-)
183.12 s
> [2026-09-09 23:10:32.583] @gammalooprs::model INFO : The following 36 couplings were removed by the restriction card:
183.12 s
> GC_13, GC_14, GC_16, GC_17, GC_18, GC_19, GC_20, GC_22, GC_23, GC_24, GC_25, GC_26, GC_28, GC_29, GC_42, GC_43, GC_44, GC_46, GC_47, GC_48, GC_84, GC_85, GC_86, GC_87, GC_88, GC_89, GC_90, GC_91, GC_92, GC_93, GC_101, GC_102, GC_103, GC_105, GC_106, GC_107
183.12 s
> [2026-09-09 23:10:32.584] @gammaloop_api::se... INFO : Running command remove processes
183.12 s
> [2026-09-09 23:10:32.584] @gammaloop_api::se... INFO : Running command generate amp {} > {} [{2}] | g u
183.12 s
> --numerator-grouping group_identical_graphs_up_to_scalar_rescaling
183.12 s
> --max-n-bridges 0
183.12 s
> --number-of-factorized-loop-subtopologies 1 1
183.12 s
> --number-of-fermion-loops 1 1
183.12 s
> [...]
183.12 s
> [2026-09-09 23:10:32.586] @feyngen::diagram_... INFO : 0s | Δ=0s | Starting Feynman graph generation with Symbolica...
183.12 s
> [2026-09-09 23:10:32.586] @feyngen::diagram_... INFO : 0s | Δ=0s | Number of graphs resulting from Symbolica generation: 3
183.12 s
> [2026-09-09 23:10:32.586] @feyngen::diagram_... INFO : 0s | Δ=0s | Number of graphs retained after removal of vetoed topologies: 2
183.12 s
> [2026-09-09 23:10:32.589] @feyngen::diagram_... INFO : 0s | Δ=0s | Number of graphs after vertex info assignment: 2
183.12 s
> [2026-09-09 23:10:32.589] @feyngen::diagram_... INFO : 0s | Δ=0s | Number of graphs after all complete graphs filters are applied: 2
183.12 s
> [2026-09-09 23:10:32.592] @feyngen::diagram_... INFO : 0s | Δ=0s | Number of graphs after closed fermion chains analysis: 1
183.12 s
> [2026-09-09 23:10:32.592] @feyngen::diagram_... INFO : 0s | Δ=0s | Number of graphs after symmetrization of external states: 1
183.12 s
> [2026-09-09 23:10:32.594] @feyngen::diagram_... INFO : 0s | Δ=0s | Number of graphs after canonization of vertices, edges and flows (graph labels assigned here): 1
183.12 s
> [2026-09-09 23:10:32.635] @feyngen::diagram_... INFO : 0s | Δ=0s | Number of graphs after numerator-aware grouping with strategy 'up to a scalar rescaling': 1 (1 isomorphically unique graph, 0 color zero, 0 lorentz zero, 0 grouped and 0 cancellation)
183.12 s
> [2026-09-09 23:10:32.635] @feyngen::diagram_... INFO : ( Sum of the symmetry factors from each graph generated = -1/2 )
183.12 s
> [2026-09-09 23:10:32.636] @commands::generate INFO : Generated amplitude 1 graphs.
183.12 s
> [2026-09-09 23:10:32.636] @commands::generate INFO : Only diagram generation was requested, skipping integrand generation. You can generate integrands later using the 'generate existing <options> ' command.
183.12 s
> [2026-09-09 23:10:32.636] @gammaloop_api::se... INFO : Running command generate
183.12 s
> The application panicked (crashed).
183.12 s
> Message: called `Result::unwrap()` on an `Err` value: variable __Static610 not found
183.12 s
>
183.12 s
> Stack backtrace:
183.12 s
> 0: <anyhow::Error>::msg::<alloc::string::String>
183.12 s
> 1: <symjit::symjit::compiler::IndirectTranslator as symjit::symjit::composer::Composer>::compile
183.12 s
> 2: <symjit::symjit::compiler::Translator as symjit::symjit::composer::Composer>::compile
183.12 s
> 3: <numerica::domains::float::complex::Complex<f64> as symbolica::evaluate::backend::JITCompiledNumber>::jit_compile
183.12 s
> 4: <gammalooprs::integrands::process::evaluators::GenericEvaluator>::activate_symjit
183.12 s
> 5: <gammalooprs::integrands::process::amplitude::AmplitudeIntegrand>::prepare_runtime_backends_after_generation_with_compile_times
183.12 s
> 6: <gammalooprs::processes::amplitude::Amplitude>::build_integrand
183.12 s
> 7: <gammalooprs::processes::process::Process>::generate_integrands
183.12 s
> 8: <gammalooprs::processes::ProcessList>::generate_integrands
183.12 s
> 9: <gammaloop_api::state::State>::generate_integrands
183.12 s
> 10: <gammaloop_api::commands::generate::Generate>::run::<&std::path::PathBuf>
183.12 s
> 11: <gammaloop_api::commands::Commands>::run
183.12 s
> 12: <gammaloop_api::session::CliSession>::execute_prepared
183.12 s
> 13: <gammaloop_api::session::CliSession>::execute_prepared_commands
183.12 s
> 14: <gammaloop_api::session::CliSession>::execute_prepared
183.12 s
> 15: <gammaloop_api::session::CliSession>::execute_command
183.12 s
> 16: <gammaloop_integration_tests::CLIState>::run_command_flow
183.12 s
> 17: <gammaloop_integration_tests::CLIState>::run_command
183.12 s
> 18: uv::run_single_integrated_uv_case
183.12 s
> 19: <uv::thermal_sunrise_uv::{closure#0} as core::ops::function::FnOnce<()>>::call_once
183.12 s
> 20: test::__rust_begin_short_backtrace::<core::result::Result<(), alloc::string::String>, fn() -> core::result::Result<(), alloc::string::String>>
183.12 s
> 21: test::run_test::{closure#0}
183.12 s
> 22: std::sys::backtrace::__rust_begin_short_backtrace::<test::run_test::{closure#1}, ()>
183.12 s
> 23: <std::thread::lifecycle::spawn_unchecked<test::run_test::{closure#1}, ()>::{closure#1} as core::ops::function::FnOnce<()>>::call_once::{shim:vtable#0}
183.12 s
> 24: <std::sys::thread::unix::Thread>::new::thread_start
183.12 s
> 25: start_thread
183.12 s
> 26: __clone3
183.12 s
> Location: /nix/store/l5xazfnr7k6r6p8mlkn38x2afab0rygz-vendor-cargo-deps/c19b7c6f923b580ac259164a89f2577984ad5ab09ee9d583b888f934adbbe8d0/symjit-2.25.0/src/symjit/compiler.rs :883
183.12 s
>
183.12 s
> ━━━━━━━━━━━━━━━━━━━━━━━━━━━━━━━━━━ BACKTRACE ━━━━━━━━━━━━━━━━━━━━━━━━━━━━━━━━━━━
183.12 s
> 1: <color_eyre[51793ea62743adbd]::config::PanicHook>::panic_report <unknown>
183.12 s
> at <unknown source file> :<unknown line>
183.12 s
> 2: <color_eyre[51793ea62743adbd]::config::PanicHook>::into_panic_hook::{closure#0} <unknown>
183.12 s
> at <unknown source file> :<unknown line>
183.12 s
> 3: std[bcb96dfbba0ab899]::panicking::panic_with_hook <unknown>
183.12 s
> at <unknown source file> :<unknown line>
183.12 s
> 4: std[bcb96dfbba0ab899]::panicking::panic_handler::{closure#0} <unknown>
183.12 s
> at <unknown source file> :<unknown line>
183.12 s
> 5: std[bcb96dfbba0ab899]::sys::backtrace::__rust_end_short_backtrace::<std[bcb96dfbba0ab899]::panicking::panic_handler::{closure#0}, !> <unknown>
183.12 s
> at <unknown source file> :<unknown line>
183.12 s
> 6: __rustc[6c289b9f9c454d21]::rust_begin_unwind <unknown>
183.12 s
> at <unknown source file> :<unknown line>
183.12 s
> 7: core[940e698046960fd5]::panicking::panic_fmt <unknown>
183.12 s
> at <unknown source file> :<unknown line>
183.12 s
> 8: core[940e698046960fd5]::result::unwrap_failed <unknown>
183.12 s
> at <unknown source file> :<unknown line>
183.12 s
> 9: <symjit[9dfb3c17cbb79ae4]::symjit::compiler::IndirectTranslator as symjit[9dfb3c17cbb79ae4]::symjit::composer::Composer>::compile <unknown>
183.12 s
> at <unknown source file> :<unknown line>
183.12 s
> 10: <symjit[9dfb3c17cbb79ae4]::symjit::compiler::Translator as symjit[9dfb3c17cbb79ae4]::symjit::composer::Composer>::compile <unknown>
183.12 s
> at <unknown source file> :<unknown line>
183.12 s
> 11: <numerica[ca5044e7d57d1d48]::domains::float::complex::Complex<f64> as symbolica[911a260017ea9deb]::evaluate::backend::JITCompiledNumber>::jit_compile <unknown>
183.12 s
> at <unknown source file> :<unknown line>
183.12 s
> 12: <gammalooprs[61738dd440287478]::integrands::process::evaluators::GenericEvaluator>::activate_symjit <unknown>
183.12 s
> at <unknown source file> :<unknown line>
183.12 s
> 13: <gammalooprs[61738dd440287478]::integrands::process::amplitude::AmplitudeIntegrand>::prepare_runtime_backends_after_generation_with_compile_times <unknown>
183.12 s
> at <unknown source file> :<unknown line>
183.12 s
> 14: <gammalooprs[61738dd440287478]::processes::amplitude::Amplitude>::build_integrand <unknown>
183.12 s
> at <unknown source file> :<unknown line>
183.12 s
> 15: <gammalooprs[61738dd440287478]::processes::process::Process>::generate_integrands <unknown>
183.12 s
> at <unknown source file> :<unknown line>
183.12 s
> 16: <gammalooprs[61738dd440287478]::processes::ProcessList>::generate_integrands <unknown>
183.12 s
> at <unknown source file> :<unknown line>
183.12 s
> 17: <gammaloop_api[781ec552bb626e12]::state::State>::generate_integrands <unknown>
183.12 s
> at <unknown source file> :<unknown line>
183.12 s
> 18: <gammaloop_api[781ec552bb626e12]::commands::generate::Generate>::run::<&std[bcb96dfbba0ab899]::path::PathBuf> <unknown>
183.12 s
> at <unknown source file> :<unknown line>
183.12 s
> 19: <gammaloop_api[781ec552bb626e12]::commands::Commands>::run <unknown>
183.12 s
> at <unknown source file> :<unknown line>
183.12 s
> 20: <gammaloop_api[781ec552bb626e12]::session::CliSession>::execute_prepared <unknown>
183.12 s
> at <unknown source file> :<unknown line>
183.12 s
> 21: <gammaloop_api[781ec552bb626e12]::session::CliSession>::execute_prepared_commands <unknown>
183.12 s
> at <unknown source file> :<unknown line>
183.12 s
> 22: <gammaloop_api[781ec552bb626e12]::session::CliSession>::execute_prepared <unknown>
183.12 s
> at <unknown source file> :<unknown line>
183.12 s
> 23: <gammaloop_api[781ec552bb626e12]::session::CliSession>::execute_command <unknown>
183.12 s
> at <unknown source file> :<unknown line>
183.12 s
> 24: <gammaloop_integration_tests[3349793260628f2c]::CLIState>::run_command_flow <unknown>
183.12 s
> at <unknown source file> :<unknown line>
183.12 s
> 25: <gammaloop_integration_tests[3349793260628f2c]::CLIState>::run_command <unknown>
183.12 s
> at <unknown source file> :<unknown line>
183.12 s
> 26: uv[4a8ff97c1fe5666b]::run_single_integrated_uv_case <unknown>
183.12 s
> at <unknown source file> :<unknown line>
183.12 s
> 27: <uv[4a8ff97c1fe5666b]::thermal_sunrise_uv::{closure#0} as core[940e698046960fd5]::ops::function::FnOnce<()>>::call_once <unknown>
183.12 s
> at <unknown source file> :<unknown line>
183.12 s
> 28: test[75d6903177b1d7e9]::__rust_begin_short_backtrace::<core[940e698046960fd5]::result::Result<(), alloc[2ea6bcb46fca0c42]::string::String>, fn() -> core[940e698046960fd5]::result::Result<(), alloc[2ea6bcb46fca0c42]::string::String>> <unknown>
183.12 s
> at <unknown source file> :<unknown line>
183.12 s
> 29: test[75d6903177b1d7e9]::run_test::{closure#0} <unknown>
183.12 s
> at <unknown source file> :<unknown line>
183.12 s
> 30: std[bcb96dfbba0ab899]::sys::backtrace::__rust_begin_short_backtrace::<test[75d6903177b1d7e9]::run_test::{closure#1}, ()> <unknown>
183.12 s
> at <unknown source file> :<unknown line>
183.12 s
> 31: <std[bcb96dfbba0ab899]::thread::lifecycle::spawn_unchecked<test[75d6903177b1d7e9]::run_test::{closure#1}, ()>::{closure#1} as core[940e698046960fd5]::ops::function::FnOnce<()>>::call_once::{shim:vtable#0} <unknown>
183.12 s
> at <unknown source file> :<unknown line>
183.12 s
> 32: <std[bcb96dfbba0ab899]::sys::thread::unix::Thread>::new::thread_start <unknown>
183.12 s
> at <unknown source file> :<unknown line>
183.12 s
> 33: start_thread <unknown>
183.12 s
> at <unknown source file> :<unknown line>
183.12 s
> 34: __clone3 <unknown>
183.12 s
> at <unknown source file> :<unknown line>
183.12 s
>
183.12 s
> Run with COLORBT_SHOW_HIDDEN=1 environment variable to disable frame filtering.
183.12 s
> Run with RUST_BACKTRACE=full to include source snippets.
183.12 s
> Warning: SpanTrace capture is Unsupported.
183.12 s
> Ensure that you've setup a tracing-error ErrorLayer and the semver versions are compatible
183.12 s
>
183.12 s
> error : test run failed
183.12 s
>
183.12 s
> ========== nextest test summary ==========
183.12 s
> report: target/nextest/ci_gammaloop/junit.xml
183.12 s
> tests: 107, failures: 1, errors: 0
183.12 s
>
183.12 s
> 1. gammaloop-integration-tests::uv::thermal_sunrise_uv
183.12 s
> failure: test failure with exit code 101
183.12 s
> system-out
183.12 s
> running 1 test
183.12 s
> test thermal_sunrise_uv ... FAILED
183.12 s
>
183.12 s
> failures:
183.12 s
>
183.12 s
> failures:
183.12 s
> thermal_sunrise_uv
183.12 s
>
183.12 s
> test result: FAILED. 0 passed; 1 failed; 0 ignored; 0 measured; 25 filtered out; finished in 2.71s
183.12 s
> system-err
183.12 s
> [2026-09-09 23:10:32.550] @gammaloop_api::se... INFO : Running command run generate
183.12 s
> [2026-09-09 23:10:32.550] @gammaloop_api::se... INFO : Starting command block generate
183.12 s
> [2026-09-09 23:10:32.551] @gammaloop_api::se... INFO : Running command import model sm-default.json
183.12 s
> [2026-09-09 23:10:32.551] @import::model INFO : Loading built-in JSON model sm-default
183.12 s
> [2026-09-09 23:10:32.583] @gammalooprs::model INFO : The following 15 external parameters were forced to zero by the restriction card:
183.12 s
> lamWS, AWS, rhoWS, etaWS, ymc, yme, ymm, MC, Me, MM, WTau, muQ, muLe, muLmu, muLtau
183.12 s
> [2026-09-09 23:10:32.583] @gammalooprs::model INFO : The following 34 vertex rules were removed by the restriction card:
183.12 s
> V_82 -> (c~, d, G+) | V_83 -> (t~, d, G+) | V_84 -> (c~, s, G+) | V_85 -> (t~, s, G+) | V_86 -> (u~, b, G+) | V_87 -> (c~, b, G+) | V_90 -> (c~, d, W+) | V_91 -> (t~, d, W+) | V_92 -> (u~, s, W+) | V_94 -> (t~, s, W+) | V_95 -> (u~, b, W+) | V_96 -> (c~, b, W+) | V_101 -> (e+, e-, G0) | V_102 -> (mu+, mu-, G0) | V_104 -> (e+, e-, H) | V_105 -> (mu+, mu-, H) | V_110 -> (ve~, e-, G+) | V_111 -> (vm~, mu-, G+) | V_116 -> (b~, u, G-) | V_117 -> (d~, c, G-) | V_118 -> (s~, c, G-) | V_119 -> (b~, c, G-) | V_120 -> (d~, t, G-) | V_121 -> (s~, t, G-) | V_124 -> (s~, u, W-) | V_125 -> (b~, u, W-) | V_126 -> (d~, c, W-) | V_128 -> (b~, c, W-) | V_129 -> (d~, t, W-) | V_130 -> (s~, t, W-) | V_138 -> (c~, c, G0) | V_140 -> (c~, c, H) | V_145 -> (e+, ve, G-) | V_146 -> (mu+, vm, G-)
183.12 s
> [2026-09-09 23:10:32.583] @gammalooprs::model INFO : The following 36 couplings were removed by the restriction card:
183.12 s
> GC_13, GC_14, GC_16, GC_17, GC_18, GC_19, GC_20, GC_22, GC_23, GC_24, GC_25, GC_26, GC_28, GC_29, GC_42, GC_43, GC_44, GC_46, GC_47, GC_48, GC_84, GC_85, GC_86, GC_87, GC_88, GC_89, GC_90, GC_91, GC_92, GC_93, GC_101, GC_102, GC_103, GC_105, GC_106, GC_107
183.12 s
> [2026-09-09 23:10:32.584] @gammaloop_api::se... INFO : Running command remove processes
183.12 s
> [2026-09-09 23:10:32.584] @gammaloop_api::se... INFO : Running command generate amp {} > {} [{2}] | g u
183.12 s
> --numerator-grouping group_identical_graphs_up_to_scalar_rescaling
183.12 s
> --max-n-bridges 0
183.12 s
> --number-of-factorized-loop-subtopologies 1 1
183.12 s
> --number-of-fermion-loops 1 1
183.12 s
> [...]
183.12 s
> [2026-09-09 23:10:32.586] @feyngen::diagram_... INFO : 0s | Δ=0s | Starting Feynman graph generation with Symbolica...
183.12 s
> [2026-09-09 23:10:32.586] @feyngen::diagram_... INFO : 0s | Δ=0s | Number of graphs resulting from Symbolica generation: 3
183.12 s
> [2026-09-09 23:10:32.586] @feyngen::diagram_... INFO : 0s | Δ=0s | Number of graphs retained after removal of vetoed topologies: 2
183.12 s
> [2026-09-09 23:10:32.589] @feyngen::diagram_... INFO : 0s | Δ=0s | Number of graphs after vertex info assignment: 2
183.12 s
> [2026-09-09 23:10:32.589] @feyngen::diagram_... INFO : 0s | Δ=0s | Number of graphs after all complete graphs filters are applied: 2
183.12 s
> [2026-09-09 23:10:32.592] @feyngen::diagram_... INFO : 0s | Δ=0s | Number of graphs after closed fermion chains analysis: 1
183.12 s
> [2026-09-09 23:10:32.592] @feyngen::diagram_... INFO : 0s | Δ=0s | Number of graphs after symmetrization of external states: 1
183.12 s
> [2026-09-09 23:10:32.594] @feyngen::diagram_... INFO : 0s | Δ=0s | Number of graphs after canonization of vertices, edges and flows (graph labels assigned here): 1
183.12 s
> [2026-09-09 23:10:32.635] @feyngen::diagram_... INFO : 0s | Δ=0s | Number of graphs after numerator-aware grouping with strategy 'up to a scalar rescaling': 1 (1 isomorphically unique graph, 0 color zero, 0 lorentz zero, 0 grouped and 0 cancellation)
183.12 s
> [2026-09-09 23:10:32.635] @feyngen::diagram_... INFO : ( Sum of the symmetry factors from each graph generated = -1/2 )
183.12 s
> [2026-09-09 23:10:32.636] @commands::generate INFO : Generated amplitude 1 graphs.
183.12 s
> [2026-09-09 23:10:32.636] @commands::generate INFO : Only diagram generation was requested, skipping integrand generation. You can generate integrands later using the 'generate existing <options>' command.
183.12 s
> [2026-09-09 23:10:32.636] @gammaloop_api::se... INFO : Running command generate
183.12 s
> The application panicked (crashed).
183.12 s
> Message: called `Result::unwrap()` on an `Err` value: variable __Static610 not found
183.12 s
>
183.12 s
> Stack backtrace:
183.12 s
> 0: <anyhow::Error>::msg::<alloc::string::String>
183.12 s
> 1: <symjit::symjit::compiler::IndirectTranslator as symjit::symjit::composer::Composer>::compile
183.12 s
> 2: <symjit::symjit::compiler::Translator as symjit::symjit::composer::Composer>::compile
183.12 s
> 3: <numerica::domains::float::complex::Complex<f64> as symbolica::evaluate::backend::JITCompiledNumber>::jit_compile
183.12 s
> 4: <gammalooprs::integrands::process::evaluators::GenericEvaluator>::activate_symjit
183.12 s
> 5: <gammalooprs::integrands::process::amplitude::AmplitudeIntegrand>::prepare_runtime_backends_after_generation_with_compile_times
183.12 s
> 6: <gammalooprs::processes::amplitude::Amplitude>::build_integrand
183.12 s
> 7: <gammalooprs::processes::process::Process>::generate_integrands
183.12 s
> 8: <gammalooprs::processes::ProcessList>::generate_integrands
183.12 s
> 9: <gammaloop_api::state::State>::generate_integrands
183.12 s
> 10: <gammaloop_api::commands::generate::Generate>::run::<&std::path::PathBuf>
183.12 s
> 11: <gammaloop_api::commands::Commands>::run
183.12 s
> 12: <gammaloop_api::session::CliSession>::execute_prepared
183.12 s
> 13: <gammaloop_api::session::CliSession>::execute_prepared_commands
183.12 s
> 14: <gammaloop_api::session::CliSession>::execute_prepared
183.12 s
> 15: <gammaloop_api::session::CliSession>::execute_command
183.12 s
> 16: <gammaloop_integration_tests::CLIState>::run_command_flow
183.12 s
> 17: <gammaloop_integration_tests::CLIState>::run_command
183.12 s
> 18: uv::run_single_integrated_uv_case
183.12 s
> 19: <uv::thermal_sunrise_uv::{closure#0} as core::ops::function::FnOnce<()>>::call_once
183.12 s
> 20: test::__rust_begin_short_backtrace::<core::result::Result<(), alloc::string::String>, fn() -> core::result::Result<(), alloc::string::String>>
183.12 s
> 21: test::run_test::{closure#0}
183.12 s
> 22: std::sys::backtrace::__rust_begin_short_backtrace::<test::run_test::{closure#1}, ()>
183.12 s
> 23: <std::thread::lifecycle::spawn_unchecked<test::run_test::{closure#1}, ()>::{closure#1} as core::ops::function::FnOnce<()>>::call_once::{shim:vtable#0}
183.12 s
> 24: <std::sys::thread::unix::Thread>::new::thread_start
183.12 s
> 25: start_thread
183.12 s
> 26: __clone3
183.12 s
> Location: /nix/store/l5xazfnr7k6r6p8mlkn38x2afab0rygz-vendor-cargo-deps/c19b7c6f923b580ac259164a89f2577984ad5ab09ee9d583b888f934adbbe8d0/symjit-2.25.0/src/symjit/compiler.rs:883
183.12 s
>
183.12 s
> ━━━━━━━━━━━━━━━━━━━━━━━━━━━━━━━━━━ BACKTRACE ━━━━━━━━━━━━━━━━━━━━━━━━━━━━━━━━━━━
183.12 s
> 1: <color_eyre[51793ea62743adbd]::config::PanicHook>::panic_report<unknown>
183.12 s
> at <unknown source file>:<unknown line>
183.12 s
> 2: <color_eyre[51793ea62743adbd]::config::PanicHook>::into_panic_hook::{closure#0}<unknown>
183.12 s
> at <unknown source file>:<unknown line>
183.12 s
> 3: std[bcb96dfbba0ab899]::panicking::panic_with_hook<unknown>
183.12 s
> at <unknown source file>:<unknown line>
183.12 s
> 4: std[bcb96dfbba0ab899]::panicking::panic_handler::{closure#0}<unknown>
183.12 s
> at <unknown source file>:<unknown line>
183.12 s
> 5: std[bcb96dfbba0ab899]::sys::backtrace::__rust_end_short_backtrace::<std[bcb96dfbba0ab899]::panicking::panic_handler::{closure#0}, !><unknown>
183.12 s
> at <unknown source file>:<unknown line>
183.12 s
> 6: __rustc[6c289b9f9c454d21]::rust_begin_unwind<unknown>
183.12 s
> at <unknown source file>:<unknown line>
183.12 s
> 7: core[940e698046960fd5]::panicking::panic_fmt<unknown>
183.12 s
> at <unknown source file>:<unknown line>
183.12 s
> 8: core[940e698046960fd5]::result::unwrap_failed<unknown>
183.12 s
> at <unknown source file>:<unknown line>
183.12 s
> 9: <symjit[9dfb3c17cbb79ae4]::symjit::compiler::IndirectTranslator as symjit[9dfb3c17cbb79ae4]::symjit::composer::Composer>::compile<unknown>
183.12 s
> at <unknown source file>:<unknown line>
183.12 s
> 10: <symjit[9dfb3c17cbb79ae4]::symjit::compiler::Translator as symjit[9dfb3c17cbb79ae4]::symjit::composer::Composer>::compile<unknown>
183.12 s
> at <unknown source file>:<unknown line>
183.12 s
> 11: <numerica[ca5044e7d57d1d48]::domains::float::complex::Complex<f64> as symbolica[911a260017ea9deb]::evaluate::backend::JITCompiledNumber>::jit_compile<unknown>
183.12 s
> at <unknown source file>:<unknown line>
183.12 s
> 12: <gammalooprs[61738dd440287478]::integrands::process::evaluators::GenericEvaluator>::activate_symjit<unknown>
183.12 s
> at <unknown source file>:<unknown line>
183.12 s
> 13: <gammalooprs[61738dd440287478]::integrands::process::amplitude::AmplitudeIntegrand>::prepare_runtime_backends_after_generation_with_compile_times<unknown>
183.12 s
> at <unknown source file>:<unknown line>
183.12 s
> 14: <gammalooprs[61738dd440287478]::processes::amplitude::Amplitude>::build_integrand<unknown>
183.12 s
> at <unknown source file>:<unknown line>
183.12 s
> 15: <gammalooprs[61738dd440287478]::processes::process::Process>::generate_integrands<unknown>
183.12 s
> at <unknown source file>:<unknown line>
183.12 s
> 16: <gammalooprs[61738dd440287478]::processes::ProcessList>::generate_integrands<unknown>
183.12 s
> at <unknown source file>:<unknown line>
183.12 s
> 17: <gammaloop_api[781ec552bb626e12]::state::State>::generate_integrands<unknown>
183.12 s
> at <unknown source file>:<unknown line>
183.12 s
> 18: <gammaloop_api[781ec552bb626e12]::commands::generate::Generate>::run::<&std[bcb96dfbba0ab899]::path::PathBuf><unknown>
183.12 s
> at <unknown source file>:<unknown line>
183.12 s
> 19: <gammaloop_api[781ec552bb626e12]::commands::Commands>::run<unknown>
183.12 s
> at <unknown source file>:<unknown line>
183.12 s
> 20: <gammaloop_api[781ec552bb626e12]::session::CliSession>::execute_prepared<unknown>
183.12 s
> at <unknown source file>:<unknown line>
183.12 s
> 21: <gammaloop_api[781ec552bb626e12]::session::CliSession>::execute_prepared_commands<unknown>
183.12 s
> at <unknown source file>:<unknown line>
183.12 s
> 22: <gammaloop_api[781ec552bb626e12]::session::CliSession>::execute_prepared<unknown>
183.12 s
> at <unknown source file>:<unknown line>
183.12 s
> 23: <gammaloop_api[781ec552bb626e12]::session::CliSession>::execute_command<unknown>
183.12 s
> at <unknown source file>:<unknown line>
183.12 s
> 24: <gammaloop_integration_tests[3349793260628f2c]::CLIState>::run_command_flow<unknown>
183.12 s
> at <unknown source file>:<unknown line>
183.12 s
> 25: <gammaloop_integration_tests[3349793260628f2c]::CLIState>::run_command<unknown>
183.12 s
> at <unknown source file>:<unknown line>
183.12 s
> 26: uv[4a8ff97c1fe5666b]::run_single_integrated_uv_case<unknown>
183.12 s
> at <unknown source file>:<unknown line>
183.12 s
> 27: <uv[4a8ff97c1fe5666b]::thermal_sunrise_uv::{closure#0} as core[940e698046960fd5]::ops::function::FnOnce<()>>::call_once<unknown>
183.12 s
> at <unknown source file>:<unknown line>
183.12 s
> 28: test[75d6903177b1d7e9]::__rust_begin_short_backtrace::<core[940e698046960fd5]::result::Result<(), alloc[2ea6bcb46fca0c42]::string::String>, fn() -> core[940e698046960fd5]::result::Result<(), alloc[2ea6bcb46fca0c42]::string::String>><unknown>
183.12 s
> ... omitted 18 more lines; see full nextest output above
183.12 s
> =========================================
183.12 s
For full logs, run:
183.12 s
nix log /nix/store/85r60p7hwgsrgkazjyi3fv4lbc82mrhs-gammaloop-nextest-integration.drv
183.22 s
[5 built (1 failed ), 63 Run failed.