test packages.x86_64-linux.nix-ci-check-gammaloop-nextest-integration

Reproduce this run
Original Run
  1. 0.00 s $ /nix/store/9ypz3flqsrl5xl495mm8h645gadjsxi1-coreutils-9.11/bin/timeout --kill-after=15s 7200s /nix/store/23zk8sgzamrbmj1fday15szf7f2279s8-nix-2.34.7/bin/nix --extra-experimental-features nix-command --extra-experimental-features flakes flake clone git+https://github.com/alphal00p/gammaloop --dest /tmp/nix-ci-worker/stable-pwd/repo/
  2. 0.07 s Cloning into '/tmp/nix-ci-worker/stable-pwd/repo'...
  3. 1.33 s remote: Enumerating objects: 82005, done.
  4. 1.57 s remote: Counting objects: 0% (1/8160) remote: Counting objects: 1% (82/8160) remote: Counting objects: 2% (164/8160) remote: Counting objects: 3% (245/8160) remote: Counting objects: 4% (327/8160) remote: Counting objects: 5% (408/8160) remote: Counting objects: 6% (490/8160) remote: Counting objects: 7% (572/8160) remote: Counting objects: 8% (653/8160) remote: Counting objects: 9% (735/8160) remote: Counting objects: 10% (816/8160) remote: Counting objects: 11% (898/8160) remote: Counting objects: 12% (980/8160) remote: Counting objects: 13% (1061/8160) remote: Counting objects: 14% (1143/8160) remote: Counting objects: 15% (1224/8160) remote: Counting objects: 16% (1306/8160) remote: Counting objects: 17% (1388/8160) remote: Counting objects: 18% (1469/8160) remote: Counting objects: 19% (1551/8160) remote: Counting objects: 20% (1632/8160) remote: Counting objects: 21% (1714/8160) remote: Counting objects: 22% (1796/8160) remote: Counting objects: 23% (1877/8160) remote: Counting objects: 24% (1959/8160) remote: Counting objects: 25% (2040/8160) remote: Counting objects: 26% (2122/8160) remote: Counting objects: 27% (2204/8160) remote: Counting objects: 28% (2285/8160) remote: Counting objects: 29% (2367/8160) remote: Counting objects: 30% (2448/8160) remote: Counting objects: 31% (2530/8160) remote: Counting objects: 32% (2612/8160) remote: Counting objects: 33% (2693/8160) remote: Counting objects: 34% (2775/8160) remote: Counting objects: 35% (2856/8160) remote: Counting objects: 36% (2938/8160) remote: Counting objects: 37% (3020/8160) remote: Counting objects: 38% (3101/8160) remote: Counting objects: 39% (3183/8160) remote: Counting objects: 40% (3264/8160) remote: Counting objects: 41% (3346/8160) remote: Counting objects: 42% (3428/8160) remote: Counting objects: 43% (3509/8160) remote: Counting objects: 44% (3591/8160) remote: Counting objects: 45% (3672/8160) remote: Counting objects: 46% (3754/8160) remote: Counting objects: 47% (3836/8160) remote: Counting objects: 48% (3917/8160) remote: Counting objects: 49% (3999/8160) remote: Counting objects: 50% (4080/8160) remote: Counting objects: 51% (4162/8160) remote: Counting objects: 52% (4244/8160) remote: Counting objects: 53% (4325/8160) remote: Counting objects: 54% (4407/8160) remote: Counting objects: 55% (4488/8160) remote: Counting objects: 56% (4570/8160) remote: Counting objects: 57% (4652/8160) remote: Counting objects: 58% (4733/8160) remote: Counting objects: 59% (4815/8160) remote: Counting objects: 60% (4896/8160) remote: Counting objects: 61% (4978/8160) remote: Counting objects: 62% (5060/8160) remote: Counting objects: 63% (5141/8160) remote: Counting objects: 64% (5223/8160) remote: Counting objects: 65% (5304/8160) remote: Counting objects: 66% (5386/8160) remote: Counting objects: 67% (5468/8160) remote: Counting objects: 68% (5549/8160) remote: Counting objects: 69% (5631/8160) remote: Counting objects: 70% (5712/8160) remote: Counting objects: 71% (5794/8160) remote: Counting objects: 72% (5876/8160) remote: Counting objects: 73% (5957/8160) remote: Counting objects: 74% (6039/8160) remote: Counting objects: 75% (6120/8160) remote: Counting objects: 76% (6202/8160) remote: Counting objects: 77% (6284/8160) remote: Counting objects: 78% (6365/8160) remote: Counting objects: 79% (6447/8160) remote: Counting objects: 80% (6528/8160) remote: Counting objects: 81% (6610/8160) remote: Counting objects: 82% (6692/8160) remote: Counting objects: 83% (6773/8160) remote: Counting objects: 84% (6855/8160) remote: Counting objects: 85% (6936/8160) remote: Counting objects: 86% (7018/8160) remote: Counting objects: 87% (7100/8160) remote: Counting objects: 88% (7181/8160) remote: Counting objects: 89% (7263/8160) remote: Counting objects: 90% (7344/8160) remote: Counting objects: 91% (7426/8160) remote: Counting objects: 92% (7508/8160) remote: Counting objects: 93% (7589/8160) remote: Counting objects: 94% (7671/8160) remote: Counting objects: 95% (7752/8160) remote: Counting objects: 96% (7834/8160) remote: Counting objects: 97% (7916/8160) remote: Counting objects: 98% (7997/8160) remote: Counting objects: 99% (8079/8160) remote: Counting objects: 100% (8160/8160) remote: Counting objects: 100% (8160/8160), done.
  5. 3.03 s remote: Compressing objects: 0% (1/1552) remote: Compressing objects: 1% (16/1552) remote: Compressing objects: 2% (32/1552) remote: Compressing objects: 3% (47/1552) remote: Compressing objects: 4% (63/1552) remote: Compressing objects: 5% (78/1552) remote: Compressing objects: 6% (94/1552) remote: Compressing objects: 7% (109/1552) remote: Compressing objects: 8% (125/1552) remote: Compressing objects: 9% (140/1552) remote: Compressing objects: 10% (156/1552) remote: Compressing objects: 10% (163/1552) remote: Compressing objects: 11% (171/1552) remote: Compressing objects: 12% (187/1552) remote: Compressing objects: 13% (202/1552) remote: Compressing objects: 14% (218/1552) remote: Compressing objects: 15% (233/1552) remote: Compressing objects: 16% (249/1552) remote: Compressing objects: 17% (264/1552) remote: Compressing objects: 18% (280/1552) remote: Compressing objects: 19% (295/1552) remote: Compressing objects: 20% (311/1552) remote: Compressing objects: 21% (326/1552) remote: Compressing objects: 22% (342/1552) remote: Compressing objects: 23% (357/1552) remote: Compressing objects: 24% (373/1552) remote: Compressing objects: 25% (388/1552) remote: Compressing objects: 26% (404/1552) remote: Compressing objects: 27% (420/1552) remote: Compressing objects: 28% (435/1552) remote: Compressing objects: 29% (451/1552) remote: Compressing objects: 30% (466/1552) remote: Compressing objects: 31% (482/1552) remote: Compressing objects: 32% (497/1552) remote: Compressing objects: 33% (513/1552) remote: Compressing objects: 34% (528/1552) remote: Compressing objects: 35% (544/1552) remote: Compressing objects: 36% (559/1552) remote: Compressing objects: 37% (575/1552) remote: Compressing objects: 38% (590/1552) remote: Compressing objects: 39% (606/1552) remote: Compressing objects: 40% (621/1552) remote: Compressing objects: 41% (637/1552) remote: Compressing objects: 42% (652/1552) remote: Compressing objects: 43% (668/1552) remote: Compressing objects: 44% (683/1552) remote: Compressing objects: 45% (699/1552) remote: Compressing objects: 46% (714/1552) remote: Compressing objects: 47% (730/1552) remote: Compressing objects: 48% (745/1552) remote: Compressing objects: 49% (761/1552) remote: Compressing objects: 50% (776/1552) remote: Compressing objects: 51% (792/1552) remote: Compressing objects: 52% (808/1552) remote: Compressing objects: 53% (823/1552) remote: Compressing objects: 54% (839/1552) remote: Compressing objects: 55% (854/1552) remote: Compressing objects: 56% (870/1552) remote: Compressing objects: 57% (885/1552) remote: Compressing objects: 58% (901/1552) remote: Compressing objects: 59% (916/1552) remote: Compressing objects: 60% (932/1552) remote: Compressing objects: 61% (947/1552) remote: Compressing objects: 62% (963/1552) remote: Compressing objects: 63% (978/1552) remote: Compressing objects: 64% (994/1552) remote: Compressing objects: 65% (1009/1552) remote: Compressing objects: 66% (1025/1552) remote: Compressing objects: 67% (1040/1552) remote: Compressing objects: 68% (1056/1552) remote: Compressing objects: 69% (1071/1552) remote: Compressing objects: 70% (1087/1552) remote: Compressing objects: 71% (1102/1552) remote: Compressing objects: 72% (1118/1552) remote: Compressing objects: 73% (1133/1552) remote: Compressing objects: 74% (1149/1552) remote: Compressing objects: 75% (1164/1552) remote: Compressing objects: 76% (1180/1552) remote: Compressing objects: 77% (1196/1552) remote: Compressing objects: 78% (1211/1552) remote: Compressing objects: 79% (1227/1552) remote: Compressing objects: 80% (1242/1552) remote: Compressing objects: 81% (1258/1552) remote: Compressing objects: 82% (1273/1552) remote: Compressing objects: 83% (1289/1552) remote: Compressing objects: 84% (1304/1552) remote: Compressing objects: 85% (1320/1552) remote: Compressing objects: 86% (1335/1552) remote: Compressing objects: 87% (1351/1552) remote: Compressing objects: 88% (1366/1552) remote: Compressing objects: 89% (1382/1552) remote: Compressing objects: 90% (1397/1552) remote: Compressing objects: 91% (1413/1552) remote: Compressing objects: 92% (1428/1552) remote: Compressing objects: 93% (1444/1552) remote: Compressing objects: 94% (1459/1552) remote: Compressing objects: 95% (1475/1552) remote: Compressing objects: 96% (1490/1552) remote: Compressing objects: 97% (1506/1552) remote: Compressing objects: 98% (1521/1552) remote: Compressing objects: 99% (1537/1552) remote: Compressing objects: 100% (1552/1552) remote: Compressing objects: 100% (1552/1552), done.
  6. 7.27 s Receiving objects: 0% (1/82005) Receiving objects: 1% (821/82005) Receiving objects: 2% (1641/82005) Receiving objects: 3% (2461/82005) Receiving objects: 4% (3281/82005) Receiving objects: 5% (4101/82005) Receiving objects: 6% (4921/82005), 9.13 MiB | 18.25 MiB/s Receiving objects: 7% (5741/82005), 9.13 MiB | 18.25 MiB/s Receiving objects: 8% (6561/82005), 9.13 MiB | 18.25 MiB/s Receiving objects: 9% (7381/82005), 9.13 MiB | 18.25 MiB/s Receiving objects: 10% (8201/82005), 9.13 MiB | 18.25 MiB/s Receiving objects: 11% (9021/82005), 9.13 MiB | 18.25 MiB/s Receiving objects: 12% (9841/82005), 9.13 MiB | 18.25 MiB/s Receiving objects: 13% (10661/82005), 9.13 MiB | 18.25 MiB/s Receiving objects: 14% (11481/82005), 9.13 MiB | 18.25 MiB/s Receiving objects: 15% (12301/82005), 9.13 MiB | 18.25 MiB/s Receiving objects: 16% (13121/82005), 9.13 MiB | 18.25 MiB/s Receiving objects: 17% (13941/82005), 9.13 MiB | 18.25 MiB/s Receiving objects: 18% (14761/82005), 9.13 MiB | 18.25 MiB/s Receiving objects: 19% (15581/82005), 9.13 MiB | 18.25 MiB/s Receiving objects: 20% (16401/82005), 9.13 MiB | 18.25 MiB/s Receiving objects: 21% (17222/82005), 9.13 MiB | 18.25 MiB/s Receiving objects: 22% (18042/82005), 9.13 MiB | 18.25 MiB/s Receiving objects: 23% (18862/82005), 9.13 MiB | 18.25 MiB/s Receiving objects: 24% (19682/82005), 9.13 MiB | 18.25 MiB/s Receiving objects: 25% (20502/82005), 9.13 MiB | 18.25 MiB/s Receiving objects: 26% (21322/82005), 9.13 MiB | 18.25 MiB/s Receiving objects: 27% (22142/82005), 9.13 MiB | 18.25 MiB/s Receiving objects: 28% (22962/82005), 9.13 MiB | 18.25 MiB/s Receiving objects: 29% (23782/82005), 9.13 MiB | 18.25 MiB/s Receiving objects: 30% (24602/82005), 9.13 MiB | 18.25 MiB/s Receiving objects: 31% (25422/82005), 9.13 MiB | 18.25 MiB/s Receiving objects: 32% (26242/82005), 9.13 MiB | 18.25 MiB/s Receiving objects: 33% (27062/82005), 9.13 MiB | 18.25 MiB/s Receiving objects: 34% (27882/82005), 9.13 MiB | 18.25 MiB/s Receiving objects: 35% (28702/82005), 9.13 MiB | 18.25 MiB/s Receiving objects: 36% (29522/82005), 9.13 MiB | 18.25 MiB/s Receiving objects: 37% (30342/82005), 9.13 MiB | 18.25 MiB/s Receiving objects: 38% (31162/82005), 9.13 MiB | 18.25 MiB/s Receiving objects: 39% (31982/82005), 9.13 MiB | 18.25 MiB/s Receiving objects: 39% (32343/82005), 9.13 MiB | 18.25 MiB/s Receiving objects: 40% (32802/82005), 29.75 MiB | 29.74 MiB/s Receiving objects: 41% (33623/82005), 29.75 MiB | 29.74 MiB/s Receiving objects: 42% (34443/82005), 29.75 MiB | 29.74 MiB/s Receiving objects: 43% (35263/82005), 29.75 MiB | 29.74 MiB/s Receiving objects: 44% (36083/82005), 29.75 MiB | 29.74 MiB/s Receiving objects: 45% (36903/82005), 29.75 MiB | 29.74 MiB/s Receiving objects: 46% (37723/82005), 29.75 MiB | 29.74 MiB/s Receiving objects: 47% (38543/82005), 29.75 MiB | 29.74 MiB/s Receiving objects: 48% (39363/82005), 44.77 MiB | 29.31 MiB/s Receiving objects: 49% (40183/82005), 44.77 MiB | 29.31 MiB/s Receiving objects: 50% (41003/82005), 44.77 MiB | 29.31 MiB/s Receiving objects: 51% (41823/82005), 44.77 MiB | 29.31 MiB/s Receiving objects: 52% (42643/82005), 44.77 MiB | 29.31 MiB/s Receiving objects: 53% (43463/82005), 44.77 MiB | 29.31 MiB/s Receiving objects: 54% (44283/82005), 44.77 MiB | 29.31 MiB/s Receiving objects: 55% (45103/82005), 44.77 MiB | 29.31 MiB/s Receiving objects: 56% (45923/82005), 44.77 MiB | 29.31 MiB/s Receiving objects: 56% (46354/82005), 44.77 MiB | 29.31 MiB/s Receiving objects: 57% (46743/82005), 57.88 MiB | 28.54 MiB/s Receiving objects: 58% (47563/82005), 57.88 MiB | 28.54 MiB/s Receiving objects: 59% (48383/82005), 57.88 MiB | 28.54 MiB/s Receiving objects: 60% (49203/82005), 57.88 MiB | 28.54 MiB/s Receiving objects: 61% (50024/82005), 57.88 MiB | 28.54 MiB/s Receiving objects: 62% (50844/82005), 57.88 MiB | 28.54 MiB/s Receiving objects: 63% (51664/82005), 73.53 MiB | 29.09 MiB/s Receiving objects: 64% (52484/82005), 73.53 MiB | 29.09 MiB/s Receiving objects: 65% (53304/82005), 73.53 MiB | 29.09 MiB/s Receiving objects: 66% (54124/82005), 73.53 MiB | 29.09 MiB/s Receiving objects: 67% (54944/82005), 73.53 MiB | 29.09 MiB/s Receiving objects: 68% (55764/82005), 73.53 MiB | 29.09 MiB/s Receiving objects: 69% (56584/82005), 73.53 MiB | 29.09 MiB/s Receiving objects: 70% (57404/82005), 73.53 MiB | 29.09 MiB/s Receiving objects: 71% (58224/82005), 73.53 MiB | 29.09 MiB/s Receiving objects: 71% (58856/82005), 73.53 MiB | 29.09 MiB/s Receiving objects: 72% (59044/82005), 73.53 MiB | 29.09 MiB/s Receiving objects: 73% (59864/82005), 73.53 MiB | 29.09 MiB/s Receiving objects: 74% (60684/82005), 89.36 MiB | 29.51 MiB/s Receiving objects: 75% (61504/82005), 89.36 MiB | 29.51 MiB/s Receiving objects: 76% (62324/82005), 89.36 MiB | 29.51 MiB/s Receiving objects: 77% (63144/82005), 89.36 MiB | 29.51 MiB/s Receiving objects: 78% (63964/82005), 105.73 MiB | 29.64 MiB/s Receiving objects: 79% (64784/82005), 105.73 MiB | 29.64 MiB/s Receiving objects: 80% (65604/82005), 105.73 MiB | 29.64 MiB/s Receiving objects: 81% (66425/82005), 105.73 MiB | 29.64 MiB/s Receiving objects: 82% (67245/82005), 105.73 MiB | 29.64 MiB/s Receiving objects: 83% (68065/82005), 105.73 MiB | 29.64 MiB/s Receiving objects: 84% (68885/82005), 105.73 MiB | 29.64 MiB/s Receiving objects: 85% (69705/82005), 105.73 MiB | 29.64 MiB/s Receiving objects: 86% (70525/82005), 105.73 MiB | 29.64 MiB/s Receiving objects: 87% (71345/82005), 105.73 MiB | 29.64 MiB/s Receiving objects: 88% (72165/82005), 105.73 MiB | 29.64 MiB/s Receiving objects: 88% (72964/82005), 105.73 MiB | 29.64 MiB/s Receiving objects: 89% (72985/82005), 105.73 MiB | 29.64 MiB/s Receiving objects: 90% (73805/82005), 122.21 MiB | 29.94 MiB/s Receiving objects: 91% (74625/82005), 122.21 MiB | 29.94 MiB/s Receiving objects: 92% (75445/82005), 122.21 MiB | 29.94 MiB/s Receiving objects: 93% (76265/82005), 122.21 MiB | 29.94 MiB/s Receiving objects: 94% (77085/82005), 122.21 MiB | 29.94 MiB/s Receiving objects: 95% (77905/82005), 122.21 MiB | 29.94 MiB/s Receiving objects: 96% (78725/82005), 122.21 MiB | 29.94 MiB/s Receiving objects: 97% (79545/82005), 122.21 MiB | 29.94 MiB/s Receiving objects: 98% (80365/82005), 122.21 MiB | 29.94 MiB/s Receiving objects: 99% (81185/82005), 122.21 MiB | 29.94 MiB/s remote: Total 82005 (delta 7170), reused 6608 (delta 6608), pack-reused 73845 (from 3)
  7. 7.27 s Receiving objects: 100% (82005/82005), 122.21 MiB | 29.94 MiB/s Receiving objects: 100% (82005/82005), 127.98 MiB | 30.17 MiB/s, done.
  8. 8.50 s Resolving deltas: 0% (0/55486) Resolving deltas: 1% (555/55486) Resolving deltas: 2% (1110/55486) Resolving deltas: 3% (1665/55486) Resolving deltas: 4% (2220/55486) Resolving deltas: 5% (2775/55486) Resolving deltas: 6% (3330/55486) Resolving deltas: 7% (3885/55486) Resolving deltas: 8% (4439/55486) Resolving deltas: 9% (4994/55486) Resolving deltas: 10% (5550/55486) Resolving deltas: 11% (6104/55486) Resolving deltas: 12% (6659/55486) Resolving deltas: 13% (7214/55486) Resolving deltas: 14% (7769/55486) Resolving deltas: 15% (8323/55486) Resolving deltas: 16% (8878/55486) Resolving deltas: 17% (9433/55486) Resolving deltas: 18% (9988/55486) Resolving deltas: 19% (10545/55486) Resolving deltas: 20% (11098/55486) Resolving deltas: 21% (11653/55486) Resolving deltas: 22% (12207/55486) Resolving deltas: 23% (12762/55486) Resolving deltas: 24% (13318/55486) Resolving deltas: 25% (13872/55486) Resolving deltas: 26% (14427/55486) Resolving deltas: 27% (14982/55486) Resolving deltas: 28% (15537/55486) Resolving deltas: 29% (16091/55486) Resolving deltas: 30% (16648/55486) Resolving deltas: 31% (17201/55486) Resolving deltas: 32% (17756/55486) Resolving deltas: 33% (18311/55486) Resolving deltas: 34% (18866/55486) Resolving deltas: 35% (19421/55486) Resolving deltas: 36% (19975/55486) Resolving deltas: 37% (20530/55486) Resolving deltas: 38% (21085/55486) Resolving deltas: 39% (21642/55486) Resolving deltas: 40% (22195/55486) Resolving deltas: 41% (22751/55486) Resolving deltas: 42% (23305/55486) Resolving deltas: 43% (23862/55486) Resolving deltas: 44% (24414/55486) Resolving deltas: 45% (24969/55486) Resolving deltas: 46% (25524/55486) Resolving deltas: 47% (26079/55486) Resolving deltas: 48% (26634/55486) Resolving deltas: 49% (27189/55486) Resolving deltas: 50% (27744/55486) Resolving deltas: 51% (28298/55486) Resolving deltas: 52% (28853/55486) Resolving deltas: 53% (29408/55486) Resolving deltas: 54% (29963/55486) Resolving deltas: 55% (30518/55486) Resolving deltas: 56% (31073/55486) Resolving deltas: 57% (31628/55486) Resolving deltas: 58% (32183/55486) Resolving deltas: 59% (32738/55486) Resolving deltas: 60% (33292/55486) Resolving deltas: 61% (33847/55486) Resolving deltas: 62% (34402/55486) Resolving deltas: 63% (34957/55486) Resolving deltas: 64% (35512/55486) Resolving deltas: 65% (36066/55486) Resolving deltas: 66% (36624/55486) Resolving deltas: 67% (37176/55486) Resolving deltas: 68% (37731/55486) Resolving deltas: 69% (38286/55486) Resolving deltas: 70% (38841/55486) Resolving deltas: 71% (39396/55486) Resolving deltas: 72% (39950/55486) Resolving deltas: 73% (40505/55486) Resolving deltas: 74% (41060/55486) Resolving deltas: 75% (41615/55486) Resolving deltas: 76% (42170/55486) Resolving deltas: 77% (42725/55486) Resolving deltas: 78% (43282/55486) Resolving deltas: 79% (43834/55486) Resolving deltas: 80% (44389/55486) Resolving deltas: 80% (44613/55486) Resolving deltas: 81% (44944/55486) Resolving deltas: 82% (45499/55486) Resolving deltas: 83% (46054/55486) Resolving deltas: 84% (46613/55486) Resolving deltas: 85% (47164/55486) Resolving deltas: 86% (47719/55486) Resolving deltas: 87% (48273/55486) Resolving deltas: 88% (48828/55486) Resolving deltas: 89% (49383/55486) Resolving deltas: 90% (49938/55486) Resolving deltas: 91% (50494/55486) Resolving deltas: 92% (51048/55486) Resolving deltas: 93% (51602/55486) Resolving deltas: 94% (52157/55486) Resolving deltas: 95% (52715/55486) Resolving deltas: 96% (53268/55486) Resolving deltas: 97% (53823/55486) Resolving deltas: 98% (54378/55486) Resolving deltas: 99% (54932/55486) Resolving deltas: 100% (55486/55486) Resolving deltas: 100% (55486/55486), done.
  9. 9.04 s Fetching commit 3ac50f3815c6073e4c79182c5d6ad6bb9b59126b for wip/native-symbolica-hyperbolics ...
  10. 9.04 s $ /nix/store/bcnisk3ydfgv26v2gw3zlky24g00yww2-git-2.54.0/bin/git fetch origin 3ac50f3815c6073e4c79182c5d6ad6bb9b59126b
  11. 9.49 s From https://github.com/alphal00p/gammaloop
  12. 9.49 s * branch 3ac50f3815c6073e4c79182c5d6ad6bb9b59126b -> FETCH_HEAD
  13. 9.50 s $ /nix/store/9ypz3flqsrl5xl495mm8h645gadjsxi1-coreutils-9.11/bin/timeout --kill-after=15s 7200s /nix/store/bcnisk3ydfgv26v2gw3zlky24g00yww2-git-2.54.0/bin/git -c advice.detachedHead=false checkout 3ac50f3815c6073e4c79182c5d6ad6bb9b59126b
  14. 9.74 s HEAD is now at 3ac50f381 Adjust CFF test tolerances and comments
  15. 9.75 s $ /nix/store/9ypz3flqsrl5xl495mm8h645gadjsxi1-coreutils-9.11/bin/timeout --kill-after=15s 7200s /nix/store/23zk8sgzamrbmj1fday15szf7f2279s8-nix-2.34.7/bin/nix --extra-experimental-features nix-command --extra-experimental-features flakes --log-format internal-json run .#packages.x86_64-linux.nix-ci-check-gammaloop-nextest-integration --print-build-logs
  16. 17.08 s
  17. 24.04 s evaluating derivation 'g copying '/nix/store/6cs6 evaluating derivation 'g copying '/nix/store/6cs6 evaluating derivation 'g copying '/nix/store/6cs6 evaluating derivation 'g copying '/nix/store/6cs6 evaluating derivation 'g copying '/nix/store/6cs6 evaluating derivation 'g copying '/nix/store/6cs6 evaluating derivation 'g copying '/nix/store/6cs6 evaluating derivation 'g querying gammaloop-nexte [0.0 KiB DL] querying ne [0/5 built, 0.6 KiB DL] [0/2 built, 1/0/1 copied [0/1 built, 1 copied (4. [1/0/1 built, 1 copied (gammaloop-nextest-integration> Extracting 9 binaries, 1 build script output directory, and 3 linked paths to /build/nextest-archive-4X9ZxZ
  18. 25.72 s gammaloop-nextest-integration> Extracted 26 files to /build/nextest-archive-4X9ZxZ in 1.69s
  19. 25.74 s gammaloop-nextest-integration> ------------
  20. 25.74 s gammaloop-nextest-integration> Nextest run ID 6663b554-7357-43d5-ab07-747cba6b8725 with nextest profile: ci_gammaloop
  21. 25.74 s gammaloop-nextest-integration> Starting 107 tests across 9 binaries (68 tests skipped via profile.ci_gammaloop.default-filter)
  22. 53.58 s gammaloop-nextest-integration> FAIL [ 4.679s] ( 94/107) gammaloop-integration-tests::uv thermal_sunrise_uv
  23. 53.58 s gammaloop-nextest-integration> stdout ---
  24. 53.58 s gammaloop-nextest-integration>
  25. 53.58 s gammaloop-nextest-integration> running 1 test
  26. 53.58 s gammaloop-nextest-integration> test thermal_sunrise_uv ... FAILED
  27. 53.58 s gammaloop-nextest-integration>
  28. 53.58 s gammaloop-nextest-integration> failures:
  29. 53.58 s gammaloop-nextest-integration>
  30. 53.58 s gammaloop-nextest-integration> failures:
  31. 53.58 s gammaloop-nextest-integration> thermal_sunrise_uv
  32. 53.58 s gammaloop-nextest-integration>
  33. 53.58 s gammaloop-nextest-integration> test result: FAILED. 0 passed; 1 failed; 0 ignored; 0 measured; 25 filtered out; finished in 4.66s
  34. 53.58 s gammaloop-nextest-integration>
  35. 53.58 s gammaloop-nextest-integration> stderr ---
  36. 53.58 s gammaloop-nextest-integration> [2026-09-09 23:13:23.768] @gammaloop_api::se... INFO : Running command run generate
  37. 53.58 s gammaloop-nextest-integration> [2026-09-09 23:13:23.768] @gammaloop_api::se... INFO : Starting command block generate
  38. 53.58 s gammaloop-nextest-integration> [2026-09-09 23:13:23.768] @gammaloop_api::se... INFO : Running command import model sm-default.json
  39. 53.58 s gammaloop-nextest-integration> [2026-09-09 23:13:23.768] @import::model INFO : Loading built-in JSON model sm-default
  40. 53.58 s gammaloop-nextest-integration> [2026-09-09 23:13:23.813] @gammalooprs::model INFO : The following 15 external parameters were forced to zero by the restriction card:
  41. 53.58 s gammaloop-nextest-integration> lamWS, AWS, rhoWS, etaWS, ymc, yme, ymm, MC, Me, MM, WTau, muQ, muLe, muLmu, muLtau
  42. 53.58 s gammaloop-nextest-integration> [2026-09-09 23:13:23.814] @gammalooprs::model INFO : The following 34 vertex rules were removed by the restriction card:
  43. 53.58 s gammaloop-nextest-integration> V_82 -> (c~, d, G+) | V_83 -> (t~, d, G+) | V_84 -> (c~, s, G+) | V_85 -> (t~, s, G+) | V_86 -> (u~, b, G+) | V_87 -> (c~, b, G+) | V_90 -> (c~, d, W+) | V_91 -> (t~, d, W+) | V_92 -> (u~, s, W+) | V_94 -> (t~, s, W+) | V_95 -> (u~, b, W+) | V_96 -> (c~, b, W+) | V_101 -> (e+, e-, G0) | V_102 -> (mu+, mu-, G0) | V_104 -> (e+, e-, H) | V_105 -> (mu+, mu-, H) | V_110 -> (ve~, e-, G+) | V_111 -> (vm~, mu-, G+) | V_116 -> (b~, u, G-) | V_117 -> (d~, c, G-) | V_118 -> (s~, c, G-) | V_119 -> (b~, c, G-) | V_120 -> (d~, t, G-) | V_121 -> (s~, t, G-) | V_124 -> (s~, u, W-) | V_125 -> (b~, u, W-) | V_126 -> (d~, c, W-) | V_128 -> (b~, c, W-) | V_129 -> (d~, t, W-) | V_130 -> (s~, t, W-) | V_138 -> (c~, c, G0) | V_140 -> (c~, c, H) | V_145 -> (e+, ve, G-) | V_146 -> (mu+, vm, G-)
  44. 53.58 s gammaloop-nextest-integration> [2026-09-09 23:13:23.814] @gammalooprs::model INFO : The following 36 couplings were removed by the restriction card:
  45. 53.58 s gammaloop-nextest-integration> GC_13, GC_14, GC_16, GC_17, GC_18, GC_19, GC_20, GC_22, GC_23, GC_24, GC_25, GC_26, GC_28, GC_29, GC_42, GC_43, GC_44, GC_46, GC_47, GC_48, GC_84, GC_85, GC_86, GC_87, GC_88, GC_89, GC_90, GC_91, GC_92, GC_93, GC_101, GC_102, GC_103, GC_105, GC_106, GC_107
  46. 53.58 s gammaloop-nextest-integration> [2026-09-09 23:13:23.814] @gammaloop_api::se... INFO : Running command remove processes
  47. 53.58 s gammaloop-nextest-integration> [2026-09-09 23:13:23.815] @gammaloop_api::se... INFO : Running command generate amp {} > {} [{2}] | g u
  48. 53.58 s gammaloop-nextest-integration> --numerator-grouping group_identical_graphs_up_to_scalar_rescaling
  49. 53.58 s gammaloop-nextest-integration> --max-n-bridges 0
  50. 53.58 s gammaloop-nextest-integration> --number-of-factorized-loop-subtopologies 1 1
  51. 53.58 s gammaloop-nextest-integration> --number-of-fermion-loops 1 1
  52. 53.58 s gammaloop-nextest-integration> [...]
  53. 53.58 s gammaloop-nextest-integration> [2026-09-09 23:13:23.816] @feyngen::diagram_... INFO : 0s | Δ=0s | Starting Feynman graph generation with Symbolica...
  54. 53.58 s gammaloop-nextest-integration> [2026-09-09 23:13:23.816] @feyngen::diagram_... INFO : 0s | Δ=0s | Number of graphs resulting from Symbolica generation: 3
  55. 53.58 s gammaloop-nextest-integration> [2026-09-09 23:13:23.817] @feyngen::diagram_... INFO : 0s | Δ=0s | Number of graphs retained after removal of vetoed topologies: 2
  56. 53.58 s gammaloop-nextest-integration> [2026-09-09 23:13:23.817] @feyngen::diagram_... INFO : 0s | Δ=0s | Number of graphs after vertex info assignment: 2
  57. 53.58 s gammaloop-nextest-integration> [2026-09-09 23:13:23.817] @feyngen::diagram_... INFO : 0s | Δ=0s | Number of graphs after all complete graphs filters are applied: 2
  58. 53.58 s gammaloop-nextest-integration> [2026-09-09 23:13:23.817] @feyngen::diagram_... INFO : 0s | Δ=0s | Number of graphs after closed fermion chains analysis: 1
  59. 53.58 s gammaloop-nextest-integration> [2026-09-09 23:13:23.817] @feyngen::diagram_... INFO : 0s | Δ=0s | Number of graphs after symmetrization of external states: 1
  60. 53.58 s gammaloop-nextest-integration> [2026-09-09 23:13:23.817] @feyngen::diagram_... INFO : 0s | Δ=0s | Number of graphs after canonization of vertices, edges and flows (graph labels assigned here): 1
  61. 53.58 s gammaloop-nextest-integration> [2026-09-09 23:13:23.841] @feyngen::diagram_... INFO : 0s | Δ=0s | Number of graphs after numerator-aware grouping with strategy 'up to a scalar rescaling': 1 (1 isomorphically unique graph, 0 color zero, 0 lorentz zero, 0 grouped and 0 cancellation)
  62. 53.58 s gammaloop-nextest-integration> [2026-09-09 23:13:23.841] @feyngen::diagram_... INFO : ( Sum of the symmetry factors from each graph generated = -1/2 )
  63. 53.58 s gammaloop-nextest-integration> [2026-09-09 23:13:23.841] @commands::generate INFO : Generated amplitude 1 graphs.
  64. 53.58 s gammaloop-nextest-integration> [2026-09-09 23:13:23.841] @commands::generate INFO : Only diagram generation was requested, skipping integrand generation. You can generate integrands later using the 'generate existing <options>' command.
  65. 53.59 s gammaloop-nextest-integration> [2026-09-09 23:13:23.842] @gammaloop_api::se... INFO : Running command generate
  66. 53.59 s gammaloop-nextest-integration> The application panicked (crashed).
  67. 53.59 s gammaloop-nextest-integration> Message: called `Result::unwrap()` on an `Err` value: variable __Static610 not found
  68. 53.59 s gammaloop-nextest-integration>
  69. 53.59 s gammaloop-nextest-integration> Stack backtrace:
  70. 53.59 s gammaloop-nextest-integration> 0: <anyhow::Error>::msg::<alloc::string::String>
  71. 53.59 s gammaloop-nextest-integration> 1: <symjit::symjit::compiler::IndirectTranslator as symjit::symjit::composer::Composer>::compile
  72. 53.59 s gammaloop-nextest-integration> 2: <symjit::symjit::compiler::Translator as symjit::symjit::composer::Composer>::compile
  73. 53.59 s gammaloop-nextest-integration> 3: <numerica::domains::float::complex::Complex<f64> as symbolica::evaluate::backend::JITCompiledNumber>::jit_compile
  74. 53.59 s gammaloop-nextest-integration> 4: <gammalooprs::integrands::process::evaluators::GenericEvaluator>::activate_symjit
  75. 53.59 s gammaloop-nextest-integration> 5: <gammalooprs::integrands::process::amplitude::AmplitudeIntegrand>::prepare_runtime_backends_after_generation_with_compile_times
  76. 53.59 s gammaloop-nextest-integration> 6: <gammalooprs::processes::amplitude::Amplitude>::build_integrand
  77. 53.59 s gammaloop-nextest-integration> 7: <gammalooprs::processes::process::Process>::generate_integrands
  78. 53.59 s gammaloop-nextest-integration> 8: <gammalooprs::processes::ProcessList>::generate_integrands
  79. 53.59 s gammaloop-nextest-integration> 9: <gammaloop_api::state::State>::generate_integrands
  80. 53.59 s gammaloop-nextest-integration> 10: <gammaloop_api::commands::generate::Generate>::run::<&std::path::PathBuf>
  81. 53.59 s gammaloop-nextest-integration> 11: <gammaloop_api::commands::Commands>::run
  82. 53.59 s gammaloop-nextest-integration> 12: <gammaloop_api::session::CliSession>::execute_prepared
  83. 53.59 s gammaloop-nextest-integration> 13: <gammaloop_api::session::CliSession>::execute_prepared_commands
  84. 53.59 s gammaloop-nextest-integration> 14: <gammaloop_api::session::CliSession>::execute_prepared
  85. 53.59 s gammaloop-nextest-integration> 15: <gammaloop_api::session::CliSession>::execute_command
  86. 53.59 s gammaloop-nextest-integration> 16: <gammaloop_integration_tests::CLIState>::run_command_flow
  87. 53.59 s gammaloop-nextest-integration> 17: <gammaloop_integration_tests::CLIState>::run_command
  88. 53.59 s gammaloop-nextest-integration> 18: uv::run_single_integrated_uv_case
  89. 53.59 s gammaloop-nextest-integration> 19: <uv::thermal_sunrise_uv::{closure#0} as core::ops::function::FnOnce<()>>::call_once
  90. 53.59 s gammaloop-nextest-integration> 20: test::__rust_begin_short_backtrace::<core::result::Result<(), alloc::string::String>, fn() -> core::result::Result<(), alloc::string::String>>
  91. 53.59 s gammaloop-nextest-integration> 21: test::run_test::{closure#0}
  92. 53.59 s gammaloop-nextest-integration> 22: std::sys::backtrace::__rust_begin_short_backtrace::<test::run_test::{closure#1}, ()>
  93. 53.59 s gammaloop-nextest-integration> 23: <std::thread::lifecycle::spawn_unchecked<test::run_test::{closure#1}, ()>::{closure#1} as core::ops::function::FnOnce<()>>::call_once::{shim:vtable#0}
  94. 53.59 s gammaloop-nextest-integration> 24: <std::sys::thread::unix::Thread>::new::thread_start
  95. 53.59 s gammaloop-nextest-integration> 25: start_thread
  96. 53.59 s gammaloop-nextest-integration> 26: __clone3
  97. 53.59 s gammaloop-nextest-integration> Location: /nix/store/l5xazfnr7k6r6p8mlkn38x2afab0rygz-vendor-cargo-deps/c19b7c6f923b580ac259164a89f2577984ad5ab09ee9d583b888f934adbbe8d0/symjit-2.25.0/src/symjit/compiler.rs:883
  98. 53.59 s gammaloop-nextest-integration>
  99. 53.59 s gammaloop-nextest-integration> ━━━━━━━━━━━━━━━━━━━━━━━━━━━━━━━━━━ BACKTRACE ━━━━━━━━━━━━━━━━━━━━━━━━━━━━━━━━━━━
  100. 53.59 s gammaloop-nextest-integration> 1: <color_eyre[51793ea62743adbd]::config::PanicHook>::panic_report<unknown>
  101. 53.59 s gammaloop-nextest-integration> at <unknown source file>:<unknown line>
  102. 53.59 s gammaloop-nextest-integration> 2: <color_eyre[51793ea62743adbd]::config::PanicHook>::into_panic_hook::{closure#0}<unknown>
  103. 53.59 s gammaloop-nextest-integration> at <unknown source file>:<unknown line>
  104. 53.59 s gammaloop-nextest-integration> 3: std[bcb96dfbba0ab899]::panicking::panic_with_hook<unknown>
  105. 53.59 s gammaloop-nextest-integration> at <unknown source file>:<unknown line>
  106. 53.59 s gammaloop-nextest-integration> 4: std[bcb96dfbba0ab899]::panicking::panic_handler::{closure#0}<unknown>
  107. 53.59 s gammaloop-nextest-integration> at <unknown source file>:<unknown line>
  108. 53.59 s gammaloop-nextest-integration> 5: std[bcb96dfbba0ab899]::sys::backtrace::__rust_end_short_backtrace::<std[bcb96dfbba0ab899]::panicking::panic_handler::{closure#0}, !><unknown>
  109. 53.59 s gammaloop-nextest-integration> at <unknown source file>:<unknown line>
  110. 53.59 s gammaloop-nextest-integration> 6: __rustc[6c289b9f9c454d21]::rust_begin_unwind<unknown>
  111. 53.59 s gammaloop-nextest-integration> at <unknown source file>:<unknown line>
  112. 53.59 s gammaloop-nextest-integration> 7: core[940e698046960fd5]::panicking::panic_fmt<unknown>
  113. 53.59 s gammaloop-nextest-integration> at <unknown source file>:<unknown line>
  114. 53.59 s gammaloop-nextest-integration> 8: core[940e698046960fd5]::result::unwrap_failed<unknown>
  115. 53.59 s gammaloop-nextest-integration> at <unknown source file>:<unknown line>
  116. 53.59 s gammaloop-nextest-integration> 9: <symjit[9dfb3c17cbb79ae4]::symjit::compiler::IndirectTranslator as symjit[9dfb3c17cbb79ae4]::symjit::composer::Composer>::compile<unknown>
  117. 53.59 s gammaloop-nextest-integration> at <unknown source file>:<unknown line>
  118. 53.59 s gammaloop-nextest-integration> 10: <symjit[9dfb3c17cbb79ae4]::symjit::compiler::Translator as symjit[9dfb3c17cbb79ae4]::symjit::composer::Composer>::compile<unknown>
  119. 53.59 s gammaloop-nextest-integration> at <unknown source file>:<unknown line>
  120. 53.59 s gammaloop-nextest-integration> 11: <numerica[ca5044e7d57d1d48]::domains::float::complex::Complex<f64> as symbolica[911a260017ea9deb]::evaluate::backend::JITCompiledNumber>::jit_compile<unknown>
  121. 53.59 s gammaloop-nextest-integration> at <unknown source file>:<unknown line>
  122. 53.59 s gammaloop-nextest-integration> 12: <gammalooprs[61738dd440287478]::integrands::process::evaluators::GenericEvaluator>::activate_symjit<unknown>
  123. 53.59 s gammaloop-nextest-integration> at <unknown source file>:<unknown line>
  124. 53.59 s gammaloop-nextest-integration> 13: <gammalooprs[61738dd440287478]::integrands::process::amplitude::AmplitudeIntegrand>::prepare_runtime_backends_after_generation_with_compile_times<unknown>
  125. 53.59 s gammaloop-nextest-integration> at <unknown source file>:<unknown line>
  126. 53.59 s gammaloop-nextest-integration> 14: <gammalooprs[61738dd440287478]::processes::amplitude::Amplitude>::build_integrand<unknown>
  127. 53.59 s gammaloop-nextest-integration> at <unknown source file>:<unknown line>
  128. 53.59 s gammaloop-nextest-integration> 15: <gammalooprs[61738dd440287478]::processes::process::Process>::generate_integrands<unknown>
  129. 53.59 s gammaloop-nextest-integration> at <unknown source file>:<unknown line>
  130. 53.59 s gammaloop-nextest-integration> 16: <gammalooprs[61738dd440287478]::processes::ProcessList>::generate_integrands<unknown>
  131. 53.59 s gammaloop-nextest-integration> at <unknown source file>:<unknown line>
  132. 53.59 s gammaloop-nextest-integration> 17: <gammaloop_api[781ec552bb626e12]::state::State>::generate_integrands<unknown>
  133. 53.59 s gammaloop-nextest-integration> at <unknown source file>:<unknown line>
  134. 53.59 s gammaloop-nextest-integration> 18: <gammaloop_api[781ec552bb626e12]::commands::generate::Generate>::run::<&std[bcb96dfbba0ab899]::path::PathBuf><unknown>
  135. 53.59 s gammaloop-nextest-integration> at <unknown source file>:<unknown line>
  136. 53.59 s gammaloop-nextest-integration> 19: <gammaloop_api[781ec552bb626e12]::commands::Commands>::run<unknown>
  137. 53.59 s gammaloop-nextest-integration> at <unknown source file>:<unknown line>
  138. 53.59 s gammaloop-nextest-integration> 20: <gammaloop_api[781ec552bb626e12]::session::CliSession>::execute_prepared<unknown>
  139. 53.59 s gammaloop-nextest-integration> at <unknown source file>:<unknown line>
  140. 53.59 s gammaloop-nextest-integration> 21: <gammaloop_api[781ec552bb626e12]::session::CliSession>::execute_prepared_commands<unknown>
  141. 53.59 s gammaloop-nextest-integration> at <unknown source file>:<unknown line>
  142. 53.59 s gammaloop-nextest-integration> 22: <gammaloop_api[781ec552bb626e12]::session::CliSession>::execute_prepared<unknown>
  143. 53.59 s gammaloop-nextest-integration> at <unknown source file>:<unknown line>
  144. 53.59 s gammaloop-nextest-integration> 23: <gammaloop_api[781ec552bb626e12]::session::CliSession>::execute_command<unknown>
  145. 53.59 s gammaloop-nextest-integration> at <unknown source file>:<unknown line>
  146. 53.59 s gammaloop-nextest-integration> 24: <gammaloop_integration_tests[3349793260628f2c]::CLIState>::run_command_flow<unknown>
  147. 53.59 s gammaloop-nextest-integration> at <unknown source file>:<unknown line>
  148. 53.59 s gammaloop-nextest-integration> 25: <gammaloop_integration_tests[3349793260628f2c]::CLIState>::run_command<unknown>
  149. 53.59 s gammaloop-nextest-integration> at <unknown source file>:<unknown line>
  150. 53.59 s gammaloop-nextest-integration> 26: uv[4a8ff97c1fe5666b]::run_single_integrated_uv_case<unknown>
  151. 53.59 s gammaloop-nextest-integration> at <unknown source file>:<unknown line>
  152. 53.59 s gammaloop-nextest-integration> 27: <uv[4a8ff97c1fe5666b]::thermal_sunrise_uv::{closure#0} as core[940e698046960fd5]::ops::function::FnOnce<()>>::call_once<unknown>
  153. 53.59 s gammaloop-nextest-integration> at <unknown source file>:<unknown line>
  154. 53.59 s gammaloop-nextest-integration> 28: test[75d6903177b1d7e9]::__rust_begin_short_backtrace::<core[940e698046960fd5]::result::Result<(), alloc[2ea6bcb46fca0c42]::string::String>, fn() -> core[940e698046960fd5]::result::Result<(), alloc[2ea6bcb46fca0c42]::string::String>><unknown>
  155. 53.59 s gammaloop-nextest-integration> at <unknown source file>:<unknown line>
  156. 53.59 s gammaloop-nextest-integration> 29: test[75d6903177b1d7e9]::run_test::{closure#0}<unknown>
  157. 53.59 s gammaloop-nextest-integration> at <unknown source file>:<unknown line>
  158. 53.59 s gammaloop-nextest-integration> 30: std[bcb96dfbba0ab899]::sys::backtrace::__rust_begin_short_backtrace::<test[75d6903177b1d7e9]::run_test::{closure#1}, ()><unknown>
  159. 53.59 s gammaloop-nextest-integration> at <unknown source file>:<unknown line>
  160. 53.59 s gammaloop-nextest-integration> 31: <std[bcb96dfbba0ab899]::thread::lifecycle::spawn_unchecked<test[75d6903177b1d7e9]::run_test::{closure#1}, ()>::{closure#1} as core[940e698046960fd5]::ops::function::FnOnce<()>>::call_once::{shim:vtable#0}<unknown>
  161. 53.59 s gammaloop-nextest-integration> at <unknown source file>:<unknown line>
  162. 53.59 s gammaloop-nextest-integration> 32: <std[bcb96dfbba0ab899]::sys::thread::unix::Thread>::new::thread_start<unknown>
  163. 53.59 s gammaloop-nextest-integration> at <unknown source file>:<unknown line>
  164. 53.59 s gammaloop-nextest-integration> 33: start_thread<unknown>
  165. 53.59 s gammaloop-nextest-integration> at <unknown source file>:<unknown line>
  166. 53.59 s gammaloop-nextest-integration> 34: __clone3<unknown>
  167. 53.59 s gammaloop-nextest-integration> at <unknown source file>:<unknown line>
  168. 53.59 s gammaloop-nextest-integration>
  169. 53.59 s gammaloop-nextest-integration> Run with COLORBT_SHOW_HIDDEN=1 environment variable to disable frame filtering.
  170. 53.59 s gammaloop-nextest-integration> Run with RUST_BACKTRACE=full to include source snippets.
  171. 53.59 s gammaloop-nextest-integration> Warning: SpanTrace capture is Unsupported.
  172. 53.59 s gammaloop-nextest-integration> Ensure that you've setup a tracing-error ErrorLayer and the semver versions are compatible
  173. 53.59 s gammaloop-nextest-integration>
  174. 198.60 s gammaloop-nextest-integration> ------------
  175. 198.60 s gammaloop-nextest-integration> Summary [ 172.861s] 107 tests run: 106 passed (2 slow), 1 failed, 68 skipped
  176. 198.60 s gammaloop-nextest-integration> FAIL [ 4.679s] ( 94/107) gammaloop-integration-tests::uv thermal_sunrise_uv
  177. 198.60 s gammaloop-nextest-integration> stdout ---
  178. 198.60 s gammaloop-nextest-integration>
  179. 198.60 s gammaloop-nextest-integration> running 1 test
  180. 198.60 s gammaloop-nextest-integration> test thermal_sunrise_uv ... FAILED
  181. 198.60 s gammaloop-nextest-integration>
  182. 198.60 s gammaloop-nextest-integration> failures:
  183. 198.60 s gammaloop-nextest-integration>
  184. 198.60 s gammaloop-nextest-integration> failures:
  185. 198.60 s gammaloop-nextest-integration> thermal_sunrise_uv
  186. 198.60 s gammaloop-nextest-integration>
  187. 198.60 s gammaloop-nextest-integration> test result: FAILED. 0 passed; 1 failed; 0 ignored; 0 measured; 25 filtered out; finished in 4.66s
  188. 198.60 s gammaloop-nextest-integration>
  189. 198.60 s gammaloop-nextest-integration> stderr ---
  190. 198.60 s gammaloop-nextest-integration> [2026-09-09 23:13:23.768] @gammaloop_api::se... INFO : Running command run generate
  191. 198.60 s gammaloop-nextest-integration> [2026-09-09 23:13:23.768] @gammaloop_api::se... INFO : Starting command block generate
  192. 198.60 s gammaloop-nextest-integration> [2026-09-09 23:13:23.768] @gammaloop_api::se... INFO : Running command import model sm-default.json
  193. 198.60 s gammaloop-nextest-integration> [2026-09-09 23:13:23.768] @import::model INFO : Loading built-in JSON model sm-default
  194. 198.60 s gammaloop-nextest-integration> [2026-09-09 23:13:23.813] @gammalooprs::model INFO : The following 15 external parameters were forced to zero by the restriction card:
  195. 198.60 s gammaloop-nextest-integration> lamWS, AWS, rhoWS, etaWS, ymc, yme, ymm, MC, Me, MM, WTau, muQ, muLe, muLmu, muLtau
  196. 198.60 s gammaloop-nextest-integration> [2026-09-09 23:13:23.814] @gammalooprs::model INFO : The following 34 vertex rules were removed by the restriction card:
  197. 198.60 s gammaloop-nextest-integration> V_82 -> (c~, d, G+) | V_83 -> (t~, d, G+) | V_84 -> (c~, s, G+) | V_85 -> (t~, s, G+) | V_86 -> (u~, b, G+) | V_87 -> (c~, b, G+) | V_90 -> (c~, d, W+) | V_91 -> (t~, d, W+) | V_92 -> (u~, s, W+) | V_94 -> (t~, s, W+) | V_95 -> (u~, b, W+) | V_96 -> (c~, b, W+) | V_101 -> (e+, e-, G0) | V_102 -> (mu+, mu-, G0) | V_104 -> (e+, e-, H) | V_105 -> (mu+, mu-, H) | V_110 -> (ve~, e-, G+) | V_111 -> (vm~, mu-, G+) | V_116 -> (b~, u, G-) | V_117 -> (d~, c, G-) | V_118 -> (s~, c, G-) | V_119 -> (b~, c, G-) | V_120 -> (d~, t, G-) | V_121 -> (s~, t, G-) | V_124 -> (s~, u, W-) | V_125 -> (b~, u, W-) | V_126 -> (d~, c, W-) | V_128 -> (b~, c, W-) | V_129 -> (d~, t, W-) | V_130 -> (s~, t, W-) | V_138 -> (c~, c, G0) | V_140 -> (c~, c, H) | V_145 -> (e+, ve, G-) | V_146 -> (mu+, vm, G-)
  198. 198.60 s gammaloop-nextest-integration> [2026-09-09 23:13:23.814] @gammalooprs::model INFO : The following 36 couplings were removed by the restriction card:
  199. 198.60 s gammaloop-nextest-integration> GC_13, GC_14, GC_16, GC_17, GC_18, GC_19, GC_20, GC_22, GC_23, GC_24, GC_25, GC_26, GC_28, GC_29, GC_42, GC_43, GC_44, GC_46, GC_47, GC_48, GC_84, GC_85, GC_86, GC_87, GC_88, GC_89, GC_90, GC_91, GC_92, GC_93, GC_101, GC_102, GC_103, GC_105, GC_106, GC_107
  200. 198.60 s gammaloop-nextest-integration> [2026-09-09 23:13:23.814] @gammaloop_api::se... INFO : Running command remove processes
  201. 198.60 s gammaloop-nextest-integration> [2026-09-09 23:13:23.815] @gammaloop_api::se... INFO : Running command generate amp {} > {} [{2}] | g u
  202. 198.60 s gammaloop-nextest-integration> --numerator-grouping group_identical_graphs_up_to_scalar_rescaling
  203. 198.60 s gammaloop-nextest-integration> --max-n-bridges 0
  204. 198.60 s gammaloop-nextest-integration> --number-of-factorized-loop-subtopologies 1 1
  205. 198.60 s gammaloop-nextest-integration> --number-of-fermion-loops 1 1
  206. 198.60 s gammaloop-nextest-integration> [...]
  207. 198.60 s gammaloop-nextest-integration> [2026-09-09 23:13:23.816] @feyngen::diagram_... INFO : 0s | Δ=0s | Starting Feynman graph generation with Symbolica...
  208. 198.60 s gammaloop-nextest-integration> [2026-09-09 23:13:23.816] @feyngen::diagram_... INFO : 0s | Δ=0s | Number of graphs resulting from Symbolica generation: 3
  209. 198.60 s gammaloop-nextest-integration> [2026-09-09 23:13:23.817] @feyngen::diagram_... INFO : 0s | Δ=0s | Number of graphs retained after removal of vetoed topologies: 2
  210. 198.60 s gammaloop-nextest-integration> [2026-09-09 23:13:23.817] @feyngen::diagram_... INFO : 0s | Δ=0s | Number of graphs after vertex info assignment: 2
  211. 198.60 s gammaloop-nextest-integration> [2026-09-09 23:13:23.817] @feyngen::diagram_... INFO : 0s | Δ=0s | Number of graphs after all complete graphs filters are applied: 2
  212. 198.60 s gammaloop-nextest-integration> [2026-09-09 23:13:23.817] @feyngen::diagram_... INFO : 0s | Δ=0s | Number of graphs after closed fermion chains analysis: 1
  213. 198.60 s gammaloop-nextest-integration> [2026-09-09 23:13:23.817] @feyngen::diagram_... INFO : 0s | Δ=0s | Number of graphs after symmetrization of external states: 1
  214. 198.60 s gammaloop-nextest-integration> [2026-09-09 23:13:23.817] @feyngen::diagram_... INFO : 0s | Δ=0s | Number of graphs after canonization of vertices, edges and flows (graph labels assigned here): 1
  215. 198.60 s gammaloop-nextest-integration> [2026-09-09 23:13:23.841] @feyngen::diagram_... INFO : 0s | Δ=0s | Number of graphs after numerator-aware grouping with strategy 'up to a scalar rescaling': 1 (1 isomorphically unique graph, 0 color zero, 0 lorentz zero, 0 grouped and 0 cancellation)
  216. 198.60 s gammaloop-nextest-integration> [2026-09-09 23:13:23.841] @feyngen::diagram_... INFO : ( Sum of the symmetry factors from each graph generated = -1/2 )
  217. 198.60 s gammaloop-nextest-integration> [2026-09-09 23:13:23.841] @commands::generate INFO : Generated amplitude 1 graphs.
  218. 198.60 s gammaloop-nextest-integration> [2026-09-09 23:13:23.841] @commands::generate INFO : Only diagram generation was requested, skipping integrand generation. You can generate integrands later using the 'generate existing <options>' command.
  219. 198.60 s gammaloop-nextest-integration> [2026-09-09 23:13:23.842] @gammaloop_api::se... INFO : Running command generate
  220. 198.60 s gammaloop-nextest-integration> The application panicked (crashed).
  221. 198.60 s gammaloop-nextest-integration> Message: called `Result::unwrap()` on an `Err` value: variable __Static610 not found
  222. 198.60 s gammaloop-nextest-integration>
  223. 198.60 s gammaloop-nextest-integration> Stack backtrace:
  224. 198.60 s gammaloop-nextest-integration> 0: <anyhow::Error>::msg::<alloc::string::String>
  225. 198.60 s gammaloop-nextest-integration> 1: <symjit::symjit::compiler::IndirectTranslator as symjit::symjit::composer::Composer>::compile
  226. 198.60 s gammaloop-nextest-integration> 2: <symjit::symjit::compiler::Translator as symjit::symjit::composer::Composer>::compile
  227. 198.60 s gammaloop-nextest-integration> 3: <numerica::domains::float::complex::Complex<f64> as symbolica::evaluate::backend::JITCompiledNumber>::jit_compile
  228. 198.60 s gammaloop-nextest-integration> 4: <gammalooprs::integrands::process::evaluators::GenericEvaluator>::activate_symjit
  229. 198.60 s gammaloop-nextest-integration> 5: <gammalooprs::integrands::process::amplitude::AmplitudeIntegrand>::prepare_runtime_backends_after_generation_with_compile_times
  230. 198.60 s gammaloop-nextest-integration> 6: <gammalooprs::processes::amplitude::Amplitude>::build_integrand
  231. 198.60 s gammaloop-nextest-integration> 7: <gammalooprs::processes::process::Process>::generate_integrands
  232. 198.60 s gammaloop-nextest-integration> 8: <gammalooprs::processes::ProcessList>::generate_integrands
  233. 198.60 s gammaloop-nextest-integration> 9: <gammaloop_api::state::State>::generate_integrands
  234. 198.60 s gammaloop-nextest-integration> 10: <gammaloop_api::commands::generate::Generate>::run::<&std::path::PathBuf>
  235. 198.60 s gammaloop-nextest-integration> 11: <gammaloop_api::commands::Commands>::run
  236. 198.60 s gammaloop-nextest-integration> 12: <gammaloop_api::session::CliSession>::execute_prepared
  237. 198.60 s gammaloop-nextest-integration> 13: <gammaloop_api::session::CliSession>::execute_prepared_commands
  238. 198.60 s gammaloop-nextest-integration> 14: <gammaloop_api::session::CliSession>::execute_prepared
  239. 198.60 s gammaloop-nextest-integration> 15: <gammaloop_api::session::CliSession>::execute_command
  240. 198.60 s gammaloop-nextest-integration> 16: <gammaloop_integration_tests::CLIState>::run_command_flow
  241. 198.60 s gammaloop-nextest-integration> 17: <gammaloop_integration_tests::CLIState>::run_command
  242. 198.60 s gammaloop-nextest-integration> 18: uv::run_single_integrated_uv_case
  243. 198.60 s gammaloop-nextest-integration> 19: <uv::thermal_sunrise_uv::{closure#0} as core::ops::function::FnOnce<()>>::call_once
  244. 198.60 s gammaloop-nextest-integration> 20: test::__rust_begin_short_backtrace::<core::result::Result<(), alloc::string::String>, fn() -> core::result::Result<(), alloc::string::String>>
  245. 198.60 s gammaloop-nextest-integration> 21: test::run_test::{closure#0}
  246. 198.60 s gammaloop-nextest-integration> 22: std::sys::backtrace::__rust_begin_short_backtrace::<test::run_test::{closure#1}, ()>
  247. 198.60 s gammaloop-nextest-integration> 23: <std::thread::lifecycle::spawn_unchecked<test::run_test::{closure#1}, ()>::{closure#1} as core::ops::function::FnOnce<()>>::call_once::{shim:vtable#0}
  248. 198.60 s gammaloop-nextest-integration> 24: <std::sys::thread::unix::Thread>::new::thread_start
  249. 198.60 s gammaloop-nextest-integration> 25: start_thread
  250. 198.60 s gammaloop-nextest-integration> 26: __clone3
  251. 198.60 s gammaloop-nextest-integration> Location: /nix/store/l5xazfnr7k6r6p8mlkn38x2afab0rygz-vendor-cargo-deps/c19b7c6f923b580ac259164a89f2577984ad5ab09ee9d583b888f934adbbe8d0/symjit-2.25.0/src/symjit/compiler.rs:883
  252. 198.60 s gammaloop-nextest-integration>
  253. 198.60 s gammaloop-nextest-integration> ━━━━━━━━━━━━━━━━━━━━━━━━━━━━━━━━━━ BACKTRACE ━━━━━━━━━━━━━━━━━━━━━━━━━━━━━━━━━━━
  254. 198.60 s gammaloop-nextest-integration> 1: <color_eyre[51793ea62743adbd]::config::PanicHook>::panic_report<unknown>
  255. 198.60 s gammaloop-nextest-integration> at <unknown source file>:<unknown line>
  256. 198.60 s gammaloop-nextest-integration> 2: <color_eyre[51793ea62743adbd]::config::PanicHook>::into_panic_hook::{closure#0}<unknown>
  257. 198.60 s gammaloop-nextest-integration> at <unknown source file>:<unknown line>
  258. 198.60 s gammaloop-nextest-integration> 3: std[bcb96dfbba0ab899]::panicking::panic_with_hook<unknown>
  259. 198.60 s gammaloop-nextest-integration> at <unknown source file>:<unknown line>
  260. 198.60 s gammaloop-nextest-integration> 4: std[bcb96dfbba0ab899]::panicking::panic_handler::{closure#0}<unknown>
  261. 198.60 s gammaloop-nextest-integration> at <unknown source file>:<unknown line>
  262. 198.60 s gammaloop-nextest-integration> 5: std[bcb96dfbba0ab899]::sys::backtrace::__rust_end_short_backtrace::<std[bcb96dfbba0ab899]::panicking::panic_handler::{closure#0}, !><unknown>
  263. 198.60 s gammaloop-nextest-integration> at <unknown source file>:<unknown line>
  264. 198.60 s gammaloop-nextest-integration> 6: __rustc[6c289b9f9c454d21]::rust_begin_unwind<unknown>
  265. 198.60 s gammaloop-nextest-integration> at <unknown source file>:<unknown line>
  266. 198.60 s gammaloop-nextest-integration> 7: core[940e698046960fd5]::panicking::panic_fmt<unknown>
  267. 198.60 s gammaloop-nextest-integration> at <unknown source file>:<unknown line>
  268. 198.60 s gammaloop-nextest-integration> 8: core[940e698046960fd5]::result::unwrap_failed<unknown>
  269. 198.60 s gammaloop-nextest-integration> at <unknown source file>:<unknown line>
  270. 198.60 s gammaloop-nextest-integration> 9: <symjit[9dfb3c17cbb79ae4]::symjit::compiler::IndirectTranslator as symjit[9dfb3c17cbb79ae4]::symjit::composer::Composer>::compile<unknown>
  271. 198.60 s gammaloop-nextest-integration> at <unknown source file>:<unknown line>
  272. 198.60 s gammaloop-nextest-integration> 10: <symjit[9dfb3c17cbb79ae4]::symjit::compiler::Translator as symjit[9dfb3c17cbb79ae4]::symjit::composer::Composer>::compile<unknown>
  273. 198.60 s gammaloop-nextest-integration> at <unknown source file>:<unknown line>
  274. 198.60 s gammaloop-nextest-integration> 11: <numerica[ca5044e7d57d1d48]::domains::float::complex::Complex<f64> as symbolica[911a260017ea9deb]::evaluate::backend::JITCompiledNumber>::jit_compile<unknown>
  275. 198.60 s gammaloop-nextest-integration> at <unknown source file>:<unknown line>
  276. 198.61 s gammaloop-nextest-integration> 12: <gammalooprs[61738dd440287478]::integrands::process::evaluators::GenericEvaluator>::activate_symjit<unknown>
  277. 198.61 s gammaloop-nextest-integration> at <unknown source file>:<unknown line>
  278. 198.61 s gammaloop-nextest-integration> 13: <gammalooprs[61738dd440287478]::integrands::process::amplitude::AmplitudeIntegrand>::prepare_runtime_backends_after_generation_with_compile_times<unknown>
  279. 198.61 s gammaloop-nextest-integration> at <unknown source file>:<unknown line>
  280. 198.61 s gammaloop-nextest-integration> 14: <gammalooprs[61738dd440287478]::processes::amplitude::Amplitude>::build_integrand<unknown>
  281. 198.61 s gammaloop-nextest-integration> at <unknown source file>:<unknown line>
  282. 198.61 s gammaloop-nextest-integration> 15: <gammalooprs[61738dd440287478]::processes::process::Process>::generate_integrands<unknown>
  283. 198.61 s gammaloop-nextest-integration> at <unknown source file>:<unknown line>
  284. 198.61 s gammaloop-nextest-integration> 16: <gammalooprs[61738dd440287478]::processes::ProcessList>::generate_integrands<unknown>
  285. 198.61 s gammaloop-nextest-integration> at <unknown source file>:<unknown line>
  286. 198.61 s gammaloop-nextest-integration> 17: <gammaloop_api[781ec552bb626e12]::state::State>::generate_integrands<unknown>
  287. 198.61 s gammaloop-nextest-integration> at <unknown source file>:<unknown line>
  288. 198.61 s gammaloop-nextest-integration> 18: <gammaloop_api[781ec552bb626e12]::commands::generate::Generate>::run::<&std[bcb96dfbba0ab899]::path::PathBuf><unknown>
  289. 198.61 s gammaloop-nextest-integration> at <unknown source file>:<unknown line>
  290. 198.61 s gammaloop-nextest-integration> 19: <gammaloop_api[781ec552bb626e12]::commands::Commands>::run<unknown>
  291. 198.61 s gammaloop-nextest-integration> at <unknown source file>:<unknown line>
  292. 198.61 s gammaloop-nextest-integration> 20: <gammaloop_api[781ec552bb626e12]::session::CliSession>::execute_prepared<unknown>
  293. 198.61 s gammaloop-nextest-integration> at <unknown source file>:<unknown line>
  294. 198.61 s gammaloop-nextest-integration> 21: <gammaloop_api[781ec552bb626e12]::session::CliSession>::execute_prepared_commands<unknown>
  295. 198.61 s gammaloop-nextest-integration> at <unknown source file>:<unknown line>
  296. 198.61 s gammaloop-nextest-integration> 22: <gammaloop_api[781ec552bb626e12]::session::CliSession>::execute_prepared<unknown>
  297. 198.61 s gammaloop-nextest-integration> at <unknown source file>:<unknown line>
  298. 198.61 s gammaloop-nextest-integration> 23: <gammaloop_api[781ec552bb626e12]::session::CliSession>::execute_command<unknown>
  299. 198.61 s gammaloop-nextest-integration> at <unknown source file>:<unknown line>
  300. 198.61 s gammaloop-nextest-integration> 24: <gammaloop_integration_tests[3349793260628f2c]::CLIState>::run_command_flow<unknown>
  301. 198.61 s gammaloop-nextest-integration> at <unknown source file>:<unknown line>
  302. 198.61 s gammaloop-nextest-integration> 25: <gammaloop_integration_tests[3349793260628f2c]::CLIState>::run_command<unknown>
  303. 198.61 s gammaloop-nextest-integration> at <unknown source file>:<unknown line>
  304. 198.61 s gammaloop-nextest-integration> 26: uv[4a8ff97c1fe5666b]::run_single_integrated_uv_case<unknown>
  305. 198.61 s gammaloop-nextest-integration> at <unknown source file>:<unknown line>
  306. 198.61 s gammaloop-nextest-integration> 27: <uv[4a8ff97c1fe5666b]::thermal_sunrise_uv::{closure#0} as core[940e698046960fd5]::ops::function::FnOnce<()>>::call_once<unknown>
  307. 198.61 s gammaloop-nextest-integration> at <unknown source file>:<unknown line>
  308. 198.61 s gammaloop-nextest-integration> 28: test[75d6903177b1d7e9]::__rust_begin_short_backtrace::<core[940e698046960fd5]::result::Result<(), alloc[2ea6bcb46fca0c42]::string::String>, fn() -> core[940e698046960fd5]::result::Result<(), alloc[2ea6bcb46fca0c42]::string::String>><unknown>
  309. 198.61 s gammaloop-nextest-integration> at <unknown source file>:<unknown line>
  310. 198.61 s gammaloop-nextest-integration> 29: test[75d6903177b1d7e9]::run_test::{closure#0}<unknown>
  311. 198.61 s gammaloop-nextest-integration> at <unknown source file>:<unknown line>
  312. 198.61 s gammaloop-nextest-integration> 30: std[bcb96dfbba0ab899]::sys::backtrace::__rust_begin_short_backtrace::<test[75d6903177b1d7e9]::run_test::{closure#1}, ()><unknown>
  313. 198.61 s gammaloop-nextest-integration> at <unknown source file>:<unknown line>
  314. 198.61 s gammaloop-nextest-integration> 31: <std[bcb96dfbba0ab899]::thread::lifecycle::spawn_unchecked<test[75d6903177b1d7e9]::run_test::{closure#1}, ()>::{closure#1} as core[940e698046960fd5]::ops::function::FnOnce<()>>::call_once::{shim:vtable#0}<unknown>
  315. 198.61 s gammaloop-nextest-integration> at <unknown source file>:<unknown line>
  316. 198.61 s gammaloop-nextest-integration> 32: <std[bcb96dfbba0ab899]::sys::thread::unix::Thread>::new::thread_start<unknown>
  317. 198.61 s gammaloop-nextest-integration> at <unknown source file>:<unknown line>
  318. 198.61 s gammaloop-nextest-integration> 33: start_thread<unknown>
  319. 198.61 s gammaloop-nextest-integration> at <unknown source file>:<unknown line>
  320. 198.61 s gammaloop-nextest-integration> 34: __clone3<unknown>
  321. 198.61 s gammaloop-nextest-integration> at <unknown source file>:<unknown line>
  322. 198.61 s gammaloop-nextest-integration>
  323. 198.61 s gammaloop-nextest-integration> Run with COLORBT_SHOW_HIDDEN=1 environment variable to disable frame filtering.
  324. 198.61 s gammaloop-nextest-integration> Run with RUST_BACKTRACE=full to include source snippets.
  325. 198.61 s gammaloop-nextest-integration> Warning: SpanTrace capture is Unsupported.
  326. 198.61 s gammaloop-nextest-integration> Ensure that you've setup a tracing-error ErrorLayer and the semver versions are compatible
  327. 198.61 s gammaloop-nextest-integration>
  328. 198.79 s gammaloop-nextest-integration> error: test run failed
  329. 198.83 s gammaloop-nextest-integration>
  330. 198.83 s gammaloop-nextest-integration> ========== nextest test summary ==========
  331. 198.83 s gammaloop-nextest-integration> report: target/nextest/ci_gammaloop/junit.xml
  332. 198.83 s gammaloop-nextest-integration> tests: 107, failures: 1, errors: 0
  333. 198.83 s gammaloop-nextest-integration>
  334. 198.83 s gammaloop-nextest-integration> 1. gammaloop-integration-tests::uv::thermal_sunrise_uv
  335. 198.83 s gammaloop-nextest-integration> failure: test failure with exit code 101
  336. 198.83 s gammaloop-nextest-integration> system-out
  337. 198.83 s gammaloop-nextest-integration> running 1 test
  338. 198.83 s gammaloop-nextest-integration> test thermal_sunrise_uv ... FAILED
  339. 198.83 s gammaloop-nextest-integration>
  340. 198.83 s gammaloop-nextest-integration> failures:
  341. 198.83 s gammaloop-nextest-integration>
  342. 198.83 s gammaloop-nextest-integration> failures:
  343. 198.83 s gammaloop-nextest-integration> thermal_sunrise_uv
  344. 198.83 s gammaloop-nextest-integration>
  345. 198.83 s gammaloop-nextest-integration> test result: FAILED. 0 passed; 1 failed; 0 ignored; 0 measured; 25 filtered out; finished in 4.66s
  346. 198.83 s gammaloop-nextest-integration> system-err
  347. 198.83 s gammaloop-nextest-integration> [2026-09-09 23:13:23.768] @gammaloop_api::se... INFO : Running command run generate
  348. 198.83 s gammaloop-nextest-integration> [2026-09-09 23:13:23.768] @gammaloop_api::se... INFO : Starting command block generate
  349. 198.83 s gammaloop-nextest-integration> [2026-09-09 23:13:23.768] @gammaloop_api::se... INFO : Running command import model sm-default.json
  350. 198.83 s gammaloop-nextest-integration> [2026-09-09 23:13:23.768] @import::model INFO : Loading built-in JSON model sm-default
  351. 198.83 s gammaloop-nextest-integration> [2026-09-09 23:13:23.813] @gammalooprs::model INFO : The following 15 external parameters were forced to zero by the restriction card:
  352. 198.83 s gammaloop-nextest-integration> lamWS, AWS, rhoWS, etaWS, ymc, yme, ymm, MC, Me, MM, WTau, muQ, muLe, muLmu, muLtau
  353. 198.83 s gammaloop-nextest-integration> [2026-09-09 23:13:23.814] @gammalooprs::model INFO : The following 34 vertex rules were removed by the restriction card:
  354. 198.83 s gammaloop-nextest-integration> V_82 -> (c~, d, G+) | V_83 -> (t~, d, G+) | V_84 -> (c~, s, G+) | V_85 -> (t~, s, G+) | V_86 -> (u~, b, G+) | V_87 -> (c~, b, G+) | V_90 -> (c~, d, W+) | V_91 -> (t~, d, W+) | V_92 -> (u~, s, W+) | V_94 -> (t~, s, W+) | V_95 -> (u~, b, W+) | V_96 -> (c~, b, W+) | V_101 -> (e+, e-, G0) | V_102 -> (mu+, mu-, G0) | V_104 -> (e+, e-, H) | V_105 -> (mu+, mu-, H) | V_110 -> (ve~, e-, G+) | V_111 -> (vm~, mu-, G+) | V_116 -> (b~, u, G-) | V_117 -> (d~, c, G-) | V_118 -> (s~, c, G-) | V_119 -> (b~, c, G-) | V_120 -> (d~, t, G-) | V_121 -> (s~, t, G-) | V_124 -> (s~, u, W-) | V_125 -> (b~, u, W-) | V_126 -> (d~, c, W-) | V_128 -> (b~, c, W-) | V_129 -> (d~, t, W-) | V_130 -> (s~, t, W-) | V_138 -> (c~, c, G0) | V_140 -> (c~, c, H) | V_145 -> (e+, ve, G-) | V_146 -> (mu+, vm, G-)
  355. 198.83 s gammaloop-nextest-integration> [2026-09-09 23:13:23.814] @gammalooprs::model INFO : The following 36 couplings were removed by the restriction card:
  356. 198.83 s gammaloop-nextest-integration> GC_13, GC_14, GC_16, GC_17, GC_18, GC_19, GC_20, GC_22, GC_23, GC_24, GC_25, GC_26, GC_28, GC_29, GC_42, GC_43, GC_44, GC_46, GC_47, GC_48, GC_84, GC_85, GC_86, GC_87, GC_88, GC_89, GC_90, GC_91, GC_92, GC_93, GC_101, GC_102, GC_103, GC_105, GC_106, GC_107
  357. 198.83 s gammaloop-nextest-integration> [2026-09-09 23:13:23.814] @gammaloop_api::se... INFO : Running command remove processes
  358. 198.83 s gammaloop-nextest-integration> [2026-09-09 23:13:23.815] @gammaloop_api::se... INFO : Running command generate amp {} > {} [{2}] | g u
  359. 198.83 s gammaloop-nextest-integration> --numerator-grouping group_identical_graphs_up_to_scalar_rescaling
  360. 198.83 s gammaloop-nextest-integration> --max-n-bridges 0
  361. 198.83 s gammaloop-nextest-integration> --number-of-factorized-loop-subtopologies 1 1
  362. 198.83 s gammaloop-nextest-integration> --number-of-fermion-loops 1 1
  363. 198.83 s gammaloop-nextest-integration> [...]
  364. 198.83 s gammaloop-nextest-integration> [2026-09-09 23:13:23.816] @feyngen::diagram_... INFO : 0s | Δ=0s | Starting Feynman graph generation with Symbolica...
  365. 198.83 s gammaloop-nextest-integration> [2026-09-09 23:13:23.816] @feyngen::diagram_... INFO : 0s | Δ=0s | Number of graphs resulting from Symbolica generation: 3
  366. 198.83 s gammaloop-nextest-integration> [2026-09-09 23:13:23.817] @feyngen::diagram_... INFO : 0s | Δ=0s | Number of graphs retained after removal of vetoed topologies: 2
  367. 198.83 s gammaloop-nextest-integration> [2026-09-09 23:13:23.817] @feyngen::diagram_... INFO : 0s | Δ=0s | Number of graphs after vertex info assignment: 2
  368. 198.83 s gammaloop-nextest-integration> [2026-09-09 23:13:23.817] @feyngen::diagram_... INFO : 0s | Δ=0s | Number of graphs after all complete graphs filters are applied: 2
  369. 198.83 s gammaloop-nextest-integration> [2026-09-09 23:13:23.817] @feyngen::diagram_... INFO : 0s | Δ=0s | Number of graphs after closed fermion chains analysis: 1
  370. 198.83 s gammaloop-nextest-integration> [2026-09-09 23:13:23.817] @feyngen::diagram_... INFO : 0s | Δ=0s | Number of graphs after symmetrization of external states: 1
  371. 198.83 s gammaloop-nextest-integration> [2026-09-09 23:13:23.817] @feyngen::diagram_... INFO : 0s | Δ=0s | Number of graphs after canonization of vertices, edges and flows (graph labels assigned here): 1
  372. 198.83 s gammaloop-nextest-integration> [2026-09-09 23:13:23.841] @feyngen::diagram_... INFO : 0s | Δ=0s | Number of graphs after numerator-aware grouping with strategy 'up to a scalar rescaling': 1 (1 isomorphically unique graph, 0 color zero, 0 lorentz zero, 0 grouped and 0 cancellation)
  373. 198.83 s gammaloop-nextest-integration> [2026-09-09 23:13:23.841] @feyngen::diagram_... INFO : ( Sum of the symmetry factors from each graph generated = -1/2 )
  374. 198.83 s gammaloop-nextest-integration> [2026-09-09 23:13:23.841] @commands::generate INFO : Generated amplitude 1 graphs.
  375. 198.83 s gammaloop-nextest-integration> [2026-09-09 23:13:23.841] @commands::generate INFO : Only diagram generation was requested, skipping integrand generation. You can generate integrands later using the 'generate existing <options>' command.
  376. 198.83 s gammaloop-nextest-integration> [2026-09-09 23:13:23.842] @gammaloop_api::se... INFO : Running command generate
  377. 198.83 s gammaloop-nextest-integration> The application panicked (crashed).
  378. 198.83 s gammaloop-nextest-integration> Message: called `Result::unwrap()` on an `Err` value: variable __Static610 not found
  379. 198.83 s gammaloop-nextest-integration>
  380. 198.83 s gammaloop-nextest-integration> Stack backtrace:
  381. 198.83 s gammaloop-nextest-integration> 0: <anyhow::Error>::msg::<alloc::string::String>
  382. 198.83 s gammaloop-nextest-integration> 1: <symjit::symjit::compiler::IndirectTranslator as symjit::symjit::composer::Composer>::compile
  383. 198.83 s gammaloop-nextest-integration> 2: <symjit::symjit::compiler::Translator as symjit::symjit::composer::Composer>::compile
  384. 198.83 s gammaloop-nextest-integration> 3: <numerica::domains::float::complex::Complex<f64> as symbolica::evaluate::backend::JITCompiledNumber>::jit_compile
  385. 198.83 s gammaloop-nextest-integration> 4: <gammalooprs::integrands::process::evaluators::GenericEvaluator>::activate_symjit
  386. 198.83 s gammaloop-nextest-integration> 5: <gammalooprs::integrands::process::amplitude::AmplitudeIntegrand>::prepare_runtime_backends_after_generation_with_compile_times
  387. 198.83 s gammaloop-nextest-integration> 6: <gammalooprs::processes::amplitude::Amplitude>::build_integrand
  388. 198.83 s gammaloop-nextest-integration> 7: <gammalooprs::processes::process::Process>::generate_integrands
  389. 198.83 s gammaloop-nextest-integration> 8: <gammalooprs::processes::ProcessList>::generate_integrands
  390. 198.83 s gammaloop-nextest-integration> 9: <gammaloop_api::state::State>::generate_integrands
  391. 198.83 s gammaloop-nextest-integration> 10: <gammaloop_api::commands::generate::Generate>::run::<&std::path::PathBuf>
  392. 198.83 s gammaloop-nextest-integration> 11: <gammaloop_api::commands::Commands>::run
  393. 198.83 s gammaloop-nextest-integration> 12: <gammaloop_api::session::CliSession>::execute_prepared
  394. 198.83 s gammaloop-nextest-integration> 13: <gammaloop_api::session::CliSession>::execute_prepared_commands
  395. 198.83 s gammaloop-nextest-integration> 14: <gammaloop_api::session::CliSession>::execute_prepared
  396. 198.83 s gammaloop-nextest-integration> 15: <gammaloop_api::session::CliSession>::execute_command
  397. 198.83 s gammaloop-nextest-integration> 16: <gammaloop_integration_tests::CLIState>::run_command_flow
  398. 198.83 s gammaloop-nextest-integration> 17: <gammaloop_integration_tests::CLIState>::run_command
  399. 198.83 s gammaloop-nextest-integration> 18: uv::run_single_integrated_uv_case
  400. 198.83 s gammaloop-nextest-integration> 19: <uv::thermal_sunrise_uv::{closure#0} as core::ops::function::FnOnce<()>>::call_once
  401. 198.83 s gammaloop-nextest-integration> 20: test::__rust_begin_short_backtrace::<core::result::Result<(), alloc::string::String>, fn() -> core::result::Result<(), alloc::string::String>>
  402. 198.83 s gammaloop-nextest-integration> 21: test::run_test::{closure#0}
  403. 198.83 s gammaloop-nextest-integration> 22: std::sys::backtrace::__rust_begin_short_backtrace::<test::run_test::{closure#1}, ()>
  404. 198.83 s gammaloop-nextest-integration> 23: <std::thread::lifecycle::spawn_unchecked<test::run_test::{closure#1}, ()>::{closure#1} as core::ops::function::FnOnce<()>>::call_once::{shim:vtable#0}
  405. 198.83 s gammaloop-nextest-integration> 24: <std::sys::thread::unix::Thread>::new::thread_start
  406. 198.83 s gammaloop-nextest-integration> 25: start_thread
  407. 198.83 s gammaloop-nextest-integration> 26: __clone3
  408. 198.83 s gammaloop-nextest-integration> Location: /nix/store/l5xazfnr7k6r6p8mlkn38x2afab0rygz-vendor-cargo-deps/c19b7c6f923b580ac259164a89f2577984ad5ab09ee9d583b888f934adbbe8d0/symjit-2.25.0/src/symjit/compiler.rs:883
  409. 198.83 s gammaloop-nextest-integration>
  410. 198.83 s gammaloop-nextest-integration> ━━━━━━━━━━━━━━━━━━━━━━━━━━━━━━━━━━ BACKTRACE ━━━━━━━━━━━━━━━━━━━━━━━━━━━━━━━━━━━
  411. 198.83 s gammaloop-nextest-integration> 1: <color_eyre[51793ea62743adbd]::config::PanicHook>::panic_report<unknown>
  412. 198.83 s gammaloop-nextest-integration> at <unknown source file>:<unknown line>
  413. 198.83 s gammaloop-nextest-integration> 2: <color_eyre[51793ea62743adbd]::config::PanicHook>::into_panic_hook::{closure#0}<unknown>
  414. 198.83 s gammaloop-nextest-integration> at <unknown source file>:<unknown line>
  415. 198.83 s gammaloop-nextest-integration> 3: std[bcb96dfbba0ab899]::panicking::panic_with_hook<unknown>
  416. 198.83 s gammaloop-nextest-integration> at <unknown source file>:<unknown line>
  417. 198.83 s gammaloop-nextest-integration> 4: std[bcb96dfbba0ab899]::panicking::panic_handler::{closure#0}<unknown>
  418. 198.83 s gammaloop-nextest-integration> at <unknown source file>:<unknown line>
  419. 198.83 s gammaloop-nextest-integration> 5: std[bcb96dfbba0ab899]::sys::backtrace::__rust_end_short_backtrace::<std[bcb96dfbba0ab899]::panicking::panic_handler::{closure#0}, !><unknown>
  420. 198.83 s gammaloop-nextest-integration> at <unknown source file>:<unknown line>
  421. 198.83 s gammaloop-nextest-integration> 6: __rustc[6c289b9f9c454d21]::rust_begin_unwind<unknown>
  422. 198.83 s gammaloop-nextest-integration> at <unknown source file>:<unknown line>
  423. 198.83 s gammaloop-nextest-integration> 7: core[940e698046960fd5]::panicking::panic_fmt<unknown>
  424. 198.83 s gammaloop-nextest-integration> at <unknown source file>:<unknown line>
  425. 198.83 s gammaloop-nextest-integration> 8: core[940e698046960fd5]::result::unwrap_failed<unknown>
  426. 198.83 s gammaloop-nextest-integration> at <unknown source file>:<unknown line>
  427. 198.83 s gammaloop-nextest-integration> 9: <symjit[9dfb3c17cbb79ae4]::symjit::compiler::IndirectTranslator as symjit[9dfb3c17cbb79ae4]::symjit::composer::Composer>::compile<unknown>
  428. 198.83 s gammaloop-nextest-integration> at <unknown source file>:<unknown line>
  429. 198.83 s gammaloop-nextest-integration> 10: <symjit[9dfb3c17cbb79ae4]::symjit::compiler::Translator as symjit[9dfb3c17cbb79ae4]::symjit::composer::Composer>::compile<unknown>
  430. 198.83 s gammaloop-nextest-integration> at <unknown source file>:<unknown line>
  431. 198.83 s gammaloop-nextest-integration> 11: <numerica[ca5044e7d57d1d48]::domains::float::complex::Complex<f64> as symbolica[911a260017ea9deb]::evaluate::backend::JITCompiledNumber>::jit_compile<unknown>
  432. 198.83 s gammaloop-nextest-integration> at <unknown source file>:<unknown line>
  433. 198.83 s gammaloop-nextest-integration> 12: <gammalooprs[61738dd440287478]::integrands::process::evaluators::GenericEvaluator>::activate_symjit<unknown>
  434. 198.83 s gammaloop-nextest-integration> at <unknown source file>:<unknown line>
  435. 198.83 s gammaloop-nextest-integration> 13: <gammalooprs[61738dd440287478]::integrands::process::amplitude::AmplitudeIntegrand>::prepare_runtime_backends_after_generation_with_compile_times<unknown>
  436. 198.83 s gammaloop-nextest-integration> at <unknown source file>:<unknown line>
  437. 198.83 s gammaloop-nextest-integration> 14: <gammalooprs[61738dd440287478]::processes::amplitude::Amplitude>::build_integrand<unknown>
  438. 198.83 s gammaloop-nextest-integration> at <unknown source file>:<unknown line>
  439. 198.83 s gammaloop-nextest-integration> 15: <gammalooprs[61738dd440287478]::processes::process::Process>::generate_integrands<unknown>
  440. 198.83 s gammaloop-nextest-integration> at <unknown source file>:<unknown line>
  441. 198.83 s gammaloop-nextest-integration> 16: <gammalooprs[61738dd440287478]::processes::ProcessList>::generate_integrands<unknown>
  442. 198.83 s gammaloop-nextest-integration> at <unknown source file>:<unknown line>
  443. 198.83 s gammaloop-nextest-integration> 17: <gammaloop_api[781ec552bb626e12]::state::State>::generate_integrands<unknown>
  444. 198.83 s gammaloop-nextest-integration> at <unknown source file>:<unknown line>
  445. 198.83 s gammaloop-nextest-integration> 18: <gammaloop_api[781ec552bb626e12]::commands::generate::Generate>::run::<&std[bcb96dfbba0ab899]::path::PathBuf><unknown>
  446. 198.83 s gammaloop-nextest-integration> at <unknown source file>:<unknown line>
  447. 198.83 s gammaloop-nextest-integration> 19: <gammaloop_api[781ec552bb626e12]::commands::Commands>::run<unknown>
  448. 198.83 s gammaloop-nextest-integration> at <unknown source file>:<unknown line>
  449. 198.83 s gammaloop-nextest-integration> 20: <gammaloop_api[781ec552bb626e12]::session::CliSession>::execute_prepared<unknown>
  450. 198.83 s gammaloop-nextest-integration> at <unknown source file>:<unknown line>
  451. 198.83 s gammaloop-nextest-integration> 21: <gammaloop_api[781ec552bb626e12]::session::CliSession>::execute_prepared_commands<unknown>
  452. 198.83 s gammaloop-nextest-integration> at <unknown source file>:<unknown line>
  453. 198.83 s gammaloop-nextest-integration> 22: <gammaloop_api[781ec552bb626e12]::session::CliSession>::execute_prepared<unknown>
  454. 198.83 s gammaloop-nextest-integration> at <unknown source file>:<unknown line>
  455. 198.83 s gammaloop-nextest-integration> 23: <gammaloop_api[781ec552bb626e12]::session::CliSession>::execute_command<unknown>
  456. 198.83 s gammaloop-nextest-integration> at <unknown source file>:<unknown line>
  457. 198.83 s gammaloop-nextest-integration> 24: <gammaloop_integration_tests[3349793260628f2c]::CLIState>::run_command_flow<unknown>
  458. 198.83 s gammaloop-nextest-integration> at <unknown source file>:<unknown line>
  459. 198.83 s gammaloop-nextest-integration> 25: <gammaloop_integration_tests[3349793260628f2c]::CLIState>::run_command<unknown>
  460. 198.83 s gammaloop-nextest-integration> at <unknown source file>:<unknown line>
  461. 198.83 s gammaloop-nextest-integration> 26: uv[4a8ff97c1fe5666b]::run_single_integrated_uv_case<unknown>
  462. 198.83 s gammaloop-nextest-integration> at <unknown source file>:<unknown line>
  463. 198.83 s gammaloop-nextest-integration> 27: <uv[4a8ff97c1fe5666b]::thermal_sunrise_uv::{closure#0} as core[940e698046960fd5]::ops::function::FnOnce<()>>::call_once<unknown>
  464. 198.83 s gammaloop-nextest-integration> at <unknown source file>:<unknown line>
  465. 198.83 s gammaloop-nextest-integration> 28: test[75d6903177b1d7e9]::__rust_begin_short_backtrace::<core[940e698046960fd5]::result::Result<(), alloc[2ea6bcb46fca0c42]::string::String>, fn() -> core[940e698046960fd5]::result::Result<(), alloc[2ea6bcb46fca0c42]::string::String>><unknown>
  466. 198.83 s gammaloop-nextest-integration> ... omitted 18 more lines; see full nextest output above
  467. 198.83 s gammaloop-nextest-integration> =========================================
  468. 198.93 s error: Cannot build '/nix/store/85r60p7hwgsrgkazjyi3fv4lbc82mrhs-gammaloop-nextest-integration.drv'.
  469. 198.93 s Reason: builder failed with exit code 100.
  470. 198.93 s Output paths:
  471. 198.93 s /nix/store/dlmhihq612414w8wpsbb5dr2npz5rgg7-gammaloop-nextest-integration
  472. 198.93 s Last 451 log lines:
  473. 198.93 s > Extracting 9 binaries, 1 build script output directory, and 3 linked paths to /build/nextest-archive-4X9ZxZ
  474. 198.93 s > Extracted 26 files to /build/nextest-archive-4X9ZxZ in 1.69s
  475. 198.93 s > ------------
  476. 198.93 s > Nextest run ID 6663b554-7357-43d5-ab07-747cba6b8725 with nextest profile: ci_gammaloop
  477. 198.93 s > Starting 107 tests across 9 binaries (68 tests skipped via profile.ci_gammaloop.default-filter)
  478. 198.93 s > FAIL [ 4.679s] ( 94/107) gammaloop-integration-tests::uv thermal_sunrise_uv
  479. 198.93 s > stdout ---
  480. 198.93 s >
  481. 198.93 s > running 1 test
  482. 198.93 s > test thermal_sunrise_uv ... FAILED
  483. 198.93 s >
  484. 198.93 s > failures:
  485. 198.93 s >
  486. 198.93 s > failures:
  487. 198.93 s > thermal_sunrise_uv
  488. 198.93 s >
  489. 198.93 s > test result: FAILED. 0 passed; 1 failed; 0 ignored; 0 measured; 25 filtered out; finished in 4.66s
  490. 198.93 s >
  491. 198.93 s > stderr ---
  492. 198.93 s > [2026-09-09 23:13:23.768] @gammaloop_api::se... INFO : Running command run generate
  493. 198.93 s > [2026-09-09 23:13:23.768] @gammaloop_api::se... INFO : Starting command block generate
  494. 198.93 s > [2026-09-09 23:13:23.768] @gammaloop_api::se... INFO : Running command import model sm-default.json
  495. 198.93 s > [2026-09-09 23:13:23.768] @import::model INFO : Loading built-in JSON model sm-default
  496. 198.93 s > [2026-09-09 23:13:23.813] @gammalooprs::model INFO : The following 15 external parameters were forced to zero by the restriction card:
  497. 198.93 s > lamWS, AWS, rhoWS, etaWS, ymc, yme, ymm, MC, Me, MM, WTau, muQ, muLe, muLmu, muLtau
  498. 198.93 s > [2026-09-09 23:13:23.814] @gammalooprs::model INFO : The following 34 vertex rules were removed by the restriction card:
  499. 198.93 s > V_82 -> (c~, d, G+) | V_83 -> (t~, d, G+) | V_84 -> (c~, s, G+) | V_85 -> (t~, s, G+) | V_86 -> (u~, b, G+) | V_87 -> (c~, b, G+) | V_90 -> (c~, d, W+) | V_91 -> (t~, d, W+) | V_92 -> (u~, s, W+) | V_94 -> (t~, s, W+) | V_95 -> (u~, b, W+) | V_96 -> (c~, b, W+) | V_101 -> (e+, e-, G0) | V_102 -> (mu+, mu-, G0) | V_104 -> (e+, e-, H) | V_105 -> (mu+, mu-, H) | V_110 -> (ve~, e-, G+) | V_111 -> (vm~, mu-, G+) | V_116 -> (b~, u, G-) | V_117 -> (d~, c, G-) | V_118 -> (s~, c, G-) | V_119 -> (b~, c, G-) | V_120 -> (d~, t, G-) | V_121 -> (s~, t, G-) | V_124 -> (s~, u, W-) | V_125 -> (b~, u, W-) | V_126 -> (d~, c, W-) | V_128 -> (b~, c, W-) | V_129 -> (d~, t, W-) | V_130 -> (s~, t, W-) | V_138 -> (c~, c, G0) | V_140 -> (c~, c, H) | V_145 -> (e+, ve, G-) | V_146 -> (mu+, vm, G-)
  500. 198.93 s > [2026-09-09 23:13:23.814] @gammalooprs::model INFO : The following 36 couplings were removed by the restriction card:
  501. 198.93 s > GC_13, GC_14, GC_16, GC_17, GC_18, GC_19, GC_20, GC_22, GC_23, GC_24, GC_25, GC_26, GC_28, GC_29, GC_42, GC_43, GC_44, GC_46, GC_47, GC_48, GC_84, GC_85, GC_86, GC_87, GC_88, GC_89, GC_90, GC_91, GC_92, GC_93, GC_101, GC_102, GC_103, GC_105, GC_106, GC_107
  502. 198.93 s > [2026-09-09 23:13:23.814] @gammaloop_api::se... INFO : Running command remove processes
  503. 198.93 s > [2026-09-09 23:13:23.815] @gammaloop_api::se... INFO : Running command generate amp {} > {} [{2}] | g u
  504. 198.93 s > --numerator-grouping group_identical_graphs_up_to_scalar_rescaling
  505. 198.93 s > --max-n-bridges 0
  506. 198.93 s > --number-of-factorized-loop-subtopologies 1 1
  507. 198.93 s > --number-of-fermion-loops 1 1
  508. 198.93 s > [...]
  509. 198.93 s > [2026-09-09 23:13:23.816] @feyngen::diagram_... INFO : 0s | Δ=0s | Starting Feynman graph generation with Symbolica...
  510. 198.93 s > [2026-09-09 23:13:23.816] @feyngen::diagram_... INFO : 0s | Δ=0s | Number of graphs resulting from Symbolica generation: 3
  511. 198.93 s > [2026-09-09 23:13:23.817] @feyngen::diagram_... INFO : 0s | Δ=0s | Number of graphs retained after removal of vetoed topologies: 2
  512. 198.93 s > [2026-09-09 23:13:23.817] @feyngen::diagram_... INFO : 0s | Δ=0s | Number of graphs after vertex info assignment: 2
  513. 198.93 s > [2026-09-09 23:13:23.817] @feyngen::diagram_... INFO : 0s | Δ=0s | Number of graphs after all complete graphs filters are applied: 2
  514. 198.93 s > [2026-09-09 23:13:23.817] @feyngen::diagram_... INFO : 0s | Δ=0s | Number of graphs after closed fermion chains analysis: 1
  515. 198.93 s > [2026-09-09 23:13:23.817] @feyngen::diagram_... INFO : 0s | Δ=0s | Number of graphs after symmetrization of external states: 1
  516. 198.93 s > [2026-09-09 23:13:23.817] @feyngen::diagram_... INFO : 0s | Δ=0s | Number of graphs after canonization of vertices, edges and flows (graph labels assigned here): 1
  517. 198.93 s > [2026-09-09 23:13:23.841] @feyngen::diagram_... INFO : 0s | Δ=0s | Number of graphs after numerator-aware grouping with strategy 'up to a scalar rescaling': 1 (1 isomorphically unique graph, 0 color zero, 0 lorentz zero, 0 grouped and 0 cancellation)
  518. 198.93 s > [2026-09-09 23:13:23.841] @feyngen::diagram_... INFO : ( Sum of the symmetry factors from each graph generated = -1/2 )
  519. 198.93 s > [2026-09-09 23:13:23.841] @commands::generate INFO : Generated amplitude 1 graphs.
  520. 198.93 s > [2026-09-09 23:13:23.841] @commands::generate INFO : Only diagram generation was requested, skipping integrand generation. You can generate integrands later using the 'generate existing <options>' command.
  521. 198.93 s > [2026-09-09 23:13:23.842] @gammaloop_api::se... INFO : Running command generate
  522. 198.93 s > The application panicked (crashed).
  523. 198.93 s > Message: called `Result::unwrap()` on an `Err` value: variable __Static610 not found
  524. 198.93 s >
  525. 198.93 s > Stack backtrace:
  526. 198.93 s > 0: <anyhow::Error>::msg::<alloc::string::String>
  527. 198.93 s > 1: <symjit::symjit::compiler::IndirectTranslator as symjit::symjit::composer::Composer>::compile
  528. 198.93 s > 2: <symjit::symjit::compiler::Translator as symjit::symjit::composer::Composer>::compile
  529. 198.93 s > 3: <numerica::domains::float::complex::Complex<f64> as symbolica::evaluate::backend::JITCompiledNumber>::jit_compile
  530. 198.93 s > 4: <gammalooprs::integrands::process::evaluators::GenericEvaluator>::activate_symjit
  531. 198.93 s > 5: <gammalooprs::integrands::process::amplitude::AmplitudeIntegrand>::prepare_runtime_backends_after_generation_with_compile_times
  532. 198.93 s > 6: <gammalooprs::processes::amplitude::Amplitude>::build_integrand
  533. 198.93 s > 7: <gammalooprs::processes::process::Process>::generate_integrands
  534. 198.93 s > 8: <gammalooprs::processes::ProcessList>::generate_integrands
  535. 198.93 s > 9: <gammaloop_api::state::State>::generate_integrands
  536. 198.93 s > 10: <gammaloop_api::commands::generate::Generate>::run::<&std::path::PathBuf>
  537. 198.93 s > 11: <gammaloop_api::commands::Commands>::run
  538. 198.93 s > 12: <gammaloop_api::session::CliSession>::execute_prepared
  539. 198.93 s > 13: <gammaloop_api::session::CliSession>::execute_prepared_commands
  540. 198.93 s > 14: <gammaloop_api::session::CliSession>::execute_prepared
  541. 198.93 s > 15: <gammaloop_api::session::CliSession>::execute_command
  542. 198.93 s > 16: <gammaloop_integration_tests::CLIState>::run_command_flow
  543. 198.93 s > 17: <gammaloop_integration_tests::CLIState>::run_command
  544. 198.93 s > 18: uv::run_single_integrated_uv_case
  545. 198.93 s > 19: <uv::thermal_sunrise_uv::{closure#0} as core::ops::function::FnOnce<()>>::call_once
  546. 198.93 s > 20: test::__rust_begin_short_backtrace::<core::result::Result<(), alloc::string::String>, fn() -> core::result::Result<(), alloc::string::String>>
  547. 198.93 s > 21: test::run_test::{closure#0}
  548. 198.93 s > 22: std::sys::backtrace::__rust_begin_short_backtrace::<test::run_test::{closure#1}, ()>
  549. 198.93 s > 23: <std::thread::lifecycle::spawn_unchecked<test::run_test::{closure#1}, ()>::{closure#1} as core::ops::function::FnOnce<()>>::call_once::{shim:vtable#0}
  550. 198.93 s > 24: <std::sys::thread::unix::Thread>::new::thread_start
  551. 198.93 s > 25: start_thread
  552. 198.93 s > 26: __clone3
  553. 198.93 s > Location: /nix/store/l5xazfnr7k6r6p8mlkn38x2afab0rygz-vendor-cargo-deps/c19b7c6f923b580ac259164a89f2577984ad5ab09ee9d583b888f934adbbe8d0/symjit-2.25.0/src/symjit/compiler.rs:883
  554. 198.93 s >
  555. 198.93 s > ━━━━━━━━━━━━━━━━━━━━━━━━━━━━━━━━━━ BACKTRACE ━━━━━━━━━━━━━━━━━━━━━━━━━━━━━━━━━━━
  556. 198.93 s > 1: <color_eyre[51793ea62743adbd]::config::PanicHook>::panic_report<unknown>
  557. 198.93 s > at <unknown source file>:<unknown line>
  558. 198.93 s > 2: <color_eyre[51793ea62743adbd]::config::PanicHook>::into_panic_hook::{closure#0}<unknown>
  559. 198.93 s > at <unknown source file>:<unknown line>
  560. 198.93 s > 3: std[bcb96dfbba0ab899]::panicking::panic_with_hook<unknown>
  561. 198.93 s > at <unknown source file>:<unknown line>
  562. 198.93 s > 4: std[bcb96dfbba0ab899]::panicking::panic_handler::{closure#0}<unknown>
  563. 198.93 s > at <unknown source file>:<unknown line>
  564. 198.93 s > 5: std[bcb96dfbba0ab899]::sys::backtrace::__rust_end_short_backtrace::<std[bcb96dfbba0ab899]::panicking::panic_handler::{closure#0}, !><unknown>
  565. 198.93 s > at <unknown source file>:<unknown line>
  566. 198.93 s > 6: __rustc[6c289b9f9c454d21]::rust_begin_unwind<unknown>
  567. 198.93 s > at <unknown source file>:<unknown line>
  568. 198.93 s > 7: core[940e698046960fd5]::panicking::panic_fmt<unknown>
  569. 198.93 s > at <unknown source file>:<unknown line>
  570. 198.93 s > 8: core[940e698046960fd5]::result::unwrap_failed<unknown>
  571. 198.93 s > at <unknown source file>:<unknown line>
  572. 198.93 s > 9: <symjit[9dfb3c17cbb79ae4]::symjit::compiler::IndirectTranslator as symjit[9dfb3c17cbb79ae4]::symjit::composer::Composer>::compile<unknown>
  573. 198.93 s > at <unknown source file>:<unknown line>
  574. 198.93 s > 10: <symjit[9dfb3c17cbb79ae4]::symjit::compiler::Translator as symjit[9dfb3c17cbb79ae4]::symjit::composer::Composer>::compile<unknown>
  575. 198.93 s > at <unknown source file>:<unknown line>
  576. 198.93 s > 11: <numerica[ca5044e7d57d1d48]::domains::float::complex::Complex<f64> as symbolica[911a260017ea9deb]::evaluate::backend::JITCompiledNumber>::jit_compile<unknown>
  577. 198.93 s > at <unknown source file>:<unknown line>
  578. 198.93 s > 12: <gammalooprs[61738dd440287478]::integrands::process::evaluators::GenericEvaluator>::activate_symjit<unknown>
  579. 198.93 s > at <unknown source file>:<unknown line>
  580. 198.93 s > 13: <gammalooprs[61738dd440287478]::integrands::process::amplitude::AmplitudeIntegrand>::prepare_runtime_backends_after_generation_with_compile_times<unknown>
  581. 198.93 s > at <unknown source file>:<unknown line>
  582. 198.93 s > 14: <gammalooprs[61738dd440287478]::processes::amplitude::Amplitude>::build_integrand<unknown>
  583. 198.93 s > at <unknown source file>:<unknown line>
  584. 198.93 s > 15: <gammalooprs[61738dd440287478]::processes::process::Process>::generate_integrands<unknown>
  585. 198.93 s > at <unknown source file>:<unknown line>
  586. 198.93 s > 16: <gammalooprs[61738dd440287478]::processes::ProcessList>::generate_integrands<unknown>
  587. 198.93 s > at <unknown source file>:<unknown line>
  588. 198.93 s > 17: <gammaloop_api[781ec552bb626e12]::state::State>::generate_integrands<unknown>
  589. 198.93 s > at <unknown source file>:<unknown line>
  590. 198.93 s > 18: <gammaloop_api[781ec552bb626e12]::commands::generate::Generate>::run::<&std[bcb96dfbba0ab899]::path::PathBuf><unknown>
  591. 198.93 s > at <unknown source file>:<unknown line>
  592. 198.93 s > 19: <gammaloop_api[781ec552bb626e12]::commands::Commands>::run<unknown>
  593. 198.93 s > at <unknown source file>:<unknown line>
  594. 198.93 s > 20: <gammaloop_api[781ec552bb626e12]::session::CliSession>::execute_prepared<unknown>
  595. 198.93 s > at <unknown source file>:<unknown line>
  596. 198.93 s > 21: <gammaloop_api[781ec552bb626e12]::session::CliSession>::execute_prepared_commands<unknown>
  597. 198.93 s > at <unknown source file>:<unknown line>
  598. 198.93 s > 22: <gammaloop_api[781ec552bb626e12]::session::CliSession>::execute_prepared<unknown>
  599. 198.93 s > at <unknown source file>:<unknown line>
  600. 198.93 s > 23: <gammaloop_api[781ec552bb626e12]::session::CliSession>::execute_command<unknown>
  601. 198.93 s > at <unknown source file>:<unknown line>
  602. 198.93 s > 24: <gammaloop_integration_tests[3349793260628f2c]::CLIState>::run_command_flow<unknown>
  603. 198.93 s > at <unknown source file>:<unknown line>
  604. 198.93 s > 25: <gammaloop_integration_tests[3349793260628f2c]::CLIState>::run_command<unknown>
  605. 198.93 s > at <unknown source file>:<unknown line>
  606. 198.93 s > 26: uv[4a8ff97c1fe5666b]::run_single_integrated_uv_case<unknown>
  607. 198.93 s > at <unknown source file>:<unknown line>
  608. 198.93 s > 27: <uv[4a8ff97c1fe5666b]::thermal_sunrise_uv::{closure#0} as core[940e698046960fd5]::ops::function::FnOnce<()>>::call_once<unknown>
  609. 198.93 s > at <unknown source file>:<unknown line>
  610. 198.93 s > 28: test[75d6903177b1d7e9]::__rust_begin_short_backtrace::<core[940e698046960fd5]::result::Result<(), alloc[2ea6bcb46fca0c42]::string::String>, fn() -> core[940e698046960fd5]::result::Result<(), alloc[2ea6bcb46fca0c42]::string::String>><unknown>
  611. 198.93 s > at <unknown source file>:<unknown line>
  612. 198.93 s > 29: test[75d6903177b1d7e9]::run_test::{closure#0}<unknown>
  613. 198.93 s > at <unknown source file>:<unknown line>
  614. 198.93 s > 30: std[bcb96dfbba0ab899]::sys::backtrace::__rust_begin_short_backtrace::<test[75d6903177b1d7e9]::run_test::{closure#1}, ()><unknown>
  615. 198.93 s > at <unknown source file>:<unknown line>
  616. 198.93 s > 31: <std[bcb96dfbba0ab899]::thread::lifecycle::spawn_unchecked<test[75d6903177b1d7e9]::run_test::{closure#1}, ()>::{closure#1} as core[940e698046960fd5]::ops::function::FnOnce<()>>::call_once::{shim:vtable#0}<unknown>
  617. 198.93 s > at <unknown source file>:<unknown line>
  618. 198.93 s > 32: <std[bcb96dfbba0ab899]::sys::thread::unix::Thread>::new::thread_start<unknown>
  619. 198.93 s > at <unknown source file>:<unknown line>
  620. 198.93 s > 33: start_thread<unknown>
  621. 198.93 s > at <unknown source file>:<unknown line>
  622. 198.93 s > 34: __clone3<unknown>
  623. 198.93 s > at <unknown source file>:<unknown line>
  624. 198.93 s >
  625. 198.93 s > Run with COLORBT_SHOW_HIDDEN=1 environment variable to disable frame filtering.
  626. 198.93 s > Run with RUST_BACKTRACE=full to include source snippets.
  627. 198.93 s > Warning: SpanTrace capture is Unsupported.
  628. 198.93 s > Ensure that you've setup a tracing-error ErrorLayer and the semver versions are compatible
  629. 198.93 s >
  630. 198.93 s > ------------
  631. 198.93 s > Summary [ 172.861s] 107 tests run: 106 passed (2 slow), 1 failed, 68 skipped
  632. 198.93 s > FAIL [ 4.679s] ( 94/107) gammaloop-integration-tests::uv thermal_sunrise_uv
  633. 198.93 s > stdout ---
  634. 198.93 s >
  635. 198.93 s > running 1 test
  636. 198.93 s > test thermal_sunrise_uv ... FAILED
  637. 198.93 s >
  638. 198.93 s > failures:
  639. 198.93 s >
  640. 198.93 s > failures:
  641. 198.93 s > thermal_sunrise_uv
  642. 198.93 s >
  643. 198.93 s > test result: FAILED. 0 passed; 1 failed; 0 ignored; 0 measured; 25 filtered out; finished in 4.66s
  644. 198.93 s >
  645. 198.93 s > stderr ---
  646. 198.93 s > [2026-09-09 23:13:23.768] @gammaloop_api::se... INFO : Running command run generate
  647. 198.93 s > [2026-09-09 23:13:23.768] @gammaloop_api::se... INFO : Starting command block generate
  648. 198.93 s > [2026-09-09 23:13:23.768] @gammaloop_api::se... INFO : Running command import model sm-default.json
  649. 198.93 s > [2026-09-09 23:13:23.768] @import::model INFO : Loading built-in JSON model sm-default
  650. 198.93 s > [2026-09-09 23:13:23.813] @gammalooprs::model INFO : The following 15 external parameters were forced to zero by the restriction card:
  651. 198.93 s > lamWS, AWS, rhoWS, etaWS, ymc, yme, ymm, MC, Me, MM, WTau, muQ, muLe, muLmu, muLtau
  652. 198.93 s > [2026-09-09 23:13:23.814] @gammalooprs::model INFO : The following 34 vertex rules were removed by the restriction card:
  653. 198.93 s > V_82 -> (c~, d, G+) | V_83 -> (t~, d, G+) | V_84 -> (c~, s, G+) | V_85 -> (t~, s, G+) | V_86 -> (u~, b, G+) | V_87 -> (c~, b, G+) | V_90 -> (c~, d, W+) | V_91 -> (t~, d, W+) | V_92 -> (u~, s, W+) | V_94 -> (t~, s, W+) | V_95 -> (u~, b, W+) | V_96 -> (c~, b, W+) | V_101 -> (e+, e-, G0) | V_102 -> (mu+, mu-, G0) | V_104 -> (e+, e-, H) | V_105 -> (mu+, mu-, H) | V_110 -> (ve~, e-, G+) | V_111 -> (vm~, mu-, G+) | V_116 -> (b~, u, G-) | V_117 -> (d~, c, G-) | V_118 -> (s~, c, G-) | V_119 -> (b~, c, G-) | V_120 -> (d~, t, G-) | V_121 -> (s~, t, G-) | V_124 -> (s~, u, W-) | V_125 -> (b~, u, W-) | V_126 -> (d~, c, W-) | V_128 -> (b~, c, W-) | V_129 -> (d~, t, W-) | V_130 -> (s~, t, W-) | V_138 -> (c~, c, G0) | V_140 -> (c~, c, H) | V_145 -> (e+, ve, G-) | V_146 -> (mu+, vm, G-)
  654. 198.93 s > [2026-09-09 23:13:23.814] @gammalooprs::model INFO : The following 36 couplings were removed by the restriction card:
  655. 198.93 s > GC_13, GC_14, GC_16, GC_17, GC_18, GC_19, GC_20, GC_22, GC_23, GC_24, GC_25, GC_26, GC_28, GC_29, GC_42, GC_43, GC_44, GC_46, GC_47, GC_48, GC_84, GC_85, GC_86, GC_87, GC_88, GC_89, GC_90, GC_91, GC_92, GC_93, GC_101, GC_102, GC_103, GC_105, GC_106, GC_107
  656. 198.93 s > [2026-09-09 23:13:23.814] @gammaloop_api::se... INFO : Running command remove processes
  657. 198.93 s > [2026-09-09 23:13:23.815] @gammaloop_api::se... INFO : Running command generate amp {} > {} [{2}] | g u
  658. 198.93 s > --numerator-grouping group_identical_graphs_up_to_scalar_rescaling
  659. 198.93 s > --max-n-bridges 0
  660. 198.93 s > --number-of-factorized-loop-subtopologies 1 1
  661. 198.93 s > --number-of-fermion-loops 1 1
  662. 198.93 s > [...]
  663. 198.93 s > [2026-09-09 23:13:23.816] @feyngen::diagram_... INFO : 0s | Δ=0s | Starting Feynman graph generation with Symbolica...
  664. 198.93 s > [2026-09-09 23:13:23.816] @feyngen::diagram_... INFO : 0s | Δ=0s | Number of graphs resulting from Symbolica generation: 3
  665. 198.93 s > [2026-09-09 23:13:23.817] @feyngen::diagram_... INFO : 0s | Δ=0s | Number of graphs retained after removal of vetoed topologies: 2
  666. 198.93 s > [2026-09-09 23:13:23.817] @feyngen::diagram_... INFO : 0s | Δ=0s | Number of graphs after vertex info assignment: 2
  667. 198.93 s > [2026-09-09 23:13:23.817] @feyngen::diagram_... INFO : 0s | Δ=0s | Number of graphs after all complete graphs filters are applied: 2
  668. 198.93 s > [2026-09-09 23:13:23.817] @feyngen::diagram_... INFO : 0s | Δ=0s | Number of graphs after closed fermion chains analysis: 1
  669. 198.93 s > [2026-09-09 23:13:23.817] @feyngen::diagram_... INFO : 0s | Δ=0s | Number of graphs after symmetrization of external states: 1
  670. 198.93 s > [2026-09-09 23:13:23.817] @feyngen::diagram_... INFO : 0s | Δ=0s | Number of graphs after canonization of vertices, edges and flows (graph labels assigned here): 1
  671. 198.93 s > [2026-09-09 23:13:23.841] @feyngen::diagram_... INFO : 0s | Δ=0s | Number of graphs after numerator-aware grouping with strategy 'up to a scalar rescaling': 1 (1 isomorphically unique graph, 0 color zero, 0 lorentz zero, 0 grouped and 0 cancellation)
  672. 198.93 s > [2026-09-09 23:13:23.841] @feyngen::diagram_... INFO : ( Sum of the symmetry factors from each graph generated = -1/2 )
  673. 198.93 s > [2026-09-09 23:13:23.841] @commands::generate INFO : Generated amplitude 1 graphs.
  674. 198.93 s > [2026-09-09 23:13:23.841] @commands::generate INFO : Only diagram generation was requested, skipping integrand generation. You can generate integrands later using the 'generate existing <options>' command.
  675. 198.93 s > [2026-09-09 23:13:23.842] @gammaloop_api::se... INFO : Running command generate
  676. 198.93 s > The application panicked (crashed).
  677. 198.93 s > Message: called `Result::unwrap()` on an `Err` value: variable __Static610 not found
  678. 198.93 s >
  679. 198.93 s > Stack backtrace:
  680. 198.93 s > 0: <anyhow::Error>::msg::<alloc::string::String>
  681. 198.93 s > 1: <symjit::symjit::compiler::IndirectTranslator as symjit::symjit::composer::Composer>::compile
  682. 198.93 s > 2: <symjit::symjit::compiler::Translator as symjit::symjit::composer::Composer>::compile
  683. 198.93 s > 3: <numerica::domains::float::complex::Complex<f64> as symbolica::evaluate::backend::JITCompiledNumber>::jit_compile
  684. 198.93 s > 4: <gammalooprs::integrands::process::evaluators::GenericEvaluator>::activate_symjit
  685. 198.93 s > 5: <gammalooprs::integrands::process::amplitude::AmplitudeIntegrand>::prepare_runtime_backends_after_generation_with_compile_times
  686. 198.93 s > 6: <gammalooprs::processes::amplitude::Amplitude>::build_integrand
  687. 198.93 s > 7: <gammalooprs::processes::process::Process>::generate_integrands
  688. 198.93 s > 8: <gammalooprs::processes::ProcessList>::generate_integrands
  689. 198.93 s > 9: <gammaloop_api::state::State>::generate_integrands
  690. 198.93 s > 10: <gammaloop_api::commands::generate::Generate>::run::<&std::path::PathBuf>
  691. 198.93 s > 11: <gammaloop_api::commands::Commands>::run
  692. 198.93 s > 12: <gammaloop_api::session::CliSession>::execute_prepared
  693. 198.93 s > 13: <gammaloop_api::session::CliSession>::execute_prepared_commands
  694. 198.93 s > 14: <gammaloop_api::session::CliSession>::execute_prepared
  695. 198.93 s > 15: <gammaloop_api::session::CliSession>::execute_command
  696. 198.93 s > 16: <gammaloop_integration_tests::CLIState>::run_command_flow
  697. 198.93 s > 17: <gammaloop_integration_tests::CLIState>::run_command
  698. 198.93 s > 18: uv::run_single_integrated_uv_case
  699. 198.93 s > 19: <uv::thermal_sunrise_uv::{closure#0} as core::ops::function::FnOnce<()>>::call_once
  700. 198.93 s > 20: test::__rust_begin_short_backtrace::<core::result::Result<(), alloc::string::String>, fn() -> core::result::Result<(), alloc::string::String>>
  701. 198.93 s > 21: test::run_test::{closure#0}
  702. 198.93 s > 22: std::sys::backtrace::__rust_begin_short_backtrace::<test::run_test::{closure#1}, ()>
  703. 198.93 s > 23: <std::thread::lifecycle::spawn_unchecked<test::run_test::{closure#1}, ()>::{closure#1} as core::ops::function::FnOnce<()>>::call_once::{shim:vtable#0}
  704. 198.93 s > 24: <std::sys::thread::unix::Thread>::new::thread_start
  705. 198.93 s > 25: start_thread
  706. 198.93 s > 26: __clone3
  707. 198.93 s > Location: /nix/store/l5xazfnr7k6r6p8mlkn38x2afab0rygz-vendor-cargo-deps/c19b7c6f923b580ac259164a89f2577984ad5ab09ee9d583b888f934adbbe8d0/symjit-2.25.0/src/symjit/compiler.rs:883
  708. 198.93 s >
  709. 198.93 s > ━━━━━━━━━━━━━━━━━━━━━━━━━━━━━━━━━━ BACKTRACE ━━━━━━━━━━━━━━━━━━━━━━━━━━━━━━━━━━━
  710. 198.93 s > 1: <color_eyre[51793ea62743adbd]::config::PanicHook>::panic_report<unknown>
  711. 198.93 s > at <unknown source file>:<unknown line>
  712. 198.93 s > 2: <color_eyre[51793ea62743adbd]::config::PanicHook>::into_panic_hook::{closure#0}<unknown>
  713. 198.93 s > at <unknown source file>:<unknown line>
  714. 198.93 s > 3: std[bcb96dfbba0ab899]::panicking::panic_with_hook<unknown>
  715. 198.93 s > at <unknown source file>:<unknown line>
  716. 198.93 s > 4: std[bcb96dfbba0ab899]::panicking::panic_handler::{closure#0}<unknown>
  717. 198.93 s > at <unknown source file>:<unknown line>
  718. 198.93 s > 5: std[bcb96dfbba0ab899]::sys::backtrace::__rust_end_short_backtrace::<std[bcb96dfbba0ab899]::panicking::panic_handler::{closure#0}, !><unknown>
  719. 198.93 s > at <unknown source file>:<unknown line>
  720. 198.93 s > 6: __rustc[6c289b9f9c454d21]::rust_begin_unwind<unknown>
  721. 198.93 s > at <unknown source file>:<unknown line>
  722. 198.93 s > 7: core[940e698046960fd5]::panicking::panic_fmt<unknown>
  723. 198.93 s > at <unknown source file>:<unknown line>
  724. 198.93 s > 8: core[940e698046960fd5]::result::unwrap_failed<unknown>
  725. 198.93 s > at <unknown source file>:<unknown line>
  726. 198.93 s > 9: <symjit[9dfb3c17cbb79ae4]::symjit::compiler::IndirectTranslator as symjit[9dfb3c17cbb79ae4]::symjit::composer::Composer>::compile<unknown>
  727. 198.93 s > at <unknown source file>:<unknown line>
  728. 198.93 s > 10: <symjit[9dfb3c17cbb79ae4]::symjit::compiler::Translator as symjit[9dfb3c17cbb79ae4]::symjit::composer::Composer>::compile<unknown>
  729. 198.93 s > at <unknown source file>:<unknown line>
  730. 198.93 s > 11: <numerica[ca5044e7d57d1d48]::domains::float::complex::Complex<f64> as symbolica[911a260017ea9deb]::evaluate::backend::JITCompiledNumber>::jit_compile<unknown>
  731. 198.93 s > at <unknown source file>:<unknown line>
  732. 198.93 s > 12: <gammalooprs[61738dd440287478]::integrands::process::evaluators::GenericEvaluator>::activate_symjit<unknown>
  733. 198.93 s > at <unknown source file>:<unknown line>
  734. 198.93 s > 13: <gammalooprs[61738dd440287478]::integrands::process::amplitude::AmplitudeIntegrand>::prepare_runtime_backends_after_generation_with_compile_times<unknown>
  735. 198.93 s > at <unknown source file>:<unknown line>
  736. 198.93 s > 14: <gammalooprs[61738dd440287478]::processes::amplitude::Amplitude>::build_integrand<unknown>
  737. 198.93 s > at <unknown source file>:<unknown line>
  738. 198.93 s > 15: <gammalooprs[61738dd440287478]::processes::process::Process>::generate_integrands<unknown>
  739. 198.93 s > at <unknown source file>:<unknown line>
  740. 198.93 s > 16: <gammalooprs[61738dd440287478]::processes::ProcessList>::generate_integrands<unknown>
  741. 198.93 s > at <unknown source file>:<unknown line>
  742. 198.93 s > 17: <gammaloop_api[781ec552bb626e12]::state::State>::generate_integrands<unknown>
  743. 198.93 s > at <unknown source file>:<unknown line>
  744. 198.93 s > 18: <gammaloop_api[781ec552bb626e12]::commands::generate::Generate>::run::<&std[bcb96dfbba0ab899]::path::PathBuf><unknown>
  745. 198.93 s > at <unknown source file>:<unknown line>
  746. 198.93 s > 19: <gammaloop_api[781ec552bb626e12]::commands::Commands>::run<unknown>
  747. 198.93 s > at <unknown source file>:<unknown line>
  748. 198.93 s > 20: <gammaloop_api[781ec552bb626e12]::session::CliSession>::execute_prepared<unknown>
  749. 198.93 s > at <unknown source file>:<unknown line>
  750. 198.93 s > 21: <gammaloop_api[781ec552bb626e12]::session::CliSession>::execute_prepared_commands<unknown>
  751. 198.93 s > at <unknown source file>:<unknown line>
  752. 198.93 s > 22: <gammaloop_api[781ec552bb626e12]::session::CliSession>::execute_prepared<unknown>
  753. 198.93 s > at <unknown source file>:<unknown line>
  754. 198.93 s > 23: <gammaloop_api[781ec552bb626e12]::session::CliSession>::execute_command<unknown>
  755. 198.93 s > at <unknown source file>:<unknown line>
  756. 198.93 s > 24: <gammaloop_integration_tests[3349793260628f2c]::CLIState>::run_command_flow<unknown>
  757. 198.93 s > at <unknown source file>:<unknown line>
  758. 198.93 s > 25: <gammaloop_integration_tests[3349793260628f2c]::CLIState>::run_command<unknown>
  759. 198.93 s > at <unknown source file>:<unknown line>
  760. 198.93 s > 26: uv[4a8ff97c1fe5666b]::run_single_integrated_uv_case<unknown>
  761. 198.93 s > at <unknown source file>:<unknown line>
  762. 198.93 s > 27: <uv[4a8ff97c1fe5666b]::thermal_sunrise_uv::{closure#0} as core[940e698046960fd5]::ops::function::FnOnce<()>>::call_once<unknown>
  763. 198.93 s > at <unknown source file>:<unknown line>
  764. 198.93 s > 28: test[75d6903177b1d7e9]::__rust_begin_short_backtrace::<core[940e698046960fd5]::result::Result<(), alloc[2ea6bcb46fca0c42]::string::String>, fn() -> core[940e698046960fd5]::result::Result<(), alloc[2ea6bcb46fca0c42]::string::String>><unknown>
  765. 198.93 s > at <unknown source file>:<unknown line>
  766. 198.93 s > 29: test[75d6903177b1d7e9]::run_test::{closure#0}<unknown>
  767. 198.93 s > at <unknown source file>:<unknown line>
  768. 198.93 s > 30: std[bcb96dfbba0ab899]::sys::backtrace::__rust_begin_short_backtrace::<test[75d6903177b1d7e9]::run_test::{closure#1}, ()><unknown>
  769. 198.93 s > at <unknown source file>:<unknown line>
  770. 198.93 s > 31: <std[bcb96dfbba0ab899]::thread::lifecycle::spawn_unchecked<test[75d6903177b1d7e9]::run_test::{closure#1}, ()>::{closure#1} as core[940e698046960fd5]::ops::function::FnOnce<()>>::call_once::{shim:vtable#0}<unknown>
  771. 198.93 s > at <unknown source file>:<unknown line>
  772. 198.93 s > 32: <std[bcb96dfbba0ab899]::sys::thread::unix::Thread>::new::thread_start<unknown>
  773. 198.93 s > at <unknown source file>:<unknown line>
  774. 198.93 s > 33: start_thread<unknown>
  775. 198.93 s > at <unknown source file>:<unknown line>
  776. 198.93 s > 34: __clone3<unknown>
  777. 198.93 s > at <unknown source file>:<unknown line>
  778. 198.93 s >
  779. 198.93 s > Run with COLORBT_SHOW_HIDDEN=1 environment variable to disable frame filtering.
  780. 198.93 s > Run with RUST_BACKTRACE=full to include source snippets.
  781. 198.93 s > Warning: SpanTrace capture is Unsupported.
  782. 198.93 s > Ensure that you've setup a tracing-error ErrorLayer and the semver versions are compatible
  783. 198.93 s >
  784. 198.93 s > error: test run failed
  785. 198.93 s >
  786. 198.93 s > ========== nextest test summary ==========
  787. 198.93 s > report: target/nextest/ci_gammaloop/junit.xml
  788. 198.93 s > tests: 107, failures: 1, errors: 0
  789. 198.93 s >
  790. 198.93 s > 1. gammaloop-integration-tests::uv::thermal_sunrise_uv
  791. 198.93 s > failure: test failure with exit code 101
  792. 198.93 s > system-out
  793. 198.93 s > running 1 test
  794. 198.93 s > test thermal_sunrise_uv ... FAILED
  795. 198.93 s >
  796. 198.93 s > failures:
  797. 198.93 s >
  798. 198.93 s > failures:
  799. 198.93 s > thermal_sunrise_uv
  800. 198.93 s >
  801. 198.93 s > test result: FAILED. 0 passed; 1 failed; 0 ignored; 0 measured; 25 filtered out; finished in 4.66s
  802. 198.93 s > system-err
  803. 198.93 s > [2026-09-09 23:13:23.768] @gammaloop_api::se... INFO : Running command run generate
  804. 198.93 s > [2026-09-09 23:13:23.768] @gammaloop_api::se... INFO : Starting command block generate
  805. 198.93 s > [2026-09-09 23:13:23.768] @gammaloop_api::se... INFO : Running command import model sm-default.json
  806. 198.93 s > [2026-09-09 23:13:23.768] @import::model INFO : Loading built-in JSON model sm-default
  807. 198.93 s > [2026-09-09 23:13:23.813] @gammalooprs::model INFO : The following 15 external parameters were forced to zero by the restriction card:
  808. 198.93 s > lamWS, AWS, rhoWS, etaWS, ymc, yme, ymm, MC, Me, MM, WTau, muQ, muLe, muLmu, muLtau
  809. 198.93 s > [2026-09-09 23:13:23.814] @gammalooprs::model INFO : The following 34 vertex rules were removed by the restriction card:
  810. 198.93 s > V_82 -> (c~, d, G+) | V_83 -> (t~, d, G+) | V_84 -> (c~, s, G+) | V_85 -> (t~, s, G+) | V_86 -> (u~, b, G+) | V_87 -> (c~, b, G+) | V_90 -> (c~, d, W+) | V_91 -> (t~, d, W+) | V_92 -> (u~, s, W+) | V_94 -> (t~, s, W+) | V_95 -> (u~, b, W+) | V_96 -> (c~, b, W+) | V_101 -> (e+, e-, G0) | V_102 -> (mu+, mu-, G0) | V_104 -> (e+, e-, H) | V_105 -> (mu+, mu-, H) | V_110 -> (ve~, e-, G+) | V_111 -> (vm~, mu-, G+) | V_116 -> (b~, u, G-) | V_117 -> (d~, c, G-) | V_118 -> (s~, c, G-) | V_119 -> (b~, c, G-) | V_120 -> (d~, t, G-) | V_121 -> (s~, t, G-) | V_124 -> (s~, u, W-) | V_125 -> (b~, u, W-) | V_126 -> (d~, c, W-) | V_128 -> (b~, c, W-) | V_129 -> (d~, t, W-) | V_130 -> (s~, t, W-) | V_138 -> (c~, c, G0) | V_140 -> (c~, c, H) | V_145 -> (e+, ve, G-) | V_146 -> (mu+, vm, G-)
  811. 198.93 s > [2026-09-09 23:13:23.814] @gammalooprs::model INFO : The following 36 couplings were removed by the restriction card:
  812. 198.93 s > GC_13, GC_14, GC_16, GC_17, GC_18, GC_19, GC_20, GC_22, GC_23, GC_24, GC_25, GC_26, GC_28, GC_29, GC_42, GC_43, GC_44, GC_46, GC_47, GC_48, GC_84, GC_85, GC_86, GC_87, GC_88, GC_89, GC_90, GC_91, GC_92, GC_93, GC_101, GC_102, GC_103, GC_105, GC_106, GC_107
  813. 198.93 s > [2026-09-09 23:13:23.814] @gammaloop_api::se... INFO : Running command remove processes
  814. 198.93 s > [2026-09-09 23:13:23.815] @gammaloop_api::se... INFO : Running command generate amp {} > {} [{2}] | g u
  815. 198.93 s > --numerator-grouping group_identical_graphs_up_to_scalar_rescaling
  816. 198.93 s > --max-n-bridges 0
  817. 198.93 s > --number-of-factorized-loop-subtopologies 1 1
  818. 198.93 s > --number-of-fermion-loops 1 1
  819. 198.93 s > [...]
  820. 198.93 s > [2026-09-09 23:13:23.816] @feyngen::diagram_... INFO : 0s | Δ=0s | Starting Feynman graph generation with Symbolica...
  821. 198.93 s > [2026-09-09 23:13:23.816] @feyngen::diagram_... INFO : 0s | Δ=0s | Number of graphs resulting from Symbolica generation: 3
  822. 198.93 s > [2026-09-09 23:13:23.817] @feyngen::diagram_... INFO : 0s | Δ=0s | Number of graphs retained after removal of vetoed topologies: 2
  823. 198.93 s > [2026-09-09 23:13:23.817] @feyngen::diagram_... INFO : 0s | Δ=0s | Number of graphs after vertex info assignment: 2
  824. 198.93 s > [2026-09-09 23:13:23.817] @feyngen::diagram_... INFO : 0s | Δ=0s | Number of graphs after all complete graphs filters are applied: 2
  825. 198.93 s > [2026-09-09 23:13:23.817] @feyngen::diagram_... INFO : 0s | Δ=0s | Number of graphs after closed fermion chains analysis: 1
  826. 198.93 s > [2026-09-09 23:13:23.817] @feyngen::diagram_... INFO : 0s | Δ=0s | Number of graphs after symmetrization of external states: 1
  827. 198.93 s > [2026-09-09 23:13:23.817] @feyngen::diagram_... INFO : 0s | Δ=0s | Number of graphs after canonization of vertices, edges and flows (graph labels assigned here): 1
  828. 198.93 s > [2026-09-09 23:13:23.841] @feyngen::diagram_... INFO : 0s | Δ=0s | Number of graphs after numerator-aware grouping with strategy 'up to a scalar rescaling': 1 (1 isomorphically unique graph, 0 color zero, 0 lorentz zero, 0 grouped and 0 cancellation)
  829. 198.93 s > [2026-09-09 23:13:23.841] @feyngen::diagram_... INFO : ( Sum of the symmetry factors from each graph generated = -1/2 )
  830. 198.93 s > [2026-09-09 23:13:23.841] @commands::generate INFO : Generated amplitude 1 graphs.
  831. 198.93 s > [2026-09-09 23:13:23.841] @commands::generate INFO : Only diagram generation was requested, skipping integrand generation. You can generate integrands later using the 'generate existing <options>' command.
  832. 198.93 s > [2026-09-09 23:13:23.842] @gammaloop_api::se... INFO : Running command generate
  833. 198.93 s > The application panicked (crashed).
  834. 198.93 s > Message: called `Result::unwrap()` on an `Err` value: variable __Static610 not found
  835. 198.93 s >
  836. 198.93 s > Stack backtrace:
  837. 198.93 s > 0: <anyhow::Error>::msg::<alloc::string::String>
  838. 198.93 s > 1: <symjit::symjit::compiler::IndirectTranslator as symjit::symjit::composer::Composer>::compile
  839. 198.93 s > 2: <symjit::symjit::compiler::Translator as symjit::symjit::composer::Composer>::compile
  840. 198.93 s > 3: <numerica::domains::float::complex::Complex<f64> as symbolica::evaluate::backend::JITCompiledNumber>::jit_compile
  841. 198.93 s > 4: <gammalooprs::integrands::process::evaluators::GenericEvaluator>::activate_symjit
  842. 198.93 s > 5: <gammalooprs::integrands::process::amplitude::AmplitudeIntegrand>::prepare_runtime_backends_after_generation_with_compile_times
  843. 198.93 s > 6: <gammalooprs::processes::amplitude::Amplitude>::build_integrand
  844. 198.93 s > 7: <gammalooprs::processes::process::Process>::generate_integrands
  845. 198.93 s > 8: <gammalooprs::processes::ProcessList>::generate_integrands
  846. 198.93 s > 9: <gammaloop_api::state::State>::generate_integrands
  847. 198.93 s > 10: <gammaloop_api::commands::generate::Generate>::run::<&std::path::PathBuf>
  848. 198.93 s > 11: <gammaloop_api::commands::Commands>::run
  849. 198.93 s > 12: <gammaloop_api::session::CliSession>::execute_prepared
  850. 198.93 s > 13: <gammaloop_api::session::CliSession>::execute_prepared_commands
  851. 198.93 s > 14: <gammaloop_api::session::CliSession>::execute_prepared
  852. 198.93 s > 15: <gammaloop_api::session::CliSession>::execute_command
  853. 198.93 s > 16: <gammaloop_integration_tests::CLIState>::run_command_flow
  854. 198.93 s > 17: <gammaloop_integration_tests::CLIState>::run_command
  855. 198.93 s > 18: uv::run_single_integrated_uv_case
  856. 198.93 s > 19: <uv::thermal_sunrise_uv::{closure#0} as core::ops::function::FnOnce<()>>::call_once
  857. 198.93 s > 20: test::__rust_begin_short_backtrace::<core::result::Result<(), alloc::string::String>, fn() -> core::result::Result<(), alloc::string::String>>
  858. 198.93 s > 21: test::run_test::{closure#0}
  859. 198.93 s > 22: std::sys::backtrace::__rust_begin_short_backtrace::<test::run_test::{closure#1}, ()>
  860. 198.93 s > 23: <std::thread::lifecycle::spawn_unchecked<test::run_test::{closure#1}, ()>::{closure#1} as core::ops::function::FnOnce<()>>::call_once::{shim:vtable#0}
  861. 198.93 s > 24: <std::sys::thread::unix::Thread>::new::thread_start
  862. 198.93 s > 25: start_thread
  863. 198.93 s > 26: __clone3
  864. 198.93 s > Location: /nix/store/l5xazfnr7k6r6p8mlkn38x2afab0rygz-vendor-cargo-deps/c19b7c6f923b580ac259164a89f2577984ad5ab09ee9d583b888f934adbbe8d0/symjit-2.25.0/src/symjit/compiler.rs:883
  865. 198.93 s >
  866. 198.93 s > ━━━━━━━━━━━━━━━━━━━━━━━━━━━━━━━━━━ BACKTRACE ━━━━━━━━━━━━━━━━━━━━━━━━━━━━━━━━━━━
  867. 198.93 s > 1: <color_eyre[51793ea62743adbd]::config::PanicHook>::panic_report<unknown>
  868. 198.93 s > at <unknown source file>:<unknown line>
  869. 198.93 s > 2: <color_eyre[51793ea62743adbd]::config::PanicHook>::into_panic_hook::{closure#0}<unknown>
  870. 198.93 s > at <unknown source file>:<unknown line>
  871. 198.93 s > 3: std[bcb96dfbba0ab899]::panicking::panic_with_hook<unknown>
  872. 198.93 s > at <unknown source file>:<unknown line>
  873. 198.93 s > 4: std[bcb96dfbba0ab899]::panicking::panic_handler::{closure#0}<unknown>
  874. 198.93 s > at <unknown source file>:<unknown line>
  875. 198.93 s > 5: std[bcb96dfbba0ab899]::sys::backtrace::__rust_end_short_backtrace::<std[bcb96dfbba0ab899]::panicking::panic_handler::{closure#0}, !><unknown>
  876. 198.93 s > at <unknown source file>:<unknown line>
  877. 198.93 s > 6: __rustc[6c289b9f9c454d21]::rust_begin_unwind<unknown>
  878. 198.93 s > at <unknown source file>:<unknown line>
  879. 198.93 s > 7: core[940e698046960fd5]::panicking::panic_fmt<unknown>
  880. 198.93 s > at <unknown source file>:<unknown line>
  881. 198.93 s > 8: core[940e698046960fd5]::result::unwrap_failed<unknown>
  882. 198.93 s > at <unknown source file>:<unknown line>
  883. 198.93 s > 9: <symjit[9dfb3c17cbb79ae4]::symjit::compiler::IndirectTranslator as symjit[9dfb3c17cbb79ae4]::symjit::composer::Composer>::compile<unknown>
  884. 198.93 s > at <unknown source file>:<unknown line>
  885. 198.93 s > 10: <symjit[9dfb3c17cbb79ae4]::symjit::compiler::Translator as symjit[9dfb3c17cbb79ae4]::symjit::composer::Composer>::compile<unknown>
  886. 198.93 s > at <unknown source file>:<unknown line>
  887. 198.93 s > 11: <numerica[ca5044e7d57d1d48]::domains::float::complex::Complex<f64> as symbolica[911a260017ea9deb]::evaluate::backend::JITCompiledNumber>::jit_compile<unknown>
  888. 198.93 s > at <unknown source file>:<unknown line>
  889. 198.93 s > 12: <gammalooprs[61738dd440287478]::integrands::process::evaluators::GenericEvaluator>::activate_symjit<unknown>
  890. 198.93 s > at <unknown source file>:<unknown line>
  891. 198.93 s > 13: <gammalooprs[61738dd440287478]::integrands::process::amplitude::AmplitudeIntegrand>::prepare_runtime_backends_after_generation_with_compile_times<unknown>
  892. 198.93 s > at <unknown source file>:<unknown line>
  893. 198.93 s > 14: <gammalooprs[61738dd440287478]::processes::amplitude::Amplitude>::build_integrand<unknown>
  894. 198.93 s > at <unknown source file>:<unknown line>
  895. 198.93 s > 15: <gammalooprs[61738dd440287478]::processes::process::Process>::generate_integrands<unknown>
  896. 198.93 s > at <unknown source file>:<unknown line>
  897. 198.93 s > 16: <gammalooprs[61738dd440287478]::processes::ProcessList>::generate_integrands<unknown>
  898. 198.93 s > at <unknown source file>:<unknown line>
  899. 198.93 s > 17: <gammaloop_api[781ec552bb626e12]::state::State>::generate_integrands<unknown>
  900. 198.93 s > at <unknown source file>:<unknown line>
  901. 198.93 s > 18: <gammaloop_api[781ec552bb626e12]::commands::generate::Generate>::run::<&std[bcb96dfbba0ab899]::path::PathBuf><unknown>
  902. 198.93 s > at <unknown source file>:<unknown line>
  903. 198.93 s > 19: <gammaloop_api[781ec552bb626e12]::commands::Commands>::run<unknown>
  904. 198.93 s > at <unknown source file>:<unknown line>
  905. 198.93 s > 20: <gammaloop_api[781ec552bb626e12]::session::CliSession>::execute_prepared<unknown>
  906. 198.93 s > at <unknown source file>:<unknown line>
  907. 198.93 s > 21: <gammaloop_api[781ec552bb626e12]::session::CliSession>::execute_prepared_commands<unknown>
  908. 198.93 s > at <unknown source file>:<unknown line>
  909. 198.93 s > 22: <gammaloop_api[781ec552bb626e12]::session::CliSession>::execute_prepared<unknown>
  910. 198.93 s > at <unknown source file>:<unknown line>
  911. 198.93 s > 23: <gammaloop_api[781ec552bb626e12]::session::CliSession>::execute_command<unknown>
  912. 198.93 s > at <unknown source file>:<unknown line>
  913. 198.93 s > 24: <gammaloop_integration_tests[3349793260628f2c]::CLIState>::run_command_flow<unknown>
  914. 198.93 s > at <unknown source file>:<unknown line>
  915. 198.93 s > 25: <gammaloop_integration_tests[3349793260628f2c]::CLIState>::run_command<unknown>
  916. 198.93 s > at <unknown source file>:<unknown line>
  917. 198.93 s > 26: uv[4a8ff97c1fe5666b]::run_single_integrated_uv_case<unknown>
  918. 198.93 s > at <unknown source file>:<unknown line>
  919. 198.93 s > 27: <uv[4a8ff97c1fe5666b]::thermal_sunrise_uv::{closure#0} as core[940e698046960fd5]::ops::function::FnOnce<()>>::call_once<unknown>
  920. 198.93 s > at <unknown source file>:<unknown line>
  921. 198.93 s > 28: test[75d6903177b1d7e9]::__rust_begin_short_backtrace::<core[940e698046960fd5]::result::Result<(), alloc[2ea6bcb46fca0c42]::string::String>, fn() -> core[940e698046960fd5]::result::Result<(), alloc[2ea6bcb46fca0c42]::string::String>><unknown>
  922. 198.93 s > ... omitted 18 more lines; see full nextest output above
  923. 198.93 s > =========================================
  924. 198.93 s For full logs, run:
  925. 198.93 s nix log /nix/store/85r60p7hwgsrgkazjyi3fv4lbc82mrhs-gammaloop-nextest-integration.drv
  926. 199.05 s [0 built (1 failed), 1 cRun failed.