1. 0.10 s $ /nix/store/9ypz3flqsrl5xl495mm8h645gadjsxi1-coreutils-9.11/bin/timeout --kill-after=15s 7200s /nix/store/23zk8sgzamrbmj1fday15szf7f2279s8-nix-2.34.7/bin/nix --extra-experimental-features nix-command --extra-experimental-features flakes flake clone git+https://github.com/alphal00p/gammaloop --dest /tmp/nix-ci-worker/stable-pwd/repo/
  2. 0.23 s Cloning into '/tmp/nix-ci-worker/stable-pwd/repo'...
  3. 1.08 s remote: Enumerating objects: 81983, done.
  4. 1.19 s remote: Counting objects: 0% (1/11500) remote: Counting objects: 1% (115/11500) remote: Counting objects: 2% (230/11500) remote: Counting objects: 3% (345/11500) remote: Counting objects: 4% (460/11500) remote: Counting objects: 5% (575/11500) remote: Counting objects: 6% (690/11500) remote: Counting objects: 7% (805/11500) remote: Counting objects: 8% (920/11500) remote: Counting objects: 9% (1035/11500) remote: Counting objects: 10% (1150/11500) remote: Counting objects: 11% (1265/11500) remote: Counting objects: 12% (1380/11500) remote: Counting objects: 13% (1495/11500) remote: Counting objects: 14% (1610/11500) remote: Counting objects: 15% (1725/11500) remote: Counting objects: 16% (1840/11500) remote: Counting objects: 17% (1955/11500) remote: Counting objects: 18% (2070/11500) remote: Counting objects: 19% (2185/11500) remote: Counting objects: 20% (2300/11500) remote: Counting objects: 21% (2415/11500) remote: Counting objects: 22% (2530/11500) remote: Counting objects: 23% (2645/11500) remote: Counting objects: 24% (2760/11500) remote: Counting objects: 25% (2875/11500) remote: Counting objects: 26% (2990/11500) remote: Counting objects: 27% (3105/11500) remote: Counting objects: 28% (3220/11500) remote: Counting objects: 29% (3335/11500) remote: Counting objects: 30% (3450/11500) remote: Counting objects: 31% (3565/11500) remote: Counting objects: 32% (3680/11500) remote: Counting objects: 33% (3795/11500) remote: Counting objects: 34% (3910/11500) remote: Counting objects: 35% (4025/11500) remote: Counting objects: 36% (4140/11500) remote: Counting objects: 37% (4255/11500) remote: Counting objects: 38% (4370/11500) remote: Counting objects: 39% (4485/11500) remote: Counting objects: 40% (4600/11500) remote: Counting objects: 41% (4715/11500) remote: Counting objects: 42% (4830/11500) remote: Counting objects: 43% (4945/11500) remote: Counting objects: 44% (5060/11500) remote: Counting objects: 45% (5175/11500) remote: Counting objects: 46% (5290/11500) remote: Counting objects: 47% (5405/11500) remote: Counting objects: 48% (5520/11500) remote: Counting objects: 49% (5635/11500) remote: Counting objects: 50% (5750/11500) remote: Counting objects: 51% (5865/11500) remote: Counting objects: 52% (5980/11500) remote: Counting objects: 53% (6095/11500) remote: Counting objects: 54% (6210/11500) remote: Counting objects: 55% (6325/11500) remote: Counting objects: 56% (6440/11500) remote: Counting objects: 57% (6555/11500) remote: Counting objects: 58% (6670/11500) remote: Counting objects: 59% (6785/11500) remote: Counting objects: 60% (6900/11500) remote: Counting objects: 61% (7015/11500) remote: Counting objects: 62% (7130/11500) remote: Counting objects: 63% (7245/11500) remote: Counting objects: 64% (7360/11500) remote: Counting objects: 65% (7475/11500) remote: Counting objects: 66% (7590/11500) remote: Counting objects: 67% (7705/11500) remote: Counting objects: 68% (7820/11500) remote: Counting objects: 69% (7935/11500) remote: Counting objects: 70% (8050/11500) remote: Counting objects: 71% (8165/11500) remote: Counting objects: 72% (8280/11500) remote: Counting objects: 73% (8395/11500) remote: Counting objects: 74% (8510/11500) remote: Counting objects: 75% (8625/11500) remote: Counting objects: 76% (8740/11500) remote: Counting objects: 77% (8855/11500) remote: Counting objects: 78% (8970/11500) remote: Counting objects: 79% (9085/11500) remote: Counting objects: 80% (9200/11500) remote: Counting objects: 81% (9315/11500) remote: Counting objects: 82% (9430/11500) remote: Counting objects: 83% (9545/11500) remote: Counting objects: 84% (9660/11500) remote: Counting objects: 85% (9775/11500) remote: Counting objects: 86% (9890/11500) remote: Counting objects: 87% (10005/11500) remote: Counting objects: 88% (10120/11500) remote: Counting objects: 89% (10235/11500) remote: Counting objects: 90% (10350/11500) remote: Counting objects: 91% (10465/11500) remote: Counting objects: 92% (10580/11500) remote: Counting objects: 93% (10695/11500) remote: Counting objects: 94% (10810/11500) remote: Counting objects: 95% (10925/11500) remote: Counting objects: 96% (11040/11500) remote: Counting objects: 97% (11155/11500) remote: Counting objects: 98% (11270/11500) remote: Counting objects: 99% (11385/11500) remote: Counting objects: 100% (11500/11500) remote: Counting objects: 100% (11500/11500), done.
  5. 3.60 s remote: Compressing objects: 0% (1/2701) remote: Compressing objects: 1% (28/2701) remote: Compressing objects: 2% (55/2701) remote: Compressing objects: 3% (82/2701) remote: Compressing objects: 4% (109/2701) remote: Compressing objects: 5% (136/2701) remote: Compressing objects: 6% (163/2701) remote: Compressing objects: 7% (190/2701) remote: Compressing objects: 8% (217/2701) remote: Compressing objects: 9% (244/2701) remote: Compressing objects: 10% (271/2701) remote: Compressing objects: 11% (298/2701) remote: Compressing objects: 12% (325/2701) remote: Compressing objects: 13% (352/2701) remote: Compressing objects: 14% (379/2701) remote: Compressing objects: 15% (406/2701) remote: Compressing objects: 16% (433/2701) remote: Compressing objects: 17% (460/2701) remote: Compressing objects: 18% (487/2701) remote: Compressing objects: 19% (514/2701) remote: Compressing objects: 20% (541/2701) remote: Compressing objects: 20% (564/2701) remote: Compressing objects: 21% (568/2701) remote: Compressing objects: 22% (595/2701) remote: Compressing objects: 23% (622/2701) remote: Compressing objects: 24% (649/2701) remote: Compressing objects: 25% (676/2701) remote: Compressing objects: 26% (703/2701) remote: Compressing objects: 27% (730/2701) remote: Compressing objects: 27% (746/2701) remote: Compressing objects: 28% (757/2701) remote: Compressing objects: 29% (784/2701) remote: Compressing objects: 30% (811/2701) remote: Compressing objects: 31% (838/2701) remote: Compressing objects: 32% (865/2701) remote: Compressing objects: 33% (892/2701) remote: Compressing objects: 34% (919/2701) remote: Compressing objects: 35% (946/2701) remote: Compressing objects: 36% (973/2701) remote: Compressing objects: 37% (1000/2701) remote: Compressing objects: 38% (1027/2701) remote: Compressing objects: 39% (1054/2701) remote: Compressing objects: 40% (1081/2701) remote: Compressing objects: 41% (1108/2701) remote: Compressing objects: 42% (1135/2701) remote: Compressing objects: 43% (1162/2701) remote: Compressing objects: 44% (1189/2701) remote: Compressing objects: 45% (1216/2701) remote: Compressing objects: 46% (1243/2701) remote: Compressing objects: 47% (1270/2701) remote: Compressing objects: 48% (1297/2701) remote: Compressing objects: 49% (1324/2701) remote: Compressing objects: 50% (1351/2701) remote: Compressing objects: 51% (1378/2701) remote: Compressing objects: 52% (1405/2701) remote: Compressing objects: 53% (1432/2701) remote: Compressing objects: 54% (1459/2701) remote: Compressing objects: 55% (1486/2701) remote: Compressing objects: 56% (1513/2701) remote: Compressing objects: 57% (1540/2701) remote: Compressing objects: 58% (1567/2701) remote: Compressing objects: 59% (1594/2701) remote: Compressing objects: 60% (1621/2701) remote: Compressing objects: 61% (1648/2701) remote: Compressing objects: 62% (1675/2701) remote: Compressing objects: 63% (1702/2701) remote: Compressing objects: 64% (1729/2701) remote: Compressing objects: 65% (1756/2701) remote: Compressing objects: 66% (1783/2701) remote: Compressing objects: 67% (1810/2701) remote: Compressing objects: 68% (1837/2701) remote: Compressing objects: 69% (1864/2701) remote: Compressing objects: 70% (1891/2701) remote: Compressing objects: 71% (1918/2701) remote: Compressing objects: 72% (1945/2701) remote: Compressing objects: 73% (1972/2701) remote: Compressing objects: 74% (1999/2701) remote: Compressing objects: 75% (2026/2701) remote: Compressing objects: 76% (2053/2701) remote: Compressing objects: 77% (2080/2701) remote: Compressing objects: 78% (2107/2701) remote: Compressing objects: 79% (2134/2701) remote: Compressing objects: 80% (2161/2701) remote: Compressing objects: 81% (2188/2701) remote: Compressing objects: 82% (2215/2701) remote: Compressing objects: 83% (2242/2701) remote: Compressing objects: 84% (2269/2701) remote: Compressing objects: 85% (2296/2701) remote: Compressing objects: 86% (2323/2701) remote: Compressing objects: 87% (2350/2701) remote: Compressing objects: 88% (2377/2701) remote: Compressing objects: 89% (2404/2701) remote: Compressing objects: 90% (2431/2701) remote: Compressing objects: 91% (2458/2701) remote: Compressing objects: 92% (2485/2701) remote: Compressing objects: 93% (2512/2701) remote: Compressing objects: 94% (2539/2701) remote: Compressing objects: 95% (2566/2701) remote: Compressing objects: 96% (2593/2701) remote: Compressing objects: 97% (2620/2701) remote: Compressing objects: 98% (2647/2701) remote: Compressing objects: 99% (2674/2701) remote: Compressing objects: 100% (2701/2701) remote: Compressing objects: 100% (2701/2701), done.
  6. 7.70 s Receiving objects: 0% (1/81983) Receiving objects: 1% (820/81983) Receiving objects: 2% (1640/81983) Receiving objects: 3% (2460/81983) Receiving objects: 4% (3280/81983) Receiving objects: 5% (4100/81983) Receiving objects: 6% (4919/81983), 9.21 MiB | 18.41 MiB/s Receiving objects: 7% (5739/81983), 9.21 MiB | 18.41 MiB/s Receiving objects: 8% (6559/81983), 9.21 MiB | 18.41 MiB/s Receiving objects: 9% (7379/81983), 9.21 MiB | 18.41 MiB/s Receiving objects: 10% (8199/81983), 9.21 MiB | 18.41 MiB/s Receiving objects: 11% (9019/81983), 9.21 MiB | 18.41 MiB/s Receiving objects: 12% (9838/81983), 9.21 MiB | 18.41 MiB/s Receiving objects: 13% (10658/81983), 9.21 MiB | 18.41 MiB/s Receiving objects: 14% (11478/81983), 9.21 MiB | 18.41 MiB/s Receiving objects: 15% (12298/81983), 9.21 MiB | 18.41 MiB/s Receiving objects: 16% (13118/81983), 9.21 MiB | 18.41 MiB/s Receiving objects: 17% (13938/81983), 9.21 MiB | 18.41 MiB/s Receiving objects: 18% (14757/81983), 9.21 MiB | 18.41 MiB/s Receiving objects: 19% (15577/81983), 9.21 MiB | 18.41 MiB/s Receiving objects: 20% (16397/81983), 9.21 MiB | 18.41 MiB/s Receiving objects: 21% (17217/81983), 9.21 MiB | 18.41 MiB/s Receiving objects: 22% (18037/81983), 9.21 MiB | 18.41 MiB/s Receiving objects: 23% (18857/81983), 9.21 MiB | 18.41 MiB/s Receiving objects: 24% (19676/81983), 9.21 MiB | 18.41 MiB/s Receiving objects: 25% (20496/81983), 9.21 MiB | 18.41 MiB/s Receiving objects: 26% (21316/81983), 9.21 MiB | 18.41 MiB/s Receiving objects: 27% (22136/81983), 9.21 MiB | 18.41 MiB/s Receiving objects: 27% (22649/81983), 24.65 MiB | 24.64 MiB/s Receiving objects: 28% (22956/81983), 24.65 MiB | 24.64 MiB/s Receiving objects: 29% (23776/81983), 24.65 MiB | 24.64 MiB/s Receiving objects: 30% (24595/81983), 24.65 MiB | 24.64 MiB/s Receiving objects: 31% (25415/81983), 24.65 MiB | 24.64 MiB/s Receiving objects: 32% (26235/81983), 24.65 MiB | 24.64 MiB/s Receiving objects: 33% (27055/81983), 24.65 MiB | 24.64 MiB/s Receiving objects: 34% (27875/81983), 24.65 MiB | 24.64 MiB/s Receiving objects: 35% (28695/81983), 24.65 MiB | 24.64 MiB/s Receiving objects: 36% (29514/81983), 24.65 MiB | 24.64 MiB/s Receiving objects: 37% (30334/81983), 24.65 MiB | 24.64 MiB/s Receiving objects: 38% (31154/81983), 24.65 MiB | 24.64 MiB/s Receiving objects: 39% (31974/81983), 24.65 MiB | 24.64 MiB/s Receiving objects: 40% (32794/81983), 24.65 MiB | 24.64 MiB/s Receiving objects: 41% (33614/81983), 24.65 MiB | 24.64 MiB/s Receiving objects: 42% (34433/81983), 24.65 MiB | 24.64 MiB/s Receiving objects: 43% (35253/81983), 24.65 MiB | 24.64 MiB/s Receiving objects: 44% (36073/81983), 24.65 MiB | 24.64 MiB/s Receiving objects: 45% (36893/81983), 24.65 MiB | 24.64 MiB/s Receiving objects: 46% (37713/81983), 24.65 MiB | 24.64 MiB/s Receiving objects: 47% (38533/81983), 24.65 MiB | 24.64 MiB/s Receiving objects: 48% (39352/81983), 44.74 MiB | 29.82 MiB/s Receiving objects: 49% (40172/81983), 44.74 MiB | 29.82 MiB/s Receiving objects: 50% (40992/81983), 44.74 MiB | 29.82 MiB/s Receiving objects: 51% (41812/81983), 44.74 MiB | 29.82 MiB/s Receiving objects: 52% (42632/81983), 44.74 MiB | 29.82 MiB/s Receiving objects: 53% (43451/81983), 44.74 MiB | 29.82 MiB/s Receiving objects: 54% (44271/81983), 44.74 MiB | 29.82 MiB/s Receiving objects: 55% (45091/81983), 44.74 MiB | 29.82 MiB/s Receiving objects: 56% (45911/81983), 44.74 MiB | 29.82 MiB/s Receiving objects: 57% (46731/81983), 44.74 MiB | 29.82 MiB/s Receiving objects: 58% (47551/81983), 44.74 MiB | 29.82 MiB/s Receiving objects: 58% (47558/81983), 60.24 MiB | 29.91 MiB/s Receiving objects: 59% (48370/81983), 60.24 MiB | 29.91 MiB/s Receiving objects: 60% (49190/81983), 60.24 MiB | 29.91 MiB/s Receiving objects: 61% (50010/81983), 60.24 MiB | 29.91 MiB/s Receiving objects: 62% (50830/81983), 60.24 MiB | 29.91 MiB/s Receiving objects: 63% (51650/81983), 60.24 MiB | 29.91 MiB/s Receiving objects: 64% (52470/81983), 60.24 MiB | 29.91 MiB/s Receiving objects: 65% (53289/81983), 76.46 MiB | 30.41 MiB/s Receiving objects: 66% (54109/81983), 76.46 MiB | 30.41 MiB/s Receiving objects: 67% (54929/81983), 76.46 MiB | 30.41 MiB/s Receiving objects: 68% (55749/81983), 76.46 MiB | 30.41 MiB/s Receiving objects: 69% (56569/81983), 76.46 MiB | 30.41 MiB/s Receiving objects: 70% (57389/81983), 76.46 MiB | 30.41 MiB/s Receiving objects: 71% (58208/81983), 76.46 MiB | 30.41 MiB/s Receiving objects: 72% (59028/81983), 76.46 MiB | 30.41 MiB/s Receiving objects: 73% (59848/81983), 76.46 MiB | 30.41 MiB/s Receiving objects: 74% (60668/81983), 76.46 MiB | 30.41 MiB/s Receiving objects: 74% (60898/81983), 76.46 MiB | 30.41 MiB/s Receiving objects: 75% (61488/81983), 76.46 MiB | 30.41 MiB/s Receiving objects: 76% (62308/81983), 93.25 MiB | 30.94 MiB/s Receiving objects: 77% (63127/81983), 93.25 MiB | 30.94 MiB/s Receiving objects: 78% (63947/81983), 93.25 MiB | 30.94 MiB/s Receiving objects: 79% (64767/81983), 109.11 MiB | 31.02 MiB/s Receiving objects: 80% (65587/81983), 109.11 MiB | 31.02 MiB/s Receiving objects: 81% (66407/81983), 109.11 MiB | 31.02 MiB/s Receiving objects: 82% (67227/81983), 109.11 MiB | 31.02 MiB/s Receiving objects: 83% (68046/81983), 109.11 MiB | 31.02 MiB/s Receiving objects: 84% (68866/81983), 109.11 MiB | 31.02 MiB/s Receiving objects: 85% (69686/81983), 109.11 MiB | 31.02 MiB/s Receiving objects: 86% (70506/81983), 109.11 MiB | 31.02 MiB/s Receiving objects: 87% (71326/81983), 109.11 MiB | 31.02 MiB/s Receiving objects: 88% (72146/81983), 109.11 MiB | 31.02 MiB/s Receiving objects: 89% (72965/81983), 109.11 MiB | 31.02 MiB/s Receiving objects: 90% (73785/81983), 109.11 MiB | 31.02 MiB/s Receiving objects: 91% (74605/81983), 109.11 MiB | 31.02 MiB/s Receiving objects: 92% (75425/81983), 109.11 MiB | 31.02 MiB/s Receiving objects: 93% (76245/81983), 109.11 MiB | 31.02 MiB/s Receiving objects: 94% (77065/81983), 109.11 MiB | 31.02 MiB/s Receiving objects: 95% (77884/81983), 109.11 MiB | 31.02 MiB/s Receiving objects: 96% (78704/81983), 109.11 MiB | 31.02 MiB/s Receiving objects: 97% (79524/81983), 109.11 MiB | 31.02 MiB/s Receiving objects: 97% (80319/81983), 109.11 MiB | 31.02 MiB/s Receiving objects: 98% (80344/81983), 109.11 MiB | 31.02 MiB/s Receiving objects: 99% (81164/81983), 125.15 MiB | 31.15 MiB/s remote: Total 81983 (delta 8900), reused 9414 (delta 8005), pack-reused 70483 (from 2)
  7. 7.70 s Receiving objects: 100% (81983/81983), 125.15 MiB | 31.15 MiB/s Receiving objects: 100% (81983/81983), 127.89 MiB | 31.21 MiB/s, done.
  8. 9.16 s Resolving deltas: 0% (0/55458) Resolving deltas: 1% (555/55458) Resolving deltas: 2% (1110/55458) Resolving deltas: 3% (1664/55458) Resolving deltas: 4% (2219/55458) Resolving deltas: 5% (2774/55458) Resolving deltas: 6% (3328/55458) Resolving deltas: 7% (3883/55458) Resolving deltas: 8% (4437/55458) Resolving deltas: 9% (4992/55458) Resolving deltas: 10% (5546/55458) Resolving deltas: 11% (6101/55458) Resolving deltas: 12% (6656/55458) Resolving deltas: 13% (7212/55458) Resolving deltas: 14% (7766/55458) Resolving deltas: 15% (8322/55458) Resolving deltas: 16% (8875/55458) Resolving deltas: 17% (9428/55458) Resolving deltas: 18% (9983/55458) Resolving deltas: 19% (10539/55458) Resolving deltas: 20% (11092/55458) Resolving deltas: 21% (11648/55458) Resolving deltas: 22% (12201/55458) Resolving deltas: 23% (12756/55458) Resolving deltas: 24% (13310/55458) Resolving deltas: 25% (13865/55458) Resolving deltas: 26% (14420/55458) Resolving deltas: 27% (14975/55458) Resolving deltas: 28% (15529/55458) Resolving deltas: 29% (16083/55458) Resolving deltas: 30% (16638/55458) Resolving deltas: 31% (17192/55458) Resolving deltas: 32% (17747/55458) Resolving deltas: 33% (18302/55458) Resolving deltas: 34% (18856/55458) Resolving deltas: 35% (19411/55458) Resolving deltas: 36% (19965/55458) Resolving deltas: 37% (20520/55458) Resolving deltas: 38% (21075/55458) Resolving deltas: 39% (21631/55458) Resolving deltas: 40% (22184/55458) Resolving deltas: 41% (22738/55458) Resolving deltas: 42% (23293/55458) Resolving deltas: 43% (23847/55458) Resolving deltas: 44% (24402/55458) Resolving deltas: 45% (24957/55458) Resolving deltas: 46% (25511/55458) Resolving deltas: 47% (26066/55458) Resolving deltas: 48% (26620/55458) Resolving deltas: 49% (27175/55458) Resolving deltas: 50% (27730/55458) Resolving deltas: 51% (28285/55458) Resolving deltas: 52% (28839/55458) Resolving deltas: 53% (29393/55458) Resolving deltas: 54% (29948/55458) Resolving deltas: 55% (30502/55458) Resolving deltas: 56% (31057/55458) Resolving deltas: 57% (31613/55458) Resolving deltas: 58% (32166/55458) Resolving deltas: 59% (32721/55458) Resolving deltas: 60% (33276/55458) Resolving deltas: 61% (33833/55458) Resolving deltas: 62% (34384/55458) Resolving deltas: 63% (34939/55458) Resolving deltas: 64% (35494/55458) Resolving deltas: 65% (36048/55458) Resolving deltas: 66% (36603/55458) Resolving deltas: 67% (37157/55458) Resolving deltas: 68% (37712/55458) Resolving deltas: 69% (38269/55458) Resolving deltas: 70% (38821/55458) Resolving deltas: 70% (39275/55458) Resolving deltas: 71% (39376/55458) Resolving deltas: 72% (39930/55458) Resolving deltas: 73% (40485/55458) Resolving deltas: 74% (41039/55458) Resolving deltas: 75% (41594/55458) Resolving deltas: 76% (42149/55458) Resolving deltas: 77% (42703/55458) Resolving deltas: 78% (43259/55458) Resolving deltas: 79% (43812/55458) Resolving deltas: 80% (44368/55458) Resolving deltas: 81% (44921/55458) Resolving deltas: 82% (45477/55458) Resolving deltas: 83% (46031/55458) Resolving deltas: 84% (46585/55458) Resolving deltas: 85% (47140/55458) Resolving deltas: 86% (47695/55458) Resolving deltas: 87% (48249/55458) Resolving deltas: 88% (48804/55458) Resolving deltas: 89% (49359/55458) Resolving deltas: 90% (49914/55458) Resolving deltas: 91% (50467/55458) Resolving deltas: 92% (51022/55458) Resolving deltas: 93% (51576/55458) Resolving deltas: 94% (52131/55458) Resolving deltas: 95% (52686/55458) Resolving deltas: 96% (53241/55458) Resolving deltas: 97% (53795/55458) Resolving deltas: 98% (54349/55458) Resolving deltas: 99% (54904/55458) Resolving deltas: 100% (55458/55458) Resolving deltas: 100% (55458/55458), done.
  9. 9.65 s Fetching commit 4536be27cf46d387134394bef7d376842a5ccfe5 for wip/native-symbolica-hyperbolics ...
  10. 9.65 s $ /nix/store/bcnisk3ydfgv26v2gw3zlky24g00yww2-git-2.54.0/bin/git fetch origin 4536be27cf46d387134394bef7d376842a5ccfe5
  11. 10.08 s From https://github.com/alphal00p/gammaloop
  12. 10.08 s * branch 4536be27cf46d387134394bef7d376842a5ccfe5 -> FETCH_HEAD
  13. 10.09 s $ /nix/store/9ypz3flqsrl5xl495mm8h645gadjsxi1-coreutils-9.11/bin/timeout --kill-after=15s 7200s /nix/store/bcnisk3ydfgv26v2gw3zlky24g00yww2-git-2.54.0/bin/git -c advice.detachedHead=false checkout 4536be27cf46d387134394bef7d376842a5ccfe5
  14. 10.29 s HEAD is now at 4536be27c Update symjit and use it for thermal sunrise tests
  15. 10.30 s $ /nix/store/9ypz3flqsrl5xl495mm8h645gadjsxi1-coreutils-9.11/bin/timeout --kill-after=15s 7200s /nix/store/23zk8sgzamrbmj1fday15szf7f2279s8-nix-2.34.7/bin/nix --extra-experimental-features nix-command --extra-experimental-features flakes --log-format internal-json run .#packages.x86_64-linux.nix-ci-check-gammaloop-nextest-core --print-build-logs
  16. 10.81 s
  17. 11.34 s Downloading cached source from https://cache.nix-ci.com
  18. 20.91 s Downloaded cached source (199.4 MiB) in 9.5s
  19. 20.91 s Progress: 1 of 1 downloaded from cache
  20. 30.13 s fetching Git repository 'https://github.com/symbolica-dev/symbolica'
  21. 30.82 s remote: Enumerating objects: 9552, done.
  22. 30.82 s remote: Counting objects: 0% (1/528) remote: Counting objects: 1% (6/528) remote: Counting objects: 2% (11/528) remote: Counting objects: 3% (16/528) remote: Counting objects: 4% (22/528) remote: Counting objects: 5% (27/528) remote: Counting objects: 6% (32/528) remote: Counting objects: 7% (37/528) remote: Counting objects: 8% (43/528) remote: Counting objects: 9% (48/528) remote: Counting objects: 10% (53/528) remote: Counting objects: 11% (59/528) remote: Counting objects: 12% (64/528) remote: Counting objects: 13% (69/528) remote: Counting objects: 14% (74/528) remote: Counting objects: 15% (80/528) remote: Counting objects: 16% (85/528) remote: Counting objects: 17% (90/528) remote: Counting objects: 18% (96/528) remote: Counting objects: 19% (101/528) remote: Counting objects: 20% (106/528) remote: Counting objects: 21% (111/528) remote: Counting objects: 22% (117/528) remote: Counting objects: 23% (122/528) remote: Counting objects: 24% (127/528) remote: Counting objects: 25% (132/528) remote: Counting objects: 26% (138/528) remote: Counting objects: 27% (143/528) remote: Counting objects: 28% (148/528) remote: Counting objects: 29% (154/528) remote: Counting objects: 30% (159/528) remote: Counting objects: 31% (164/528) remote: Counting objects: 32% (169/528) remote: Counting objects: 33% (175/528) remote: Counting objects: 34% (180/528) remote: Counting objects: 35% (185/528) remote: Counting objects: 36% (191/528) remote: Counting objects: 37% (196/528) remote: Counting objects: 38% (201/528) remote: Counting objects: 39% (206/528) remote: Counting objects: 40% (212/528) remote: Counting objects: 41% (217/528) remote: Counting objects: 42% (222/528) remote: Counting objects: 43% (228/528) remote: Counting objects: 44% (233/528) remote: Counting objects: 45% (238/528) remote: Counting objects: 46% (243/528) remote: Counting objects: 47% (249/528) remote: Counting objects: 48% (254/528) remote: Counting objects: 49% (259/528) remote: Counting objects: 50% (264/528) remote: Counting objects: 51% (270/528) remote: Counting objects: 52% (275/528) remote: Counting objects: 53% (280/528) remote: Counting objects: 54% (286/528) remote: Counting objects: 55% (291/528) remote: Counting objects: 56% (296/528) remote: Counting objects: 57% (301/528) remote: Counting objects: 58% (307/528) remote: Counting objects: 59% (312/528) remote: Counting objects: 60% (317/528) remote: Counting objects: 61% (323/528) remote: Counting objects: 62% (328/528) remote: Counting objects: 63% (333/528) remote: Counting objects: 64% (338/528) remote: Counting objects: 65% (344/528) remote: Counting objects: 66% (349/528) remote: Counting objects: 67% (354/528) remote: Counting objects: 68% (360/528) remote: Counting objects: 69% (365/528) remote: Counting objects: 70% (370/528) remote: Counting objects: 71% (375/528) remote: Counting objects: 72% (381/528) remote: Counting objects: 73% (386/528) remote: Counting objects: 74% (391/528) remote: Counting objects: 75% (396/528) remote: Counting objects: 76% (402/528) remote: Counting objects: 77% (407/528) remote: Counting objects: 78% (412/528) remote: Counting objects: 79% (418/528) remote: Counting objects: 80% (423/528) remote: Counting objects: 81% (428/528) remote: Counting objects: 82% (433/528) remote: Counting objects: 83% (439/528) remote: Counting objects: 84% (444/528) remote: Counting objects: 85% (449/528) remote: Counting objects: 86% (455/528) remote: Counting objects: 87% (460/528) remote: Counting objects: 88% (465/528) remote: Counting objects: 89% (470/528) remote: Counting objects: 90% (476/528) remote: Counting objects: 91% (481/528) remote: Counting objects: 92% (486/528) remote: Counting objects: 93% (492/528) remote: Counting objects: 94% (497/528) remote: Counting objects: 95% (502/528) remote: Counting objects: 96% (507/528) remote: Counting objects: 97% (513/528) remote: Counting objects: 98% (518/528) remote: Counting objects: 99% (523/528) remote: Counting objects: 100% (528/528) remote: Counting objects: 100% (528/528), done.
  23. 31.28 s remote: Compressing objects: 0% (1/103) remote: Compressing objects: 1% (2/103) remote: Compressing objects: 2% (3/103) remote: Compressing objects: 3% (4/103) remote: Compressing objects: 4% (5/103) remote: Compressing objects: 5% (6/103) remote: Compressing objects: 6% (7/103) remote: Compressing objects: 7% (8/103) remote: Compressing objects: 8% (9/103) remote: Compressing objects: 9% (10/103) remote: Compressing objects: 10% (11/103) remote: Compressing objects: 11% (12/103) remote: Compressing objects: 12% (13/103) remote: Compressing objects: 13% (14/103) remote: Compressing objects: 14% (15/103) remote: Compressing objects: 15% (16/103) remote: Compressing objects: 16% (17/103) remote: Compressing objects: 17% (18/103) remote: Compressing objects: 18% (19/103) remote: Compressing objects: 19% (20/103) remote: Compressing objects: 20% (21/103) remote: Compressing objects: 21% (22/103) remote: Compressing objects: 22% (23/103) remote: Compressing objects: 23% (24/103) remote: Compressing objects: 24% (25/103) remote: Compressing objects: 25% (26/103) remote: Compressing objects: 26% (27/103) remote: Compressing objects: 27% (28/103) remote: Compressing objects: 28% (29/103) remote: Compressing objects: 29% (30/103) remote: Compressing objects: 30% (31/103) remote: Compressing objects: 31% (32/103) remote: Compressing objects: 32% (33/103) remote: Compressing objects: 33% (34/103) remote: Compressing objects: 34% (36/103) remote: Compressing objects: 35% (37/103) remote: Compressing objects: 36% (38/103) remote: Compressing objects: 37% (39/103) remote: Compressing objects: 38% (40/103) remote: Compressing objects: 39% (41/103) remote: Compressing objects: 40% (42/103) remote: Compressing objects: 41% (43/103) remote: Compressing objects: 42% (44/103) remote: Compressing objects: 43% (45/103) remote: Compressing objects: 44% (46/103) remote: Compressing objects: 45% (47/103) remote: Compressing objects: 46% (48/103) remote: Compressing objects: 47% (49/103) remote: Compressing objects: 48% (50/103) remote: Compressing objects: 49% (51/103) remote: Compressing objects: 50% (52/103) remote: Compressing objects: 51% (53/103) remote: Compressing objects: 52% (54/103) remote: Compressing objects: 53% (55/103) remote: Compressing objects: 54% (56/103) remote: Compressing objects: 55% (57/103) remote: Compressing objects: 56% (58/103) remote: Compressing objects: 57% (59/103) remote: Compressing objects: 58% (60/103) remote: Compressing objects: 59% (61/103) remote: Compressing objects: 60% (62/103) remote: Compressing objects: 61% (63/103) remote: Compressing objects: 62% (64/103) remote: Compressing objects: 63% (65/103) remote: Compressing objects: 64% (66/103) remote: Compressing objects: 65% (67/103) remote: Compressing objects: 66% (68/103) remote: Compressing objects: 67% (70/103) remote: Compressing objects: 68% (71/103) remote: Compressing objects: 69% (72/103) remote: Compressing objects: 70% (73/103) remote: Compressing objects: 71% (74/103) remote: Compressing objects: 72% (75/103) remote: Compressing objects: 73% (76/103) remote: Compressing objects: 74% (77/103) remote: Compressing objects: 75% (78/103) remote: Compressing objects: 76% (79/103) remote: Compressing objects: 77% (80/103) remote: Compressing objects: 78% (81/103) remote: Compressing objects: 79% (82/103) remote: Compressing objects: 80% (83/103) remote: Compressing objects: 81% (84/103) remote: Compressing objects: 82% (85/103) remote: Compressing objects: 83% (86/103) remote: Compressing objects: 84% (87/103) remote: Compressing objects: 85% (88/103) remote: Compressing objects: 86% (89/103) remote: Compressing objects: 87% (90/103) remote: Compressing objects: 88% (91/103) remote: Compressing objects: 89% (92/103) remote: Compressing objects: 90% (93/103) remote: Compressing objects: 91% (94/103) remote: Compressing objects: 92% (95/103) remote: Compressing objects: 93% (96/103) remote: Compressing objects: 94% (97/103) remote: Compressing objects: 95% (98/103) remote: Compressing objects: 96% (99/103) remote: Compressing objects: 97% (100/103) remote: Compressing objects: 98% (101/103) remote: Compressing objects: 99% (102/103) remote: Compressing objects: 100% (103/103) remote: Compressing objects: 100% (103/103), done.
  24. 31.44 s Receiving objects: 0% (1/9552) Receiving objects: 1% (96/9552) Receiving objects: 2% (192/9552) Receiving objects: 3% (287/9552) Receiving objects: 4% (383/9552) Receiving objects: 5% (478/9552) Receiving objects: 6% (574/9552) Receiving objects: 7% (669/9552) Receiving objects: 8% (765/9552) Receiving objects: 9% (860/9552) Receiving objects: 10% (956/9552) Receiving objects: 11% (1051/9552) Receiving objects: 12% (1147/9552) Receiving objects: 13% (1242/9552) Receiving objects: 14% (1338/9552) Receiving objects: 15% (1433/9552) Receiving objects: 16% (1529/9552) Receiving objects: 17% (1624/9552) Receiving objects: 18% (1720/9552) Receiving objects: 19% (1815/9552) Receiving objects: 20% (1911/9552) Receiving objects: 21% (2006/9552) Receiving objects: 22% (2102/9552) Receiving objects: 23% (2197/9552) Receiving objects: 24% (2293/9552) Receiving objects: 25% (2388/9552) Receiving objects: 26% (2484/9552) Receiving objects: 27% (2580/9552) Receiving objects: 28% (2675/9552) Receiving objects: 29% (2771/9552) Receiving objects: 30% (2866/9552) Receiving objects: 31% (2962/9552) Receiving objects: 32% (3057/9552) Receiving objects: 33% (3153/9552) Receiving objects: 34% (3248/9552) Receiving objects: 35% (3344/9552) Receiving objects: 36% (3439/9552) Receiving objects: 37% (3535/9552) Receiving objects: 38% (3630/9552) Receiving objects: 39% (3726/9552) Receiving objects: 40% (3821/9552) Receiving objects: 41% (3917/9552) Receiving objects: 42% (4012/9552) Receiving objects: 43% (4108/9552) Receiving objects: 44% (4203/9552) Receiving objects: 45% (4299/9552) Receiving objects: 46% (4394/9552) Receiving objects: 47% (4490/9552) Receiving objects: 48% (4585/9552) Receiving objects: 49% (4681/9552) Receiving objects: 50% (4776/9552) Receiving objects: 51% (4872/9552) Receiving objects: 52% (4968/9552) Receiving objects: 53% (5063/9552) Receiving objects: 54% (5159/9552) Receiving objects: 55% (5254/9552) Receiving objects: 56% (5350/9552) Receiving objects: 57% (5445/9552) Receiving objects: 58% (5541/9552) Receiving objects: 59% (5636/9552) Receiving objects: 60% (5732/9552) Receiving objects: 61% (5827/9552) Receiving objects: 62% (5923/9552) Receiving objects: 63% (6018/9552) Receiving objects: 64% (6114/9552) Receiving objects: 65% (6209/9552) Receiving objects: 66% (6305/9552) Receiving objects: 67% (6400/9552) Receiving objects: 68% (6496/9552) Receiving objects: 69% (6591/9552) Receiving objects: 70% (6687/9552) Receiving objects: 71% (6782/9552) Receiving objects: 72% (6878/9552) Receiving objects: 73% (6973/9552) Receiving objects: 74% (7069/9552) Receiving objects: 75% (7164/9552) Receiving objects: 76% (7260/9552) Receiving objects: 77% (7356/9552) Receiving objects: 78% (7451/9552) Receiving objects: 79% (7547/9552) Receiving objects: 80% (7642/9552) Receiving objects: 81% (7738/9552) Receiving objects: 82% (7833/9552) Receiving objects: 83% (7929/9552) Receiving objects: 84% (8024/9552) Receiving objects: 85% (8120/9552) Receiving objects: 86% (8215/9552) Receiving objects: 87% (8311/9552) Receiving objects: 88% (8406/9552) Receiving objects: 89% (8502/9552) Receiving objects: 90% (8597/9552) Receiving objects: 91% (8693/9552) Receiving objects: 92% (8788/9552) Receiving objects: 93% (8884/9552) Receiving objects: 94% (8979/9552) Receiving objects: 95% (9075/9552) Receiving objects: 96% (9170/9552) Receiving objects: 97% (9266/9552) Receiving objects: 98% (9361/9552) Receiving objects: 99% (9457/9552) remote: Total 9552 (delta 468), reused 425 (delta 425), pack-reused 9024 (from 2)
  25. 31.44 s Receiving objects: 100% (9552/9552) Receiving objects: 100% (9552/9552), 5.79 MiB | 36.59 MiB/s, done.
  26. 31.68 s Resolving deltas: 0% (0/7517) Resolving deltas: 1% (76/7517) Resolving deltas: 2% (152/7517) Resolving deltas: 3% (226/7517) Resolving deltas: 4% (302/7517) Resolving deltas: 5% (377/7517) Resolving deltas: 6% (452/7517) Resolving deltas: 7% (527/7517) Resolving deltas: 8% (602/7517) Resolving deltas: 9% (678/7517) Resolving deltas: 10% (752/7517) Resolving deltas: 11% (827/7517) Resolving deltas: 12% (903/7517) Resolving deltas: 13% (978/7517) Resolving deltas: 14% (1057/7517) Resolving deltas: 15% (1128/7517) Resolving deltas: 16% (1203/7517) Resolving deltas: 17% (1280/7517) Resolving deltas: 18% (1355/7517) Resolving deltas: 19% (1429/7517) Resolving deltas: 20% (1504/7517) Resolving deltas: 21% (1579/7517) Resolving deltas: 22% (1654/7517) Resolving deltas: 23% (1729/7517) Resolving deltas: 24% (1805/7517) Resolving deltas: 25% (1880/7517) Resolving deltas: 26% (1955/7517) Resolving deltas: 27% (2030/7517) Resolving deltas: 28% (2105/7517) Resolving deltas: 29% (2180/7517) Resolving deltas: 30% (2256/7517) Resolving deltas: 31% (2331/7517) Resolving deltas: 32% (2406/7517) Resolving deltas: 33% (2481/7517) Resolving deltas: 34% (2556/7517) Resolving deltas: 35% (2631/7517) Resolving deltas: 36% (2707/7517) Resolving deltas: 37% (2782/7517) Resolving deltas: 38% (2857/7517) Resolving deltas: 39% (2932/7517) Resolving deltas: 40% (3007/7517) Resolving deltas: 41% (3082/7517) Resolving deltas: 42% (3158/7517) Resolving deltas: 43% (3233/7517) Resolving deltas: 44% (3308/7517) Resolving deltas: 45% (3384/7517) Resolving deltas: 46% (3458/7517) Resolving deltas: 47% (3533/7517) Resolving deltas: 48% (3610/7517) Resolving deltas: 49% (3684/7517) Resolving deltas: 50% (3759/7517) Resolving deltas: 51% (3834/7517) Resolving deltas: 52% (3909/7517) Resolving deltas: 53% (3985/7517) Resolving deltas: 54% (4060/7517) Resolving deltas: 55% (4135/7517) Resolving deltas: 56% (4211/7517) Resolving deltas: 57% (4286/7517) Resolving deltas: 58% (4362/7517) Resolving deltas: 59% (4436/7517) Resolving deltas: 60% (4511/7517) Resolving deltas: 61% (4586/7517) Resolving deltas: 62% (4661/7517) Resolving deltas: 63% (4736/7517) Resolving deltas: 64% (4811/7517) Resolving deltas: 65% (4888/7517) Resolving deltas: 66% (4962/7517) Resolving deltas: 67% (5037/7517) Resolving deltas: 68% (5113/7517) Resolving deltas: 69% (5187/7517) Resolving deltas: 70% (5263/7517) Resolving deltas: 71% (5338/7517) Resolving deltas: 72% (5413/7517) Resolving deltas: 73% (5489/7517) Resolving deltas: 74% (5563/7517) Resolving deltas: 75% (5638/7517) Resolving deltas: 76% (5713/7517) Resolving deltas: 77% (5789/7517) Resolving deltas: 78% (5864/7517) Resolving deltas: 79% (5940/7517) Resolving deltas: 80% (6014/7517) Resolving deltas: 81% (6089/7517) Resolving deltas: 82% (6164/7517) Resolving deltas: 83% (6240/7517) Resolving deltas: 84% (6315/7517) Resolving deltas: 85% (6390/7517) Resolving deltas: 86% (6465/7517) Resolving deltas: 87% (6540/7517) Resolving deltas: 88% (6616/7517) Resolving deltas: 89% (6692/7517) Resolving deltas: 90% (6766/7517) Resolving deltas: 91% (6842/7517) Resolving deltas: 92% (6916/7517) Resolving deltas: 93% (6991/7517) Resolving deltas: 94% (7066/7517) Resolving deltas: 95% (7142/7517) Resolving deltas: 96% (7218/7517) Resolving deltas: 97% (7292/7517) Resolving deltas: 98% (7367/7517) Resolving deltas: 99% (7442/7517) Resolving deltas: 100% (7517/7517) Resolving deltas: 100% (7517/7517), done.
  27. 31.80 s From https://github.com/symbolica-dev/symbolica
  28. 31.80 s * branch 0441bd7a511209dce2ca99925fe87f8b18e4bf03 -> FETCH_HEAD
  29. 34.43 s
  30. 34.44 s Downloading cached gammaloop-nextest-binaries-core-gammaloop-api from https://cache.nix-ci.com
  31. 34.44 s Downloading cached gammaloop-nextest-binaries-core-gammaloop-tracing-filter from https://cache.nix-ci.com
  32. 34.44 s Downloading cached gammaloop-nextest-binaries-core-gammaloop-tracing-filter-macros from https://cache.nix-ci.com
  33. 34.44 s Downloading cached gammaloop-nextest-binaries-core-gammalooprs from https://cache.nix-ci.com
  34. 34.45 s Downloading cached xgcc-15.2.0-libgcc from https://cache.nix-ci.com
  35. 34.45 s Downloading cached busybox from https://cache.nix-ci.com
  36. 34.45 s Downloading cached gcc-15.2.0-libgcc from https://cache.nix-ci.com
  37. 34.45 s Downloading cached libunistring from https://cache.nix-ci.com
  38. 34.45 s Downloading cached publicsuffix-list-0-unstable-2026-05 from https://cache.nix-ci.com
  39. 34.48 s Downloaded cached xgcc-15.2.0-libgcc (193 KiB) in 32ms
  40. 34.48 s Progress: 0 of 1 built, 1 of 71 downloaded from cache (8 downloading)
  41. 34.48 s Downloaded cached busybox (230 KiB) in 30ms
  42. 34.48 s Progress: 0 of 1 built, 2 of 71 downloaded from cache (7 downloading)
  43. 34.48 s Downloaded cached gcc-15.2.0-libgcc (193 KiB) in 33ms
  44. 34.48 s Progress: 0 of 1 built, 3 of 71 downloaded from cache (6 downloading)
  45. 34.48 s Downloaded cached publicsuffix-list-0-unstable-2026-05 (329 KiB) in 31ms
  46. 34.48 s Progress: 0 of 1 built, 4 of 71 downloaded from cache (5 downloading)
  47. 34.50 s Downloaded cached libunistring (2 MiB) in 52ms
  48. 34.50 s Progress: 0 of 1 built, 5 of 71 downloaded from cache (4 downloading)
  49. 34.50 s Downloading cached libidn2 from https://cache.nix-ci.com
  50. 34.51 s Downloaded cached gammaloop-nextest-binaries-core-gammaloop-tracing-filter-macros (1.7 MiB) in 67ms
  51. 34.51 s Progress: 0 of 1 built, 6 of 71 downloaded from cache (4 downloading)
  52. 34.53 s Downloaded cached libidn2 (359 KiB) in 31ms
  53. 34.53 s Progress: 0 of 1 built, 7 of 71 downloaded from cache (3 downloading)
  54. 34.53 s Downloading cached glibc-2.42 from https://cache.nix-ci.com
  55. 34.67 s Downloaded cached gammaloop-nextest-binaries-core-gammaloop-tracing-filter (8.1 MiB) in 234ms
  56. 34.67 s Progress: 0 of 1 built, 8 of 71 downloaded from cache (3 downloading)
  57. 34.93 s Downloaded cached glibc-2.42 (33.5 MiB) in 392ms
  58. 34.93 s Progress: 0 of 1 built, 9 of 71 downloaded from cache (2 downloading)
  59. 34.93 s Downloading cached attr from https://cache.nix-ci.com
  60. 34.93 s Downloading cached aws-c-common from https://cache.nix-ci.com
  61. 34.93 s Downloading cached bash from https://cache.nix-ci.com
  62. 34.93 s Downloading cached brotli-1.2.0-lib from https://cache.nix-ci.com
  63. 34.93 s Downloading cached bzip2 from https://cache.nix-ci.com
  64. 34.93 s Downloading cached editline-1.17.1-unstable-2025-05 from https://cache.nix-ci.com
  65. 34.93 s Downloading cached gcc-15.2.0-lib from https://cache.nix-ci.com
  66. 34.93 s Downloading cached hwloc-2.14.0-lib from https://cache.nix-ci.com
  67. 34.93 s Downloading cached keyutils-1.6.3-lib from https://cache.nix-ci.com
  68. 34.93 s Downloading cached libcpuid from https://cache.nix-ci.com
  69. 34.93 s Downloading cached libpsl from https://cache.nix-ci.com
  70. 34.93 s Downloading cached libseccomp-2.6.0-lib from https://cache.nix-ci.com
  71. 34.93 s Downloading cached libsodium-1.0.22-unstable-2026-04 from https://cache.nix-ci.com
  72. 34.93 s Downloading cached libxml2 from https://cache.nix-ci.com
  73. 34.95 s Downloaded cached bzip2 (86 KiB) in 18ms
  74. 34.95 s Progress: 0 of 1 built, 10 of 71 downloaded from cache (15 downloading)
  75. 34.95 s Downloading cached llhttp from https://cache.nix-ci.com
  76. 34.95 s Downloaded cached attr (90 KiB) in 19ms
  77. 34.95 s Progress: 0 of 1 built, 11 of 71 downloaded from cache (15 downloading)
  78. 34.95 s Downloading cached lowdown-3.0.1-lib from https://cache.nix-ci.com
  79. 34.96 s Downloaded cached brotli-1.2.0-lib (961 KiB) in 29ms
  80. 34.96 s Progress: 0 of 1 built, 12 of 71 downloaded from cache (15 downloading)
  81. 34.96 s Downloading cached acl from https://cache.nix-ci.com
  82. 34.97 s Downloaded cached keyutils-1.6.3-lib (41 KiB) in 43ms
  83. 34.97 s Progress: 0 of 1 built, 13 of 71 downloaded from cache (15 downloading)
  84. 34.97 s Downloading cached nghttp2-1.69.0-lib from https://cache.nix-ci.com
  85. 34.98 s Downloaded cached aws-c-common (1.1 MiB) in 54ms
  86. 34.98 s Progress: 0 of 1 built, 14 of 71 downloaded from cache (15 downloading)
  87. 34.98 s Downloaded cached editline-1.17.1-unstable-2025-05 (58 KiB) in 54ms
  88. 34.98 s Downloading cached nghttp3 from https://cache.nix-ci.com
  89. 34.98 s Progress: 0 of 1 built, 15 of 71 downloaded from cache (15 downloading)
  90. 34.98 s Downloading cached aws-c-compression from https://cache.nix-ci.com
  91. 34.98 s Downloaded cached libsodium-1.0.22-unstable-2026-04 (666 KiB) in 55ms
  92. 34.98 s Progress: 0 of 1 built, 16 of 71 downloaded from cache (15 downloading)
  93. 34.98 s Downloading cached aws-c-sdkutils from https://cache.nix-ci.com
  94. 34.99 s Downloaded cached libcpuid (326 KiB) in 56ms
  95. 34.99 s Progress: 0 of 1 built, 17 of 71 downloaded from cache (15 downloading)
  96. 34.99 s Downloading cached aws-checksums from https://cache.nix-ci.com
  97. 34.99 s Downloaded cached bash (1.8 MiB) in 57ms
  98. 34.99 s Progress: 0 of 1 built, 18 of 71 downloaded from cache (15 downloading)
  99. 34.99 s Downloaded cached libseccomp-2.6.0-lib (193 KiB) in 57ms
  100. 34.99 s Progress: 0 of 1 built, 19 of 71 downloaded from cache (15 downloading)
  101. 34.99 s Downloading cached openssl from https://cache.nix-ci.com
  102. 34.99 s Downloading cached pcre2 from https://cache.nix-ci.com
  103. 34.99 s Downloaded cached libpsl (114 KiB) in 59ms
  104. 34.99 s Progress: 0 of 1 built, 20 of 71 downloaded from cache (15 downloading)
  105. 34.99 s Downloading cached xz from https://cache.nix-ci.com
  106. 34.99 s Downloaded cached hwloc-2.14.0-lib (459 KiB) in 63ms
  107. 34.99 s Progress: 0 of 1 built, 21 of 71 downloaded from cache (15 downloading)
  108. 34.99 s Downloading cached zlib from https://cache.nix-ci.com
  109. 34.99 s Downloaded cached libxml2 (1.4 MiB) in 63ms
  110. 34.99 s Progress: 0 of 1 built, 22 of 71 downloaded from cache (15 downloading)
  111. 34.99 s Downloaded cached llhttp (89 KiB) in 47ms
  112. 34.99 s Progress: 0 of 1 built, 23 of 71 downloaded from cache (14 downloading)
  113. 35.00 s Downloaded cached lowdown-3.0.1-lib (341 KiB) in 49ms
  114. 35.00 s Progress: 0 of 1 built, 24 of 71 downloaded from cache (13 downloading)
  115. 35.00 s Downloaded cached nghttp2-1.69.0-lib (225 KiB) in 25ms
  116. 35.00 s Progress: 0 of 1 built, 25 of 71 downloaded from cache (12 downloading)
  117. 35.00 s Downloaded cached acl (125 KiB) in 40ms
  118. 35.00 s Progress: 0 of 1 built, 26 of 71 downloaded from cache (11 downloading)
  119. 35.00 s Downloaded cached nghttp3 (228 KiB) in 18ms
  120. 35.00 s Progress: 0 of 1 built, 27 of 71 downloaded from cache (10 downloading)
  121. 35.00 s Downloaded cached aws-c-compression (31 KiB) in 18ms
  122. 35.00 s Progress: 0 of 1 built, 28 of 71 downloaded from cache (9 downloading)
  123. 35.01 s Downloaded cached aws-c-sdkutils (155 KiB) in 27ms
  124. 35.01 s Progress: 0 of 1 built, 29 of 71 downloaded from cache (8 downloading)
  125. 35.01 s Downloaded cached aws-checksums (86 KiB) in 27ms
  126. 35.01 s Progress: 0 of 1 built, 30 of 71 downloaded from cache (7 downloading)
  127. 35.04 s Downloaded cached pcre2 (2 MiB) in 54ms
  128. 35.04 s Progress: 0 of 1 built, 31 of 71 downloaded from cache (6 downloading)
  129. 35.04 s Downloaded cached xz (837 KiB) in 53ms
  130. 35.04 s Progress: 0 of 1 built, 32 of 71 downloaded from cache (5 downloading)
  131. 35.05 s Downloaded cached zlib (129 KiB) in 53ms
  132. 35.05 s Progress: 0 of 1 built, 33 of 71 downloaded from cache (4 downloading)
  133. 35.05 s Downloading cached sqlite from https://cache.nix-ci.com
  134. 35.06 s Downloaded cached openssl (8.9 MiB) in 78ms
  135. 35.06 s Progress: 0 of 1 built, 34 of 71 downloaded from cache (4 downloading)
  136. 35.06 s Downloading cached aws-c-cal from https://cache.nix-ci.com
  137. 35.06 s Downloading cached krb5-1.22.2-lib from https://cache.nix-ci.com
  138. 35.06 s Downloading cached libssh2 from https://cache.nix-ci.com
  139. 35.06 s Downloading cached ngtcp2 from https://cache.nix-ci.com
  140. 35.06 s Downloading cached s2n-tls from https://cache.nix-ci.com
  141. 35.09 s Downloaded cached aws-c-cal (158 KiB) in 28ms
  142. 35.09 s Progress: 0 of 1 built, 35 of 71 downloaded from cache (8 downloading)
  143. 35.10 s Downloaded cached libssh2 (330 KiB) in 31ms
  144. 35.10 s Progress: 0 of 1 built, 36 of 71 downloaded from cache (7 downloading)
  145. 35.10 s Downloading cached libgit2-1.9.4-lib from https://cache.nix-ci.com
  146. 35.10 s Downloaded cached ngtcp2 (515 KiB) in 32ms
  147. 35.10 s Progress: 0 of 1 built, 37 of 71 downloaded from cache (7 downloading)
  148. 35.10 s Downloaded cached sqlite (5.7 MiB) in 52ms
  149. 35.10 s Progress: 0 of 1 built, 38 of 71 downloaded from cache (6 downloading)
  150. 35.10 s Downloaded cached s2n-tls (1.3 MiB) in 40ms
  151. 35.10 s Progress: 0 of 1 built, 39 of 71 downloaded from cache (5 downloading)
  152. 35.11 s Downloading cached aws-c-io from https://cache.nix-ci.com
  153. 35.11 s Downloaded cached gcc-15.2.0-lib (9.8 MiB) in 177ms
  154. 35.11 s Progress: 0 of 1 built, 40 of 71 downloaded from cache (5 downloading)
  155. 35.11 s Downloading cached boehm-gc from https://cache.nix-ci.com
  156. 35.11 s Downloading cached icu4c from https://cache.nix-ci.com
  157. 35.11 s Downloading cached onetbb from https://cache.nix-ci.com
  158. 35.11 s Downloading cached zstd from https://cache.nix-ci.com
  159. 35.11 s Downloaded cached krb5-1.22.2-lib (2.7 MiB) in 46ms
  160. 35.11 s Progress: 0 of 1 built, 41 of 71 downloaded from cache (8 downloading)
  161. 35.12 s Downloaded cached libgit2-1.9.4-lib (1.6 MiB) in 24ms
  162. 35.12 s Progress: 0 of 1 built, 42 of 71 downloaded from cache (7 downloading)
  163. 35.13 s Downloaded cached onetbb (626 KiB) in 23ms
  164. 35.13 s Progress: 0 of 1 built, 43 of 71 downloaded from cache (6 downloading)
  165. 35.13 s Downloading cached libblake3 from https://cache.nix-ci.com
  166. 35.13 s Downloaded cached aws-c-io (648 KiB) in 25ms
  167. 35.13 s Progress: 0 of 1 built, 44 of 71 downloaded from cache (6 downloading)
  168. 35.13 s Downloading cached aws-c-event-stream from https://cache.nix-ci.com
  169. 35.13 s Downloading cached aws-c-http from https://cache.nix-ci.com
  170. 35.14 s Downloaded cached boehm-gc (312 KiB) in 30ms
  171. 35.14 s Progress: 0 of 1 built, 45 of 71 downloaded from cache (7 downloading)
  172. 35.14 s Downloaded cached zstd (1.1 MiB) in 35ms
  173. 35.14 s Progress: 0 of 1 built, 46 of 71 downloaded from cache (6 downloading)
  174. 35.14 s Downloading cached libarchive-3.8.8-lib from https://cache.nix-ci.com
  175. 35.14 s Downloading cached curl from https://cache.nix-ci.com
  176. 35.16 s Downloaded cached libblake3 (117 KiB) in 25ms
  177. 35.16 s Progress: 0 of 1 built, 47 of 71 downloaded from cache (7 downloading)
  178. 35.17 s Downloaded cached aws-c-http (641 KiB) in 38ms
  179. 35.17 s Progress: 0 of 1 built, 48 of 71 downloaded from cache (6 downloading)
  180. 35.17 s Downloading cached aws-c-mqtt from https://cache.nix-ci.com
  181. 35.17 s Downloading cached aws-c-auth from https://cache.nix-ci.com
  182. 35.17 s Downloaded cached libarchive-3.8.8-lib (953 KiB) in 32ms
  183. 35.17 s Downloaded cached aws-c-event-stream (176 KiB) in 43ms
  184. 35.18 s Progress: 0 of 1 built, 49 of 71 downloaded from cache (7 downloading)
  185. 35.18 s Progress: 0 of 1 built, 50 of 71 downloaded from cache (6 downloading)
  186. 35.18 s Downloaded cached curl (1.2 MiB) in 38ms
  187. 35.18 s Progress: 0 of 1 built, 51 of 71 downloaded from cache (5 downloading)
  188. 35.19 s Downloaded cached aws-c-mqtt (557 KiB) in 15ms
  189. 35.19 s Progress: 0 of 1 built, 52 of 71 downloaded from cache (4 downloading)
  190. 35.19 s Downloaded cached aws-c-auth (387 KiB) in 21ms
  191. 35.19 s Progress: 0 of 1 built, 53 of 71 downloaded from cache (3 downloading)
  192. 35.19 s Downloading cached aws-c-s3 from https://cache.nix-ci.com
  193. 35.21 s Downloaded cached aws-c-s3 (384 KiB) in 19ms
  194. 35.21 s Progress: 0 of 1 built, 54 of 71 downloaded from cache (3 downloading)
  195. 35.21 s Downloading cached aws-crt-cpp from https://cache.nix-ci.com
  196. 35.25 s Downloaded cached aws-crt-cpp (979 KiB) in 36ms
  197. 35.25 s Progress: 0 of 1 built, 55 of 71 downloaded from cache (3 downloading)
  198. 35.41 s Downloaded cached icu4c (38.2 MiB) in 307ms
  199. 35.41 s Progress: 0 of 1 built, 56 of 71 downloaded from cache (2 downloading)
  200. 35.41 s Downloading cached boost from https://cache.nix-ci.com
  201. 35.56 s Downloaded cached boost (14.5 MiB) in 143ms
  202. 35.56 s Progress: 0 of 1 built, 57 of 71 downloaded from cache (2 downloading)
  203. 35.56 s Downloading cached nix-util from https://cache.nix-ci.com
  204. 35.59 s Downloaded cached nix-util (2.4 MiB) in 29ms
  205. 35.59 s Progress: 0 of 1 built, 58 of 71 downloaded from cache (2 downloading)
  206. 35.59 s Downloading cached nix-nswrapper from https://cache.nix-ci.com
  207. 35.59 s Downloading cached nix-store from https://cache.nix-ci.com
  208. 35.61 s Downloaded cached nix-nswrapper (131 KiB) in 22ms
  209. 35.61 s Progress: 0 of 1 built, 59 of 71 downloaded from cache (3 downloading)
  210. 35.63 s Downloaded cached nix-store (5.8 MiB) in 44ms
  211. 35.63 s Progress: 0 of 1 built, 60 of 71 downloaded from cache (2 downloading)
  212. 35.63 s Downloading cached nix-fetchers from https://cache.nix-ci.com
  213. 35.63 s Downloading cached nix-main from https://cache.nix-ci.com
  214. 35.65 s Downloaded cached nix-main (393 KiB) in 16ms
  215. 35.65 s Progress: 0 of 1 built, 61 of 71 downloaded from cache (3 downloading)
  216. 35.66 s Downloaded cached nix-fetchers (1.5 MiB) in 21ms
  217. 35.66 s Progress: 0 of 1 built, 62 of 71 downloaded from cache (2 downloading)
  218. 35.66 s Downloading cached nix-expr from https://cache.nix-ci.com
  219. 35.67 s Downloaded cached gammaloop-nextest-binaries-core-gammaloop-api (68.5 MiB) in 1.2s
  220. 35.67 s Progress: 0 of 1 built, 63 of 71 downloaded from cache (2 downloading)
  221. 35.68 s Downloaded cached nix-expr (3.3 MiB) in 28ms
  222. 35.68 s Progress: 0 of 1 built, 64 of 71 downloaded from cache (1 downloading)
  223. 35.68 s Downloading cached nix-flake from https://cache.nix-ci.com
  224. 35.70 s Downloaded cached nix-flake (956 KiB) in 16ms
  225. 35.70 s Progress: 0 of 1 built, 65 of 71 downloaded from cache (1 downloading)
  226. 35.70 s Downloading cached nix-cmd from https://cache.nix-ci.com
  227. 35.72 s Downloaded cached nix-cmd (1 MiB) in 19ms
  228. 35.72 s Progress: 0 of 1 built, 66 of 71 downloaded from cache (1 downloading)
  229. 35.72 s Downloading cached nix from https://cache.nix-ci.com
  230. 35.75 s Downloaded cached gammaloop-nextest-binaries-core-gammalooprs (79.6 MiB) in 1.3s
  231. 35.75 s Progress: 0 of 1 built, 67 of 71 downloaded from cache (1 downloading)
  232. 35.75 s Downloading cached gammaloop-nextest-binaries-core from https://cache.nix-ci.com
  233. 35.75 s Downloaded cached nix (3.9 MiB) in 26ms
  234. 35.75 s Progress: 0 of 1 built, 68 of 71 downloaded from cache (1 downloading)
  235. 35.75 s Downloading cached nix from https://cache.nix-ci.com
  236. 35.75 s Downloaded cached gammaloop-nextest-binaries-core (1640 B) in 3ms
  237. 35.75 s Progress: 0 of 1 built, 69 of 71 downloaded from cache (1 downloading)
  238. 35.76 s Downloaded cached nix (8848 B) in 12ms
  239. 35.76 s Progress: 0 of 1 built, 70 of 71 downloaded from cache
  240. 35.76 s Downloading cached nix-ci-check-gammaloop-nextest-core from https://cache.nix-ci.com
  241. 35.76 s Downloaded cached nix-ci-check-gammaloop-nextest-core (1016 B) in 3ms
  242. 35.76 s Progress: 0 of 1 built, 71 of 71 downloaded from cache
  243. 41.16 s evaluating derivation 'g copying '/nix/store/mc4j evaluating derivation 'g copying '/nix/store/mc4j evaluating derivation 'g copying '/nix/store/mc4j evaluating derivation 'g copying '/nix/store/mc4j evaluating derivation 'g querying gammaloop-nexte [16.6 KiB DL] querying u [35.8 KiB DL] querying e [0/13 built, 0/82 copied [0/22 built, 16/5/63 cop [0/21 built, 16/16/63 co [0/21 built, 16/23/63 co [0/20 built, 16/26/63 co [0/19 built, 16/32/63 co [0/19 built, 16/33/63 co [0/17 built, 12/41/63 co [0/16 built, 9/46/63 cop [0/15 built, 8/48/63 cop [2/0/15 built, 8/48/63 ccrane-dummy-cargo-target.rs (post)> Uploading to the NixCI cache: /nix/store/hd50hqi25fymr09a2w4xdiy5jmb2cfl5-crane-dummy-cargo-target.rs
  244. 41.23 s crane-dummy-cargo-target.rs (post)> warning: 'warn-short-path-literals' is deprecated, use 'lint-short-path-literals = ignore' instead
  245. 41.29 s crane-dummy-cargo-target.rs (post)> copying 0 paths...
  246. 41.37 s crane-dummy-cargo-target.rs (post)> warning: 'warn-short-path-literals' is deprecated, use 'lint-short-path-literals = ignore' instead
  247. 42.57 s crane-dummy-cargo-target.rs (post)> copying 0 paths...
  248. 42.62 s [1/1/15 built, 4/52/63 ccrane-dummy-proc-macro-cargo-target.rs (post)> Uploading to the NixCI cache: /nix/store/z0b4s6pznqwlbyw5v4bbq7k1kp721g19-crane-dummy-proc-macro-cargo-target.rs
  249. 42.67 s crane-dummy-proc-macro-cargo-target.rs (post)> warning: 'warn-short-path-literals' is deprecated, use 'lint-short-path-literals = ignore' instead
  250. 42.70 s crane-dummy-proc-macro-cargo-target.rs (post)> copying 0 paths...
  251. 42.77 s crane-dummy-proc-macro-cargo-target.rs (post)> warning: 'warn-short-path-literals' is deprecated, use 'lint-short-path-literals = ignore' instead
  252. 42.82 s crane-dummy-proc-macro-cargo-target.rs (post)> copying 0 paths...
  253. 45.60 s [2/13 built, 6/53/63 cop [2/13 built, 5/54/63 cop [2/13 built, 5/55/63 cop [2/12 built, 4/56/63 cop [2/11 built, 3/57/63 cop [2/9 built, 2/59/63 copi [2/8 built, 1/61/63 copi [2/7 built, 1/62/63 copi [2/2/7 built, 1/62/63 co [2/2/6 built, 63 copied rust-stable-with-std (post)> Uploading to the NixCI cache: /nix/store/imnwv6nazijihjlgf2h3l1qm63m7l9wk-rust-stable-with-std-2026-07-09
  254. 45.64 s rust-stable-with-std (post)> warning: 'warn-short-path-literals' is deprecated, use 'lint-short-path-literals = ignore' instead
  255. 45.66 s rust-stable-with-std (post)> copying 0 paths...
  256. 45.71 s rust-stable-with-std (post)> warning: 'warn-short-path-literals' is deprecated, use 'lint-short-path-literals = ignore' instead
  257. 45.83 s rust-stable-with-std (post)> copying 0 paths...
  258. 46.01 s [1/3/7 built, 63 copied clippy-stable-with-std (post)> Uploading to the NixCI cache: /nix/store/r4bjy93lvnfma1awpi480n2mz3af0adx-clippy-stable-with-std-2026-07-09
  259. 46.05 s clippy-stable-with-std (post)> warning: 'warn-short-path-literals' is deprecated, use 'lint-short-path-literals = ignore' instead
  260. 46.08 s clippy-stable-with-std (post)> copying 0 paths...
  261. 46.13 s clippy-stable-with-std (post)> warning: 'warn-short-path-literals' is deprecated, use 'lint-short-path-literals = ignore' instead
  262. 46.17 s clippy-stable-with-std (post)> copying 0 paths...
  263. 46.27 s [4/7 built, 63 copied (1 [1/4/6 built, 63 copied rust-stable-with-components> /nix/store/imnwv6nazijihjlgf2h3l1qm63m7l9wk-rust-stable-with-std-2026-07-09/lib:
  264. 46.27 s rust-stable-with-components> librustc_driver-a39fc8bf9e61dbb9.so: Keeping existing link to /nix/store/r4bjy93lvnfma1awpi480n2mz3af0adx-clippy-stable-with-std-2026-07-09/lib/librustc_driver-a39fc8bf9e61dbb9.so
  265. 46.27 s rust-stable-with-components> /nix/store/imnwv6nazijihjlgf2h3l1qm63m7l9wk-rust-stable-with-std-2026-07-09/bin:
  266. 46.27 s rust-stable-with-components> rust-lldb: Keeping existing link to /nix/store/r4bjy93lvnfma1awpi480n2mz3af0adx-clippy-stable-with-std-2026-07-09/bin/rust-lldb
  267. 46.27 s rust-stable-with-components> rust-gdb: Keeping existing link to /nix/store/r4bjy93lvnfma1awpi480n2mz3af0adx-clippy-stable-with-std-2026-07-09/bin/rust-gdb
  268. 46.27 s rust-stable-with-components> rust-gdbgui: Keeping existing link to /nix/store/r4bjy93lvnfma1awpi480n2mz3af0adx-clippy-stable-with-std-2026-07-09/bin/rust-gdbgui
  269. 46.27 s rust-stable-with-components> rustdoc: Keeping existing link to /nix/store/r4bjy93lvnfma1awpi480n2mz3af0adx-clippy-stable-with-std-2026-07-09/bin/rustdoc
  270. 46.27 s rust-stable-with-components> rustc: Keeping existing link to /nix/store/r4bjy93lvnfma1awpi480n2mz3af0adx-clippy-stable-with-std-2026-07-09/bin/rustc
  271. 46.88 s rust-stable-with-components (post)> Uploading to the NixCI cache: /nix/store/9pb4ikjdw4gp766ayxl6gg3b7hqm6ds4-rust-stable-with-components-2026-07-09
  272. 46.92 s rust-stable-with-components (post)> warning: 'warn-short-path-literals' is deprecated, use 'lint-short-path-literals = ignore' instead
  273. 46.95 s rust-stable-with-components (post)> copying 0 paths...
  274. 47.00 s rust-stable-with-components (post)> warning: 'warn-short-path-literals' is deprecated, use 'lint-short-path-literals = ignore' instead
  275. 47.05 s rust-stable-with-components (post)> copying 0 paths...
  276. 47.38 s [5/7 built, 63 copied (1 [1/5/6 built, 63 copied gammaloop-nextest-core> Extracting 3 binaries (including 1 non-test binary), 1 build script output directory, and 2 linked paths to /build/nextest-archive-lkqUeY
  277. 48.01 s gammaloop-nextest-core> Extracted 18 files to /build/nextest-archive-lkqUeY in 0.62s
  278. 48.02 s gammaloop-nextest-core> ------------
  279. 48.02 s gammaloop-nextest-core> Nextest run ID aefba8c2-cebb-4890-ba75-9cf89f989de5 with nextest profile: ci_gammaloop
  280. 48.02 s gammaloop-nextest-core> Starting 339 tests across 2 binaries
  281. 48.50 s gammaloop-nextest-core> ------------
  282. 48.50 s gammaloop-nextest-core> Summary [ 0.479s] 339 tests run: 339 passed, 0 skipped
  283. 48.58 s gammaloop-nextest-core>
  284. 48.58 s gammaloop-nextest-core> ========== nextest test summary ==========
  285. 48.58 s gammaloop-nextest-core> report: target/nextest/ci_gammaloop/junit.xml
  286. 48.58 s gammaloop-nextest-core> tests: 339, failures: 0, errors: 0
  287. 48.58 s gammaloop-nextest-core> No failing testcases found.
  288. 48.58 s gammaloop-nextest-core> =========================================
  289. 48.59 s gammaloop-nextest-core> Extracting 1 binary and 1 linked path to /build/nextest-archive-fOQYxc
  290. 48.66 s gammaloop-nextest-core> Extracted 7 files to /build/nextest-archive-fOQYxc in 0.07s
  291. 48.67 s gammaloop-nextest-core> ------------
  292. 48.67 s gammaloop-nextest-core> Nextest run ID bba5e536-7cda-4c14-93ba-91a6e7f0dc73 with nextest profile: ci_gammaloop
  293. 48.67 s gammaloop-nextest-core> Starting 19 tests across 1 binary
  294. 48.68 s gammaloop-nextest-core> ------------
  295. 48.68 s gammaloop-nextest-core> Summary [ 0.010s] 19 tests run: 19 passed, 0 skipped
  296. 48.71 s gammaloop-nextest-core>
  297. 48.71 s gammaloop-nextest-core> ========== nextest test summary ==========
  298. 48.71 s gammaloop-nextest-core> report: target/nextest/ci_gammaloop/junit.xml
  299. 48.71 s gammaloop-nextest-core> tests: 19, failures: 0, errors: 0
  300. 48.71 s gammaloop-nextest-core> No failing testcases found.
  301. 48.71 s gammaloop-nextest-core> =========================================
  302. 48.73 s gammaloop-nextest-core> Extracting 1 binary to /build/nextest-archive-xkNUY4
  303. 48.76 s gammaloop-nextest-core> Extracted 4 files to /build/nextest-archive-xkNUY4 in 0.03s
  304. 48.76 s gammaloop-nextest-core> ------------
  305. 48.76 s gammaloop-nextest-core> Nextest run ID 452a6c0b-3e28-41bf-b254-3b371836768f with nextest profile: ci_gammaloop
  306. 48.76 s gammaloop-nextest-core> Starting 0 tests across 1 binary
  307. 48.76 s gammaloop-nextest-core> ------------
  308. 48.76 s gammaloop-nextest-core> Summary [ 0.000s] 0 tests run: 0 passed, 0 skipped
  309. 48.79 s gammaloop-nextest-core>
  310. 48.79 s gammaloop-nextest-core> ========== nextest test summary ==========
  311. 48.79 s gammaloop-nextest-core> report: target/nextest/ci_gammaloop/junit.xml
  312. 48.79 s gammaloop-nextest-core> tests: 0, failures: 0, errors: 0
  313. 48.79 s gammaloop-nextest-core> No failing testcases found.
  314. 48.79 s gammaloop-nextest-core> =========================================
  315. 48.81 s gammaloop-nextest-core> Extracting 4 binaries, 1 build script output directory, and 2 linked paths to /build/nextest-archive-6iVCrd
  316. 49.25 s gammaloop-nextest-core> Extracted 18 files to /build/nextest-archive-6iVCrd in 0.45s
  317. 49.27 s gammaloop-nextest-core> ------------
  318. 49.27 s gammaloop-nextest-core> Nextest run ID 65d6f979-79dc-4b65-b2ed-1210ec27ef52 with nextest profile: ci_gammaloop
  319. 49.27 s gammaloop-nextest-core> Starting 483 tests across 4 binaries (61 tests skipped, including 60 tests via profile.ci_gammaloop.default-filter)
  320. 49.30 s gammaloop-nextest-core> FAIL [ 0.015s] ( 47/483) gammalooprs cff::generation::tests_cff::thermal_bubble
  321. 49.30 s gammaloop-nextest-core> stdout ---
  322. 49.30 s gammaloop-nextest-core>
  323. 49.30 s gammaloop-nextest-core> running 1 test
  324. 49.30 s gammaloop-nextest-core> test cff::generation::tests_cff::thermal_bubble ... FAILED
  325. 49.30 s gammaloop-nextest-core>
  326. 49.30 s gammaloop-nextest-core> failures:
  327. 49.30 s gammaloop-nextest-core>
  328. 49.30 s gammaloop-nextest-core> failures:
  329. 49.30 s gammaloop-nextest-core> cff::generation::tests_cff::thermal_bubble
  330. 49.30 s gammaloop-nextest-core>
  331. 49.30 s gammaloop-nextest-core> test result: FAILED. 0 passed; 1 failed; 0 ignored; 0 measured; 535 filtered out; finished in 0.01s
  332. 49.30 s gammaloop-nextest-core>
  333. 49.30 s gammaloop-nextest-core> stderr ---
  334. 49.30 s gammaloop-nextest-core>
  335. 49.30 s gammaloop-nextest-core> thread 'cff::generation::tests_cff::thermal_bubble' (1268) panicked at /nix/store/l5xazfnr7k6r6p8mlkn38x2afab0rygz-vendor-cargo-deps/5929dab090e556a579e9f3b708cd2e67c60b3d84a12b5a276f2a36cb00473133/symbolica-2.2.0/src/evaluate/evaluator.rs:295:21:
  336. 49.30 s gammaloop-nextest-core> External function 'symbolica_coth' does not have an implementation for gammalooprs::utils::F<f64>
  337. 49.30 s gammaloop-nextest-core> stack backtrace:
  338. 49.30 s gammaloop-nextest-core> 0: __rustc::rust_begin_unwind
  339. 49.30 s gammaloop-nextest-core> 1: core::panicking::panic_fmt
  340. 49.30 s gammaloop-nextest-core> 2: <symbolica::evaluate::evaluator::ExpressionEvaluator<gammalooprs::utils::F<f64>>>::evaluate_impl_no_ops
  341. 49.30 s gammaloop-nextest-core> 3: <symbolica::evaluate::evaluator::ExpressionEvaluator<gammalooprs::utils::F<f64>>>::evaluate_single
  342. 49.30 s gammaloop-nextest-core> 4: gammalooprs::cff::generation::tests_cff::thermal_bubble
  343. 49.30 s gammaloop-nextest-core> 5: <gammalooprs::cff::generation::tests_cff::thermal_bubble::{closure#0} as core::ops::function::FnOnce<()>>::call_once
  344. 49.30 s gammaloop-nextest-core> note: Some details are omitted, run with `RUST_BACKTRACE=full` for a verbose backtrace.
  345. 49.30 s gammaloop-nextest-core>
  346. 49.30 s gammaloop-nextest-core> FAIL [ 0.014s] ( 48/483) gammalooprs cff::generation::tests_cff::thermal_eight
  347. 49.30 s gammaloop-nextest-core> stdout ---
  348. 49.30 s gammaloop-nextest-core>
  349. 49.30 s gammaloop-nextest-core> running 1 test
  350. 49.30 s gammaloop-nextest-core> test cff::generation::tests_cff::thermal_eight ... FAILED
  351. 49.30 s gammaloop-nextest-core>
  352. 49.30 s gammaloop-nextest-core> failures:
  353. 49.30 s gammaloop-nextest-core>
  354. 49.30 s gammaloop-nextest-core> failures:
  355. 49.30 s gammaloop-nextest-core> cff::generation::tests_cff::thermal_eight
  356. 49.30 s gammaloop-nextest-core>
  357. 49.30 s gammaloop-nextest-core> test result: FAILED. 0 passed; 1 failed; 0 ignored; 0 measured; 535 filtered out; finished in 0.01s
  358. 49.30 s gammaloop-nextest-core>
  359. 49.30 s gammaloop-nextest-core> stderr ---
  360. 49.30 s gammaloop-nextest-core>
  361. 49.30 s gammaloop-nextest-core> thread 'cff::generation::tests_cff::thermal_eight' (1281) panicked at /nix/store/l5xazfnr7k6r6p8mlkn38x2afab0rygz-vendor-cargo-deps/5929dab090e556a579e9f3b708cd2e67c60b3d84a12b5a276f2a36cb00473133/symbolica-2.2.0/src/evaluate/evaluator.rs:295:21:
  362. 49.30 s gammaloop-nextest-core> External function 'symbolica_coth' does not have an implementation for gammalooprs::utils::F<f64>
  363. 49.30 s gammaloop-nextest-core> stack backtrace:
  364. 49.30 s gammaloop-nextest-core> 0: __rustc::rust_begin_unwind
  365. 49.30 s gammaloop-nextest-core> 1: core::panicking::panic_fmt
  366. 49.30 s gammaloop-nextest-core> 2: <symbolica::evaluate::evaluator::ExpressionEvaluator<gammalooprs::utils::F<f64>>>::evaluate_impl_no_ops
  367. 49.30 s gammaloop-nextest-core> 3: <symbolica::evaluate::evaluator::ExpressionEvaluator<gammalooprs::utils::F<f64>>>::evaluate_single
  368. 49.30 s gammaloop-nextest-core> 4: gammalooprs::cff::generation::tests_cff::thermal_eight
  369. 49.30 s gammaloop-nextest-core> 5: <gammalooprs::cff::generation::tests_cff::thermal_eight::{closure#0} as core::ops::function::FnOnce<()>>::call_once
  370. 49.30 s gammaloop-nextest-core> note: Some details are omitted, run with `RUST_BACKTRACE=full` for a verbose backtrace.
  371. 49.30 s gammaloop-nextest-core>
  372. 49.30 s gammaloop-nextest-core> FAIL [ 0.015s] ( 51/483) gammalooprs cff::generation::tests_cff::thermal_bubble_chain
  373. 49.30 s gammaloop-nextest-core> stdout ---
  374. 49.30 s gammaloop-nextest-core>
  375. 49.30 s gammaloop-nextest-core> running 1 test
  376. 49.30 s gammaloop-nextest-core> test cff::generation::tests_cff::thermal_bubble_chain ... FAILED
  377. 49.30 s gammaloop-nextest-core>
  378. 49.30 s gammaloop-nextest-core> failures:
  379. 49.30 s gammaloop-nextest-core>
  380. 49.30 s gammaloop-nextest-core> failures:
  381. 49.30 s gammaloop-nextest-core> cff::generation::tests_cff::thermal_bubble_chain
  382. 49.30 s gammaloop-nextest-core>
  383. 49.30 s gammaloop-nextest-core> test result: FAILED. 0 passed; 1 failed; 0 ignored; 0 measured; 535 filtered out; finished in 0.01s
  384. 49.30 s gammaloop-nextest-core>
  385. 49.30 s gammaloop-nextest-core> stderr ---
  386. 49.30 s gammaloop-nextest-core>
  387. 49.30 s gammaloop-nextest-core> thread 'cff::generation::tests_cff::thermal_bubble_chain' (1273) panicked at /nix/store/l5xazfnr7k6r6p8mlkn38x2afab0rygz-vendor-cargo-deps/5929dab090e556a579e9f3b708cd2e67c60b3d84a12b5a276f2a36cb00473133/symbolica-2.2.0/src/evaluate/evaluator.rs:295:21:
  388. 49.30 s gammaloop-nextest-core> External function 'symbolica_csch' does not have an implementation for gammalooprs::utils::F<f64>
  389. 49.30 s gammaloop-nextest-core> stack backtrace:
  390. 49.30 s gammaloop-nextest-core> 0: __rustc::rust_begin_unwind
  391. 49.30 s gammaloop-nextest-core> 1: core::panicking::panic_fmt
  392. 49.30 s gammaloop-nextest-core> 2: <symbolica::evaluate::evaluator::ExpressionEvaluator<gammalooprs::utils::F<f64>>>::evaluate_impl_no_ops
  393. 49.30 s gammaloop-nextest-core> 3: <symbolica::evaluate::evaluator::ExpressionEvaluator<gammalooprs::utils::F<f64>>>::evaluate_single
  394. 49.30 s gammaloop-nextest-core> 4: gammalooprs::cff::generation::tests_cff::thermal_bubble_chain
  395. 49.30 s gammaloop-nextest-core> 5: <gammalooprs::cff::generation::tests_cff::thermal_bubble_chain::{closure#0} as core::ops::function::FnOnce<()>>::call_once
  396. 49.30 s gammaloop-nextest-core> note: Some details are omitted, run with `RUST_BACKTRACE=full` for a verbose backtrace.
  397. 49.30 s gammaloop-nextest-core>
  398. 49.33 s gammaloop-nextest-core> FAIL [ 0.047s] ( 76/483) gammalooprs cff::generation::tests_cff::thermal_ring
  399. 49.33 s gammaloop-nextest-core> stdout ---
  400. 49.33 s gammaloop-nextest-core>
  401. 49.33 s gammaloop-nextest-core> running 1 test
  402. 49.33 s gammaloop-nextest-core> test cff::generation::tests_cff::thermal_ring ... FAILED
  403. 49.33 s gammaloop-nextest-core>
  404. 49.33 s gammaloop-nextest-core> failures:
  405. 49.33 s gammaloop-nextest-core>
  406. 49.33 s gammaloop-nextest-core> failures:
  407. 49.33 s gammaloop-nextest-core> cff::generation::tests_cff::thermal_ring
  408. 49.33 s gammaloop-nextest-core>
  409. 49.33 s gammaloop-nextest-core> test result: FAILED. 0 passed; 1 failed; 0 ignored; 0 measured; 535 filtered out; finished in 0.04s
  410. 49.33 s gammaloop-nextest-core>
  411. 49.33 s gammaloop-nextest-core> stderr ---
  412. 49.33 s gammaloop-nextest-core>
  413. 49.33 s gammaloop-nextest-core> thread 'cff::generation::tests_cff::thermal_ring' (1284) panicked at /nix/store/l5xazfnr7k6r6p8mlkn38x2afab0rygz-vendor-cargo-deps/5929dab090e556a579e9f3b708cd2e67c60b3d84a12b5a276f2a36cb00473133/symbolica-2.2.0/src/evaluate/evaluator.rs:295:21:
  414. 49.33 s gammaloop-nextest-core> External function 'symbolica_coth' does not have an implementation for gammalooprs::utils::F<f64>
  415. 49.33 s gammaloop-nextest-core> stack backtrace:
  416. 49.33 s gammaloop-nextest-core> 0: __rustc::rust_begin_unwind
  417. 49.33 s gammaloop-nextest-core> 1: core::panicking::panic_fmt
  418. 49.33 s gammaloop-nextest-core> 2: <symbolica::evaluate::evaluator::ExpressionEvaluator<gammalooprs::utils::F<f64>>>::evaluate_impl_no_ops
  419. 49.33 s gammaloop-nextest-core> 3: <symbolica::evaluate::evaluator::ExpressionEvaluator<gammalooprs::utils::F<f64>>>::evaluate_single
  420. 49.33 s gammaloop-nextest-core> 4: gammalooprs::cff::generation::tests_cff::thermal_ring
  421. 49.33 s gammaloop-nextest-core> 5: <gammalooprs::cff::generation::tests_cff::thermal_ring::{closure#0} as core::ops::function::FnOnce<()>>::call_once
  422. 49.33 s gammaloop-nextest-core> note: Some details are omitted, run with `RUST_BACKTRACE=full` for a verbose backtrace.
  423. 49.33 s gammaloop-nextest-core>
  424. 49.36 s gammaloop-nextest-core> FAIL [ 0.076s] ( 77/483) gammalooprs cff::generation::tests_cff::thermal_mercedes
  425. 49.36 s gammaloop-nextest-core> stdout ---
  426. 49.36 s gammaloop-nextest-core>
  427. 49.36 s gammaloop-nextest-core> running 1 test
  428. 49.36 s gammaloop-nextest-core> test cff::generation::tests_cff::thermal_mercedes ... FAILED
  429. 49.36 s gammaloop-nextest-core>
  430. 49.36 s gammaloop-nextest-core> failures:
  431. 49.36 s gammaloop-nextest-core>
  432. 49.36 s gammaloop-nextest-core> failures:
  433. 49.36 s gammaloop-nextest-core> cff::generation::tests_cff::thermal_mercedes
  434. 49.36 s gammaloop-nextest-core>
  435. 49.36 s gammaloop-nextest-core> test result: FAILED. 0 passed; 1 failed; 0 ignored; 0 measured; 535 filtered out; finished in 0.07s
  436. 49.36 s gammaloop-nextest-core>
  437. 49.36 s gammaloop-nextest-core> stderr ---
  438. 49.36 s gammaloop-nextest-core>
  439. 49.36 s gammaloop-nextest-core> thread 'cff::generation::tests_cff::thermal_mercedes' (1288) panicked at /nix/store/l5xazfnr7k6r6p8mlkn38x2afab0rygz-vendor-cargo-deps/5929dab090e556a579e9f3b708cd2e67c60b3d84a12b5a276f2a36cb00473133/symbolica-2.2.0/src/evaluate/evaluator.rs:295:21:
  440. 49.36 s gammaloop-nextest-core> External function 'symbolica_coth' does not have an implementation for gammalooprs::utils::F<f64>
  441. 49.36 s gammaloop-nextest-core> stack backtrace:
  442. 49.36 s gammaloop-nextest-core> 0: __rustc::rust_begin_unwind
  443. 49.36 s gammaloop-nextest-core> 1: core::panicking::panic_fmt
  444. 49.36 s gammaloop-nextest-core> 2: <symbolica::evaluate::evaluator::ExpressionEvaluator<gammalooprs::utils::F<f64>>>::evaluate_impl_no_ops
  445. 49.36 s gammaloop-nextest-core> 3: <symbolica::evaluate::evaluator::ExpressionEvaluator<gammalooprs::utils::F<f64>>>::evaluate_single
  446. 49.36 s gammaloop-nextest-core> 4: gammalooprs::cff::generation::tests_cff::thermal_mercedes
  447. 49.36 s gammaloop-nextest-core> 5: <gammalooprs::cff::generation::tests_cff::thermal_mercedes::{closure#0} as core::ops::function::FnOnce<()>>::call_once
  448. 49.36 s gammaloop-nextest-core> note: Some details are omitted, run with `RUST_BACKTRACE=full` for a verbose backtrace.
  449. 49.36 s gammaloop-nextest-core>
  450. 50.05 s gammaloop-nextest-core> FAIL [ 0.739s] (431/483) gammalooprs graph::feynman_graph::tests::native_thermal_distributions
  451. 50.05 s gammaloop-nextest-core> stdout ---
  452. 50.05 s gammaloop-nextest-core>
  453. 50.05 s gammaloop-nextest-core> running 1 test
  454. 50.05 s gammaloop-nextest-core> test graph::feynman_graph::tests::native_thermal_distributions ... FAILED
  455. 50.05 s gammaloop-nextest-core>
  456. 50.05 s gammaloop-nextest-core> failures:
  457. 50.05 s gammaloop-nextest-core>
  458. 50.05 s gammaloop-nextest-core> failures:
  459. 50.05 s gammaloop-nextest-core> graph::feynman_graph::tests::native_thermal_distributions
  460. 50.05 s gammaloop-nextest-core>
  461. 50.05 s gammaloop-nextest-core> test result: FAILED. 0 passed; 1 failed; 0 ignored; 0 measured; 535 filtered out; finished in 0.73s
  462. 50.05 s gammaloop-nextest-core>
  463. 50.05 s gammaloop-nextest-core> stderr ---
  464. 50.05 s gammaloop-nextest-core> The application panicked (crashed).
  465. 50.05 s gammaloop-nextest-core> Message: called `Result::unwrap()` on an `Err` value: Custom { kind: Other, error: "Could not compile code: g++ -shared -O3 -fPIC -ffast-math -funsafe-math-optimizations -march=native -o /build/gammaloop-native-thermal-1339/thermal_0_0.so /build/gammaloop-native-thermal-1339/thermal_0_0.cpp\nwarning: Skipping impure flag -march=native because NIX_ENFORCE_NO_NATIVE is set\n/build/gammaloop-native-thermal-1339/thermal_0_0.cpp: In function 'void thermal_realf64(const double*, double*, double*)':\n/build/gammaloop-native-thermal-1339/thermal_0_0.cpp:27:16: error: 'symbolica_tanh' was not declared in this scope\n 27 | Z[6] = symbolica_tanh(Z[6]);\n | ^~~~~~~~~~~~~~\n" }
  466. 50.05 s gammaloop-nextest-core> Location: crates/gammalooprs/src/graph/feynman_graph.rs:937
  467. 50.05 s gammaloop-nextest-core>
  468. 50.05 s gammaloop-nextest-core> ━━━━━━━━━━━━━━━━━━━━━━━━━━━━━━━━━━ BACKTRACE ━━━━━━━━━━━━━━━━━━━━━━━━━━━━━━━━━━━
  469. 50.05 s gammaloop-nextest-core> 1: <color_eyre[b0c9e66060e883b2]::config::PanicHook>::panic_report<unknown>
  470. 50.05 s gammaloop-nextest-core> at <unknown source file>:<unknown line>
  471. 50.05 s gammaloop-nextest-core> 2: <color_eyre[b0c9e66060e883b2]::config::PanicHook>::into_panic_hook::{closure#0}<unknown>
  472. 50.05 s gammaloop-nextest-core> at <unknown source file>:<unknown line>
  473. 50.05 s gammaloop-nextest-core> 3: std[bcb96dfbba0ab899]::panicking::panic_with_hook<unknown>
  474. 50.05 s gammaloop-nextest-core> at <unknown source file>:<unknown line>
  475. 50.05 s gammaloop-nextest-core> 4: std[bcb96dfbba0ab899]::panicking::panic_handler::{closure#0}<unknown>
  476. 50.05 s gammaloop-nextest-core> at <unknown source file>:<unknown line>
  477. 50.05 s gammaloop-nextest-core> 5: std[bcb96dfbba0ab899]::sys::backtrace::__rust_end_short_backtrace::<std[bcb96dfbba0ab899]::panicking::panic_handler::{closure#0}, !><unknown>
  478. 50.05 s gammaloop-nextest-core> at <unknown source file>:<unknown line>
  479. 50.05 s gammaloop-nextest-core> 6: __rustc[6c289b9f9c454d21]::rust_begin_unwind<unknown>
  480. 50.05 s gammaloop-nextest-core> at <unknown source file>:<unknown line>
  481. 50.05 s gammaloop-nextest-core> 7: core[940e698046960fd5]::panicking::panic_fmt<unknown>
  482. 50.05 s gammaloop-nextest-core> at <unknown source file>:<unknown line>
  483. 50.05 s gammaloop-nextest-core> 8: core[940e698046960fd5]::result::unwrap_failed<unknown>
  484. 50.05 s gammaloop-nextest-core> at <unknown source file>:<unknown line>
  485. 50.05 s gammaloop-nextest-core> 9: gammalooprs[f21b74aec46f5289]::graph::feynman_graph::tests::native_thermal_distributions<unknown>
  486. 50.05 s gammaloop-nextest-core> at <unknown source file>:<unknown line>
  487. 50.05 s gammaloop-nextest-core> 10: <gammalooprs[f21b74aec46f5289]::graph::feynman_graph::tests::native_thermal_distributions::{closure#0} as core[940e698046960fd5]::ops::function::FnOnce<()>>::call_once<unknown>
  488. 50.05 s gammaloop-nextest-core> at <unknown source file>:<unknown line>
  489. 50.05 s gammaloop-nextest-core> 11: test[75d6903177b1d7e9]::__rust_begin_short_backtrace::<core[940e698046960fd5]::result::Result<(), alloc[2ea6bcb46fca0c42]::string::String>, fn() -> core[940e698046960fd5]::result::Result<(), alloc[2ea6bcb46fca0c42]::string::String>><unknown>
  490. 50.05 s gammaloop-nextest-core> at <unknown source file>:<unknown line>
  491. 50.05 s gammaloop-nextest-core> 12: test[75d6903177b1d7e9]::run_test::{closure#0}<unknown>
  492. 50.05 s gammaloop-nextest-core> at <unknown source file>:<unknown line>
  493. 50.05 s gammaloop-nextest-core> 13: std[bcb96dfbba0ab899]::sys::backtrace::__rust_begin_short_backtrace::<test[75d6903177b1d7e9]::run_test::{closure#1}, ()><unknown>
  494. 50.05 s gammaloop-nextest-core> at <unknown source file>:<unknown line>
  495. 50.05 s gammaloop-nextest-core> 14: <std[bcb96dfbba0ab899]::thread::lifecycle::spawn_unchecked<test[75d6903177b1d7e9]::run_test::{closure#1}, ()>::{closure#1} as core[940e698046960fd5]::ops::function::FnOnce<()>>::call_once::{shim:vtable#0}<unknown>
  496. 50.05 s gammaloop-nextest-core> at <unknown source file>:<unknown line>
  497. 50.05 s gammaloop-nextest-core> 15: <std[bcb96dfbba0ab899]::sys::thread::unix::Thread>::new::thread_start<unknown>
  498. 50.05 s gammaloop-nextest-core> at <unknown source file>:<unknown line>
  499. 50.05 s gammaloop-nextest-core> 16: start_thread<unknown>
  500. 50.05 s gammaloop-nextest-core> at <unknown source file>:<unknown line>
  501. 50.05 s gammaloop-nextest-core> 17: __clone3<unknown>
  502. 50.05 s gammaloop-nextest-core> at <unknown source file>:<unknown line>
  503. 50.05 s gammaloop-nextest-core>
  504. 50.05 s gammaloop-nextest-core> Run with COLORBT_SHOW_HIDDEN=1 environment variable to disable frame filtering.
  505. 50.05 s gammaloop-nextest-core> Run with RUST_BACKTRACE=full to include source snippets.
  506. 50.05 s gammaloop-nextest-core>
  507. 55.08 s gammaloop-nextest-core> FAIL [ 5.800s] (478/483) gammalooprs cff::generation::tests_cff::thermal_bugblatter
  508. 55.08 s gammaloop-nextest-core> stdout ---
  509. 55.08 s gammaloop-nextest-core>
  510. 55.08 s gammaloop-nextest-core> running 1 test
  511. 55.08 s gammaloop-nextest-core> test cff::generation::tests_cff::thermal_bugblatter ... FAILED
  512. 55.08 s gammaloop-nextest-core>
  513. 55.08 s gammaloop-nextest-core> failures:
  514. 55.08 s gammaloop-nextest-core>
  515. 55.08 s gammaloop-nextest-core> failures:
  516. 55.08 s gammaloop-nextest-core> cff::generation::tests_cff::thermal_bugblatter
  517. 55.08 s gammaloop-nextest-core>
  518. 55.08 s gammaloop-nextest-core> test result: FAILED. 0 passed; 1 failed; 0 ignored; 0 measured; 535 filtered out; finished in 5.76s
  519. 55.08 s gammaloop-nextest-core>
  520. 55.08 s gammaloop-nextest-core> stderr ---
  521. 55.08 s gammaloop-nextest-core>
  522. 55.08 s gammaloop-nextest-core> thread 'cff::generation::tests_cff::thermal_bugblatter' (1274) panicked at /nix/store/l5xazfnr7k6r6p8mlkn38x2afab0rygz-vendor-cargo-deps/5929dab090e556a579e9f3b708cd2e67c60b3d84a12b5a276f2a36cb00473133/symbolica-2.2.0/src/evaluate/evaluator.rs:295:21:
  523. 55.08 s gammaloop-nextest-core> External function 'symbolica_coth' does not have an implementation for gammalooprs::utils::F<f64>
  524. 55.08 s gammaloop-nextest-core> stack backtrace:
  525. 55.08 s gammaloop-nextest-core> 0: __rustc::rust_begin_unwind
  526. 55.08 s gammaloop-nextest-core> 1: core::panicking::panic_fmt
  527. 55.08 s gammaloop-nextest-core> 2: <symbolica::evaluate::evaluator::ExpressionEvaluator<gammalooprs::utils::F<f64>>>::evaluate_impl_no_ops
  528. 55.08 s gammaloop-nextest-core> 3: <symbolica::evaluate::evaluator::ExpressionEvaluator<gammalooprs::utils::F<f64>>>::evaluate_single
  529. 55.08 s gammaloop-nextest-core> 4: gammalooprs::cff::generation::tests_cff::thermal_bugblatter
  530. 55.08 s gammaloop-nextest-core> 5: <gammalooprs::cff::generation::tests_cff::thermal_bugblatter::{closure#0} as core::ops::function::FnOnce<()>>::call_once
  531. 55.08 s gammaloop-nextest-core> note: Some details are omitted, run with `RUST_BACKTRACE=full` for a verbose backtrace.
  532. 55.08 s gammaloop-nextest-core>
  533. 59.18 s gammaloop-nextest-core> ------------
  534. 59.18 s gammaloop-nextest-core> Summary [ 9.916s] 483 tests run: 476 passed, 7 failed, 61 skipped
  535. 59.18 s gammaloop-nextest-core> FAIL [ 0.015s] ( 47/483) gammalooprs cff::generation::tests_cff::thermal_bubble
  536. 59.18 s gammaloop-nextest-core> stdout ---
  537. 59.18 s gammaloop-nextest-core>
  538. 59.18 s gammaloop-nextest-core> running 1 test
  539. 59.18 s gammaloop-nextest-core> test cff::generation::tests_cff::thermal_bubble ... FAILED
  540. 59.18 s gammaloop-nextest-core>
  541. 59.18 s gammaloop-nextest-core> failures:
  542. 59.18 s gammaloop-nextest-core>
  543. 59.18 s gammaloop-nextest-core> failures:
  544. 59.18 s gammaloop-nextest-core> cff::generation::tests_cff::thermal_bubble
  545. 59.18 s gammaloop-nextest-core>
  546. 59.18 s gammaloop-nextest-core> test result: FAILED. 0 passed; 1 failed; 0 ignored; 0 measured; 535 filtered out; finished in 0.01s
  547. 59.18 s gammaloop-nextest-core>
  548. 59.18 s gammaloop-nextest-core> stderr ---
  549. 59.18 s gammaloop-nextest-core>
  550. 59.18 s gammaloop-nextest-core> thread 'cff::generation::tests_cff::thermal_bubble' (1268) panicked at /nix/store/l5xazfnr7k6r6p8mlkn38x2afab0rygz-vendor-cargo-deps/5929dab090e556a579e9f3b708cd2e67c60b3d84a12b5a276f2a36cb00473133/symbolica-2.2.0/src/evaluate/evaluator.rs:295:21:
  551. 59.18 s gammaloop-nextest-core> External function 'symbolica_coth' does not have an implementation for gammalooprs::utils::F<f64>
  552. 59.18 s gammaloop-nextest-core> stack backtrace:
  553. 59.18 s gammaloop-nextest-core> 0: __rustc::rust_begin_unwind
  554. 59.18 s gammaloop-nextest-core> 1: core::panicking::panic_fmt
  555. 59.18 s gammaloop-nextest-core> 2: <symbolica::evaluate::evaluator::ExpressionEvaluator<gammalooprs::utils::F<f64>>>::evaluate_impl_no_ops
  556. 59.18 s gammaloop-nextest-core> 3: <symbolica::evaluate::evaluator::ExpressionEvaluator<gammalooprs::utils::F<f64>>>::evaluate_single
  557. 59.18 s gammaloop-nextest-core> 4: gammalooprs::cff::generation::tests_cff::thermal_bubble
  558. 59.18 s gammaloop-nextest-core> 5: <gammalooprs::cff::generation::tests_cff::thermal_bubble::{closure#0} as core::ops::function::FnOnce<()>>::call_once
  559. 59.18 s gammaloop-nextest-core> note: Some details are omitted, run with `RUST_BACKTRACE=full` for a verbose backtrace.
  560. 59.18 s gammaloop-nextest-core>
  561. 59.18 s gammaloop-nextest-core> FAIL [ 0.014s] ( 48/483) gammalooprs cff::generation::tests_cff::thermal_eight
  562. 59.18 s gammaloop-nextest-core> stdout ---
  563. 59.18 s gammaloop-nextest-core>
  564. 59.18 s gammaloop-nextest-core> running 1 test
  565. 59.18 s gammaloop-nextest-core> test cff::generation::tests_cff::thermal_eight ... FAILED
  566. 59.18 s gammaloop-nextest-core>
  567. 59.18 s gammaloop-nextest-core> failures:
  568. 59.18 s gammaloop-nextest-core>
  569. 59.18 s gammaloop-nextest-core> failures:
  570. 59.18 s gammaloop-nextest-core> cff::generation::tests_cff::thermal_eight
  571. 59.18 s gammaloop-nextest-core>
  572. 59.18 s gammaloop-nextest-core> test result: FAILED. 0 passed; 1 failed; 0 ignored; 0 measured; 535 filtered out; finished in 0.01s
  573. 59.18 s gammaloop-nextest-core>
  574. 59.18 s gammaloop-nextest-core> stderr ---
  575. 59.18 s gammaloop-nextest-core>
  576. 59.18 s gammaloop-nextest-core> thread 'cff::generation::tests_cff::thermal_eight' (1281) panicked at /nix/store/l5xazfnr7k6r6p8mlkn38x2afab0rygz-vendor-cargo-deps/5929dab090e556a579e9f3b708cd2e67c60b3d84a12b5a276f2a36cb00473133/symbolica-2.2.0/src/evaluate/evaluator.rs:295:21:
  577. 59.18 s gammaloop-nextest-core> External function 'symbolica_coth' does not have an implementation for gammalooprs::utils::F<f64>
  578. 59.18 s gammaloop-nextest-core> stack backtrace:
  579. 59.18 s gammaloop-nextest-core> 0: __rustc::rust_begin_unwind
  580. 59.18 s gammaloop-nextest-core> 1: core::panicking::panic_fmt
  581. 59.18 s gammaloop-nextest-core> 2: <symbolica::evaluate::evaluator::ExpressionEvaluator<gammalooprs::utils::F<f64>>>::evaluate_impl_no_ops
  582. 59.18 s gammaloop-nextest-core> 3: <symbolica::evaluate::evaluator::ExpressionEvaluator<gammalooprs::utils::F<f64>>>::evaluate_single
  583. 59.18 s gammaloop-nextest-core> 4: gammalooprs::cff::generation::tests_cff::thermal_eight
  584. 59.18 s gammaloop-nextest-core> 5: <gammalooprs::cff::generation::tests_cff::thermal_eight::{closure#0} as core::ops::function::FnOnce<()>>::call_once
  585. 59.18 s gammaloop-nextest-core> note: Some details are omitted, run with `RUST_BACKTRACE=full` for a verbose backtrace.
  586. 59.18 s gammaloop-nextest-core>
  587. 59.18 s gammaloop-nextest-core> FAIL [ 0.015s] ( 51/483) gammalooprs cff::generation::tests_cff::thermal_bubble_chain
  588. 59.18 s gammaloop-nextest-core> stdout ---
  589. 59.18 s gammaloop-nextest-core>
  590. 59.18 s gammaloop-nextest-core> running 1 test
  591. 59.18 s gammaloop-nextest-core> test cff::generation::tests_cff::thermal_bubble_chain ... FAILED
  592. 59.18 s gammaloop-nextest-core>
  593. 59.18 s gammaloop-nextest-core> failures:
  594. 59.18 s gammaloop-nextest-core>
  595. 59.18 s gammaloop-nextest-core> failures:
  596. 59.18 s gammaloop-nextest-core> cff::generation::tests_cff::thermal_bubble_chain
  597. 59.18 s gammaloop-nextest-core>
  598. 59.18 s gammaloop-nextest-core> test result: FAILED. 0 passed; 1 failed; 0 ignored; 0 measured; 535 filtered out; finished in 0.01s
  599. 59.18 s gammaloop-nextest-core>
  600. 59.18 s gammaloop-nextest-core> stderr ---
  601. 59.18 s gammaloop-nextest-core>
  602. 59.18 s gammaloop-nextest-core> thread 'cff::generation::tests_cff::thermal_bubble_chain' (1273) panicked at /nix/store/l5xazfnr7k6r6p8mlkn38x2afab0rygz-vendor-cargo-deps/5929dab090e556a579e9f3b708cd2e67c60b3d84a12b5a276f2a36cb00473133/symbolica-2.2.0/src/evaluate/evaluator.rs:295:21:
  603. 59.18 s gammaloop-nextest-core> External function 'symbolica_csch' does not have an implementation for gammalooprs::utils::F<f64>
  604. 59.18 s gammaloop-nextest-core> stack backtrace:
  605. 59.18 s gammaloop-nextest-core> 0: __rustc::rust_begin_unwind
  606. 59.18 s gammaloop-nextest-core> 1: core::panicking::panic_fmt
  607. 59.18 s gammaloop-nextest-core> 2: <symbolica::evaluate::evaluator::ExpressionEvaluator<gammalooprs::utils::F<f64>>>::evaluate_impl_no_ops
  608. 59.18 s gammaloop-nextest-core> 3: <symbolica::evaluate::evaluator::ExpressionEvaluator<gammalooprs::utils::F<f64>>>::evaluate_single
  609. 59.18 s gammaloop-nextest-core> 4: gammalooprs::cff::generation::tests_cff::thermal_bubble_chain
  610. 59.18 s gammaloop-nextest-core> 5: <gammalooprs::cff::generation::tests_cff::thermal_bubble_chain::{closure#0} as core::ops::function::FnOnce<()>>::call_once
  611. 59.18 s gammaloop-nextest-core> note: Some details are omitted, run with `RUST_BACKTRACE=full` for a verbose backtrace.
  612. 59.18 s gammaloop-nextest-core>
  613. 59.18 s gammaloop-nextest-core> FAIL [ 0.047s] ( 76/483) gammalooprs cff::generation::tests_cff::thermal_ring
  614. 59.18 s gammaloop-nextest-core> stdout ---
  615. 59.18 s gammaloop-nextest-core>
  616. 59.18 s gammaloop-nextest-core> running 1 test
  617. 59.18 s gammaloop-nextest-core> test cff::generation::tests_cff::thermal_ring ... FAILED
  618. 59.18 s gammaloop-nextest-core>
  619. 59.18 s gammaloop-nextest-core> failures:
  620. 59.18 s gammaloop-nextest-core>
  621. 59.18 s gammaloop-nextest-core> failures:
  622. 59.18 s gammaloop-nextest-core> cff::generation::tests_cff::thermal_ring
  623. 59.18 s gammaloop-nextest-core>
  624. 59.18 s gammaloop-nextest-core> test result: FAILED. 0 passed; 1 failed; 0 ignored; 0 measured; 535 filtered out; finished in 0.04s
  625. 59.18 s gammaloop-nextest-core>
  626. 59.18 s gammaloop-nextest-core> stderr ---
  627. 59.18 s gammaloop-nextest-core>
  628. 59.18 s gammaloop-nextest-core> thread 'cff::generation::tests_cff::thermal_ring' (1284) panicked at /nix/store/l5xazfnr7k6r6p8mlkn38x2afab0rygz-vendor-cargo-deps/5929dab090e556a579e9f3b708cd2e67c60b3d84a12b5a276f2a36cb00473133/symbolica-2.2.0/src/evaluate/evaluator.rs:295:21:
  629. 59.18 s gammaloop-nextest-core> External function 'symbolica_coth' does not have an implementation for gammalooprs::utils::F<f64>
  630. 59.18 s gammaloop-nextest-core> stack backtrace:
  631. 59.18 s gammaloop-nextest-core> 0: __rustc::rust_begin_unwind
  632. 59.18 s gammaloop-nextest-core> 1: core::panicking::panic_fmt
  633. 59.18 s gammaloop-nextest-core> 2: <symbolica::evaluate::evaluator::ExpressionEvaluator<gammalooprs::utils::F<f64>>>::evaluate_impl_no_ops
  634. 59.18 s gammaloop-nextest-core> 3: <symbolica::evaluate::evaluator::ExpressionEvaluator<gammalooprs::utils::F<f64>>>::evaluate_single
  635. 59.18 s gammaloop-nextest-core> 4: gammalooprs::cff::generation::tests_cff::thermal_ring
  636. 59.18 s gammaloop-nextest-core> 5: <gammalooprs::cff::generation::tests_cff::thermal_ring::{closure#0} as core::ops::function::FnOnce<()>>::call_once
  637. 59.18 s gammaloop-nextest-core> note: Some details are omitted, run with `RUST_BACKTRACE=full` for a verbose backtrace.
  638. 59.18 s gammaloop-nextest-core>
  639. 59.18 s gammaloop-nextest-core> FAIL [ 0.076s] ( 77/483) gammalooprs cff::generation::tests_cff::thermal_mercedes
  640. 59.18 s gammaloop-nextest-core> stdout ---
  641. 59.18 s gammaloop-nextest-core>
  642. 59.18 s gammaloop-nextest-core> running 1 test
  643. 59.18 s gammaloop-nextest-core> test cff::generation::tests_cff::thermal_mercedes ... FAILED
  644. 59.18 s gammaloop-nextest-core>
  645. 59.18 s gammaloop-nextest-core> failures:
  646. 59.18 s gammaloop-nextest-core>
  647. 59.18 s gammaloop-nextest-core> failures:
  648. 59.18 s gammaloop-nextest-core> cff::generation::tests_cff::thermal_mercedes
  649. 59.18 s gammaloop-nextest-core>
  650. 59.18 s gammaloop-nextest-core> test result: FAILED. 0 passed; 1 failed; 0 ignored; 0 measured; 535 filtered out; finished in 0.07s
  651. 59.18 s gammaloop-nextest-core>
  652. 59.18 s gammaloop-nextest-core> stderr ---
  653. 59.18 s gammaloop-nextest-core>
  654. 59.18 s gammaloop-nextest-core> thread 'cff::generation::tests_cff::thermal_mercedes' (1288) panicked at /nix/store/l5xazfnr7k6r6p8mlkn38x2afab0rygz-vendor-cargo-deps/5929dab090e556a579e9f3b708cd2e67c60b3d84a12b5a276f2a36cb00473133/symbolica-2.2.0/src/evaluate/evaluator.rs:295:21:
  655. 59.18 s gammaloop-nextest-core> External function 'symbolica_coth' does not have an implementation for gammalooprs::utils::F<f64>
  656. 59.18 s gammaloop-nextest-core> stack backtrace:
  657. 59.18 s gammaloop-nextest-core> 0: __rustc::rust_begin_unwind
  658. 59.18 s gammaloop-nextest-core> 1: core::panicking::panic_fmt
  659. 59.18 s gammaloop-nextest-core> 2: <symbolica::evaluate::evaluator::ExpressionEvaluator<gammalooprs::utils::F<f64>>>::evaluate_impl_no_ops
  660. 59.18 s gammaloop-nextest-core> 3: <symbolica::evaluate::evaluator::ExpressionEvaluator<gammalooprs::utils::F<f64>>>::evaluate_single
  661. 59.18 s gammaloop-nextest-core> 4: gammalooprs::cff::generation::tests_cff::thermal_mercedes
  662. 59.18 s gammaloop-nextest-core> 5: <gammalooprs::cff::generation::tests_cff::thermal_mercedes::{closure#0} as core::ops::function::FnOnce<()>>::call_once
  663. 59.18 s gammaloop-nextest-core> note: Some details are omitted, run with `RUST_BACKTRACE=full` for a verbose backtrace.
  664. 59.18 s gammaloop-nextest-core>
  665. 59.18 s gammaloop-nextest-core> FAIL [ 0.739s] (431/483) gammalooprs graph::feynman_graph::tests::native_thermal_distributions
  666. 59.18 s gammaloop-nextest-core> stdout ---
  667. 59.18 s gammaloop-nextest-core>
  668. 59.18 s gammaloop-nextest-core> running 1 test
  669. 59.18 s gammaloop-nextest-core> test graph::feynman_graph::tests::native_thermal_distributions ... FAILED
  670. 59.18 s gammaloop-nextest-core>
  671. 59.18 s gammaloop-nextest-core> failures:
  672. 59.18 s gammaloop-nextest-core>
  673. 59.18 s gammaloop-nextest-core> failures:
  674. 59.18 s gammaloop-nextest-core> graph::feynman_graph::tests::native_thermal_distributions
  675. 59.18 s gammaloop-nextest-core>
  676. 59.18 s gammaloop-nextest-core> test result: FAILED. 0 passed; 1 failed; 0 ignored; 0 measured; 535 filtered out; finished in 0.73s
  677. 59.18 s gammaloop-nextest-core>
  678. 59.18 s gammaloop-nextest-core> stderr ---
  679. 59.18 s gammaloop-nextest-core> The application panicked (crashed).
  680. 59.18 s gammaloop-nextest-core> Message: called `Result::unwrap()` on an `Err` value: Custom { kind: Other, error: "Could not compile code: g++ -shared -O3 -fPIC -ffast-math -funsafe-math-optimizations -march=native -o /build/gammaloop-native-thermal-1339/thermal_0_0.so /build/gammaloop-native-thermal-1339/thermal_0_0.cpp\nwarning: Skipping impure flag -march=native because NIX_ENFORCE_NO_NATIVE is set\n/build/gammaloop-native-thermal-1339/thermal_0_0.cpp: In function 'void thermal_realf64(const double*, double*, double*)':\n/build/gammaloop-native-thermal-1339/thermal_0_0.cpp:27:16: error: 'symbolica_tanh' was not declared in this scope\n 27 | Z[6] = symbolica_tanh(Z[6]);\n | ^~~~~~~~~~~~~~\n" }
  681. 59.18 s gammaloop-nextest-core> Location: crates/gammalooprs/src/graph/feynman_graph.rs:937
  682. 59.18 s gammaloop-nextest-core>
  683. 59.18 s gammaloop-nextest-core> ━━━━━━━━━━━━━━━━━━━━━━━━━━━━━━━━━━ BACKTRACE ━━━━━━━━━━━━━━━━━━━━━━━━━━━━━━━━━━━
  684. 59.18 s gammaloop-nextest-core> 1: <color_eyre[b0c9e66060e883b2]::config::PanicHook>::panic_report<unknown>
  685. 59.18 s gammaloop-nextest-core> at <unknown source file>:<unknown line>
  686. 59.18 s gammaloop-nextest-core> 2: <color_eyre[b0c9e66060e883b2]::config::PanicHook>::into_panic_hook::{closure#0}<unknown>
  687. 59.18 s gammaloop-nextest-core> at <unknown source file>:<unknown line>
  688. 59.18 s gammaloop-nextest-core> 3: std[bcb96dfbba0ab899]::panicking::panic_with_hook<unknown>
  689. 59.18 s gammaloop-nextest-core> at <unknown source file>:<unknown line>
  690. 59.18 s gammaloop-nextest-core> 4: std[bcb96dfbba0ab899]::panicking::panic_handler::{closure#0}<unknown>
  691. 59.18 s gammaloop-nextest-core> at <unknown source file>:<unknown line>
  692. 59.18 s gammaloop-nextest-core> 5: std[bcb96dfbba0ab899]::sys::backtrace::__rust_end_short_backtrace::<std[bcb96dfbba0ab899]::panicking::panic_handler::{closure#0}, !><unknown>
  693. 59.18 s gammaloop-nextest-core> at <unknown source file>:<unknown line>
  694. 59.18 s gammaloop-nextest-core> 6: __rustc[6c289b9f9c454d21]::rust_begin_unwind<unknown>
  695. 59.18 s gammaloop-nextest-core> at <unknown source file>:<unknown line>
  696. 59.18 s gammaloop-nextest-core> 7: core[940e698046960fd5]::panicking::panic_fmt<unknown>
  697. 59.18 s gammaloop-nextest-core> at <unknown source file>:<unknown line>
  698. 59.18 s gammaloop-nextest-core> 8: core[940e698046960fd5]::result::unwrap_failed<unknown>
  699. 59.18 s gammaloop-nextest-core> at <unknown source file>:<unknown line>
  700. 59.18 s gammaloop-nextest-core> 9: gammalooprs[f21b74aec46f5289]::graph::feynman_graph::tests::native_thermal_distributions<unknown>
  701. 59.18 s gammaloop-nextest-core> at <unknown source file>:<unknown line>
  702. 59.18 s gammaloop-nextest-core> 10: <gammalooprs[f21b74aec46f5289]::graph::feynman_graph::tests::native_thermal_distributions::{closure#0} as core[940e698046960fd5]::ops::function::FnOnce<()>>::call_once<unknown>
  703. 59.18 s gammaloop-nextest-core> at <unknown source file>:<unknown line>
  704. 59.18 s gammaloop-nextest-core> 11: test[75d6903177b1d7e9]::__rust_begin_short_backtrace::<core[940e698046960fd5]::result::Result<(), alloc[2ea6bcb46fca0c42]::string::String>, fn() -> core[940e698046960fd5]::result::Result<(), alloc[2ea6bcb46fca0c42]::string::String>><unknown>
  705. 59.18 s gammaloop-nextest-core> at <unknown source file>:<unknown line>
  706. 59.18 s gammaloop-nextest-core> 12: test[75d6903177b1d7e9]::run_test::{closure#0}<unknown>
  707. 59.18 s gammaloop-nextest-core> at <unknown source file>:<unknown line>
  708. 59.18 s gammaloop-nextest-core> 13: std[bcb96dfbba0ab899]::sys::backtrace::__rust_begin_short_backtrace::<test[75d6903177b1d7e9]::run_test::{closure#1}, ()><unknown>
  709. 59.18 s gammaloop-nextest-core> at <unknown source file>:<unknown line>
  710. 59.18 s gammaloop-nextest-core> 14: <std[bcb96dfbba0ab899]::thread::lifecycle::spawn_unchecked<test[75d6903177b1d7e9]::run_test::{closure#1}, ()>::{closure#1} as core[940e698046960fd5]::ops::function::FnOnce<()>>::call_once::{shim:vtable#0}<unknown>
  711. 59.18 s gammaloop-nextest-core> at <unknown source file>:<unknown line>
  712. 59.18 s gammaloop-nextest-core> 15: <std[bcb96dfbba0ab899]::sys::thread::unix::Thread>::new::thread_start<unknown>
  713. 59.19 s gammaloop-nextest-core> at <unknown source file>:<unknown line>
  714. 59.19 s gammaloop-nextest-core> 16: start_thread<unknown>
  715. 59.19 s gammaloop-nextest-core> at <unknown source file>:<unknown line>
  716. 59.19 s gammaloop-nextest-core> 17: __clone3<unknown>
  717. 59.19 s gammaloop-nextest-core> at <unknown source file>:<unknown line>
  718. 59.19 s gammaloop-nextest-core>
  719. 59.19 s gammaloop-nextest-core> Run with COLORBT_SHOW_HIDDEN=1 environment variable to disable frame filtering.
  720. 59.19 s gammaloop-nextest-core> Run with RUST_BACKTRACE=full to include source snippets.
  721. 59.19 s gammaloop-nextest-core>
  722. 59.19 s gammaloop-nextest-core> FAIL [ 5.800s] (478/483) gammalooprs cff::generation::tests_cff::thermal_bugblatter
  723. 59.19 s gammaloop-nextest-core> stdout ---
  724. 59.19 s gammaloop-nextest-core>
  725. 59.19 s gammaloop-nextest-core> running 1 test
  726. 59.19 s gammaloop-nextest-core> test cff::generation::tests_cff::thermal_bugblatter ... FAILED
  727. 59.19 s gammaloop-nextest-core>
  728. 59.19 s gammaloop-nextest-core> failures:
  729. 59.19 s gammaloop-nextest-core>
  730. 59.19 s gammaloop-nextest-core> failures:
  731. 59.19 s gammaloop-nextest-core> cff::generation::tests_cff::thermal_bugblatter
  732. 59.19 s gammaloop-nextest-core>
  733. 59.19 s gammaloop-nextest-core> test result: FAILED. 0 passed; 1 failed; 0 ignored; 0 measured; 535 filtered out; finished in 5.76s
  734. 59.19 s gammaloop-nextest-core>
  735. 59.19 s gammaloop-nextest-core> stderr ---
  736. 59.19 s gammaloop-nextest-core>
  737. 59.19 s gammaloop-nextest-core> thread 'cff::generation::tests_cff::thermal_bugblatter' (1274) panicked at /nix/store/l5xazfnr7k6r6p8mlkn38x2afab0rygz-vendor-cargo-deps/5929dab090e556a579e9f3b708cd2e67c60b3d84a12b5a276f2a36cb00473133/symbolica-2.2.0/src/evaluate/evaluator.rs:295:21:
  738. 59.19 s gammaloop-nextest-core> External function 'symbolica_coth' does not have an implementation for gammalooprs::utils::F<f64>
  739. 59.19 s gammaloop-nextest-core> stack backtrace:
  740. 59.19 s gammaloop-nextest-core> 0: __rustc::rust_begin_unwind
  741. 59.19 s gammaloop-nextest-core> 1: core::panicking::panic_fmt
  742. 59.19 s gammaloop-nextest-core> 2: <symbolica::evaluate::evaluator::ExpressionEvaluator<gammalooprs::utils::F<f64>>>::evaluate_impl_no_ops
  743. 59.19 s gammaloop-nextest-core> 3: <symbolica::evaluate::evaluator::ExpressionEvaluator<gammalooprs::utils::F<f64>>>::evaluate_single
  744. 59.19 s gammaloop-nextest-core> 4: gammalooprs::cff::generation::tests_cff::thermal_bugblatter
  745. 59.19 s gammaloop-nextest-core> 5: <gammalooprs::cff::generation::tests_cff::thermal_bugblatter::{closure#0} as core::ops::function::FnOnce<()>>::call_once
  746. 59.19 s gammaloop-nextest-core> note: Some details are omitted, run with `RUST_BACKTRACE=full` for a verbose backtrace.
  747. 59.19 s gammaloop-nextest-core>
  748. 59.25 s gammaloop-nextest-core> error: test run failed
  749. 59.29 s gammaloop-nextest-core>
  750. 59.29 s gammaloop-nextest-core> ========== nextest test summary ==========
  751. 59.29 s gammaloop-nextest-core> report: target/nextest/ci_gammaloop/junit.xml
  752. 59.29 s gammaloop-nextest-core> tests: 483, failures: 7, errors: 0
  753. 59.29 s gammaloop-nextest-core>
  754. 59.29 s gammaloop-nextest-core> 1. gammalooprs::cff::generation::tests_cff::thermal_bubble
  755. 59.29 s gammaloop-nextest-core> failure: test failure with exit code 101
  756. 59.29 s gammaloop-nextest-core> thread 'cff::generation::tests_cff::thermal_bubble' (1268) panicked at /nix/store/l5xazfnr7k6r6p8mlkn38x2afab0rygz-vendor-cargo-deps/5929dab090e556a579e9f3b708cd2e67c60b3d84a12b5a276f2a36cb00473133/symbolica-2.2.0/src/evaluate/evaluator.rs:295:21:
  757. 59.29 s gammaloop-nextest-core> External function 'symbolica_coth' does not have an implementation for gammalooprs::utils::F<f64>
  758. 59.29 s gammaloop-nextest-core> stack backtrace:
  759. 59.29 s gammaloop-nextest-core> 0: __rustc::rust_begin_unwind
  760. 59.29 s gammaloop-nextest-core> 1: core::panicking::panic_fmt
  761. 59.29 s gammaloop-nextest-core> 2: <symbolica::evaluate::evaluator::ExpressionEvaluator<gammalooprs::utils::F<f64>>>::evaluate_impl_no_ops
  762. 59.29 s gammaloop-nextest-core> 3: <symbolica::evaluate::evaluator::ExpressionEvaluator<gammalooprs::utils::F<f64>>>::evaluate_single
  763. 59.29 s gammaloop-nextest-core> 4: gammalooprs::cff::generation::tests_cff::thermal_bubble
  764. 59.29 s gammaloop-nextest-core> 5: <gammalooprs::cff::generation::tests_cff::thermal_bubble::{closure#0} as core::ops::function::FnOnce<()>>::call_once
  765. 59.29 s gammaloop-nextest-core> note: Some details are omitted, run with `RUST_BACKTRACE=full` for a verbose backtrace.
  766. 59.29 s gammaloop-nextest-core> system-out
  767. 59.29 s gammaloop-nextest-core> running 1 test
  768. 59.29 s gammaloop-nextest-core> test cff::generation::tests_cff::thermal_bubble ... FAILED
  769. 59.29 s gammaloop-nextest-core>
  770. 59.29 s gammaloop-nextest-core> failures:
  771. 59.29 s gammaloop-nextest-core>
  772. 59.29 s gammaloop-nextest-core> failures:
  773. 59.29 s gammaloop-nextest-core> cff::generation::tests_cff::thermal_bubble
  774. 59.29 s gammaloop-nextest-core>
  775. 59.29 s gammaloop-nextest-core> test result: FAILED. 0 passed; 1 failed; 0 ignored; 0 measured; 535 filtered out; finished in 0.01s
  776. 59.29 s gammaloop-nextest-core> system-err
  777. 59.29 s gammaloop-nextest-core> thread 'cff::generation::tests_cff::thermal_bubble' (1268) panicked at /nix/store/l5xazfnr7k6r6p8mlkn38x2afab0rygz-vendor-cargo-deps/5929dab090e556a579e9f3b708cd2e67c60b3d84a12b5a276f2a36cb00473133/symbolica-2.2.0/src/evaluate/evaluator.rs:295:21:
  778. 59.29 s gammaloop-nextest-core> External function 'symbolica_coth' does not have an implementation for gammalooprs::utils::F<f64>
  779. 59.29 s gammaloop-nextest-core> stack backtrace:
  780. 59.29 s gammaloop-nextest-core> 0: __rustc::rust_begin_unwind
  781. 59.29 s gammaloop-nextest-core> 1: core::panicking::panic_fmt
  782. 59.29 s gammaloop-nextest-core> 2: <symbolica::evaluate::evaluator::ExpressionEvaluator<gammalooprs::utils::F<f64>>>::evaluate_impl_no_ops
  783. 59.29 s gammaloop-nextest-core> 3: <symbolica::evaluate::evaluator::ExpressionEvaluator<gammalooprs::utils::F<f64>>>::evaluate_single
  784. 59.29 s gammaloop-nextest-core> 4: gammalooprs::cff::generation::tests_cff::thermal_bubble
  785. 59.29 s gammaloop-nextest-core> 5: <gammalooprs::cff::generation::tests_cff::thermal_bubble::{closure#0} as core::ops::function::FnOnce<()>>::call_once
  786. 59.29 s gammaloop-nextest-core> note: Some details are omitted, run with `RUST_BACKTRACE=full` for a verbose backtrace.
  787. 59.29 s gammaloop-nextest-core>
  788. 59.29 s gammaloop-nextest-core> 2. gammalooprs::cff::generation::tests_cff::thermal_eight
  789. 59.29 s gammaloop-nextest-core> failure: test failure with exit code 101
  790. 59.29 s gammaloop-nextest-core> thread 'cff::generation::tests_cff::thermal_eight' (1281) panicked at /nix/store/l5xazfnr7k6r6p8mlkn38x2afab0rygz-vendor-cargo-deps/5929dab090e556a579e9f3b708cd2e67c60b3d84a12b5a276f2a36cb00473133/symbolica-2.2.0/src/evaluate/evaluator.rs:295:21:
  791. 59.29 s gammaloop-nextest-core> External function 'symbolica_coth' does not have an implementation for gammalooprs::utils::F<f64>
  792. 59.29 s gammaloop-nextest-core> stack backtrace:
  793. 59.29 s gammaloop-nextest-core> 0: __rustc::rust_begin_unwind
  794. 59.29 s gammaloop-nextest-core> 1: core::panicking::panic_fmt
  795. 59.29 s gammaloop-nextest-core> 2: <symbolica::evaluate::evaluator::ExpressionEvaluator<gammalooprs::utils::F<f64>>>::evaluate_impl_no_ops
  796. 59.29 s gammaloop-nextest-core> 3: <symbolica::evaluate::evaluator::ExpressionEvaluator<gammalooprs::utils::F<f64>>>::evaluate_single
  797. 59.29 s gammaloop-nextest-core> 4: gammalooprs::cff::generation::tests_cff::thermal_eight
  798. 59.29 s gammaloop-nextest-core> 5: <gammalooprs::cff::generation::tests_cff::thermal_eight::{closure#0} as core::ops::function::FnOnce<()>>::call_once
  799. 59.29 s gammaloop-nextest-core> note: Some details are omitted, run with `RUST_BACKTRACE=full` for a verbose backtrace.
  800. 59.29 s gammaloop-nextest-core> system-out
  801. 59.29 s gammaloop-nextest-core> running 1 test
  802. 59.29 s gammaloop-nextest-core> test cff::generation::tests_cff::thermal_eight ... FAILED
  803. 59.29 s gammaloop-nextest-core>
  804. 59.29 s gammaloop-nextest-core> failures:
  805. 59.29 s gammaloop-nextest-core>
  806. 59.29 s gammaloop-nextest-core> failures:
  807. 59.29 s gammaloop-nextest-core> cff::generation::tests_cff::thermal_eight
  808. 59.29 s gammaloop-nextest-core>
  809. 59.29 s gammaloop-nextest-core> test result: FAILED. 0 passed; 1 failed; 0 ignored; 0 measured; 535 filtered out; finished in 0.01s
  810. 59.29 s gammaloop-nextest-core> system-err
  811. 59.29 s gammaloop-nextest-core> thread 'cff::generation::tests_cff::thermal_eight' (1281) panicked at /nix/store/l5xazfnr7k6r6p8mlkn38x2afab0rygz-vendor-cargo-deps/5929dab090e556a579e9f3b708cd2e67c60b3d84a12b5a276f2a36cb00473133/symbolica-2.2.0/src/evaluate/evaluator.rs:295:21:
  812. 59.29 s gammaloop-nextest-core> External function 'symbolica_coth' does not have an implementation for gammalooprs::utils::F<f64>
  813. 59.29 s gammaloop-nextest-core> stack backtrace:
  814. 59.29 s gammaloop-nextest-core> 0: __rustc::rust_begin_unwind
  815. 59.29 s gammaloop-nextest-core> 1: core::panicking::panic_fmt
  816. 59.29 s gammaloop-nextest-core> 2: <symbolica::evaluate::evaluator::ExpressionEvaluator<gammalooprs::utils::F<f64>>>::evaluate_impl_no_ops
  817. 59.29 s gammaloop-nextest-core> 3: <symbolica::evaluate::evaluator::ExpressionEvaluator<gammalooprs::utils::F<f64>>>::evaluate_single
  818. 59.29 s gammaloop-nextest-core> 4: gammalooprs::cff::generation::tests_cff::thermal_eight
  819. 59.29 s gammaloop-nextest-core> 5: <gammalooprs::cff::generation::tests_cff::thermal_eight::{closure#0} as core::ops::function::FnOnce<()>>::call_once
  820. 59.29 s gammaloop-nextest-core> note: Some details are omitted, run with `RUST_BACKTRACE=full` for a verbose backtrace.
  821. 59.29 s gammaloop-nextest-core>
  822. 59.29 s gammaloop-nextest-core> 3. gammalooprs::cff::generation::tests_cff::thermal_bubble_chain
  823. 59.29 s gammaloop-nextest-core> failure: test failure with exit code 101
  824. 59.29 s gammaloop-nextest-core> thread 'cff::generation::tests_cff::thermal_bubble_chain' (1273) panicked at /nix/store/l5xazfnr7k6r6p8mlkn38x2afab0rygz-vendor-cargo-deps/5929dab090e556a579e9f3b708cd2e67c60b3d84a12b5a276f2a36cb00473133/symbolica-2.2.0/src/evaluate/evaluator.rs:295:21:
  825. 59.29 s gammaloop-nextest-core> External function 'symbolica_csch' does not have an implementation for gammalooprs::utils::F<f64>
  826. 59.29 s gammaloop-nextest-core> stack backtrace:
  827. 59.29 s gammaloop-nextest-core> 0: __rustc::rust_begin_unwind
  828. 59.29 s gammaloop-nextest-core> 1: core::panicking::panic_fmt
  829. 59.29 s gammaloop-nextest-core> 2: <symbolica::evaluate::evaluator::ExpressionEvaluator<gammalooprs::utils::F<f64>>>::evaluate_impl_no_ops
  830. 59.29 s gammaloop-nextest-core> 3: <symbolica::evaluate::evaluator::ExpressionEvaluator<gammalooprs::utils::F<f64>>>::evaluate_single
  831. 59.29 s gammaloop-nextest-core> 4: gammalooprs::cff::generation::tests_cff::thermal_bubble_chain
  832. 59.29 s gammaloop-nextest-core> 5: <gammalooprs::cff::generation::tests_cff::thermal_bubble_chain::{closure#0} as core::ops::function::FnOnce<()>>::call_once
  833. 59.29 s gammaloop-nextest-core> note: Some details are omitted, run with `RUST_BACKTRACE=full` for a verbose backtrace.
  834. 59.29 s gammaloop-nextest-core> system-out
  835. 59.29 s gammaloop-nextest-core> running 1 test
  836. 59.29 s gammaloop-nextest-core> test cff::generation::tests_cff::thermal_bubble_chain ... FAILED
  837. 59.29 s gammaloop-nextest-core>
  838. 59.29 s gammaloop-nextest-core> failures:
  839. 59.29 s gammaloop-nextest-core>
  840. 59.29 s gammaloop-nextest-core> failures:
  841. 59.29 s gammaloop-nextest-core> cff::generation::tests_cff::thermal_bubble_chain
  842. 59.29 s gammaloop-nextest-core>
  843. 59.29 s gammaloop-nextest-core> test result: FAILED. 0 passed; 1 failed; 0 ignored; 0 measured; 535 filtered out; finished in 0.01s
  844. 59.29 s gammaloop-nextest-core> system-err
  845. 59.29 s gammaloop-nextest-core> thread 'cff::generation::tests_cff::thermal_bubble_chain' (1273) panicked at /nix/store/l5xazfnr7k6r6p8mlkn38x2afab0rygz-vendor-cargo-deps/5929dab090e556a579e9f3b708cd2e67c60b3d84a12b5a276f2a36cb00473133/symbolica-2.2.0/src/evaluate/evaluator.rs:295:21:
  846. 59.29 s gammaloop-nextest-core> External function 'symbolica_csch' does not have an implementation for gammalooprs::utils::F<f64>
  847. 59.29 s gammaloop-nextest-core> stack backtrace:
  848. 59.29 s gammaloop-nextest-core> 0: __rustc::rust_begin_unwind
  849. 59.29 s gammaloop-nextest-core> 1: core::panicking::panic_fmt
  850. 59.29 s gammaloop-nextest-core> 2: <symbolica::evaluate::evaluator::ExpressionEvaluator<gammalooprs::utils::F<f64>>>::evaluate_impl_no_ops
  851. 59.29 s gammaloop-nextest-core> 3: <symbolica::evaluate::evaluator::ExpressionEvaluator<gammalooprs::utils::F<f64>>>::evaluate_single
  852. 59.29 s gammaloop-nextest-core> 4: gammalooprs::cff::generation::tests_cff::thermal_bubble_chain
  853. 59.29 s gammaloop-nextest-core> 5: <gammalooprs::cff::generation::tests_cff::thermal_bubble_chain::{closure#0} as core::ops::function::FnOnce<()>>::call_once
  854. 59.29 s gammaloop-nextest-core> note: Some details are omitted, run with `RUST_BACKTRACE=full` for a verbose backtrace.
  855. 59.29 s gammaloop-nextest-core>
  856. 59.29 s gammaloop-nextest-core> 4. gammalooprs::cff::generation::tests_cff::thermal_ring
  857. 59.29 s gammaloop-nextest-core> failure: test failure with exit code 101
  858. 59.29 s gammaloop-nextest-core> thread 'cff::generation::tests_cff::thermal_ring' (1284) panicked at /nix/store/l5xazfnr7k6r6p8mlkn38x2afab0rygz-vendor-cargo-deps/5929dab090e556a579e9f3b708cd2e67c60b3d84a12b5a276f2a36cb00473133/symbolica-2.2.0/src/evaluate/evaluator.rs:295:21:
  859. 59.29 s gammaloop-nextest-core> External function 'symbolica_coth' does not have an implementation for gammalooprs::utils::F<f64>
  860. 59.29 s gammaloop-nextest-core> stack backtrace:
  861. 59.29 s gammaloop-nextest-core> 0: __rustc::rust_begin_unwind
  862. 59.29 s gammaloop-nextest-core> 1: core::panicking::panic_fmt
  863. 59.29 s gammaloop-nextest-core> 2: <symbolica::evaluate::evaluator::ExpressionEvaluator<gammalooprs::utils::F<f64>>>::evaluate_impl_no_ops
  864. 59.29 s gammaloop-nextest-core> 3: <symbolica::evaluate::evaluator::ExpressionEvaluator<gammalooprs::utils::F<f64>>>::evaluate_single
  865. 59.29 s gammaloop-nextest-core> 4: gammalooprs::cff::generation::tests_cff::thermal_ring
  866. 59.29 s gammaloop-nextest-core> 5: <gammalooprs::cff::generation::tests_cff::thermal_ring::{closure#0} as core::ops::function::FnOnce<()>>::call_once
  867. 59.29 s gammaloop-nextest-core> note: Some details are omitted, run with `RUST_BACKTRACE=full` for a verbose backtrace.
  868. 59.29 s gammaloop-nextest-core> system-out
  869. 59.29 s gammaloop-nextest-core> running 1 test
  870. 59.29 s gammaloop-nextest-core> test cff::generation::tests_cff::thermal_ring ... FAILED
  871. 59.29 s gammaloop-nextest-core>
  872. 59.29 s gammaloop-nextest-core> failures:
  873. 59.29 s gammaloop-nextest-core>
  874. 59.29 s gammaloop-nextest-core> failures:
  875. 59.29 s gammaloop-nextest-core> cff::generation::tests_cff::thermal_ring
  876. 59.29 s gammaloop-nextest-core>
  877. 59.29 s gammaloop-nextest-core> test result: FAILED. 0 passed; 1 failed; 0 ignored; 0 measured; 535 filtered out; finished in 0.04s
  878. 59.29 s gammaloop-nextest-core> system-err
  879. 59.29 s gammaloop-nextest-core> thread 'cff::generation::tests_cff::thermal_ring' (1284) panicked at /nix/store/l5xazfnr7k6r6p8mlkn38x2afab0rygz-vendor-cargo-deps/5929dab090e556a579e9f3b708cd2e67c60b3d84a12b5a276f2a36cb00473133/symbolica-2.2.0/src/evaluate/evaluator.rs:295:21:
  880. 59.29 s gammaloop-nextest-core> External function 'symbolica_coth' does not have an implementation for gammalooprs::utils::F<f64>
  881. 59.29 s gammaloop-nextest-core> stack backtrace:
  882. 59.29 s gammaloop-nextest-core> 0: __rustc::rust_begin_unwind
  883. 59.29 s gammaloop-nextest-core> 1: core::panicking::panic_fmt
  884. 59.29 s gammaloop-nextest-core> 2: <symbolica::evaluate::evaluator::ExpressionEvaluator<gammalooprs::utils::F<f64>>>::evaluate_impl_no_ops
  885. 59.29 s gammaloop-nextest-core> 3: <symbolica::evaluate::evaluator::ExpressionEvaluator<gammalooprs::utils::F<f64>>>::evaluate_single
  886. 59.29 s gammaloop-nextest-core> 4: gammalooprs::cff::generation::tests_cff::thermal_ring
  887. 59.29 s gammaloop-nextest-core> 5: <gammalooprs::cff::generation::tests_cff::thermal_ring::{closure#0} as core::ops::function::FnOnce<()>>::call_once
  888. 59.29 s gammaloop-nextest-core> note: Some details are omitted, run with `RUST_BACKTRACE=full` for a verbose backtrace.
  889. 59.29 s gammaloop-nextest-core>
  890. 59.29 s gammaloop-nextest-core> 5. gammalooprs::cff::generation::tests_cff::thermal_mercedes
  891. 59.29 s gammaloop-nextest-core> failure: test failure with exit code 101
  892. 59.29 s gammaloop-nextest-core> thread 'cff::generation::tests_cff::thermal_mercedes' (1288) panicked at /nix/store/l5xazfnr7k6r6p8mlkn38x2afab0rygz-vendor-cargo-deps/5929dab090e556a579e9f3b708cd2e67c60b3d84a12b5a276f2a36cb00473133/symbolica-2.2.0/src/evaluate/evaluator.rs:295:21:
  893. 59.29 s gammaloop-nextest-core> External function 'symbolica_coth' does not have an implementation for gammalooprs::utils::F<f64>
  894. 59.29 s gammaloop-nextest-core> stack backtrace:
  895. 59.29 s gammaloop-nextest-core> 0: __rustc::rust_begin_unwind
  896. 59.29 s gammaloop-nextest-core> 1: core::panicking::panic_fmt
  897. 59.29 s gammaloop-nextest-core> 2: <symbolica::evaluate::evaluator::ExpressionEvaluator<gammalooprs::utils::F<f64>>>::evaluate_impl_no_ops
  898. 59.29 s gammaloop-nextest-core> 3: <symbolica::evaluate::evaluator::ExpressionEvaluator<gammalooprs::utils::F<f64>>>::evaluate_single
  899. 59.29 s gammaloop-nextest-core> 4: gammalooprs::cff::generation::tests_cff::thermal_mercedes
  900. 59.29 s gammaloop-nextest-core> 5: <gammalooprs::cff::generation::tests_cff::thermal_mercedes::{closure#0} as core::ops::function::FnOnce<()>>::call_once
  901. 59.29 s gammaloop-nextest-core> note: Some details are omitted, run with `RUST_BACKTRACE=full` for a verbose backtrace.
  902. 59.29 s gammaloop-nextest-core> system-out
  903. 59.29 s gammaloop-nextest-core> running 1 test
  904. 59.29 s gammaloop-nextest-core> test cff::generation::tests_cff::thermal_mercedes ... FAILED
  905. 59.29 s gammaloop-nextest-core>
  906. 59.29 s gammaloop-nextest-core> failures:
  907. 59.29 s gammaloop-nextest-core>
  908. 59.29 s gammaloop-nextest-core> failures:
  909. 59.29 s gammaloop-nextest-core> cff::generation::tests_cff::thermal_mercedes
  910. 59.29 s gammaloop-nextest-core>
  911. 59.29 s gammaloop-nextest-core> test result: FAILED. 0 passed; 1 failed; 0 ignored; 0 measured; 535 filtered out; finished in 0.07s
  912. 59.29 s gammaloop-nextest-core> system-err
  913. 59.29 s gammaloop-nextest-core> thread 'cff::generation::tests_cff::thermal_mercedes' (1288) panicked at /nix/store/l5xazfnr7k6r6p8mlkn38x2afab0rygz-vendor-cargo-deps/5929dab090e556a579e9f3b708cd2e67c60b3d84a12b5a276f2a36cb00473133/symbolica-2.2.0/src/evaluate/evaluator.rs:295:21:
  914. 59.29 s gammaloop-nextest-core> External function 'symbolica_coth' does not have an implementation for gammalooprs::utils::F<f64>
  915. 59.29 s gammaloop-nextest-core> stack backtrace:
  916. 59.29 s gammaloop-nextest-core> 0: __rustc::rust_begin_unwind
  917. 59.29 s gammaloop-nextest-core> 1: core::panicking::panic_fmt
  918. 59.29 s gammaloop-nextest-core> 2: <symbolica::evaluate::evaluator::ExpressionEvaluator<gammalooprs::utils::F<f64>>>::evaluate_impl_no_ops
  919. 59.29 s gammaloop-nextest-core> 3: <symbolica::evaluate::evaluator::ExpressionEvaluator<gammalooprs::utils::F<f64>>>::evaluate_single
  920. 59.29 s gammaloop-nextest-core> 4: gammalooprs::cff::generation::tests_cff::thermal_mercedes
  921. 59.29 s gammaloop-nextest-core> 5: <gammalooprs::cff::generation::tests_cff::thermal_mercedes::{closure#0} as core::ops::function::FnOnce<()>>::call_once
  922. 59.29 s gammaloop-nextest-core> note: Some details are omitted, run with `RUST_BACKTRACE=full` for a verbose backtrace.
  923. 59.29 s gammaloop-nextest-core>
  924. 59.29 s gammaloop-nextest-core> 6. gammalooprs::graph::feynman_graph::tests::native_thermal_distributions
  925. 59.29 s gammaloop-nextest-core> failure: test failure with exit code 101
  926. 59.29 s gammaloop-nextest-core> system-out
  927. 59.29 s gammaloop-nextest-core> running 1 test
  928. 59.29 s gammaloop-nextest-core> test graph::feynman_graph::tests::native_thermal_distributions ... FAILED
  929. 59.29 s gammaloop-nextest-core>
  930. 59.29 s gammaloop-nextest-core> failures:
  931. 59.29 s gammaloop-nextest-core>
  932. 59.29 s gammaloop-nextest-core> failures:
  933. 59.29 s gammaloop-nextest-core> graph::feynman_graph::tests::native_thermal_distributions
  934. 59.29 s gammaloop-nextest-core>
  935. 59.29 s gammaloop-nextest-core> test result: FAILED. 0 passed; 1 failed; 0 ignored; 0 measured; 535 filtered out; finished in 0.73s
  936. 59.29 s gammaloop-nextest-core> system-err
  937. 59.29 s gammaloop-nextest-core> The application panicked (crashed).
  938. 59.29 s gammaloop-nextest-core> Message: called `Result::unwrap()` on an `Err` value: Custom { kind: Other, error: "Could not compile code: g++ -shared -O3 -fPIC -ffast-math -funsafe-math-optimizations -march=native -o /build/gammaloop-native-thermal-1339/thermal_0_0.so /build/gammaloop-native-thermal-1339/thermal_0_0.cpp\nwarning: Skipping impure flag -march=native because NIX_ENFORCE_NO_NATIVE is set\n/build/gammaloop-native-thermal-1339/thermal_0_0.cpp: In function 'void thermal_realf64(const double*, double*, double*)':\n/build/gammaloop-native-thermal-1339/thermal_0_0.cpp:27:16: error: 'symbolica_tanh' was not declared in this scope\n 27 | Z[6] = symbolica_tanh(Z[6]);\n | ^~~~~~~~~~~~~~\n" }
  939. 59.29 s gammaloop-nextest-core> Location: crates/gammalooprs/src/graph/feynman_graph.rs:937
  940. 59.29 s gammaloop-nextest-core>
  941. 59.29 s gammaloop-nextest-core> ━━━━━━━━━━━━━━━━━━━━━━━━━━━━━━━━━━ BACKTRACE ━━━━━━━━━━━━━━━━━━━━━━━━━━━━━━━━━━━
  942. 59.29 s gammaloop-nextest-core> 1: <color_eyre[b0c9e66060e883b2]::config::PanicHook>::panic_report<unknown>
  943. 59.29 s gammaloop-nextest-core> at <unknown source file>:<unknown line>
  944. 59.29 s gammaloop-nextest-core> 2: <color_eyre[b0c9e66060e883b2]::config::PanicHook>::into_panic_hook::{closure#0}<unknown>
  945. 59.29 s gammaloop-nextest-core> at <unknown source file>:<unknown line>
  946. 59.29 s gammaloop-nextest-core> 3: std[bcb96dfbba0ab899]::panicking::panic_with_hook<unknown>
  947. 59.29 s gammaloop-nextest-core> at <unknown source file>:<unknown line>
  948. 59.29 s gammaloop-nextest-core> 4: std[bcb96dfbba0ab899]::panicking::panic_handler::{closure#0}<unknown>
  949. 59.29 s gammaloop-nextest-core> at <unknown source file>:<unknown line>
  950. 59.29 s gammaloop-nextest-core> 5: std[bcb96dfbba0ab899]::sys::backtrace::__rust_end_short_backtrace::<std[bcb96dfbba0ab899]::panicking::panic_handler::{closure#0}, !><unknown>
  951. 59.29 s gammaloop-nextest-core> at <unknown source file>:<unknown line>
  952. 59.29 s gammaloop-nextest-core> 6: __rustc[6c289b9f9c454d21]::rust_begin_unwind<unknown>
  953. 59.29 s gammaloop-nextest-core> at <unknown source file>:<unknown line>
  954. 59.29 s gammaloop-nextest-core> 7: core[940e698046960fd5]::panicking::panic_fmt<unknown>
  955. 59.29 s gammaloop-nextest-core> at <unknown source file>:<unknown line>
  956. 59.29 s gammaloop-nextest-core> 8: core[940e698046960fd5]::result::unwrap_failed<unknown>
  957. 59.29 s gammaloop-nextest-core> at <unknown source file>:<unknown line>
  958. 59.29 s gammaloop-nextest-core> 9: gammalooprs[f21b74aec46f5289]::graph::feynman_graph::tests::native_thermal_distributions<unknown>
  959. 59.29 s gammaloop-nextest-core> at <unknown source file>:<unknown line>
  960. 59.30 s gammaloop-nextest-core> 10: <gammalooprs[f21b74aec46f5289]::graph::feynman_graph::tests::native_thermal_distributions::{closure#0} as core[940e698046960fd5]::ops::function::FnOnce<()>>::call_once<unknown>
  961. 59.30 s gammaloop-nextest-core> at <unknown source file>:<unknown line>
  962. 59.30 s gammaloop-nextest-core> 11: test[75d6903177b1d7e9]::__rust_begin_short_backtrace::<core[940e698046960fd5]::result::Result<(), alloc[2ea6bcb46fca0c42]::string::String>, fn() -> core[940e698046960fd5]::result::Result<(), alloc[2ea6bcb46fca0c42]::string::String>><unknown>
  963. 59.30 s gammaloop-nextest-core> at <unknown source file>:<unknown line>
  964. 59.30 s gammaloop-nextest-core> 12: test[75d6903177b1d7e9]::run_test::{closure#0}<unknown>
  965. 59.30 s gammaloop-nextest-core> at <unknown source file>:<unknown line>
  966. 59.30 s gammaloop-nextest-core> 13: std[bcb96dfbba0ab899]::sys::backtrace::__rust_begin_short_backtrace::<test[75d6903177b1d7e9]::run_test::{closure#1}, ()><unknown>
  967. 59.30 s gammaloop-nextest-core> at <unknown source file>:<unknown line>
  968. 59.30 s gammaloop-nextest-core> 14: <std[bcb96dfbba0ab899]::thread::lifecycle::spawn_unchecked<test[75d6903177b1d7e9]::run_test::{closure#1}, ()>::{closure#1} as core[940e698046960fd5]::ops::function::FnOnce<()>>::call_once::{shim:vtable#0}<unknown>
  969. 59.30 s gammaloop-nextest-core> at <unknown source file>:<unknown line>
  970. 59.30 s gammaloop-nextest-core> 15: <std[bcb96dfbba0ab899]::sys::thread::unix::Thread>::new::thread_start<unknown>
  971. 59.30 s gammaloop-nextest-core> at <unknown source file>:<unknown line>
  972. 59.30 s gammaloop-nextest-core> 16: start_thread<unknown>
  973. 59.30 s gammaloop-nextest-core> at <unknown source file>:<unknown line>
  974. 59.30 s gammaloop-nextest-core> 17: __clone3<unknown>
  975. 59.30 s gammaloop-nextest-core> at <unknown source file>:<unknown line>
  976. 59.30 s gammaloop-nextest-core>
  977. 59.30 s gammaloop-nextest-core> Run with COLORBT_SHOW_HIDDEN=1 environment variable to disable frame filtering.
  978. 59.30 s gammaloop-nextest-core> Run with RUST_BACKTRACE=full to include source snippets.
  979. 59.30 s gammaloop-nextest-core>
  980. 59.30 s gammaloop-nextest-core> 7. gammalooprs::cff::generation::tests_cff::thermal_bugblatter
  981. 59.30 s gammaloop-nextest-core> failure: test failure with exit code 101
  982. 59.30 s gammaloop-nextest-core> thread 'cff::generation::tests_cff::thermal_bugblatter' (1274) panicked at /nix/store/l5xazfnr7k6r6p8mlkn38x2afab0rygz-vendor-cargo-deps/5929dab090e556a579e9f3b708cd2e67c60b3d84a12b5a276f2a36cb00473133/symbolica-2.2.0/src/evaluate/evaluator.rs:295:21:
  983. 59.30 s gammaloop-nextest-core> External function 'symbolica_coth' does not have an implementation for gammalooprs::utils::F<f64>
  984. 59.30 s gammaloop-nextest-core> stack backtrace:
  985. 59.30 s gammaloop-nextest-core> 0: __rustc::rust_begin_unwind
  986. 59.30 s gammaloop-nextest-core> 1: core::panicking::panic_fmt
  987. 59.30 s gammaloop-nextest-core> 2: <symbolica::evaluate::evaluator::ExpressionEvaluator<gammalooprs::utils::F<f64>>>::evaluate_impl_no_ops
  988. 59.30 s gammaloop-nextest-core> 3: <symbolica::evaluate::evaluator::ExpressionEvaluator<gammalooprs::utils::F<f64>>>::evaluate_single
  989. 59.30 s gammaloop-nextest-core> 4: gammalooprs::cff::generation::tests_cff::thermal_bugblatter
  990. 59.30 s gammaloop-nextest-core> 5: <gammalooprs::cff::generation::tests_cff::thermal_bugblatter::{closure#0} as core::ops::function::FnOnce<()>>::call_once
  991. 59.30 s gammaloop-nextest-core> note: Some details are omitted, run with `RUST_BACKTRACE=full` for a verbose backtrace.
  992. 59.30 s gammaloop-nextest-core> system-out
  993. 59.30 s gammaloop-nextest-core> running 1 test
  994. 59.30 s gammaloop-nextest-core> test cff::generation::tests_cff::thermal_bugblatter ... FAILED
  995. 59.30 s gammaloop-nextest-core>
  996. 59.30 s gammaloop-nextest-core> failures:
  997. 59.30 s gammaloop-nextest-core>
  998. 59.30 s gammaloop-nextest-core> failures:
  999. 59.30 s gammaloop-nextest-core> cff::generation::tests_cff::thermal_bugblatter
  1000. 59.30 s gammaloop-nextest-core>
  1001. 59.30 s gammaloop-nextest-core> test result: FAILED. 0 passed; 1 failed; 0 ignored; 0 measured; 535 filtered out; finished in 5.76s
  1002. 59.30 s gammaloop-nextest-core> system-err
  1003. 59.30 s gammaloop-nextest-core> thread 'cff::generation::tests_cff::thermal_bugblatter' (1274) panicked at /nix/store/l5xazfnr7k6r6p8mlkn38x2afab0rygz-vendor-cargo-deps/5929dab090e556a579e9f3b708cd2e67c60b3d84a12b5a276f2a36cb00473133/symbolica-2.2.0/src/evaluate/evaluator.rs:295:21:
  1004. 59.30 s gammaloop-nextest-core> External function 'symbolica_coth' does not have an implementation for gammalooprs::utils::F<f64>
  1005. 59.30 s gammaloop-nextest-core> stack backtrace:
  1006. 59.30 s gammaloop-nextest-core> 0: __rustc::rust_begin_unwind
  1007. 59.30 s gammaloop-nextest-core> 1: core::panicking::panic_fmt
  1008. 59.30 s gammaloop-nextest-core> 2: <symbolica::evaluate::evaluator::ExpressionEvaluator<gammalooprs::utils::F<f64>>>::evaluate_impl_no_ops
  1009. 59.30 s gammaloop-nextest-core> 3: <symbolica::evaluate::evaluator::ExpressionEvaluator<gammalooprs::utils::F<f64>>>::evaluate_single
  1010. 59.30 s gammaloop-nextest-core> 4: gammalooprs::cff::generation::tests_cff::thermal_bugblatter
  1011. 59.30 s gammaloop-nextest-core> 5: <gammalooprs::cff::generation::tests_cff::thermal_bugblatter::{closure#0} as core::ops::function::FnOnce<()>>::call_once
  1012. 59.30 s gammaloop-nextest-core> note: Some details are omitted, run with `RUST_BACKTRACE=full` for a verbose backtrace.
  1013. 59.30 s gammaloop-nextest-core> =========================================
  1014. 59.35 s error: Cannot build '/nix/store/8r84j4srh5jz28101cd8xndlncp1i0gs-gammaloop-nextest-core.drv'.
  1015. 59.35 s Reason: builder failed with exit code 100.
  1016. 59.35 s Output paths:
  1017. 59.35 s /nix/store/31q585g5sl9sp361gqhbqb1ds9nvb6js-gammaloop-nextest-core
  1018. 59.35 s Last 738 log lines:
  1019. 59.35 s > Extracting 3 binaries (including 1 non-test binary), 1 build script output directory, and 2 linked paths to /build/nextest-archive-lkqUeY
  1020. 59.35 s > Extracted 18 files to /build/nextest-archive-lkqUeY in 0.62s
  1021. 59.35 s > ------------
  1022. 59.35 s > Nextest run ID aefba8c2-cebb-4890-ba75-9cf89f989de5 with nextest profile: ci_gammaloop
  1023. 59.35 s > Starting 339 tests across 2 binaries
  1024. 59.35 s > ------------
  1025. 59.35 s > Summary [ 0.479s] 339 tests run: 339 passed, 0 skipped
  1026. 59.35 s >
  1027. 59.35 s > ========== nextest test summary ==========
  1028. 59.35 s > report: target/nextest/ci_gammaloop/junit.xml
  1029. 59.35 s > tests: 339, failures: 0, errors: 0
  1030. 59.35 s > No failing testcases found.
  1031. 59.35 s > =========================================
  1032. 59.35 s > Extracting 1 binary and 1 linked path to /build/nextest-archive-fOQYxc
  1033. 59.35 s > Extracted 7 files to /build/nextest-archive-fOQYxc in 0.07s
  1034. 59.35 s > ------------
  1035. 59.35 s > Nextest run ID bba5e536-7cda-4c14-93ba-91a6e7f0dc73 with nextest profile: ci_gammaloop
  1036. 59.35 s > Starting 19 tests across 1 binary
  1037. 59.35 s > ------------
  1038. 59.35 s > Summary [ 0.010s] 19 tests run: 19 passed, 0 skipped
  1039. 59.35 s >
  1040. 59.35 s > ========== nextest test summary ==========
  1041. 59.35 s > report: target/nextest/ci_gammaloop/junit.xml
  1042. 59.35 s > tests: 19, failures: 0, errors: 0
  1043. 59.35 s > No failing testcases found.
  1044. 59.35 s > =========================================
  1045. 59.35 s > Extracting 1 binary to /build/nextest-archive-xkNUY4
  1046. 59.35 s > Extracted 4 files to /build/nextest-archive-xkNUY4 in 0.03s
  1047. 59.35 s > ------------
  1048. 59.35 s > Nextest run ID 452a6c0b-3e28-41bf-b254-3b371836768f with nextest profile: ci_gammaloop
  1049. 59.35 s > Starting 0 tests across 1 binary
  1050. 59.35 s > ------------
  1051. 59.35 s > Summary [ 0.000s] 0 tests run: 0 passed, 0 skipped
  1052. 59.35 s >
  1053. 59.35 s > ========== nextest test summary ==========
  1054. 59.35 s > report: target/nextest/ci_gammaloop/junit.xml
  1055. 59.35 s > tests: 0, failures: 0, errors: 0
  1056. 59.35 s > No failing testcases found.
  1057. 59.35 s > =========================================
  1058. 59.35 s > Extracting 4 binaries, 1 build script output directory, and 2 linked paths to /build/nextest-archive-6iVCrd
  1059. 59.35 s > Extracted 18 files to /build/nextest-archive-6iVCrd in 0.45s
  1060. 59.35 s > ------------
  1061. 59.35 s > Nextest run ID 65d6f979-79dc-4b65-b2ed-1210ec27ef52 with nextest profile: ci_gammaloop
  1062. 59.35 s > Starting 483 tests across 4 binaries (61 tests skipped, including 60 tests via profile.ci_gammaloop.default-filter)
  1063. 59.35 s > FAIL [ 0.015s] ( 47/483) gammalooprs cff::generation::tests_cff::thermal_bubble
  1064. 59.35 s > stdout ---
  1065. 59.35 s >
  1066. 59.35 s > running 1 test
  1067. 59.35 s > test cff::generation::tests_cff::thermal_bubble ... FAILED
  1068. 59.35 s >
  1069. 59.35 s > failures:
  1070. 59.35 s >
  1071. 59.35 s > failures:
  1072. 59.35 s > cff::generation::tests_cff::thermal_bubble
  1073. 59.35 s >
  1074. 59.35 s > test result: FAILED. 0 passed; 1 failed; 0 ignored; 0 measured; 535 filtered out; finished in 0.01s
  1075. 59.35 s >
  1076. 59.35 s > stderr ---
  1077. 59.35 s >
  1078. 59.35 s > thread 'cff::generation::tests_cff::thermal_bubble' (1268) panicked at /nix/store/l5xazfnr7k6r6p8mlkn38x2afab0rygz-vendor-cargo-deps/5929dab090e556a579e9f3b708cd2e67c60b3d84a12b5a276f2a36cb00473133/symbolica-2.2.0/src/evaluate/evaluator.rs:295:21:
  1079. 59.35 s > External function 'symbolica_coth' does not have an implementation for gammalooprs::utils::F<f64>
  1080. 59.35 s > stack backtrace:
  1081. 59.35 s > 0: __rustc::rust_begin_unwind
  1082. 59.35 s > 1: core::panicking::panic_fmt
  1083. 59.35 s > 2: <symbolica::evaluate::evaluator::ExpressionEvaluator<gammalooprs::utils::F<f64>>>::evaluate_impl_no_ops
  1084. 59.35 s > 3: <symbolica::evaluate::evaluator::ExpressionEvaluator<gammalooprs::utils::F<f64>>>::evaluate_single
  1085. 59.35 s > 4: gammalooprs::cff::generation::tests_cff::thermal_bubble
  1086. 59.35 s > 5: <gammalooprs::cff::generation::tests_cff::thermal_bubble::{closure#0} as core::ops::function::FnOnce<()>>::call_once
  1087. 59.35 s > note: Some details are omitted, run with `RUST_BACKTRACE=full` for a verbose backtrace.
  1088. 59.35 s >
  1089. 59.35 s > FAIL [ 0.014s] ( 48/483) gammalooprs cff::generation::tests_cff::thermal_eight
  1090. 59.35 s > stdout ---
  1091. 59.35 s >
  1092. 59.35 s > running 1 test
  1093. 59.35 s > test cff::generation::tests_cff::thermal_eight ... FAILED
  1094. 59.35 s >
  1095. 59.35 s > failures:
  1096. 59.35 s >
  1097. 59.35 s > failures:
  1098. 59.35 s > cff::generation::tests_cff::thermal_eight
  1099. 59.35 s >
  1100. 59.35 s > test result: FAILED. 0 passed; 1 failed; 0 ignored; 0 measured; 535 filtered out; finished in 0.01s
  1101. 59.35 s >
  1102. 59.35 s > stderr ---
  1103. 59.35 s >
  1104. 59.35 s > thread 'cff::generation::tests_cff::thermal_eight' (1281) panicked at /nix/store/l5xazfnr7k6r6p8mlkn38x2afab0rygz-vendor-cargo-deps/5929dab090e556a579e9f3b708cd2e67c60b3d84a12b5a276f2a36cb00473133/symbolica-2.2.0/src/evaluate/evaluator.rs:295:21:
  1105. 59.35 s > External function 'symbolica_coth' does not have an implementation for gammalooprs::utils::F<f64>
  1106. 59.35 s > stack backtrace:
  1107. 59.35 s > 0: __rustc::rust_begin_unwind
  1108. 59.35 s > 1: core::panicking::panic_fmt
  1109. 59.35 s > 2: <symbolica::evaluate::evaluator::ExpressionEvaluator<gammalooprs::utils::F<f64>>>::evaluate_impl_no_ops
  1110. 59.35 s > 3: <symbolica::evaluate::evaluator::ExpressionEvaluator<gammalooprs::utils::F<f64>>>::evaluate_single
  1111. 59.35 s > 4: gammalooprs::cff::generation::tests_cff::thermal_eight
  1112. 59.35 s > 5: <gammalooprs::cff::generation::tests_cff::thermal_eight::{closure#0} as core::ops::function::FnOnce<()>>::call_once
  1113. 59.35 s > note: Some details are omitted, run with `RUST_BACKTRACE=full` for a verbose backtrace.
  1114. 59.35 s >
  1115. 59.35 s > FAIL [ 0.015s] ( 51/483) gammalooprs cff::generation::tests_cff::thermal_bubble_chain
  1116. 59.35 s > stdout ---
  1117. 59.35 s >
  1118. 59.35 s > running 1 test
  1119. 59.35 s > test cff::generation::tests_cff::thermal_bubble_chain ... FAILED
  1120. 59.35 s >
  1121. 59.35 s > failures:
  1122. 59.35 s >
  1123. 59.35 s > failures:
  1124. 59.35 s > cff::generation::tests_cff::thermal_bubble_chain
  1125. 59.35 s >
  1126. 59.35 s > test result: FAILED. 0 passed; 1 failed; 0 ignored; 0 measured; 535 filtered out; finished in 0.01s
  1127. 59.35 s >
  1128. 59.35 s > stderr ---
  1129. 59.35 s >
  1130. 59.35 s > thread 'cff::generation::tests_cff::thermal_bubble_chain' (1273) panicked at /nix/store/l5xazfnr7k6r6p8mlkn38x2afab0rygz-vendor-cargo-deps/5929dab090e556a579e9f3b708cd2e67c60b3d84a12b5a276f2a36cb00473133/symbolica-2.2.0/src/evaluate/evaluator.rs:295:21:
  1131. 59.35 s > External function 'symbolica_csch' does not have an implementation for gammalooprs::utils::F<f64>
  1132. 59.35 s > stack backtrace:
  1133. 59.35 s > 0: __rustc::rust_begin_unwind
  1134. 59.35 s > 1: core::panicking::panic_fmt
  1135. 59.35 s > 2: <symbolica::evaluate::evaluator::ExpressionEvaluator<gammalooprs::utils::F<f64>>>::evaluate_impl_no_ops
  1136. 59.35 s > 3: <symbolica::evaluate::evaluator::ExpressionEvaluator<gammalooprs::utils::F<f64>>>::evaluate_single
  1137. 59.35 s > 4: gammalooprs::cff::generation::tests_cff::thermal_bubble_chain
  1138. 59.35 s > 5: <gammalooprs::cff::generation::tests_cff::thermal_bubble_chain::{closure#0} as core::ops::function::FnOnce<()>>::call_once
  1139. 59.35 s > note: Some details are omitted, run with `RUST_BACKTRACE=full` for a verbose backtrace.
  1140. 59.35 s >
  1141. 59.35 s > FAIL [ 0.047s] ( 76/483) gammalooprs cff::generation::tests_cff::thermal_ring
  1142. 59.35 s > stdout ---
  1143. 59.35 s >
  1144. 59.35 s > running 1 test
  1145. 59.35 s > test cff::generation::tests_cff::thermal_ring ... FAILED
  1146. 59.35 s >
  1147. 59.35 s > failures:
  1148. 59.35 s >
  1149. 59.35 s > failures:
  1150. 59.35 s > cff::generation::tests_cff::thermal_ring
  1151. 59.35 s >
  1152. 59.35 s > test result: FAILED. 0 passed; 1 failed; 0 ignored; 0 measured; 535 filtered out; finished in 0.04s
  1153. 59.35 s >
  1154. 59.35 s > stderr ---
  1155. 59.35 s >
  1156. 59.35 s > thread 'cff::generation::tests_cff::thermal_ring' (1284) panicked at /nix/store/l5xazfnr7k6r6p8mlkn38x2afab0rygz-vendor-cargo-deps/5929dab090e556a579e9f3b708cd2e67c60b3d84a12b5a276f2a36cb00473133/symbolica-2.2.0/src/evaluate/evaluator.rs:295:21:
  1157. 59.35 s > External function 'symbolica_coth' does not have an implementation for gammalooprs::utils::F<f64>
  1158. 59.35 s > stack backtrace:
  1159. 59.35 s > 0: __rustc::rust_begin_unwind
  1160. 59.35 s > 1: core::panicking::panic_fmt
  1161. 59.35 s > 2: <symbolica::evaluate::evaluator::ExpressionEvaluator<gammalooprs::utils::F<f64>>>::evaluate_impl_no_ops
  1162. 59.35 s > 3: <symbolica::evaluate::evaluator::ExpressionEvaluator<gammalooprs::utils::F<f64>>>::evaluate_single
  1163. 59.35 s > 4: gammalooprs::cff::generation::tests_cff::thermal_ring
  1164. 59.35 s > 5: <gammalooprs::cff::generation::tests_cff::thermal_ring::{closure#0} as core::ops::function::FnOnce<()>>::call_once
  1165. 59.35 s > note: Some details are omitted, run with `RUST_BACKTRACE=full` for a verbose backtrace.
  1166. 59.35 s >
  1167. 59.35 s > FAIL [ 0.076s] ( 77/483) gammalooprs cff::generation::tests_cff::thermal_mercedes
  1168. 59.35 s > stdout ---
  1169. 59.35 s >
  1170. 59.35 s > running 1 test
  1171. 59.35 s > test cff::generation::tests_cff::thermal_mercedes ... FAILED
  1172. 59.35 s >
  1173. 59.35 s > failures:
  1174. 59.35 s >
  1175. 59.35 s > failures:
  1176. 59.35 s > cff::generation::tests_cff::thermal_mercedes
  1177. 59.35 s >
  1178. 59.35 s > test result: FAILED. 0 passed; 1 failed; 0 ignored; 0 measured; 535 filtered out; finished in 0.07s
  1179. 59.35 s >
  1180. 59.35 s > stderr ---
  1181. 59.35 s >
  1182. 59.35 s > thread 'cff::generation::tests_cff::thermal_mercedes' (1288) panicked at /nix/store/l5xazfnr7k6r6p8mlkn38x2afab0rygz-vendor-cargo-deps/5929dab090e556a579e9f3b708cd2e67c60b3d84a12b5a276f2a36cb00473133/symbolica-2.2.0/src/evaluate/evaluator.rs:295:21:
  1183. 59.35 s > External function 'symbolica_coth' does not have an implementation for gammalooprs::utils::F<f64>
  1184. 59.35 s > stack backtrace:
  1185. 59.35 s > 0: __rustc::rust_begin_unwind
  1186. 59.35 s > 1: core::panicking::panic_fmt
  1187. 59.35 s > 2: <symbolica::evaluate::evaluator::ExpressionEvaluator<gammalooprs::utils::F<f64>>>::evaluate_impl_no_ops
  1188. 59.35 s > 3: <symbolica::evaluate::evaluator::ExpressionEvaluator<gammalooprs::utils::F<f64>>>::evaluate_single
  1189. 59.35 s > 4: gammalooprs::cff::generation::tests_cff::thermal_mercedes
  1190. 59.35 s > 5: <gammalooprs::cff::generation::tests_cff::thermal_mercedes::{closure#0} as core::ops::function::FnOnce<()>>::call_once
  1191. 59.35 s > note: Some details are omitted, run with `RUST_BACKTRACE=full` for a verbose backtrace.
  1192. 59.35 s >
  1193. 59.35 s > FAIL [ 0.739s] (431/483) gammalooprs graph::feynman_graph::tests::native_thermal_distributions
  1194. 59.35 s > stdout ---
  1195. 59.35 s >
  1196. 59.35 s > running 1 test
  1197. 59.35 s > test graph::feynman_graph::tests::native_thermal_distributions ... FAILED
  1198. 59.35 s >
  1199. 59.35 s > failures:
  1200. 59.35 s >
  1201. 59.35 s > failures:
  1202. 59.35 s > graph::feynman_graph::tests::native_thermal_distributions
  1203. 59.35 s >
  1204. 59.35 s > test result: FAILED. 0 passed; 1 failed; 0 ignored; 0 measured; 535 filtered out; finished in 0.73s
  1205. 59.35 s >
  1206. 59.35 s > stderr ---
  1207. 59.35 s > The application panicked (crashed).
  1208. 59.35 s > Message: called `Result::unwrap()` on an `Err` value: Custom { kind: Other, error: "Could not compile code: g++ -shared -O3 -fPIC -ffast-math -funsafe-math-optimizations -march=native -o /build/gammaloop-native-thermal-1339/thermal_0_0.so /build/gammaloop-native-thermal-1339/thermal_0_0.cpp\nwarning: Skipping impure flag -march=native because NIX_ENFORCE_NO_NATIVE is set\n/build/gammaloop-native-thermal-1339/thermal_0_0.cpp: In function 'void thermal_realf64(const double*, double*, double*)':\n/build/gammaloop-native-thermal-1339/thermal_0_0.cpp:27:16: error: 'symbolica_tanh' was not declared in this scope\n 27 | Z[6] = symbolica_tanh(Z[6]);\n | ^~~~~~~~~~~~~~\n" }
  1209. 59.35 s > Location: crates/gammalooprs/src/graph/feynman_graph.rs:937
  1210. 59.35 s >
  1211. 59.35 s > ━━━━━━━━━━━━━━━━━━━━━━━━━━━━━━━━━━ BACKTRACE ━━━━━━━━━━━━━━━━━━━━━━━━━━━━━━━━━━━
  1212. 59.35 s > 1: <color_eyre[b0c9e66060e883b2]::config::PanicHook>::panic_report<unknown>
  1213. 59.35 s > at <unknown source file>:<unknown line>
  1214. 59.35 s > 2: <color_eyre[b0c9e66060e883b2]::config::PanicHook>::into_panic_hook::{closure#0}<unknown>
  1215. 59.35 s > at <unknown source file>:<unknown line>
  1216. 59.35 s > 3: std[bcb96dfbba0ab899]::panicking::panic_with_hook<unknown>
  1217. 59.35 s > at <unknown source file>:<unknown line>
  1218. 59.35 s > 4: std[bcb96dfbba0ab899]::panicking::panic_handler::{closure#0}<unknown>
  1219. 59.35 s > at <unknown source file>:<unknown line>
  1220. 59.35 s > 5: std[bcb96dfbba0ab899]::sys::backtrace::__rust_end_short_backtrace::<std[bcb96dfbba0ab899]::panicking::panic_handler::{closure#0}, !><unknown>
  1221. 59.35 s > at <unknown source file>:<unknown line>
  1222. 59.35 s > 6: __rustc[6c289b9f9c454d21]::rust_begin_unwind<unknown>
  1223. 59.35 s > at <unknown source file>:<unknown line>
  1224. 59.35 s > 7: core[940e698046960fd5]::panicking::panic_fmt<unknown>
  1225. 59.35 s > at <unknown source file>:<unknown line>
  1226. 59.35 s > 8: core[940e698046960fd5]::result::unwrap_failed<unknown>
  1227. 59.35 s > at <unknown source file>:<unknown line>
  1228. 59.35 s > 9: gammalooprs[f21b74aec46f5289]::graph::feynman_graph::tests::native_thermal_distributions<unknown>
  1229. 59.35 s > at <unknown source file>:<unknown line>
  1230. 59.35 s > 10: <gammalooprs[f21b74aec46f5289]::graph::feynman_graph::tests::native_thermal_distributions::{closure#0} as core[940e698046960fd5]::ops::function::FnOnce<()>>::call_once<unknown>
  1231. 59.35 s > at <unknown source file>:<unknown line>
  1232. 59.35 s > 11: test[75d6903177b1d7e9]::__rust_begin_short_backtrace::<core[940e698046960fd5]::result::Result<(), alloc[2ea6bcb46fca0c42]::string::String>, fn() -> core[940e698046960fd5]::result::Result<(), alloc[2ea6bcb46fca0c42]::string::String>><unknown>
  1233. 59.35 s > at <unknown source file>:<unknown line>
  1234. 59.35 s > 12: test[75d6903177b1d7e9]::run_test::{closure#0}<unknown>
  1235. 59.35 s > at <unknown source file>:<unknown line>
  1236. 59.35 s > 13: std[bcb96dfbba0ab899]::sys::backtrace::__rust_begin_short_backtrace::<test[75d6903177b1d7e9]::run_test::{closure#1}, ()><unknown>
  1237. 59.35 s > at <unknown source file>:<unknown line>
  1238. 59.35 s > 14: <std[bcb96dfbba0ab899]::thread::lifecycle::spawn_unchecked<test[75d6903177b1d7e9]::run_test::{closure#1}, ()>::{closure#1} as core[940e698046960fd5]::ops::function::FnOnce<()>>::call_once::{shim:vtable#0}<unknown>
  1239. 59.35 s > at <unknown source file>:<unknown line>
  1240. 59.35 s > 15: <std[bcb96dfbba0ab899]::sys::thread::unix::Thread>::new::thread_start<unknown>
  1241. 59.35 s > at <unknown source file>:<unknown line>
  1242. 59.35 s > 16: start_thread<unknown>
  1243. 59.35 s > at <unknown source file>:<unknown line>
  1244. 59.35 s > 17: __clone3<unknown>
  1245. 59.35 s > at <unknown source file>:<unknown line>
  1246. 59.35 s >
  1247. 59.35 s > Run with COLORBT_SHOW_HIDDEN=1 environment variable to disable frame filtering.
  1248. 59.35 s > Run with RUST_BACKTRACE=full to include source snippets.
  1249. 59.35 s >
  1250. 59.35 s > FAIL [ 5.800s] (478/483) gammalooprs cff::generation::tests_cff::thermal_bugblatter
  1251. 59.35 s > stdout ---
  1252. 59.35 s >
  1253. 59.35 s > running 1 test
  1254. 59.35 s > test cff::generation::tests_cff::thermal_bugblatter ... FAILED
  1255. 59.35 s >
  1256. 59.35 s > failures:
  1257. 59.35 s >
  1258. 59.35 s > failures:
  1259. 59.35 s > cff::generation::tests_cff::thermal_bugblatter
  1260. 59.35 s >
  1261. 59.35 s > test result: FAILED. 0 passed; 1 failed; 0 ignored; 0 measured; 535 filtered out; finished in 5.76s
  1262. 59.35 s >
  1263. 59.35 s > stderr ---
  1264. 59.35 s >
  1265. 59.35 s > thread 'cff::generation::tests_cff::thermal_bugblatter' (1274) panicked at /nix/store/l5xazfnr7k6r6p8mlkn38x2afab0rygz-vendor-cargo-deps/5929dab090e556a579e9f3b708cd2e67c60b3d84a12b5a276f2a36cb00473133/symbolica-2.2.0/src/evaluate/evaluator.rs:295:21:
  1266. 59.35 s > External function 'symbolica_coth' does not have an implementation for gammalooprs::utils::F<f64>
  1267. 59.35 s > stack backtrace:
  1268. 59.35 s > 0: __rustc::rust_begin_unwind
  1269. 59.35 s > 1: core::panicking::panic_fmt
  1270. 59.35 s > 2: <symbolica::evaluate::evaluator::ExpressionEvaluator<gammalooprs::utils::F<f64>>>::evaluate_impl_no_ops
  1271. 59.35 s > 3: <symbolica::evaluate::evaluator::ExpressionEvaluator<gammalooprs::utils::F<f64>>>::evaluate_single
  1272. 59.35 s > 4: gammalooprs::cff::generation::tests_cff::thermal_bugblatter
  1273. 59.35 s > 5: <gammalooprs::cff::generation::tests_cff::thermal_bugblatter::{closure#0} as core::ops::function::FnOnce<()>>::call_once
  1274. 59.35 s > note: Some details are omitted, run with `RUST_BACKTRACE=full` for a verbose backtrace.
  1275. 59.35 s >
  1276. 59.35 s > ------------
  1277. 59.35 s > Summary [ 9.916s] 483 tests run: 476 passed, 7 failed, 61 skipped
  1278. 59.35 s > FAIL [ 0.015s] ( 47/483) gammalooprs cff::generation::tests_cff::thermal_bubble
  1279. 59.35 s > stdout ---
  1280. 59.35 s >
  1281. 59.35 s > running 1 test
  1282. 59.35 s > test cff::generation::tests_cff::thermal_bubble ... FAILED
  1283. 59.35 s >
  1284. 59.35 s > failures:
  1285. 59.35 s >
  1286. 59.35 s > failures:
  1287. 59.35 s > cff::generation::tests_cff::thermal_bubble
  1288. 59.35 s >
  1289. 59.35 s > test result: FAILED. 0 passed; 1 failed; 0 ignored; 0 measured; 535 filtered out; finished in 0.01s
  1290. 59.36 s >
  1291. 59.36 s > stderr ---
  1292. 59.36 s >
  1293. 59.36 s > thread 'cff::generation::tests_cff::thermal_bubble' (1268) panicked at /nix/store/l5xazfnr7k6r6p8mlkn38x2afab0rygz-vendor-cargo-deps/5929dab090e556a579e9f3b708cd2e67c60b3d84a12b5a276f2a36cb00473133/symbolica-2.2.0/src/evaluate/evaluator.rs:295:21:
  1294. 59.36 s > External function 'symbolica_coth' does not have an implementation for gammalooprs::utils::F<f64>
  1295. 59.36 s > stack backtrace:
  1296. 59.36 s > 0: __rustc::rust_begin_unwind
  1297. 59.36 s > 1: core::panicking::panic_fmt
  1298. 59.36 s > 2: <symbolica::evaluate::evaluator::ExpressionEvaluator<gammalooprs::utils::F<f64>>>::evaluate_impl_no_ops
  1299. 59.36 s > 3: <symbolica::evaluate::evaluator::ExpressionEvaluator<gammalooprs::utils::F<f64>>>::evaluate_single
  1300. 59.36 s > 4: gammalooprs::cff::generation::tests_cff::thermal_bubble
  1301. 59.36 s > 5: <gammalooprs::cff::generation::tests_cff::thermal_bubble::{closure#0} as core::ops::function::FnOnce<()>>::call_once
  1302. 59.36 s > note: Some details are omitted, run with `RUST_BACKTRACE=full` for a verbose backtrace.
  1303. 59.36 s >
  1304. 59.36 s > FAIL [ 0.014s] ( 48/483) gammalooprs cff::generation::tests_cff::thermal_eight
  1305. 59.36 s > stdout ---
  1306. 59.36 s >
  1307. 59.36 s > running 1 test
  1308. 59.36 s > test cff::generation::tests_cff::thermal_eight ... FAILED
  1309. 59.36 s >
  1310. 59.36 s > failures:
  1311. 59.36 s >
  1312. 59.36 s > failures:
  1313. 59.36 s > cff::generation::tests_cff::thermal_eight
  1314. 59.36 s >
  1315. 59.36 s > test result: FAILED. 0 passed; 1 failed; 0 ignored; 0 measured; 535 filtered out; finished in 0.01s
  1316. 59.36 s >
  1317. 59.36 s > stderr ---
  1318. 59.36 s >
  1319. 59.36 s > thread 'cff::generation::tests_cff::thermal_eight' (1281) panicked at /nix/store/l5xazfnr7k6r6p8mlkn38x2afab0rygz-vendor-cargo-deps/5929dab090e556a579e9f3b708cd2e67c60b3d84a12b5a276f2a36cb00473133/symbolica-2.2.0/src/evaluate/evaluator.rs:295:21:
  1320. 59.36 s > External function 'symbolica_coth' does not have an implementation for gammalooprs::utils::F<f64>
  1321. 59.36 s > stack backtrace:
  1322. 59.36 s > 0: __rustc::rust_begin_unwind
  1323. 59.36 s > 1: core::panicking::panic_fmt
  1324. 59.36 s > 2: <symbolica::evaluate::evaluator::ExpressionEvaluator<gammalooprs::utils::F<f64>>>::evaluate_impl_no_ops
  1325. 59.36 s > 3: <symbolica::evaluate::evaluator::ExpressionEvaluator<gammalooprs::utils::F<f64>>>::evaluate_single
  1326. 59.36 s > 4: gammalooprs::cff::generation::tests_cff::thermal_eight
  1327. 59.36 s > 5: <gammalooprs::cff::generation::tests_cff::thermal_eight::{closure#0} as core::ops::function::FnOnce<()>>::call_once
  1328. 59.36 s > note: Some details are omitted, run with `RUST_BACKTRACE=full` for a verbose backtrace.
  1329. 59.36 s >
  1330. 59.36 s > FAIL [ 0.015s] ( 51/483) gammalooprs cff::generation::tests_cff::thermal_bubble_chain
  1331. 59.36 s > stdout ---
  1332. 59.36 s >
  1333. 59.36 s > running 1 test
  1334. 59.36 s > test cff::generation::tests_cff::thermal_bubble_chain ... FAILED
  1335. 59.36 s >
  1336. 59.36 s > failures:
  1337. 59.36 s >
  1338. 59.36 s > failures:
  1339. 59.36 s > cff::generation::tests_cff::thermal_bubble_chain
  1340. 59.36 s >
  1341. 59.36 s > test result: FAILED. 0 passed; 1 failed; 0 ignored; 0 measured; 535 filtered out; finished in 0.01s
  1342. 59.36 s >
  1343. 59.36 s > stderr ---
  1344. 59.36 s >
  1345. 59.36 s > thread 'cff::generation::tests_cff::thermal_bubble_chain' (1273) panicked at /nix/store/l5xazfnr7k6r6p8mlkn38x2afab0rygz-vendor-cargo-deps/5929dab090e556a579e9f3b708cd2e67c60b3d84a12b5a276f2a36cb00473133/symbolica-2.2.0/src/evaluate/evaluator.rs:295:21:
  1346. 59.36 s > External function 'symbolica_csch' does not have an implementation for gammalooprs::utils::F<f64>
  1347. 59.36 s > stack backtrace:
  1348. 59.36 s > 0: __rustc::rust_begin_unwind
  1349. 59.36 s > 1: core::panicking::panic_fmt
  1350. 59.36 s > 2: <symbolica::evaluate::evaluator::ExpressionEvaluator<gammalooprs::utils::F<f64>>>::evaluate_impl_no_ops
  1351. 59.36 s > 3: <symbolica::evaluate::evaluator::ExpressionEvaluator<gammalooprs::utils::F<f64>>>::evaluate_single
  1352. 59.36 s > 4: gammalooprs::cff::generation::tests_cff::thermal_bubble_chain
  1353. 59.36 s > 5: <gammalooprs::cff::generation::tests_cff::thermal_bubble_chain::{closure#0} as core::ops::function::FnOnce<()>>::call_once
  1354. 59.36 s > note: Some details are omitted, run with `RUST_BACKTRACE=full` for a verbose backtrace.
  1355. 59.36 s >
  1356. 59.36 s > FAIL [ 0.047s] ( 76/483) gammalooprs cff::generation::tests_cff::thermal_ring
  1357. 59.36 s > stdout ---
  1358. 59.36 s >
  1359. 59.36 s > running 1 test
  1360. 59.36 s > test cff::generation::tests_cff::thermal_ring ... FAILED
  1361. 59.36 s >
  1362. 59.36 s > failures:
  1363. 59.36 s >
  1364. 59.36 s > failures:
  1365. 59.36 s > cff::generation::tests_cff::thermal_ring
  1366. 59.36 s >
  1367. 59.36 s > test result: FAILED. 0 passed; 1 failed; 0 ignored; 0 measured; 535 filtered out; finished in 0.04s
  1368. 59.36 s >
  1369. 59.36 s > stderr ---
  1370. 59.36 s >
  1371. 59.36 s > thread 'cff::generation::tests_cff::thermal_ring' (1284) panicked at /nix/store/l5xazfnr7k6r6p8mlkn38x2afab0rygz-vendor-cargo-deps/5929dab090e556a579e9f3b708cd2e67c60b3d84a12b5a276f2a36cb00473133/symbolica-2.2.0/src/evaluate/evaluator.rs:295:21:
  1372. 59.36 s > External function 'symbolica_coth' does not have an implementation for gammalooprs::utils::F<f64>
  1373. 59.36 s > stack backtrace:
  1374. 59.36 s > 0: __rustc::rust_begin_unwind
  1375. 59.36 s > 1: core::panicking::panic_fmt
  1376. 59.36 s > 2: <symbolica::evaluate::evaluator::ExpressionEvaluator<gammalooprs::utils::F<f64>>>::evaluate_impl_no_ops
  1377. 59.36 s > 3: <symbolica::evaluate::evaluator::ExpressionEvaluator<gammalooprs::utils::F<f64>>>::evaluate_single
  1378. 59.36 s > 4: gammalooprs::cff::generation::tests_cff::thermal_ring
  1379. 59.36 s > 5: <gammalooprs::cff::generation::tests_cff::thermal_ring::{closure#0} as core::ops::function::FnOnce<()>>::call_once
  1380. 59.36 s > note: Some details are omitted, run with `RUST_BACKTRACE=full` for a verbose backtrace.
  1381. 59.36 s >
  1382. 59.36 s > FAIL [ 0.076s] ( 77/483) gammalooprs cff::generation::tests_cff::thermal_mercedes
  1383. 59.36 s > stdout ---
  1384. 59.36 s >
  1385. 59.36 s > running 1 test
  1386. 59.36 s > test cff::generation::tests_cff::thermal_mercedes ... FAILED
  1387. 59.36 s >
  1388. 59.36 s > failures:
  1389. 59.36 s >
  1390. 59.36 s > failures:
  1391. 59.36 s > cff::generation::tests_cff::thermal_mercedes
  1392. 59.36 s >
  1393. 59.36 s > test result: FAILED. 0 passed; 1 failed; 0 ignored; 0 measured; 535 filtered out; finished in 0.07s
  1394. 59.36 s >
  1395. 59.36 s > stderr ---
  1396. 59.36 s >
  1397. 59.36 s > thread 'cff::generation::tests_cff::thermal_mercedes' (1288) panicked at /nix/store/l5xazfnr7k6r6p8mlkn38x2afab0rygz-vendor-cargo-deps/5929dab090e556a579e9f3b708cd2e67c60b3d84a12b5a276f2a36cb00473133/symbolica-2.2.0/src/evaluate/evaluator.rs:295:21:
  1398. 59.36 s > External function 'symbolica_coth' does not have an implementation for gammalooprs::utils::F<f64>
  1399. 59.36 s > stack backtrace:
  1400. 59.36 s > 0: __rustc::rust_begin_unwind
  1401. 59.36 s > 1: core::panicking::panic_fmt
  1402. 59.36 s > 2: <symbolica::evaluate::evaluator::ExpressionEvaluator<gammalooprs::utils::F<f64>>>::evaluate_impl_no_ops
  1403. 59.36 s > 3: <symbolica::evaluate::evaluator::ExpressionEvaluator<gammalooprs::utils::F<f64>>>::evaluate_single
  1404. 59.36 s > 4: gammalooprs::cff::generation::tests_cff::thermal_mercedes
  1405. 59.36 s > 5: <gammalooprs::cff::generation::tests_cff::thermal_mercedes::{closure#0} as core::ops::function::FnOnce<()>>::call_once
  1406. 59.36 s > note: Some details are omitted, run with `RUST_BACKTRACE=full` for a verbose backtrace.
  1407. 59.36 s >
  1408. 59.36 s > FAIL [ 0.739s] (431/483) gammalooprs graph::feynman_graph::tests::native_thermal_distributions
  1409. 59.36 s > stdout ---
  1410. 59.36 s >
  1411. 59.36 s > running 1 test
  1412. 59.36 s > test graph::feynman_graph::tests::native_thermal_distributions ... FAILED
  1413. 59.36 s >
  1414. 59.36 s > failures:
  1415. 59.36 s >
  1416. 59.36 s > failures:
  1417. 59.36 s > graph::feynman_graph::tests::native_thermal_distributions
  1418. 59.36 s >
  1419. 59.36 s > test result: FAILED. 0 passed; 1 failed; 0 ignored; 0 measured; 535 filtered out; finished in 0.73s
  1420. 59.36 s >
  1421. 59.36 s > stderr ---
  1422. 59.36 s > The application panicked (crashed).
  1423. 59.36 s > Message: called `Result::unwrap()` on an `Err` value: Custom { kind: Other, error: "Could not compile code: g++ -shared -O3 -fPIC -ffast-math -funsafe-math-optimizations -march=native -o /build/gammaloop-native-thermal-1339/thermal_0_0.so /build/gammaloop-native-thermal-1339/thermal_0_0.cpp\nwarning: Skipping impure flag -march=native because NIX_ENFORCE_NO_NATIVE is set\n/build/gammaloop-native-thermal-1339/thermal_0_0.cpp: In function 'void thermal_realf64(const double*, double*, double*)':\n/build/gammaloop-native-thermal-1339/thermal_0_0.cpp:27:16: error: 'symbolica_tanh' was not declared in this scope\n 27 | Z[6] = symbolica_tanh(Z[6]);\n | ^~~~~~~~~~~~~~\n" }
  1424. 59.36 s > Location: crates/gammalooprs/src/graph/feynman_graph.rs:937
  1425. 59.36 s >
  1426. 59.36 s > ━━━━━━━━━━━━━━━━━━━━━━━━━━━━━━━━━━ BACKTRACE ━━━━━━━━━━━━━━━━━━━━━━━━━━━━━━━━━━━
  1427. 59.36 s > 1: <color_eyre[b0c9e66060e883b2]::config::PanicHook>::panic_report<unknown>
  1428. 59.36 s > at <unknown source file>:<unknown line>
  1429. 59.36 s > 2: <color_eyre[b0c9e66060e883b2]::config::PanicHook>::into_panic_hook::{closure#0}<unknown>
  1430. 59.36 s > at <unknown source file>:<unknown line>
  1431. 59.36 s > 3: std[bcb96dfbba0ab899]::panicking::panic_with_hook<unknown>
  1432. 59.36 s > at <unknown source file>:<unknown line>
  1433. 59.36 s > 4: std[bcb96dfbba0ab899]::panicking::panic_handler::{closure#0}<unknown>
  1434. 59.36 s > at <unknown source file>:<unknown line>
  1435. 59.36 s > 5: std[bcb96dfbba0ab899]::sys::backtrace::__rust_end_short_backtrace::<std[bcb96dfbba0ab899]::panicking::panic_handler::{closure#0}, !><unknown>
  1436. 59.36 s > at <unknown source file>:<unknown line>
  1437. 59.36 s > 6: __rustc[6c289b9f9c454d21]::rust_begin_unwind<unknown>
  1438. 59.36 s > at <unknown source file>:<unknown line>
  1439. 59.36 s > 7: core[940e698046960fd5]::panicking::panic_fmt<unknown>
  1440. 59.36 s > at <unknown source file>:<unknown line>
  1441. 59.36 s > 8: core[940e698046960fd5]::result::unwrap_failed<unknown>
  1442. 59.36 s > at <unknown source file>:<unknown line>
  1443. 59.36 s > 9: gammalooprs[f21b74aec46f5289]::graph::feynman_graph::tests::native_thermal_distributions<unknown>
  1444. 59.36 s > at <unknown source file>:<unknown line>
  1445. 59.36 s > 10: <gammalooprs[f21b74aec46f5289]::graph::feynman_graph::tests::native_thermal_distributions::{closure#0} as core[940e698046960fd5]::ops::function::FnOnce<()>>::call_once<unknown>
  1446. 59.36 s > at <unknown source file>:<unknown line>
  1447. 59.36 s > 11: test[75d6903177b1d7e9]::__rust_begin_short_backtrace::<core[940e698046960fd5]::result::Result<(), alloc[2ea6bcb46fca0c42]::string::String>, fn() -> core[940e698046960fd5]::result::Result<(), alloc[2ea6bcb46fca0c42]::string::String>><unknown>
  1448. 59.36 s > at <unknown source file>:<unknown line>
  1449. 59.36 s > 12: test[75d6903177b1d7e9]::run_test::{closure#0}<unknown>
  1450. 59.36 s > at <unknown source file>:<unknown line>
  1451. 59.36 s > 13: std[bcb96dfbba0ab899]::sys::backtrace::__rust_begin_short_backtrace::<test[75d6903177b1d7e9]::run_test::{closure#1}, ()><unknown>
  1452. 59.36 s > at <unknown source file>:<unknown line>
  1453. 59.36 s > 14: <std[bcb96dfbba0ab899]::thread::lifecycle::spawn_unchecked<test[75d6903177b1d7e9]::run_test::{closure#1}, ()>::{closure#1} as core[940e698046960fd5]::ops::function::FnOnce<()>>::call_once::{shim:vtable#0}<unknown>
  1454. 59.36 s > at <unknown source file>:<unknown line>
  1455. 59.36 s > 15: <std[bcb96dfbba0ab899]::sys::thread::unix::Thread>::new::thread_start<unknown>
  1456. 59.36 s > at <unknown source file>:<unknown line>
  1457. 59.36 s > 16: start_thread<unknown>
  1458. 59.36 s > at <unknown source file>:<unknown line>
  1459. 59.36 s > 17: __clone3<unknown>
  1460. 59.36 s > at <unknown source file>:<unknown line>
  1461. 59.36 s >
  1462. 59.36 s > Run with COLORBT_SHOW_HIDDEN=1 environment variable to disable frame filtering.
  1463. 59.36 s > Run with RUST_BACKTRACE=full to include source snippets.
  1464. 59.36 s >
  1465. 59.36 s > FAIL [ 5.800s] (478/483) gammalooprs cff::generation::tests_cff::thermal_bugblatter
  1466. 59.36 s > stdout ---
  1467. 59.36 s >
  1468. 59.36 s > running 1 test
  1469. 59.36 s > test cff::generation::tests_cff::thermal_bugblatter ... FAILED
  1470. 59.36 s >
  1471. 59.36 s > failures:
  1472. 59.36 s >
  1473. 59.36 s > failures:
  1474. 59.36 s > cff::generation::tests_cff::thermal_bugblatter
  1475. 59.36 s >
  1476. 59.36 s > test result: FAILED. 0 passed; 1 failed; 0 ignored; 0 measured; 535 filtered out; finished in 5.76s
  1477. 59.36 s >
  1478. 59.36 s > stderr ---
  1479. 59.36 s >
  1480. 59.36 s > thread 'cff::generation::tests_cff::thermal_bugblatter' (1274) panicked at /nix/store/l5xazfnr7k6r6p8mlkn38x2afab0rygz-vendor-cargo-deps/5929dab090e556a579e9f3b708cd2e67c60b3d84a12b5a276f2a36cb00473133/symbolica-2.2.0/src/evaluate/evaluator.rs:295:21:
  1481. 59.36 s > External function 'symbolica_coth' does not have an implementation for gammalooprs::utils::F<f64>
  1482. 59.36 s > stack backtrace:
  1483. 59.36 s > 0: __rustc::rust_begin_unwind
  1484. 59.36 s > 1: core::panicking::panic_fmt
  1485. 59.36 s > 2: <symbolica::evaluate::evaluator::ExpressionEvaluator<gammalooprs::utils::F<f64>>>::evaluate_impl_no_ops
  1486. 59.36 s > 3: <symbolica::evaluate::evaluator::ExpressionEvaluator<gammalooprs::utils::F<f64>>>::evaluate_single
  1487. 59.36 s > 4: gammalooprs::cff::generation::tests_cff::thermal_bugblatter
  1488. 59.36 s > 5: <gammalooprs::cff::generation::tests_cff::thermal_bugblatter::{closure#0} as core::ops::function::FnOnce<()>>::call_once
  1489. 59.36 s > note: Some details are omitted, run with `RUST_BACKTRACE=full` for a verbose backtrace.
  1490. 59.36 s >
  1491. 59.36 s > error: test run failed
  1492. 59.36 s >
  1493. 59.36 s > ========== nextest test summary ==========
  1494. 59.36 s > report: target/nextest/ci_gammaloop/junit.xml
  1495. 59.36 s > tests: 483, failures: 7, errors: 0
  1496. 59.36 s >
  1497. 59.36 s > 1. gammalooprs::cff::generation::tests_cff::thermal_bubble
  1498. 59.36 s > failure: test failure with exit code 101
  1499. 59.36 s > thread 'cff::generation::tests_cff::thermal_bubble' (1268) panicked at /nix/store/l5xazfnr7k6r6p8mlkn38x2afab0rygz-vendor-cargo-deps/5929dab090e556a579e9f3b708cd2e67c60b3d84a12b5a276f2a36cb00473133/symbolica-2.2.0/src/evaluate/evaluator.rs:295:21:
  1500. 59.36 s > External function 'symbolica_coth' does not have an implementation for gammalooprs::utils::F<f64>
  1501. 59.36 s > stack backtrace:
  1502. 59.36 s > 0: __rustc::rust_begin_unwind
  1503. 59.36 s > 1: core::panicking::panic_fmt
  1504. 59.36 s > 2: <symbolica::evaluate::evaluator::ExpressionEvaluator<gammalooprs::utils::F<f64>>>::evaluate_impl_no_ops
  1505. 59.36 s > 3: <symbolica::evaluate::evaluator::ExpressionEvaluator<gammalooprs::utils::F<f64>>>::evaluate_single
  1506. 59.36 s > 4: gammalooprs::cff::generation::tests_cff::thermal_bubble
  1507. 59.36 s > 5: <gammalooprs::cff::generation::tests_cff::thermal_bubble::{closure#0} as core::ops::function::FnOnce<()>>::call_once
  1508. 59.36 s > note: Some details are omitted, run with `RUST_BACKTRACE=full` for a verbose backtrace.
  1509. 59.36 s > system-out
  1510. 59.36 s > running 1 test
  1511. 59.36 s > test cff::generation::tests_cff::thermal_bubble ... FAILED
  1512. 59.36 s >
  1513. 59.36 s > failures:
  1514. 59.36 s >
  1515. 59.36 s > failures:
  1516. 59.36 s > cff::generation::tests_cff::thermal_bubble
  1517. 59.36 s >
  1518. 59.36 s > test result: FAILED. 0 passed; 1 failed; 0 ignored; 0 measured; 535 filtered out; finished in 0.01s
  1519. 59.36 s > system-err
  1520. 59.36 s > thread 'cff::generation::tests_cff::thermal_bubble' (1268) panicked at /nix/store/l5xazfnr7k6r6p8mlkn38x2afab0rygz-vendor-cargo-deps/5929dab090e556a579e9f3b708cd2e67c60b3d84a12b5a276f2a36cb00473133/symbolica-2.2.0/src/evaluate/evaluator.rs:295:21:
  1521. 59.36 s > External function 'symbolica_coth' does not have an implementation for gammalooprs::utils::F<f64>
  1522. 59.36 s > stack backtrace:
  1523. 59.36 s > 0: __rustc::rust_begin_unwind
  1524. 59.36 s > 1: core::panicking::panic_fmt
  1525. 59.36 s > 2: <symbolica::evaluate::evaluator::ExpressionEvaluator<gammalooprs::utils::F<f64>>>::evaluate_impl_no_ops
  1526. 59.36 s > 3: <symbolica::evaluate::evaluator::ExpressionEvaluator<gammalooprs::utils::F<f64>>>::evaluate_single
  1527. 59.36 s > 4: gammalooprs::cff::generation::tests_cff::thermal_bubble
  1528. 59.36 s > 5: <gammalooprs::cff::generation::tests_cff::thermal_bubble::{closure#0} as core::ops::function::FnOnce<()>>::call_once
  1529. 59.36 s > note: Some details are omitted, run with `RUST_BACKTRACE=full` for a verbose backtrace.
  1530. 59.36 s >
  1531. 59.36 s > 2. gammalooprs::cff::generation::tests_cff::thermal_eight
  1532. 59.36 s > failure: test failure with exit code 101
  1533. 59.36 s > thread 'cff::generation::tests_cff::thermal_eight' (1281) panicked at /nix/store/l5xazfnr7k6r6p8mlkn38x2afab0rygz-vendor-cargo-deps/5929dab090e556a579e9f3b708cd2e67c60b3d84a12b5a276f2a36cb00473133/symbolica-2.2.0/src/evaluate/evaluator.rs:295:21:
  1534. 59.36 s > External function 'symbolica_coth' does not have an implementation for gammalooprs::utils::F<f64>
  1535. 59.36 s > stack backtrace:
  1536. 59.36 s > 0: __rustc::rust_begin_unwind
  1537. 59.36 s > 1: core::panicking::panic_fmt
  1538. 59.36 s > 2: <symbolica::evaluate::evaluator::ExpressionEvaluator<gammalooprs::utils::F<f64>>>::evaluate_impl_no_ops
  1539. 59.36 s > 3: <symbolica::evaluate::evaluator::ExpressionEvaluator<gammalooprs::utils::F<f64>>>::evaluate_single
  1540. 59.36 s > 4: gammalooprs::cff::generation::tests_cff::thermal_eight
  1541. 59.36 s > 5: <gammalooprs::cff::generation::tests_cff::thermal_eight::{closure#0} as core::ops::function::FnOnce<()>>::call_once
  1542. 59.36 s > note: Some details are omitted, run with `RUST_BACKTRACE=full` for a verbose backtrace.
  1543. 59.36 s > system-out
  1544. 59.36 s > running 1 test
  1545. 59.36 s > test cff::generation::tests_cff::thermal_eight ... FAILED
  1546. 59.36 s >
  1547. 59.36 s > failures:
  1548. 59.36 s >
  1549. 59.36 s > failures:
  1550. 59.36 s > cff::generation::tests_cff::thermal_eight
  1551. 59.36 s >
  1552. 59.36 s > test result: FAILED. 0 passed; 1 failed; 0 ignored; 0 measured; 535 filtered out; finished in 0.01s
  1553. 59.36 s > system-err
  1554. 59.36 s > thread 'cff::generation::tests_cff::thermal_eight' (1281) panicked at /nix/store/l5xazfnr7k6r6p8mlkn38x2afab0rygz-vendor-cargo-deps/5929dab090e556a579e9f3b708cd2e67c60b3d84a12b5a276f2a36cb00473133/symbolica-2.2.0/src/evaluate/evaluator.rs:295:21:
  1555. 59.36 s > External function 'symbolica_coth' does not have an implementation for gammalooprs::utils::F<f64>
  1556. 59.36 s > stack backtrace:
  1557. 59.36 s > 0: __rustc::rust_begin_unwind
  1558. 59.36 s > 1: core::panicking::panic_fmt
  1559. 59.36 s > 2: <symbolica::evaluate::evaluator::ExpressionEvaluator<gammalooprs::utils::F<f64>>>::evaluate_impl_no_ops
  1560. 59.36 s > 3: <symbolica::evaluate::evaluator::ExpressionEvaluator<gammalooprs::utils::F<f64>>>::evaluate_single
  1561. 59.36 s > 4: gammalooprs::cff::generation::tests_cff::thermal_eight
  1562. 59.36 s > 5: <gammalooprs::cff::generation::tests_cff::thermal_eight::{closure#0} as core::ops::function::FnOnce<()>>::call_once
  1563. 59.36 s > note: Some details are omitted, run with `RUST_BACKTRACE=full` for a verbose backtrace.
  1564. 59.36 s >
  1565. 59.36 s > 3. gammalooprs::cff::generation::tests_cff::thermal_bubble_chain
  1566. 59.36 s > failure: test failure with exit code 101
  1567. 59.36 s > thread 'cff::generation::tests_cff::thermal_bubble_chain' (1273) panicked at /nix/store/l5xazfnr7k6r6p8mlkn38x2afab0rygz-vendor-cargo-deps/5929dab090e556a579e9f3b708cd2e67c60b3d84a12b5a276f2a36cb00473133/symbolica-2.2.0/src/evaluate/evaluator.rs:295:21:
  1568. 59.36 s > External function 'symbolica_csch' does not have an implementation for gammalooprs::utils::F<f64>
  1569. 59.36 s > stack backtrace:
  1570. 59.36 s > 0: __rustc::rust_begin_unwind
  1571. 59.36 s > 1: core::panicking::panic_fmt
  1572. 59.36 s > 2: <symbolica::evaluate::evaluator::ExpressionEvaluator<gammalooprs::utils::F<f64>>>::evaluate_impl_no_ops
  1573. 59.36 s > 3: <symbolica::evaluate::evaluator::ExpressionEvaluator<gammalooprs::utils::F<f64>>>::evaluate_single
  1574. 59.36 s > 4: gammalooprs::cff::generation::tests_cff::thermal_bubble_chain
  1575. 59.36 s > 5: <gammalooprs::cff::generation::tests_cff::thermal_bubble_chain::{closure#0} as core::ops::function::FnOnce<()>>::call_once
  1576. 59.36 s > note: Some details are omitted, run with `RUST_BACKTRACE=full` for a verbose backtrace.
  1577. 59.36 s > system-out
  1578. 59.36 s > running 1 test
  1579. 59.36 s > test cff::generation::tests_cff::thermal_bubble_chain ... FAILED
  1580. 59.36 s >
  1581. 59.36 s > failures:
  1582. 59.36 s >
  1583. 59.36 s > failures:
  1584. 59.36 s > cff::generation::tests_cff::thermal_bubble_chain
  1585. 59.36 s >
  1586. 59.36 s > test result: FAILED. 0 passed; 1 failed; 0 ignored; 0 measured; 535 filtered out; finished in 0.01s
  1587. 59.36 s > system-err
  1588. 59.36 s > thread 'cff::generation::tests_cff::thermal_bubble_chain' (1273) panicked at /nix/store/l5xazfnr7k6r6p8mlkn38x2afab0rygz-vendor-cargo-deps/5929dab090e556a579e9f3b708cd2e67c60b3d84a12b5a276f2a36cb00473133/symbolica-2.2.0/src/evaluate/evaluator.rs:295:21:
  1589. 59.36 s > External function 'symbolica_csch' does not have an implementation for gammalooprs::utils::F<f64>
  1590. 59.36 s > stack backtrace:
  1591. 59.36 s > 0: __rustc::rust_begin_unwind
  1592. 59.36 s > 1: core::panicking::panic_fmt
  1593. 59.36 s > 2: <symbolica::evaluate::evaluator::ExpressionEvaluator<gammalooprs::utils::F<f64>>>::evaluate_impl_no_ops
  1594. 59.36 s > 3: <symbolica::evaluate::evaluator::ExpressionEvaluator<gammalooprs::utils::F<f64>>>::evaluate_single
  1595. 59.36 s > 4: gammalooprs::cff::generation::tests_cff::thermal_bubble_chain
  1596. 59.36 s > 5: <gammalooprs::cff::generation::tests_cff::thermal_bubble_chain::{closure#0} as core::ops::function::FnOnce<()>>::call_once
  1597. 59.36 s > note: Some details are omitted, run with `RUST_BACKTRACE=full` for a verbose backtrace.
  1598. 59.36 s >
  1599. 59.36 s > 4. gammalooprs::cff::generation::tests_cff::thermal_ring
  1600. 59.36 s > failure: test failure with exit code 101
  1601. 59.36 s > thread 'cff::generation::tests_cff::thermal_ring' (1284) panicked at /nix/store/l5xazfnr7k6r6p8mlkn38x2afab0rygz-vendor-cargo-deps/5929dab090e556a579e9f3b708cd2e67c60b3d84a12b5a276f2a36cb00473133/symbolica-2.2.0/src/evaluate/evaluator.rs:295:21:
  1602. 59.36 s > External function 'symbolica_coth' does not have an implementation for gammalooprs::utils::F<f64>
  1603. 59.36 s > stack backtrace:
  1604. 59.36 s > 0: __rustc::rust_begin_unwind
  1605. 59.36 s > 1: core::panicking::panic_fmt
  1606. 59.36 s > 2: <symbolica::evaluate::evaluator::ExpressionEvaluator<gammalooprs::utils::F<f64>>>::evaluate_impl_no_ops
  1607. 59.36 s > 3: <symbolica::evaluate::evaluator::ExpressionEvaluator<gammalooprs::utils::F<f64>>>::evaluate_single
  1608. 59.36 s > 4: gammalooprs::cff::generation::tests_cff::thermal_ring
  1609. 59.36 s > 5: <gammalooprs::cff::generation::tests_cff::thermal_ring::{closure#0} as core::ops::function::FnOnce<()>>::call_once
  1610. 59.36 s > note: Some details are omitted, run with `RUST_BACKTRACE=full` for a verbose backtrace.
  1611. 59.36 s > system-out
  1612. 59.36 s > running 1 test
  1613. 59.36 s > test cff::generation::tests_cff::thermal_ring ... FAILED
  1614. 59.36 s >
  1615. 59.36 s > failures:
  1616. 59.36 s >
  1617. 59.36 s > failures:
  1618. 59.36 s > cff::generation::tests_cff::thermal_ring
  1619. 59.36 s >
  1620. 59.36 s > test result: FAILED. 0 passed; 1 failed; 0 ignored; 0 measured; 535 filtered out; finished in 0.04s
  1621. 59.36 s > system-err
  1622. 59.36 s > thread 'cff::generation::tests_cff::thermal_ring' (1284) panicked at /nix/store/l5xazfnr7k6r6p8mlkn38x2afab0rygz-vendor-cargo-deps/5929dab090e556a579e9f3b708cd2e67c60b3d84a12b5a276f2a36cb00473133/symbolica-2.2.0/src/evaluate/evaluator.rs:295:21:
  1623. 59.36 s > External function 'symbolica_coth' does not have an implementation for gammalooprs::utils::F<f64>
  1624. 59.36 s > stack backtrace:
  1625. 59.36 s > 0: __rustc::rust_begin_unwind
  1626. 59.36 s > 1: core::panicking::panic_fmt
  1627. 59.36 s > 2: <symbolica::evaluate::evaluator::ExpressionEvaluator<gammalooprs::utils::F<f64>>>::evaluate_impl_no_ops
  1628. 59.36 s > 3: <symbolica::evaluate::evaluator::ExpressionEvaluator<gammalooprs::utils::F<f64>>>::evaluate_single
  1629. 59.36 s > 4: gammalooprs::cff::generation::tests_cff::thermal_ring
  1630. 59.36 s > 5: <gammalooprs::cff::generation::tests_cff::thermal_ring::{closure#0} as core::ops::function::FnOnce<()>>::call_once
  1631. 59.36 s > note: Some details are omitted, run with `RUST_BACKTRACE=full` for a verbose backtrace.
  1632. 59.36 s >
  1633. 59.36 s > 5. gammalooprs::cff::generation::tests_cff::thermal_mercedes
  1634. 59.36 s > failure: test failure with exit code 101
  1635. 59.36 s > thread 'cff::generation::tests_cff::thermal_mercedes' (1288) panicked at /nix/store/l5xazfnr7k6r6p8mlkn38x2afab0rygz-vendor-cargo-deps/5929dab090e556a579e9f3b708cd2e67c60b3d84a12b5a276f2a36cb00473133/symbolica-2.2.0/src/evaluate/evaluator.rs:295:21:
  1636. 59.36 s > External function 'symbolica_coth' does not have an implementation for gammalooprs::utils::F<f64>
  1637. 59.36 s > stack backtrace:
  1638. 59.36 s > 0: __rustc::rust_begin_unwind
  1639. 59.36 s > 1: core::panicking::panic_fmt
  1640. 59.36 s > 2: <symbolica::evaluate::evaluator::ExpressionEvaluator<gammalooprs::utils::F<f64>>>::evaluate_impl_no_ops
  1641. 59.36 s > 3: <symbolica::evaluate::evaluator::ExpressionEvaluator<gammalooprs::utils::F<f64>>>::evaluate_single
  1642. 59.36 s > 4: gammalooprs::cff::generation::tests_cff::thermal_mercedes
  1643. 59.36 s > 5: <gammalooprs::cff::generation::tests_cff::thermal_mercedes::{closure#0} as core::ops::function::FnOnce<()>>::call_once
  1644. 59.36 s > note: Some details are omitted, run with `RUST_BACKTRACE=full` for a verbose backtrace.
  1645. 59.36 s > system-out
  1646. 59.36 s > running 1 test
  1647. 59.36 s > test cff::generation::tests_cff::thermal_mercedes ... FAILED
  1648. 59.36 s >
  1649. 59.36 s > failures:
  1650. 59.36 s >
  1651. 59.36 s > failures:
  1652. 59.36 s > cff::generation::tests_cff::thermal_mercedes
  1653. 59.36 s >
  1654. 59.36 s > test result: FAILED. 0 passed; 1 failed; 0 ignored; 0 measured; 535 filtered out; finished in 0.07s
  1655. 59.36 s > system-err
  1656. 59.36 s > thread 'cff::generation::tests_cff::thermal_mercedes' (1288) panicked at /nix/store/l5xazfnr7k6r6p8mlkn38x2afab0rygz-vendor-cargo-deps/5929dab090e556a579e9f3b708cd2e67c60b3d84a12b5a276f2a36cb00473133/symbolica-2.2.0/src/evaluate/evaluator.rs:295:21:
  1657. 59.36 s > External function 'symbolica_coth' does not have an implementation for gammalooprs::utils::F<f64>
  1658. 59.36 s > stack backtrace:
  1659. 59.36 s > 0: __rustc::rust_begin_unwind
  1660. 59.36 s > 1: core::panicking::panic_fmt
  1661. 59.36 s > 2: <symbolica::evaluate::evaluator::ExpressionEvaluator<gammalooprs::utils::F<f64>>>::evaluate_impl_no_ops
  1662. 59.36 s > 3: <symbolica::evaluate::evaluator::ExpressionEvaluator<gammalooprs::utils::F<f64>>>::evaluate_single
  1663. 59.36 s > 4: gammalooprs::cff::generation::tests_cff::thermal_mercedes
  1664. 59.36 s > 5: <gammalooprs::cff::generation::tests_cff::thermal_mercedes::{closure#0} as core::ops::function::FnOnce<()>>::call_once
  1665. 59.36 s > note: Some details are omitted, run with `RUST_BACKTRACE=full` for a verbose backtrace.
  1666. 59.36 s >
  1667. 59.36 s > 6. gammalooprs::graph::feynman_graph::tests::native_thermal_distributions
  1668. 59.36 s > failure: test failure with exit code 101
  1669. 59.36 s > system-out
  1670. 59.36 s > running 1 test
  1671. 59.36 s > test graph::feynman_graph::tests::native_thermal_distributions ... FAILED
  1672. 59.36 s >
  1673. 59.36 s > failures:
  1674. 59.36 s >
  1675. 59.36 s > failures:
  1676. 59.36 s > graph::feynman_graph::tests::native_thermal_distributions
  1677. 59.36 s >
  1678. 59.36 s > test result: FAILED. 0 passed; 1 failed; 0 ignored; 0 measured; 535 filtered out; finished in 0.73s
  1679. 59.36 s > system-err
  1680. 59.36 s > The application panicked (crashed).
  1681. 59.36 s > Message: called `Result::unwrap()` on an `Err` value: Custom { kind: Other, error: "Could not compile code: g++ -shared -O3 -fPIC -ffast-math -funsafe-math-optimizations -march=native -o /build/gammaloop-native-thermal-1339/thermal_0_0.so /build/gammaloop-native-thermal-1339/thermal_0_0.cpp\nwarning: Skipping impure flag -march=native because NIX_ENFORCE_NO_NATIVE is set\n/build/gammaloop-native-thermal-1339/thermal_0_0.cpp: In function 'void thermal_realf64(const double*, double*, double*)':\n/build/gammaloop-native-thermal-1339/thermal_0_0.cpp:27:16: error: 'symbolica_tanh' was not declared in this scope\n 27 | Z[6] = symbolica_tanh(Z[6]);\n | ^~~~~~~~~~~~~~\n" }
  1682. 59.36 s > Location: crates/gammalooprs/src/graph/feynman_graph.rs:937
  1683. 59.36 s >
  1684. 59.36 s > ━━━━━━━━━━━━━━━━━━━━━━━━━━━━━━━━━━ BACKTRACE ━━━━━━━━━━━━━━━━━━━━━━━━━━━━━━━━━━━
  1685. 59.36 s > 1: <color_eyre[b0c9e66060e883b2]::config::PanicHook>::panic_report<unknown>
  1686. 59.36 s > at <unknown source file>:<unknown line>
  1687. 59.36 s > 2: <color_eyre[b0c9e66060e883b2]::config::PanicHook>::into_panic_hook::{closure#0}<unknown>
  1688. 59.36 s > at <unknown source file>:<unknown line>
  1689. 59.36 s > 3: std[bcb96dfbba0ab899]::panicking::panic_with_hook<unknown>
  1690. 59.36 s > at <unknown source file>:<unknown line>
  1691. 59.36 s > 4: std[bcb96dfbba0ab899]::panicking::panic_handler::{closure#0}<unknown>
  1692. 59.36 s > at <unknown source file>:<unknown line>
  1693. 59.36 s > 5: std[bcb96dfbba0ab899]::sys::backtrace::__rust_end_short_backtrace::<std[bcb96dfbba0ab899]::panicking::panic_handler::{closure#0}, !><unknown>
  1694. 59.36 s > at <unknown source file>:<unknown line>
  1695. 59.36 s > 6: __rustc[6c289b9f9c454d21]::rust_begin_unwind<unknown>
  1696. 59.36 s > at <unknown source file>:<unknown line>
  1697. 59.36 s > 7: core[940e698046960fd5]::panicking::panic_fmt<unknown>
  1698. 59.36 s > at <unknown source file>:<unknown line>
  1699. 59.36 s > 8: core[940e698046960fd5]::result::unwrap_failed<unknown>
  1700. 59.36 s > at <unknown source file>:<unknown line>
  1701. 59.36 s > 9: gammalooprs[f21b74aec46f5289]::graph::feynman_graph::tests::native_thermal_distributions<unknown>
  1702. 59.36 s > at <unknown source file>:<unknown line>
  1703. 59.36 s > 10: <gammalooprs[f21b74aec46f5289]::graph::feynman_graph::tests::native_thermal_distributions::{closure#0} as core[940e698046960fd5]::ops::function::FnOnce<()>>::call_once<unknown>
  1704. 59.36 s > at <unknown source file>:<unknown line>
  1705. 59.36 s > 11: test[75d6903177b1d7e9]::__rust_begin_short_backtrace::<core[940e698046960fd5]::result::Result<(), alloc[2ea6bcb46fca0c42]::string::String>, fn() -> core[940e698046960fd5]::result::Result<(), alloc[2ea6bcb46fca0c42]::string::String>><unknown>
  1706. 59.36 s > at <unknown source file>:<unknown line>
  1707. 59.36 s > 12: test[75d6903177b1d7e9]::run_test::{closure#0}<unknown>
  1708. 59.36 s > at <unknown source file>:<unknown line>
  1709. 59.36 s > 13: std[bcb96dfbba0ab899]::sys::backtrace::__rust_begin_short_backtrace::<test[75d6903177b1d7e9]::run_test::{closure#1}, ()><unknown>
  1710. 59.36 s > at <unknown source file>:<unknown line>
  1711. 59.36 s > 14: <std[bcb96dfbba0ab899]::thread::lifecycle::spawn_unchecked<test[75d6903177b1d7e9]::run_test::{closure#1}, ()>::{closure#1} as core[940e698046960fd5]::ops::function::FnOnce<()>>::call_once::{shim:vtable#0}<unknown>
  1712. 59.36 s > at <unknown source file>:<unknown line>
  1713. 59.36 s > 15: <std[bcb96dfbba0ab899]::sys::thread::unix::Thread>::new::thread_start<unknown>
  1714. 59.36 s > at <unknown source file>:<unknown line>
  1715. 59.36 s > 16: start_thread<unknown>
  1716. 59.36 s > at <unknown source file>:<unknown line>
  1717. 59.36 s > 17: __clone3<unknown>
  1718. 59.36 s > at <unknown source file>:<unknown line>
  1719. 59.36 s >
  1720. 59.36 s > Run with COLORBT_SHOW_HIDDEN=1 environment variable to disable frame filtering.
  1721. 59.36 s > Run with RUST_BACKTRACE=full to include source snippets.
  1722. 59.36 s >
  1723. 59.36 s > 7. gammalooprs::cff::generation::tests_cff::thermal_bugblatter
  1724. 59.36 s > failure: test failure with exit code 101
  1725. 59.36 s > thread 'cff::generation::tests_cff::thermal_bugblatter' (1274) panicked at /nix/store/l5xazfnr7k6r6p8mlkn38x2afab0rygz-vendor-cargo-deps/5929dab090e556a579e9f3b708cd2e67c60b3d84a12b5a276f2a36cb00473133/symbolica-2.2.0/src/evaluate/evaluator.rs:295:21:
  1726. 59.36 s > External function 'symbolica_coth' does not have an implementation for gammalooprs::utils::F<f64>
  1727. 59.36 s > stack backtrace:
  1728. 59.36 s > 0: __rustc::rust_begin_unwind
  1729. 59.36 s > 1: core::panicking::panic_fmt
  1730. 59.36 s > 2: <symbolica::evaluate::evaluator::ExpressionEvaluator<gammalooprs::utils::F<f64>>>::evaluate_impl_no_ops
  1731. 59.36 s > 3: <symbolica::evaluate::evaluator::ExpressionEvaluator<gammalooprs::utils::F<f64>>>::evaluate_single
  1732. 59.36 s > 4: gammalooprs::cff::generation::tests_cff::thermal_bugblatter
  1733. 59.36 s > 5: <gammalooprs::cff::generation::tests_cff::thermal_bugblatter::{closure#0} as core::ops::function::FnOnce<()>>::call_once
  1734. 59.36 s > note: Some details are omitted, run with `RUST_BACKTRACE=full` for a verbose backtrace.
  1735. 59.36 s > system-out
  1736. 59.36 s > running 1 test
  1737. 59.36 s > test cff::generation::tests_cff::thermal_bugblatter ... FAILED
  1738. 59.36 s >
  1739. 59.36 s > failures:
  1740. 59.36 s >
  1741. 59.36 s > failures:
  1742. 59.36 s > cff::generation::tests_cff::thermal_bugblatter
  1743. 59.36 s >
  1744. 59.36 s > test result: FAILED. 0 passed; 1 failed; 0 ignored; 0 measured; 535 filtered out; finished in 5.76s
  1745. 59.36 s > system-err
  1746. 59.36 s > thread 'cff::generation::tests_cff::thermal_bugblatter' (1274) panicked at /nix/store/l5xazfnr7k6r6p8mlkn38x2afab0rygz-vendor-cargo-deps/5929dab090e556a579e9f3b708cd2e67c60b3d84a12b5a276f2a36cb00473133/symbolica-2.2.0/src/evaluate/evaluator.rs:295:21:
  1747. 59.36 s > External function 'symbolica_coth' does not have an implementation for gammalooprs::utils::F<f64>
  1748. 59.36 s > stack backtrace:
  1749. 59.36 s > 0: __rustc::rust_begin_unwind
  1750. 59.36 s > 1: core::panicking::panic_fmt
  1751. 59.36 s > 2: <symbolica::evaluate::evaluator::ExpressionEvaluator<gammalooprs::utils::F<f64>>>::evaluate_impl_no_ops
  1752. 59.36 s > 3: <symbolica::evaluate::evaluator::ExpressionEvaluator<gammalooprs::utils::F<f64>>>::evaluate_single
  1753. 59.36 s > 4: gammalooprs::cff::generation::tests_cff::thermal_bugblatter
  1754. 59.36 s > 5: <gammalooprs::cff::generation::tests_cff::thermal_bugblatter::{closure#0} as core::ops::function::FnOnce<()>>::call_once
  1755. 59.36 s > note: Some details are omitted, run with `RUST_BACKTRACE=full` for a verbose backtrace.
  1756. 59.36 s > =========================================
  1757. 59.36 s For full logs, run:
  1758. 59.36 s nix log /nix/store/8r84j4srh5jz28101cd8xndlncp1i0gs-gammaloop-nextest-core.drv
  1759. 59.49 s [5 built (1 failed), 63 Run failed.