0.00 s
$ /nix/store/9ypz3flqsrl5xl495mm8h645gadjsxi1-coreutils-9.11/bin/timeout --kill-after=15s 7200s /nix/store/23zk8sgzamrbmj1fday15szf7f2279s8-nix-2.34.7/bin/nix --extra-experimental-features nix-command --extra-experimental-features flakes flake clone git+https://github.com/alphal00p/gammaloop --dest /tmp/nix-ci-worker/stable-pwd/repo/
0.11 s
Cloning into '/tmp/nix-ci-worker/stable-pwd/repo'...
1.72 s
remote: Enumerating objects: 83706, done.
1.95 s
remote: Counting objects: 0% (1/10144)
remote: Counting objects: 1% (102/10144)
remote: Counting objects: 2% (203/10144)
remote: Counting objects: 3% (305/10144)
remote: Counting objects: 4% (406/10144)
remote: Counting objects: 5% (508/10144)
remote: Counting objects: 6% (609/10144)
remote: Counting objects: 7% (711/10144)
remote: Counting objects: 8% (812/10144)
remote: Counting objects: 9% (913/10144)
remote: Counting objects: 10% (1015/10144)
remote: Counting objects: 11% (1116/10144)
remote: Counting objects: 12% (1218/10144)
remote: Counting objects: 13% (1319/10144)
remote: Counting objects: 14% (1421/10144)
remote: Counting objects: 15% (1522/10144)
remote: Counting objects: 16% (1624/10144)
remote: Counting objects: 17% (1725/10144)
remote: Counting objects: 18% (1826/10144)
remote: Counting objects: 19% (1928/10144)
remote: Counting objects: 20% (2029/10144)
remote: Counting objects: 21% (2131/10144)
remote: Counting objects: 22% (2232/10144)
remote: Counting objects: 23% (2334/10144)
remote: Counting objects: 24% (2435/10144)
remote: Counting objects: 25% (2536/10144)
remote: Counting objects: 26% (2638/10144)
remote: Counting objects: 27% (2739/10144)
remote: Counting objects: 28% (2841/10144)
remote: Counting objects: 29% (2942/10144)
remote: Counting objects: 30% (3044/10144)
remote: Counting objects: 31% (3145/10144)
remote: Counting objects: 32% (3247/10144)
remote: Counting objects: 33% (3348/10144)
remote: Counting objects: 34% (3449/10144)
remote: Counting objects: 35% (3551/10144)
remote: Counting objects: 36% (3652/10144)
remote: Counting objects: 37% (3754/10144)
remote: Counting objects: 38% (3855/10144)
remote: Counting objects: 39% (3957/10144)
remote: Counting objects: 40% (4058/10144)
remote: Counting objects: 41% (4160/10144)
remote: Counting objects: 42% (4261/10144)
remote: Counting objects: 43% (4362/10144)
remote: Counting objects: 44% (4464/10144)
remote: Counting objects: 45% (4565/10144)
remote: Counting objects: 46% (4667/10144)
remote: Counting objects: 47% (4768/10144)
remote: Counting objects: 48% (4870/10144)
remote: Counting objects: 49% (4971/10144)
remote: Counting objects: 50% (5072/10144)
remote: Counting objects: 51% (5174/10144)
remote: Counting objects: 52% (5275/10144)
remote: Counting objects: 53% (5377/10144)
remote: Counting objects: 54% (5478/10144)
remote: Counting objects: 55% (5580/10144)
remote: Counting objects: 56% (5681/10144)
remote: Counting objects: 57% (5783/10144)
remote: Counting objects: 58% (5884/10144)
remote: Counting objects: 59% (5985/10144)
remote: Counting objects: 60% (6087/10144)
remote: Counting objects: 61% (6188/10144)
remote: Counting objects: 62% (6290/10144)
remote: Counting objects: 63% (6391/10144)
remote: Counting objects: 64% (6493/10144)
remote: Counting objects: 65% (6594/10144)
remote: Counting objects: 66% (6696/10144)
remote: Counting objects: 67% (6797/10144)
remote: Counting objects: 68% (6898/10144)
remote: Counting objects: 69% (7000/10144)
remote: Counting objects: 70% (7101/10144)
remote: Counting objects: 71% (7203/10144)
remote: Counting objects: 72% (7304/10144)
remote: Counting objects: 73% (7406/10144)
remote: Counting objects: 74% (7507/10144)
remote: Counting objects: 75% (7608/10144)
remote: Counting objects: 76% (7710/10144)
remote: Counting objects: 77% (7811/10144)
remote: Counting objects: 78% (7913/10144)
remote: Counting objects: 79% (8014/10144)
remote: Counting objects: 80% (8116/10144)
remote: Counting objects: 81% (8217/10144)
remote: Counting objects: 82% (8319/10144)
remote: Counting objects: 83% (8420/10144)
remote: Counting objects: 84% (8521/10144)
remote: Counting objects: 85% (8623/10144)
remote: Counting objects: 86% (8724/10144)
remote: Counting objects: 87% (8826/10144)
remote: Counting objects: 88% (8927/10144)
remote: Counting objects: 89% (9029/10144)
remote: Counting objects: 90% (9130/10144)
remote: Counting objects: 91% (9232/10144)
remote: Counting objects: 92% (9333/10144)
remote: Counting objects: 93% (9434/10144)
remote: Counting objects: 94% (9536/10144)
remote: Counting objects: 95% (9637/10144)
remote: Counting objects: 96% (9739/10144)
remote: Counting objects: 97% (9840/10144)
remote: Counting objects: 98% (9942/10144)
remote: Counting objects: 99% (10043/10144)
remote: Counting objects: 100% (10144/10144)
remote: Counting objects: 100% (10144/10144), done.
4.32 s
remote: Compressing objects: 0% (1/2271)
remote: Compressing objects: 1% (23/2271)
remote: Compressing objects: 2% (46/2271)
remote: Compressing objects: 3% (69/2271)
remote: Compressing objects: 4% (91/2271)
remote: Compressing objects: 5% (114/2271)
remote: Compressing objects: 6% (137/2271)
remote: Compressing objects: 7% (159/2271)
remote: Compressing objects: 8% (182/2271)
remote: Compressing objects: 9% (205/2271)
remote: Compressing objects: 10% (228/2271)
remote: Compressing objects: 11% (250/2271)
remote: Compressing objects: 12% (273/2271)
remote: Compressing objects: 13% (296/2271)
remote: Compressing objects: 14% (318/2271)
remote: Compressing objects: 15% (341/2271)
remote: Compressing objects: 16% (364/2271)
remote: Compressing objects: 16% (386/2271)
remote: Compressing objects: 17% (387/2271)
remote: Compressing objects: 18% (409/2271)
remote: Compressing objects: 19% (432/2271)
remote: Compressing objects: 20% (455/2271)
remote: Compressing objects: 21% (477/2271)
remote: Compressing objects: 22% (500/2271)
remote: Compressing objects: 23% (523/2271)
remote: Compressing objects: 23% (545/2271)
remote: Compressing objects: 24% (546/2271)
remote: Compressing objects: 25% (568/2271)
remote: Compressing objects: 26% (591/2271)
remote: Compressing objects: 27% (614/2271)
remote: Compressing objects: 28% (636/2271)
remote: Compressing objects: 29% (659/2271)
remote: Compressing objects: 30% (682/2271)
remote: Compressing objects: 31% (705/2271)
remote: Compressing objects: 32% (727/2271)
remote: Compressing objects: 33% (750/2271)
remote: Compressing objects: 34% (773/2271)
remote: Compressing objects: 35% (795/2271)
remote: Compressing objects: 36% (818/2271)
remote: Compressing objects: 37% (841/2271)
remote: Compressing objects: 38% (863/2271)
remote: Compressing objects: 39% (886/2271)
remote: Compressing objects: 40% (909/2271)
remote: Compressing objects: 41% (932/2271)
remote: Compressing objects: 42% (954/2271)
remote: Compressing objects: 43% (977/2271)
remote: Compressing objects: 44% (1000/2271)
remote: Compressing objects: 45% (1022/2271)
remote: Compressing objects: 46% (1045/2271)
remote: Compressing objects: 47% (1068/2271)
remote: Compressing objects: 48% (1091/2271)
remote: Compressing objects: 49% (1113/2271)
remote: Compressing objects: 50% (1136/2271)
remote: Compressing objects: 51% (1159/2271)
remote: Compressing objects: 52% (1181/2271)
remote: Compressing objects: 53% (1204/2271)
remote: Compressing objects: 54% (1227/2271)
remote: Compressing objects: 55% (1250/2271)
remote: Compressing objects: 56% (1272/2271)
remote: Compressing objects: 57% (1295/2271)
remote: Compressing objects: 58% (1318/2271)
remote: Compressing objects: 59% (1340/2271)
remote: Compressing objects: 60% (1363/2271)
remote: Compressing objects: 61% (1386/2271)
remote: Compressing objects: 62% (1409/2271)
remote: Compressing objects: 63% (1431/2271)
remote: Compressing objects: 64% (1454/2271)
remote: Compressing objects: 65% (1477/2271)
remote: Compressing objects: 66% (1499/2271)
remote: Compressing objects: 67% (1522/2271)
remote: Compressing objects: 68% (1545/2271)
remote: Compressing objects: 69% (1567/2271)
remote: Compressing objects: 70% (1590/2271)
remote: Compressing objects: 71% (1613/2271)
remote: Compressing objects: 72% (1636/2271)
remote: Compressing objects: 73% (1658/2271)
remote: Compressing objects: 74% (1681/2271)
remote: Compressing objects: 75% (1704/2271)
remote: Compressing objects: 76% (1726/2271)
remote: Compressing objects: 77% (1749/2271)
remote: Compressing objects: 78% (1772/2271)
remote: Compressing objects: 79% (1795/2271)
remote: Compressing objects: 80% (1817/2271)
remote: Compressing objects: 81% (1840/2271)
remote: Compressing objects: 82% (1863/2271)
remote: Compressing objects: 83% (1885/2271)
remote: Compressing objects: 84% (1908/2271)
remote: Compressing objects: 85% (1931/2271)
remote: Compressing objects: 86% (1954/2271)
remote: Compressing objects: 87% (1976/2271)
remote: Compressing objects: 88% (1999/2271)
remote: Compressing objects: 89% (2022/2271)
remote: Compressing objects: 90% (2044/2271)
remote: Compressing objects: 91% (2067/2271)
remote: Compressing objects: 92% (2090/2271)
remote: Compressing objects: 93% (2113/2271)
remote: Compressing objects: 94% (2135/2271)
remote: Compressing objects: 95% (2158/2271)
remote: Compressing objects: 96% (2181/2271)
remote: Compressing objects: 97% (2203/2271)
remote: Compressing objects: 98% (2226/2271)
remote: Compressing objects: 99% (2249/2271)
remote: Compressing objects: 100% (2271/2271)
remote: Compressing objects: 100% (2271/2271), done.
8.62 s
Receiving objects: 0% (1/83706)
Receiving objects: 1% (838/83706)
Receiving objects: 2% (1675/83706)
Receiving objects: 3% (2512/83706)
Receiving objects: 4% (3349/83706)
Receiving objects: 5% (4186/83706)
Receiving objects: 6% (5023/83706), 9.21 MiB | 18.16 MiB/s
Receiving objects: 7% (5860/83706), 9.21 MiB | 18.16 MiB/s
Receiving objects: 8% (6697/83706), 9.21 MiB | 18.16 MiB/s
Receiving objects: 9% (7534/83706), 9.21 MiB | 18.16 MiB/s
Receiving objects: 10% (8371/83706), 9.21 MiB | 18.16 MiB/s
Receiving objects: 11% (9208/83706), 9.21 MiB | 18.16 MiB/s
Receiving objects: 12% (10045/83706), 9.21 MiB | 18.16 MiB/s
Receiving objects: 13% (10882/83706), 9.21 MiB | 18.16 MiB/s
Receiving objects: 14% (11719/83706), 9.21 MiB | 18.16 MiB/s
Receiving objects: 15% (12556/83706), 9.21 MiB | 18.16 MiB/s
Receiving objects: 16% (13393/83706), 9.21 MiB | 18.16 MiB/s
Receiving objects: 17% (14231/83706), 9.21 MiB | 18.16 MiB/s
Receiving objects: 18% (15068/83706), 9.21 MiB | 18.16 MiB/s
Receiving objects: 19% (15905/83706), 9.21 MiB | 18.16 MiB/s
Receiving objects: 20% (16742/83706), 9.21 MiB | 18.16 MiB/s
Receiving objects: 21% (17579/83706), 9.21 MiB | 18.16 MiB/s
Receiving objects: 22% (18416/83706), 9.21 MiB | 18.16 MiB/s
Receiving objects: 23% (19253/83706), 9.21 MiB | 18.16 MiB/s
Receiving objects: 24% (20090/83706), 9.21 MiB | 18.16 MiB/s
Receiving objects: 25% (20927/83706), 9.21 MiB | 18.16 MiB/s
Receiving objects: 26% (21764/83706), 9.21 MiB | 18.16 MiB/s
Receiving objects: 27% (22601/83706), 9.21 MiB | 18.16 MiB/s
Receiving objects: 28% (23438/83706), 9.21 MiB | 18.16 MiB/s
Receiving objects: 29% (24275/83706), 9.21 MiB | 18.16 MiB/s
Receiving objects: 30% (25112/83706), 9.21 MiB | 18.16 MiB/s
Receiving objects: 30% (25530/83706), 9.21 MiB | 18.16 MiB/s
Receiving objects: 31% (25949/83706), 9.21 MiB | 18.16 MiB/s
Receiving objects: 32% (26786/83706), 26.57 MiB | 26.38 MiB/s
Receiving objects: 33% (27623/83706), 26.57 MiB | 26.38 MiB/s
Receiving objects: 34% (28461/83706), 26.57 MiB | 26.38 MiB/s
Receiving objects: 35% (29298/83706), 26.57 MiB | 26.38 MiB/s
Receiving objects: 36% (30135/83706), 26.57 MiB | 26.38 MiB/s
Receiving objects: 37% (30972/83706), 26.57 MiB | 26.38 MiB/s
Receiving objects: 38% (31809/83706), 26.57 MiB | 26.38 MiB/s
Receiving objects: 39% (32646/83706), 26.57 MiB | 26.38 MiB/s
Receiving objects: 40% (33483/83706), 26.57 MiB | 26.38 MiB/s
Receiving objects: 41% (34320/83706), 26.57 MiB | 26.38 MiB/s
Receiving objects: 42% (35157/83706), 26.57 MiB | 26.38 MiB/s
Receiving objects: 43% (35994/83706), 26.57 MiB | 26.38 MiB/s
Receiving objects: 44% (36831/83706), 26.57 MiB | 26.38 MiB/s
Receiving objects: 45% (37668/83706), 26.57 MiB | 26.38 MiB/s
Receiving objects: 46% (38505/83706), 26.57 MiB | 26.38 MiB/s
Receiving objects: 47% (39342/83706), 26.57 MiB | 26.38 MiB/s
Receiving objects: 48% (40179/83706), 46.76 MiB | 31.02 MiB/s
Receiving objects: 49% (41016/83706), 46.76 MiB | 31.02 MiB/s
Receiving objects: 50% (41853/83706), 46.76 MiB | 31.02 MiB/s
Receiving objects: 51% (42691/83706), 46.76 MiB | 31.02 MiB/s
Receiving objects: 52% (43528/83706), 46.76 MiB | 31.02 MiB/s
Receiving objects: 53% (44365/83706), 46.76 MiB | 31.02 MiB/s
Receiving objects: 54% (45202/83706), 46.76 MiB | 31.02 MiB/s
Receiving objects: 55% (46039/83706), 46.76 MiB | 31.02 MiB/s
Receiving objects: 56% (46876/83706), 46.76 MiB | 31.02 MiB/s
Receiving objects: 57% (47713/83706), 46.76 MiB | 31.02 MiB/s
Receiving objects: 58% (48550/83706), 46.76 MiB | 31.02 MiB/s
Receiving objects: 58% (48754/83706), 62.57 MiB | 31.16 MiB/s
Receiving objects: 59% (49387/83706), 62.57 MiB | 31.16 MiB/s
Receiving objects: 60% (50224/83706), 62.57 MiB | 31.16 MiB/s
Receiving objects: 61% (51061/83706), 62.57 MiB | 31.16 MiB/s
Receiving objects: 62% (51898/83706), 62.57 MiB | 31.16 MiB/s
Receiving objects: 63% (52735/83706), 62.57 MiB | 31.16 MiB/s
Receiving objects: 64% (53572/83706), 62.57 MiB | 31.16 MiB/s
Receiving objects: 65% (54409/83706), 79.43 MiB | 31.67 MiB/s
Receiving objects: 66% (55246/83706), 79.43 MiB | 31.67 MiB/s
Receiving objects: 67% (56084/83706), 79.43 MiB | 31.67 MiB/s
Receiving objects: 68% (56921/83706), 79.43 MiB | 31.67 MiB/s
Receiving objects: 69% (57758/83706), 79.43 MiB | 31.67 MiB/s
Receiving objects: 70% (58595/83706), 79.43 MiB | 31.67 MiB/s
Receiving objects: 71% (59432/83706), 79.43 MiB | 31.67 MiB/s
Receiving objects: 72% (60269/83706), 79.43 MiB | 31.67 MiB/s
Receiving objects: 73% (61106/83706), 79.43 MiB | 31.67 MiB/s
Receiving objects: 74% (61943/83706), 79.43 MiB | 31.67 MiB/s
Receiving objects: 74% (62619/83706), 96.71 MiB | 32.15 MiB/s
Receiving objects: 75% (62780/83706), 96.71 MiB | 32.15 MiB/s
Receiving objects: 76% (63617/83706), 96.71 MiB | 32.15 MiB/s
Receiving objects: 77% (64454/83706), 96.71 MiB | 32.15 MiB/s
Receiving objects: 78% (65291/83706), 96.71 MiB | 32.15 MiB/s
Receiving objects: 79% (66128/83706), 96.71 MiB | 32.15 MiB/s
Receiving objects: 80% (66965/83706), 96.71 MiB | 32.15 MiB/s
Receiving objects: 81% (67802/83706), 96.71 MiB | 32.15 MiB/s
Receiving objects: 82% (68639/83706), 96.71 MiB | 32.15 MiB/s
Receiving objects: 83% (69476/83706), 113.86 MiB | 32.46 MiB/s
Receiving objects: 84% (70314/83706), 113.86 MiB | 32.46 MiB/s
Receiving objects: 85% (71151/83706), 113.86 MiB | 32.46 MiB/s
Receiving objects: 86% (71988/83706), 113.86 MiB | 32.46 MiB/s
Receiving objects: 87% (72825/83706), 113.86 MiB | 32.46 MiB/s
Receiving objects: 88% (73662/83706), 113.86 MiB | 32.46 MiB/s
Receiving objects: 89% (74499/83706), 113.86 MiB | 32.46 MiB/s
Receiving objects: 90% (75336/83706), 113.86 MiB | 32.46 MiB/s
Receiving objects: 91% (76173/83706), 113.86 MiB | 32.46 MiB/s
Receiving objects: 92% (77010/83706), 113.86 MiB | 32.46 MiB/s
Receiving objects: 93% (77847/83706), 113.86 MiB | 32.46 MiB/s
Receiving objects: 94% (78684/83706), 113.86 MiB | 32.46 MiB/s
Receiving objects: 95% (79521/83706), 113.86 MiB | 32.46 MiB/s
Receiving objects: 96% (80358/83706), 113.86 MiB | 32.46 MiB/s
Receiving objects: 97% (81195/83706), 113.86 MiB | 32.46 MiB/s
Receiving objects: 98% (82032/83706), 113.86 MiB | 32.46 MiB/s
Receiving objects: 98% (82688/83706), 130.75 MiB | 32.62 MiB/s
Receiving objects: 99% (82869/83706), 130.75 MiB | 32.62 MiB/s
remote: Total 83706 (delta 8088), reused 8207 (delta 7340), pack-reused 73562 (from 3)
8.62 s
Receiving objects: 100% (83706/83706), 130.75 MiB | 32.62 MiB/s
Receiving objects: 100% (83706/83706), 139.61 MiB | 32.68 MiB/s, done.
10.59 s
Resolving deltas: 0% (0/56176)
Resolving deltas: 1% (563/56176)
Resolving deltas: 2% (1124/56176)
Resolving deltas: 3% (1686/56176)
Resolving deltas: 4% (2252/56176)
Resolving deltas: 5% (2809/56176)
Resolving deltas: 6% (3371/56176)
Resolving deltas: 7% (3933/56176)
Resolving deltas: 8% (4495/56176)
Resolving deltas: 9% (5056/56176)
Resolving deltas: 10% (5619/56176)
Resolving deltas: 11% (6180/56176)
Resolving deltas: 12% (6742/56176)
Resolving deltas: 13% (7303/56176)
Resolving deltas: 14% (7866/56176)
Resolving deltas: 15% (8427/56176)
Resolving deltas: 16% (8989/56176)
Resolving deltas: 17% (9550/56176)
Resolving deltas: 18% (10112/56176)
Resolving deltas: 19% (10674/56176)
Resolving deltas: 20% (11236/56176)
Resolving deltas: 21% (11797/56176)
Resolving deltas: 22% (12359/56176)
Resolving deltas: 23% (12922/56176)
Resolving deltas: 24% (13483/56176)
Resolving deltas: 25% (14044/56176)
Resolving deltas: 26% (14606/56176)
Resolving deltas: 27% (15168/56176)
Resolving deltas: 28% (15730/56176)
Resolving deltas: 29% (16292/56176)
Resolving deltas: 30% (16853/56176)
Resolving deltas: 31% (17415/56176)
Resolving deltas: 32% (17977/56176)
Resolving deltas: 33% (18539/56176)
Resolving deltas: 34% (19100/56176)
Resolving deltas: 35% (19662/56176)
Resolving deltas: 36% (20224/56176)
Resolving deltas: 37% (20787/56176)
Resolving deltas: 38% (21347/56176)
Resolving deltas: 39% (21909/56176)
Resolving deltas: 40% (22472/56176)
Resolving deltas: 41% (23033/56176)
Resolving deltas: 42% (23594/56176)
Resolving deltas: 43% (24156/56176)
Resolving deltas: 44% (24718/56176)
Resolving deltas: 45% (25280/56176)
Resolving deltas: 46% (25841/56176)
Resolving deltas: 47% (26403/56176)
Resolving deltas: 48% (26965/56176)
Resolving deltas: 49% (27527/56176)
Resolving deltas: 50% (28089/56176)
Resolving deltas: 51% (28651/56176)
Resolving deltas: 52% (29212/56176)
Resolving deltas: 53% (29774/56176)
Resolving deltas: 54% (30336/56176)
Resolving deltas: 55% (30897/56176)
Resolving deltas: 56% (31459/56176)
Resolving deltas: 57% (32021/56176)
Resolving deltas: 58% (32583/56176)
Resolving deltas: 59% (33144/56176)
Resolving deltas: 60% (33706/56176)
Resolving deltas: 61% (34271/56176)
Resolving deltas: 62% (34830/56176)
Resolving deltas: 63% (35391/56176)
Resolving deltas: 64% (35953/56176)
Resolving deltas: 65% (36515/56176)
Resolving deltas: 66% (37077/56176)
Resolving deltas: 66% (37431/56176)
Resolving deltas: 67% (37638/56176)
Resolving deltas: 68% (38200/56176)
Resolving deltas: 69% (38762/56176)
Resolving deltas: 70% (39324/56176)
Resolving deltas: 71% (39885/56176)
Resolving deltas: 72% (40447/56176)
Resolving deltas: 73% (41009/56176)
Resolving deltas: 74% (41571/56176)
Resolving deltas: 75% (42132/56176)
Resolving deltas: 76% (42694/56176)
Resolving deltas: 77% (43258/56176)
Resolving deltas: 78% (43818/56176)
Resolving deltas: 79% (44380/56176)
Resolving deltas: 80% (44941/56176)
Resolving deltas: 81% (45503/56176)
Resolving deltas: 82% (46066/56176)
Resolving deltas: 83% (46627/56176)
Resolving deltas: 84% (47188/56176)
Resolving deltas: 85% (47750/56176)
Resolving deltas: 86% (48312/56176)
Resolving deltas: 87% (48874/56176)
Resolving deltas: 88% (49435/56176)
Resolving deltas: 89% (49997/56176)
Resolving deltas: 90% (50559/56176)
Resolving deltas: 91% (51121/56176)
Resolving deltas: 92% (51682/56176)
Resolving deltas: 93% (52244/56176)
Resolving deltas: 94% (52806/56176)
Resolving deltas: 95% (53368/56176)
Resolving deltas: 96% (53929/56176)
Resolving deltas: 97% (54491/56176)
Resolving deltas: 98% (55053/56176)
Resolving deltas: 99% (55615/56176)
Resolving deltas: 100% (56176/56176)
Resolving deltas: 100% (56176/56176), done.
11.44 s
Fetching commit 8d66059f66a723e7d44e7159b3db9cbce5d88b16 for wip/native-symbolica-hyperbolics ...
11.45 s
$ /nix/store/bcnisk3ydfgv26v2gw3zlky24g00yww2-git-2.54.0/bin/git fetch origin 8d66059f66a723e7d44e7159b3db9cbce5d88b16
12.14 s
From https://github.com/alphal00p/gammaloop
12.14 s
* branch 8d66059f66a723e7d44e7159b3db9cbce5d88b16 -> FETCH_HEAD
12.27 s
$ /nix/store/9ypz3flqsrl5xl495mm8h645gadjsxi1-coreutils-9.11/bin/timeout --kill-after=15s 7200s /nix/store/bcnisk3ydfgv26v2gw3zlky24g00yww2-git-2.54.0/bin/git -c advice.detachedHead=false checkout 8d66059f66a723e7d44e7159b3db9cbce5d88b16
12.73 s
HEAD is now at 8d66059f6 update symjit to 2.25.3
12.75 s
$ /nix/store/9ypz3flqsrl5xl495mm8h645gadjsxi1-coreutils-9.11/bin/timeout --kill-after=15s 7200s /nix/store/23zk8sgzamrbmj1fday15szf7f2279s8-nix-2.34.7/bin/nix --extra-experimental-features nix-command --extra-experimental-features flakes --log-format internal-json run .#packages.x86_64-linux.nix-ci-check-gammaloop-nextest-core --print-build-logs
22.08 s
33.91 s
evaluating derivation 'g
copying '/nix/store/z98r
evaluating derivation 'g
copying '/nix/store/z98r
evaluating derivation 'g
copying '/nix/store/z98r
evaluating derivation 'g
copying '/nix/store/z98r
evaluating derivation 'g
copying '/nix/store/z98r
evaluating derivation 'g
copying '/nix/store/z98r
evaluating derivation 'g
copying '/nix/store/z98r
evaluating derivation 'g
copying '/nix/store/z98r
evaluating derivation 'g
copying '/nix/store/z98r
evaluating derivation 'g
copying '/nix/store/z98r
evaluating derivation 'g
copying '/nix/store/z98r
evaluating derivation 'g
copying '/nix/store/z98r
evaluating derivation 'g
copying '/nix/store/z98r
evaluating derivation 'g
copying '/nix/store/z98r
evaluating derivation 'g
querying gammaloop-nexte
[0.0 KiB DL] querying ne
[0 /2 built, 0 /1 copied,
[0 /2 built, 1 /0 /1 copied
[0 /1 built, 1 copied (4.
[1 /0 /1 built, 1 copied (gammaloop-nextest-core> Extracting 4 binaries (including 1 non-test binary), 1 build script output directory, and 2 linked paths to /build/nextest-archive-CALvVq
35.33 s
gammaloop-nextest-core> Extracted 20 files to /build/nextest-archive-CALvVq in 1.43s
35.38 s
gammaloop-nextest-core> ------------
35.38 s
gammaloop-nextest-core> Nextest run ID 9ac193f2-3ba1-45b9-9cd9-e3f78ceb7e74 with nextest profile: ci_gammaloop
35.38 s
gammaloop-nextest-core> Starting 380 tests across 3 binaries
38.02 s
gammaloop-nextest-core> ------------
38.02 s
gammaloop-nextest-core> Summary [ 2.641s] 380 tests run: 380 passed , 0 skipped
38.50 s
gammaloop-nextest-core>
38.50 s
gammaloop-nextest-core> ========== nextest test summary ==========
38.50 s
gammaloop-nextest-core> report: target/nextest/ci_gammaloop/junit.xml
38.50 s
gammaloop-nextest-core> tests: 380, failures: 0, errors: 0
38.50 s
gammaloop-nextest-core> No failing testcases found.
38.50 s
gammaloop-nextest-core> =========================================
38.53 s
gammaloop-nextest-core> Extracting 1 binary and 1 linked path to /build/nextest-archive-qhxnwv
38.68 s
gammaloop-nextest-core> Extracted 7 files to /build/nextest-archive-qhxnwv in 0.15s
38.72 s
gammaloop-nextest-core> ------------
38.72 s
gammaloop-nextest-core> Nextest run ID 543b11e8-cda0-4f84-bdfa-56ee29b11fb9 with nextest profile: ci_gammaloop
38.72 s
gammaloop-nextest-core> Starting 19 tests across 1 binary
38.76 s
gammaloop-nextest-core> ------------
38.76 s
gammaloop-nextest-core> Summary [ 0.045s] 19 tests run: 19 passed , 0 skipped
38.88 s
gammaloop-nextest-core>
38.88 s
gammaloop-nextest-core> ========== nextest test summary ==========
38.88 s
gammaloop-nextest-core> report: target/nextest/ci_gammaloop/junit.xml
38.88 s
gammaloop-nextest-core> tests: 19, failures: 0, errors: 0
38.88 s
gammaloop-nextest-core> No failing testcases found.
38.88 s
gammaloop-nextest-core> =========================================
38.94 s
gammaloop-nextest-core> Extracting 1 binary to /build/nextest-archive-xsHsve
38.99 s
gammaloop-nextest-core> Extracted 4 files to /build/nextest-archive-xsHsve in 0.06s
39.02 s
gammaloop-nextest-core> ------------
39.02 s
gammaloop-nextest-core> Nextest run ID 3e59b117-f4d5-4248-985a-7dd42766c3a4 with nextest profile: ci_gammaloop
39.02 s
gammaloop-nextest-core> Starting 0 tests across 1 binary
39.03 s
gammaloop-nextest-core> ------------
39.03 s
gammaloop-nextest-core> Summary [ 0.004s] 0 tests run: 0 passed , 0 skipped
39.10 s
gammaloop-nextest-core>
39.10 s
gammaloop-nextest-core> ========== nextest test summary ==========
39.10 s
gammaloop-nextest-core> report: target/nextest/ci_gammaloop/junit.xml
39.10 s
gammaloop-nextest-core> tests: 0, failures: 0, errors: 0
39.10 s
gammaloop-nextest-core> No failing testcases found.
39.10 s
gammaloop-nextest-core> =========================================
39.14 s
gammaloop-nextest-core> Extracting 4 binaries, 1 build script output directory, and 2 linked paths to /build/nextest-archive-3uQ6KP
40.15 s
gammaloop-nextest-core> Extracted 18 files to /build/nextest-archive-3uQ6KP in 1.02s
40.21 s
gammaloop-nextest-core> ------------
40.21 s
gammaloop-nextest-core> Nextest run ID 069eb123-6875-494b-a27b-9059b5c3fbe5 with nextest profile: ci_gammaloop
40.21 s
gammaloop-nextest-core> Starting 687 tests across 4 binaries (60 tests skipped , including 59 tests via profile.ci_gammaloop.default-filter )
43.32 s
gammaloop-nextest-core> FAIL [ 0.211s] (235/687) gammalooprs integrands::process::param_builder::tests :: thermal_tanh_remains_finite_at_uv_scales_and_preserves_derivatives
43.32 s
gammaloop-nextest-core> stdout ---
43.32 s
gammaloop-nextest-core>
43.32 s
gammaloop-nextest-core> running 1 test
43.32 s
gammaloop-nextest-core> test integrands::process::param_builder::tests::thermal_tanh_remains_finite_at_uv_scales_and_preserves_derivatives ... FAILED
43.32 s
gammaloop-nextest-core>
43.32 s
gammaloop-nextest-core> failures:
43.32 s
gammaloop-nextest-core>
43.32 s
gammaloop-nextest-core> failures:
43.32 s
gammaloop-nextest-core> integrands::process::param_builder::tests::thermal_tanh_remains_finite_at_uv_scales_and_preserves_derivatives
43.32 s
gammaloop-nextest-core>
43.32 s
gammaloop-nextest-core> test result: FAILED. 0 passed; 1 failed; 0 ignored; 0 measured; 737 filtered out; finished in 0.19s
43.32 s
gammaloop-nextest-core>
43.32 s
gammaloop-nextest-core> stderr ---
43.32 s
gammaloop-nextest-core> The application panicked (crashed).
43.32 s
gammaloop-nextest-core> Message: called `Result::unwrap()` on an `Err` value: "To vectorize the function 'symbolica::tanh', the symbol 'symbolica::tanh_v' must be defined that takes the vector index as an additional tag"
43.32 s
gammaloop-nextest-core> Location: crates/gammalooprs/src/integrands/process/param_builder.rs :1958
43.32 s
gammaloop-nextest-core>
43.32 s
gammaloop-nextest-core> ━━━━━━━━━━━━━━━━━━━━━━━━━━━━━━━━━━ BACKTRACE ━━━━━━━━━━━━━━━━━━━━━━━━━━━━━━━━━━━
43.32 s
gammaloop-nextest-core> 1: <color_eyre[51793ea62743adbd]::config::PanicHook>::panic_report <unknown>
43.32 s
gammaloop-nextest-core> at <unknown source file> :<unknown line>
43.32 s
gammaloop-nextest-core> 2: <color_eyre[51793ea62743adbd]::config::PanicHook>::into_panic_hook::{closure#0} <unknown>
43.32 s
gammaloop-nextest-core> at <unknown source file> :<unknown line>
43.32 s
gammaloop-nextest-core> 3: std[bcb96dfbba0ab899]::panicking::panic_with_hook <unknown>
43.32 s
gammaloop-nextest-core> at <unknown source file> :<unknown line>
43.32 s
gammaloop-nextest-core> 4: std[bcb96dfbba0ab899]::panicking::panic_handler::{closure#0} <unknown>
43.32 s
gammaloop-nextest-core> at <unknown source file> :<unknown line>
43.32 s
gammaloop-nextest-core> 5: std[bcb96dfbba0ab899]::sys::backtrace::__rust_end_short_backtrace::<std[bcb96dfbba0ab899]::panicking::panic_handler::{closure#0}, !> <unknown>
43.32 s
gammaloop-nextest-core> at <unknown source file> :<unknown line>
43.32 s
gammaloop-nextest-core> 6: __rustc[6c289b9f9c454d21]::rust_begin_unwind <unknown>
43.32 s
gammaloop-nextest-core> at <unknown source file> :<unknown line>
43.32 s
gammaloop-nextest-core> 7: core[940e698046960fd5]::panicking::panic_fmt <unknown>
43.32 s
gammaloop-nextest-core> at <unknown source file> :<unknown line>
43.32 s
gammaloop-nextest-core> 8: core[940e698046960fd5]::result::unwrap_failed <unknown>
43.32 s
gammaloop-nextest-core> at <unknown source file> :<unknown line>
43.32 s
gammaloop-nextest-core> 9: gammalooprs[e90c332ffd68fb1e]::integrands::process::param_builder::tests::thermal_tanh_remains_finite_at_uv_scales_and_preserves_derivatives <unknown>
43.32 s
gammaloop-nextest-core> at <unknown source file> :<unknown line>
43.32 s
gammaloop-nextest-core> 10: <gammalooprs[e90c332ffd68fb1e]::integrands::process::param_builder::tests::thermal_tanh_remains_finite_at_uv_scales_and_preserves_derivatives::{closure#0} as core[940e698046960fd5]::ops::function::FnOnce<()>>::call_once <unknown>
43.32 s
gammaloop-nextest-core> at <unknown source file> :<unknown line>
43.32 s
gammaloop-nextest-core> 11: test[75d6903177b1d7e9]::__rust_begin_short_backtrace::<core[940e698046960fd5]::result::Result<(), alloc[2ea6bcb46fca0c42]::string::String>, fn() -> core[940e698046960fd5]::result::Result<(), alloc[2ea6bcb46fca0c42]::string::String>> <unknown>
43.32 s
gammaloop-nextest-core> at <unknown source file> :<unknown line>
43.32 s
gammaloop-nextest-core> 12: test[75d6903177b1d7e9]::run_test::{closure#0} <unknown>
43.32 s
gammaloop-nextest-core> at <unknown source file> :<unknown line>
43.32 s
gammaloop-nextest-core> 13: std[bcb96dfbba0ab899]::sys::backtrace::__rust_begin_short_backtrace::<test[75d6903177b1d7e9]::run_test::{closure#1}, ()> <unknown>
43.32 s
gammaloop-nextest-core> at <unknown source file> :<unknown line>
43.32 s
gammaloop-nextest-core> 14: <std[bcb96dfbba0ab899]::thread::lifecycle::spawn_unchecked<test[75d6903177b1d7e9]::run_test::{closure#1}, ()>::{closure#1} as core[940e698046960fd5]::ops::function::FnOnce<()>>::call_once::{shim:vtable#0} <unknown>
43.32 s
gammaloop-nextest-core> at <unknown source file> :<unknown line>
43.32 s
gammaloop-nextest-core> 15: <std[bcb96dfbba0ab899]::sys::thread::unix::Thread>::new::thread_start <unknown>
43.32 s
gammaloop-nextest-core> at <unknown source file> :<unknown line>
43.32 s
gammaloop-nextest-core> 16: start_thread <unknown>
43.32 s
gammaloop-nextest-core> at <unknown source file> :<unknown line>
43.32 s
gammaloop-nextest-core> 17: __clone3 <unknown>
43.32 s
gammaloop-nextest-core> at <unknown source file> :<unknown line>
43.32 s
gammaloop-nextest-core>
43.32 s
gammaloop-nextest-core> Run with COLORBT_SHOW_HIDDEN=1 environment variable to disable frame filtering.
43.32 s
gammaloop-nextest-core> Run with RUST_BACKTRACE=full to include source snippets.
43.32 s
gammaloop-nextest-core>
43.79 s
gammaloop-nextest-core> FAIL [ 2.350s] (325/687) gammalooprs graph::feynman_graph::tests :: native_thermal_distributions
43.79 s
gammaloop-nextest-core> stdout ---
43.79 s
gammaloop-nextest-core>
43.79 s
gammaloop-nextest-core> running 1 test
43.79 s
gammaloop-nextest-core> test graph::feynman_graph::tests::native_thermal_distributions ... FAILED
43.79 s
gammaloop-nextest-core>
43.79 s
gammaloop-nextest-core> failures:
43.79 s
gammaloop-nextest-core>
43.79 s
gammaloop-nextest-core> failures:
43.79 s
gammaloop-nextest-core> graph::feynman_graph::tests::native_thermal_distributions
43.79 s
gammaloop-nextest-core>
43.79 s
gammaloop-nextest-core> test result: FAILED. 0 passed; 1 failed; 0 ignored; 0 measured; 737 filtered out; finished in 2.32s
43.79 s
gammaloop-nextest-core>
43.79 s
gammaloop-nextest-core> stderr ---
43.79 s
gammaloop-nextest-core> The application panicked (crashed).
43.79 s
gammaloop-nextest-core> Message: called `Result::unwrap()` on an `Err` value: Custom { kind: Other, error: "Could not compile code: g++ -shared -O3 -fPIC -ffast-math -funsafe-math-optimizations -march=native -o /build/gammaloop-native-thermal-1614/thermal_0_0.so /build/gammaloop-native-thermal-1614/thermal_0_0.cpp\nwarning: Skipping impure flag -march=native because NIX_ENFORCE_NO_NATIVE is set\n/build/gammaloop-native-thermal-1614/thermal_0_0.cpp: In function 'void thermal_realf64(const double*, double*, double*)':\n/build/gammaloop-native-thermal-1614/thermal_0_0.cpp:27:16: error: 'symbolica_tanh' was not declared in this scope\n 27 | Z[6] = symbolica_tanh(Z[6]);\n | ^~~~~~~~~~~~~~\n" }
43.79 s
gammaloop-nextest-core> Location: crates/gammalooprs/src/graph/feynman_graph.rs :1165
43.79 s
gammaloop-nextest-core>
43.79 s
gammaloop-nextest-core> ━━━━━━━━━━━━━━━━━━━━━━━━━━━━━━━━━━ BACKTRACE ━━━━━━━━━━━━━━━━━━━━━━━━━━━━━━━━━━━
43.79 s
gammaloop-nextest-core> 1: <color_eyre[51793ea62743adbd]::config::PanicHook>::panic_report <unknown>
43.79 s
gammaloop-nextest-core> at <unknown source file> :<unknown line>
43.79 s
gammaloop-nextest-core> 2: <color_eyre[51793ea62743adbd]::config::PanicHook>::into_panic_hook::{closure#0} <unknown>
43.79 s
gammaloop-nextest-core> at <unknown source file> :<unknown line>
43.79 s
gammaloop-nextest-core> 3: std[bcb96dfbba0ab899]::panicking::panic_with_hook <unknown>
43.79 s
gammaloop-nextest-core> at <unknown source file> :<unknown line>
43.79 s
gammaloop-nextest-core> 4: std[bcb96dfbba0ab899]::panicking::panic_handler::{closure#0} <unknown>
43.79 s
gammaloop-nextest-core> at <unknown source file> :<unknown line>
43.79 s
gammaloop-nextest-core> 5: std[bcb96dfbba0ab899]::sys::backtrace::__rust_end_short_backtrace::<std[bcb96dfbba0ab899]::panicking::panic_handler::{closure#0}, !> <unknown>
43.79 s
gammaloop-nextest-core> at <unknown source file> :<unknown line>
43.79 s
gammaloop-nextest-core> 6: __rustc[6c289b9f9c454d21]::rust_begin_unwind <unknown>
43.79 s
gammaloop-nextest-core> at <unknown source file> :<unknown line>
43.79 s
gammaloop-nextest-core> 7: core[940e698046960fd5]::panicking::panic_fmt <unknown>
43.79 s
gammaloop-nextest-core> at <unknown source file> :<unknown line>
43.79 s
gammaloop-nextest-core> 8: core[940e698046960fd5]::result::unwrap_failed <unknown>
43.79 s
gammaloop-nextest-core> at <unknown source file> :<unknown line>
43.79 s
gammaloop-nextest-core> 9: gammalooprs[e90c332ffd68fb1e]::graph::feynman_graph::tests::native_thermal_distributions <unknown>
43.79 s
gammaloop-nextest-core> at <unknown source file> :<unknown line>
43.79 s
gammaloop-nextest-core> 10: <gammalooprs[e90c332ffd68fb1e]::graph::feynman_graph::tests::native_thermal_distributions::{closure#0} as core[940e698046960fd5]::ops::function::FnOnce<()>>::call_once <unknown>
43.79 s
gammaloop-nextest-core> at <unknown source file> :<unknown line>
43.79 s
gammaloop-nextest-core> 11: test[75d6903177b1d7e9]::__rust_begin_short_backtrace::<core[940e698046960fd5]::result::Result<(), alloc[2ea6bcb46fca0c42]::string::String>, fn() -> core[940e698046960fd5]::result::Result<(), alloc[2ea6bcb46fca0c42]::string::String>> <unknown>
43.79 s
gammaloop-nextest-core> at <unknown source file> :<unknown line>
43.79 s
gammaloop-nextest-core> 12: test[75d6903177b1d7e9]::run_test::{closure#0} <unknown>
43.79 s
gammaloop-nextest-core> at <unknown source file> :<unknown line>
43.79 s
gammaloop-nextest-core> 13: std[bcb96dfbba0ab899]::sys::backtrace::__rust_begin_short_backtrace::<test[75d6903177b1d7e9]::run_test::{closure#1}, ()> <unknown>
43.79 s
gammaloop-nextest-core> at <unknown source file> :<unknown line>
43.79 s
gammaloop-nextest-core> 14: <std[bcb96dfbba0ab899]::thread::lifecycle::spawn_unchecked<test[75d6903177b1d7e9]::run_test::{closure#1}, ()>::{closure#1} as core[940e698046960fd5]::ops::function::FnOnce<()>>::call_once::{shim:vtable#0} <unknown>
43.79 s
gammaloop-nextest-core> at <unknown source file> :<unknown line>
43.79 s
gammaloop-nextest-core> 15: <std[bcb96dfbba0ab899]::sys::thread::unix::Thread>::new::thread_start <unknown>
43.79 s
gammaloop-nextest-core> at <unknown source file> :<unknown line>
43.79 s
gammaloop-nextest-core> 16: start_thread <unknown>
43.79 s
gammaloop-nextest-core> at <unknown source file> :<unknown line>
43.79 s
gammaloop-nextest-core> 17: __clone3 <unknown>
43.79 s
gammaloop-nextest-core> at <unknown source file> :<unknown line>
43.79 s
gammaloop-nextest-core>
43.79 s
gammaloop-nextest-core> Run with COLORBT_SHOW_HIDDEN=1 environment variable to disable frame filtering.
43.79 s
gammaloop-nextest-core> Run with RUST_BACKTRACE=full to include source snippets.
43.79 s
gammaloop-nextest-core>
66.99 s
gammaloop-nextest-core> ------------
66.99 s
gammaloop-nextest-core> Summary [ 26.776s] 687 tests run: 685 passed , 2 failed , 60 skipped
66.99 s
gammaloop-nextest-core> FAIL [ 0.211s] (235/687) gammalooprs integrands::process::param_builder::tests :: thermal_tanh_remains_finite_at_uv_scales_and_preserves_derivatives
66.99 s
gammaloop-nextest-core> stdout ---
66.99 s
gammaloop-nextest-core>
66.99 s
gammaloop-nextest-core> running 1 test
66.99 s
gammaloop-nextest-core> test integrands::process::param_builder::tests::thermal_tanh_remains_finite_at_uv_scales_and_preserves_derivatives ... FAILED
66.99 s
gammaloop-nextest-core>
66.99 s
gammaloop-nextest-core> failures:
66.99 s
gammaloop-nextest-core>
66.99 s
gammaloop-nextest-core> failures:
66.99 s
gammaloop-nextest-core> integrands::process::param_builder::tests::thermal_tanh_remains_finite_at_uv_scales_and_preserves_derivatives
66.99 s
gammaloop-nextest-core>
66.99 s
gammaloop-nextest-core> test result: FAILED. 0 passed; 1 failed; 0 ignored; 0 measured; 737 filtered out; finished in 0.19s
66.99 s
gammaloop-nextest-core>
66.99 s
gammaloop-nextest-core> stderr ---
66.99 s
gammaloop-nextest-core> The application panicked (crashed).
66.99 s
gammaloop-nextest-core> Message: called `Result::unwrap()` on an `Err` value: "To vectorize the function 'symbolica::tanh', the symbol 'symbolica::tanh_v' must be defined that takes the vector index as an additional tag"
66.99 s
gammaloop-nextest-core> Location: crates/gammalooprs/src/integrands/process/param_builder.rs :1958
66.99 s
gammaloop-nextest-core>
66.99 s
gammaloop-nextest-core> ━━━━━━━━━━━━━━━━━━━━━━━━━━━━━━━━━━ BACKTRACE ━━━━━━━━━━━━━━━━━━━━━━━━━━━━━━━━━━━
66.99 s
gammaloop-nextest-core> 1: <color_eyre[51793ea62743adbd]::config::PanicHook>::panic_report <unknown>
66.99 s
gammaloop-nextest-core> at <unknown source file> :<unknown line>
66.99 s
gammaloop-nextest-core> 2: <color_eyre[51793ea62743adbd]::config::PanicHook>::into_panic_hook::{closure#0} <unknown>
66.99 s
gammaloop-nextest-core> at <unknown source file> :<unknown line>
66.99 s
gammaloop-nextest-core> 3: std[bcb96dfbba0ab899]::panicking::panic_with_hook <unknown>
66.99 s
gammaloop-nextest-core> at <unknown source file> :<unknown line>
66.99 s
gammaloop-nextest-core> 4: std[bcb96dfbba0ab899]::panicking::panic_handler::{closure#0} <unknown>
66.99 s
gammaloop-nextest-core> at <unknown source file> :<unknown line>
66.99 s
gammaloop-nextest-core> 5: std[bcb96dfbba0ab899]::sys::backtrace::__rust_end_short_backtrace::<std[bcb96dfbba0ab899]::panicking::panic_handler::{closure#0}, !> <unknown>
66.99 s
gammaloop-nextest-core> at <unknown source file> :<unknown line>
66.99 s
gammaloop-nextest-core> 6: __rustc[6c289b9f9c454d21]::rust_begin_unwind <unknown>
66.99 s
gammaloop-nextest-core> at <unknown source file> :<unknown line>
66.99 s
gammaloop-nextest-core> 7: core[940e698046960fd5]::panicking::panic_fmt <unknown>
66.99 s
gammaloop-nextest-core> at <unknown source file> :<unknown line>
66.99 s
gammaloop-nextest-core> 8: core[940e698046960fd5]::result::unwrap_failed <unknown>
66.99 s
gammaloop-nextest-core> at <unknown source file> :<unknown line>
66.99 s
gammaloop-nextest-core> 9: gammalooprs[e90c332ffd68fb1e]::integrands::process::param_builder::tests::thermal_tanh_remains_finite_at_uv_scales_and_preserves_derivatives <unknown>
66.99 s
gammaloop-nextest-core> at <unknown source file> :<unknown line>
66.99 s
gammaloop-nextest-core> 10: <gammalooprs[e90c332ffd68fb1e]::integrands::process::param_builder::tests::thermal_tanh_remains_finite_at_uv_scales_and_preserves_derivatives::{closure#0} as core[940e698046960fd5]::ops::function::FnOnce<()>>::call_once <unknown>
66.99 s
gammaloop-nextest-core> at <unknown source file> :<unknown line>
66.99 s
gammaloop-nextest-core> 11: test[75d6903177b1d7e9]::__rust_begin_short_backtrace::<core[940e698046960fd5]::result::Result<(), alloc[2ea6bcb46fca0c42]::string::String>, fn() -> core[940e698046960fd5]::result::Result<(), alloc[2ea6bcb46fca0c42]::string::String>> <unknown>
66.99 s
gammaloop-nextest-core> at <unknown source file> :<unknown line>
66.99 s
gammaloop-nextest-core> 12: test[75d6903177b1d7e9]::run_test::{closure#0} <unknown>
66.99 s
gammaloop-nextest-core> at <unknown source file> :<unknown line>
66.99 s
gammaloop-nextest-core> 13: std[bcb96dfbba0ab899]::sys::backtrace::__rust_begin_short_backtrace::<test[75d6903177b1d7e9]::run_test::{closure#1}, ()> <unknown>
66.99 s
gammaloop-nextest-core> at <unknown source file> :<unknown line>
66.99 s
gammaloop-nextest-core> 14: <std[bcb96dfbba0ab899]::thread::lifecycle::spawn_unchecked<test[75d6903177b1d7e9]::run_test::{closure#1}, ()>::{closure#1} as core[940e698046960fd5]::ops::function::FnOnce<()>>::call_once::{shim:vtable#0} <unknown>
66.99 s
gammaloop-nextest-core> at <unknown source file> :<unknown line>
66.99 s
gammaloop-nextest-core> 15: <std[bcb96dfbba0ab899]::sys::thread::unix::Thread>::new::thread_start <unknown>
66.99 s
gammaloop-nextest-core> at <unknown source file> :<unknown line>
66.99 s
gammaloop-nextest-core> 16: start_thread <unknown>
66.99 s
gammaloop-nextest-core> at <unknown source file> :<unknown line>
66.99 s
gammaloop-nextest-core> 17: __clone3 <unknown>
66.99 s
gammaloop-nextest-core> at <unknown source file> :<unknown line>
66.99 s
gammaloop-nextest-core>
66.99 s
gammaloop-nextest-core> Run with COLORBT_SHOW_HIDDEN=1 environment variable to disable frame filtering.
66.99 s
gammaloop-nextest-core> Run with RUST_BACKTRACE=full to include source snippets.
66.99 s
gammaloop-nextest-core>
66.99 s
gammaloop-nextest-core> FAIL [ 2.350s] (325/687) gammalooprs graph::feynman_graph::tests :: native_thermal_distributions
66.99 s
gammaloop-nextest-core> stdout ---
66.99 s
gammaloop-nextest-core>
66.99 s
gammaloop-nextest-core> running 1 test
66.99 s
gammaloop-nextest-core> test graph::feynman_graph::tests::native_thermal_distributions ... FAILED
66.99 s
gammaloop-nextest-core>
66.99 s
gammaloop-nextest-core> failures:
66.99 s
gammaloop-nextest-core>
66.99 s
gammaloop-nextest-core> failures:
66.99 s
gammaloop-nextest-core> graph::feynman_graph::tests::native_thermal_distributions
66.99 s
gammaloop-nextest-core>
66.99 s
gammaloop-nextest-core> test result: FAILED. 0 passed; 1 failed; 0 ignored; 0 measured; 737 filtered out; finished in 2.32s
66.99 s
gammaloop-nextest-core>
66.99 s
gammaloop-nextest-core> stderr ---
66.99 s
gammaloop-nextest-core> The application panicked (crashed).
66.99 s
gammaloop-nextest-core> Message: called `Result::unwrap()` on an `Err` value: Custom { kind: Other, error: "Could not compile code: g++ -shared -O3 -fPIC -ffast-math -funsafe-math-optimizations -march=native -o /build/gammaloop-native-thermal-1614/thermal_0_0.so /build/gammaloop-native-thermal-1614/thermal_0_0.cpp\nwarning: Skipping impure flag -march=native because NIX_ENFORCE_NO_NATIVE is set\n/build/gammaloop-native-thermal-1614/thermal_0_0.cpp: In function 'void thermal_realf64(const double*, double*, double*)':\n/build/gammaloop-native-thermal-1614/thermal_0_0.cpp:27:16: error: 'symbolica_tanh' was not declared in this scope\n 27 | Z[6] = symbolica_tanh(Z[6]);\n | ^~~~~~~~~~~~~~\n" }
66.99 s
gammaloop-nextest-core> Location: crates/gammalooprs/src/graph/feynman_graph.rs :1165
66.99 s
gammaloop-nextest-core>
66.99 s
gammaloop-nextest-core> ━━━━━━━━━━━━━━━━━━━━━━━━━━━━━━━━━━ BACKTRACE ━━━━━━━━━━━━━━━━━━━━━━━━━━━━━━━━━━━
66.99 s
gammaloop-nextest-core> 1: <color_eyre[51793ea62743adbd]::config::PanicHook>::panic_report <unknown>
66.99 s
gammaloop-nextest-core> at <unknown source file> :<unknown line>
66.99 s
gammaloop-nextest-core> 2: <color_eyre[51793ea62743adbd]::config::PanicHook>::into_panic_hook::{closure#0} <unknown>
66.99 s
gammaloop-nextest-core> at <unknown source file> :<unknown line>
66.99 s
gammaloop-nextest-core> 3: std[bcb96dfbba0ab899]::panicking::panic_with_hook <unknown>
66.99 s
gammaloop-nextest-core> at <unknown source file> :<unknown line>
66.99 s
gammaloop-nextest-core> 4: std[bcb96dfbba0ab899]::panicking::panic_handler::{closure#0} <unknown>
66.99 s
gammaloop-nextest-core> at <unknown source file> :<unknown line>
66.99 s
gammaloop-nextest-core> 5: std[bcb96dfbba0ab899]::sys::backtrace::__rust_end_short_backtrace::<std[bcb96dfbba0ab899]::panicking::panic_handler::{closure#0}, !> <unknown>
66.99 s
gammaloop-nextest-core> at <unknown source file> :<unknown line>
66.99 s
gammaloop-nextest-core> 6: __rustc[6c289b9f9c454d21]::rust_begin_unwind <unknown>
66.99 s
gammaloop-nextest-core> at <unknown source file> :<unknown line>
66.99 s
gammaloop-nextest-core> 7: core[940e698046960fd5]::panicking::panic_fmt <unknown>
66.99 s
gammaloop-nextest-core> at <unknown source file> :<unknown line>
66.99 s
gammaloop-nextest-core> 8: core[940e698046960fd5]::result::unwrap_failed <unknown>
66.99 s
gammaloop-nextest-core> at <unknown source file> :<unknown line>
66.99 s
gammaloop-nextest-core> 9: gammalooprs[e90c332ffd68fb1e]::graph::feynman_graph::tests::native_thermal_distributions <unknown>
66.99 s
gammaloop-nextest-core> at <unknown source file> :<unknown line>
66.99 s
gammaloop-nextest-core> 10: <gammalooprs[e90c332ffd68fb1e]::graph::feynman_graph::tests::native_thermal_distributions::{closure#0} as core[940e698046960fd5]::ops::function::FnOnce<()>>::call_once <unknown>
66.99 s
gammaloop-nextest-core> at <unknown source file> :<unknown line>
66.99 s
gammaloop-nextest-core> 11: test[75d6903177b1d7e9]::__rust_begin_short_backtrace::<core[940e698046960fd5]::result::Result<(), alloc[2ea6bcb46fca0c42]::string::String>, fn() -> core[940e698046960fd5]::result::Result<(), alloc[2ea6bcb46fca0c42]::string::String>> <unknown>
66.99 s
gammaloop-nextest-core> at <unknown source file> :<unknown line>
66.99 s
gammaloop-nextest-core> 12: test[75d6903177b1d7e9]::run_test::{closure#0} <unknown>
66.99 s
gammaloop-nextest-core> at <unknown source file> :<unknown line>
66.99 s
gammaloop-nextest-core> 13: std[bcb96dfbba0ab899]::sys::backtrace::__rust_begin_short_backtrace::<test[75d6903177b1d7e9]::run_test::{closure#1}, ()> <unknown>
66.99 s
gammaloop-nextest-core> at <unknown source file> :<unknown line>
66.99 s
gammaloop-nextest-core> 14: <std[bcb96dfbba0ab899]::thread::lifecycle::spawn_unchecked<test[75d6903177b1d7e9]::run_test::{closure#1}, ()>::{closure#1} as core[940e698046960fd5]::ops::function::FnOnce<()>>::call_once::{shim:vtable#0} <unknown>
66.99 s
gammaloop-nextest-core> at <unknown source file> :<unknown line>
66.99 s
gammaloop-nextest-core> 15: <std[bcb96dfbba0ab899]::sys::thread::unix::Thread>::new::thread_start <unknown>
66.99 s
gammaloop-nextest-core> at <unknown source file> :<unknown line>
66.99 s
gammaloop-nextest-core> 16: start_thread <unknown>
66.99 s
gammaloop-nextest-core> at <unknown source file> :<unknown line>
66.99 s
gammaloop-nextest-core> 17: __clone3 <unknown>
66.99 s
gammaloop-nextest-core> at <unknown source file> :<unknown line>
66.99 s
gammaloop-nextest-core>
66.99 s
gammaloop-nextest-core> Run with COLORBT_SHOW_HIDDEN=1 environment variable to disable frame filtering.
66.99 s
gammaloop-nextest-core> Run with RUST_BACKTRACE=full to include source snippets.
66.99 s
gammaloop-nextest-core>
67.13 s
gammaloop-nextest-core> error : test run failed
67.18 s
gammaloop-nextest-core>
67.18 s
gammaloop-nextest-core> ========== nextest test summary ==========
67.18 s
gammaloop-nextest-core> report: target/nextest/ci_gammaloop/junit.xml
67.18 s
gammaloop-nextest-core> tests: 687, failures: 2, errors: 0
67.18 s
gammaloop-nextest-core>
67.18 s
gammaloop-nextest-core> 1. gammalooprs::integrands::process::param_builder::tests::thermal_tanh_remains_finite_at_uv_scales_and_preserves_derivatives
67.18 s
gammaloop-nextest-core> failure: test failure with exit code 101
67.18 s
gammaloop-nextest-core> system-out
67.18 s
gammaloop-nextest-core> running 1 test
67.18 s
gammaloop-nextest-core> test integrands::process::param_builder::tests::thermal_tanh_remains_finite_at_uv_scales_and_preserves_derivatives ... FAILED
67.18 s
gammaloop-nextest-core>
67.18 s
gammaloop-nextest-core> failures:
67.18 s
gammaloop-nextest-core>
67.18 s
gammaloop-nextest-core> failures:
67.18 s
gammaloop-nextest-core> integrands::process::param_builder::tests::thermal_tanh_remains_finite_at_uv_scales_and_preserves_derivatives
67.18 s
gammaloop-nextest-core>
67.18 s
gammaloop-nextest-core> test result: FAILED. 0 passed; 1 failed; 0 ignored; 0 measured; 737 filtered out; finished in 0.19s
67.18 s
gammaloop-nextest-core> system-err
67.18 s
gammaloop-nextest-core> The application panicked (crashed).
67.18 s
gammaloop-nextest-core> Message: called `Result::unwrap()` on an `Err` value: "To vectorize the function 'symbolica::tanh', the symbol 'symbolica::tanh_v' must be defined that takes the vector index as an additional tag"
67.18 s
gammaloop-nextest-core> Location: crates/gammalooprs/src/integrands/process/param_builder.rs:1958
67.18 s
gammaloop-nextest-core>
67.18 s
gammaloop-nextest-core> ━━━━━━━━━━━━━━━━━━━━━━━━━━━━━━━━━━ BACKTRACE ━━━━━━━━━━━━━━━━━━━━━━━━━━━━━━━━━━━
67.18 s
gammaloop-nextest-core> 1: <color_eyre[51793ea62743adbd]::config::PanicHook>::panic_report<unknown>
67.18 s
gammaloop-nextest-core> at <unknown source file>:<unknown line>
67.18 s
gammaloop-nextest-core> 2: <color_eyre[51793ea62743adbd]::config::PanicHook>::into_panic_hook::{closure#0}<unknown>
67.18 s
gammaloop-nextest-core> at <unknown source file>:<unknown line>
67.18 s
gammaloop-nextest-core> 3: std[bcb96dfbba0ab899]::panicking::panic_with_hook<unknown>
67.18 s
gammaloop-nextest-core> at <unknown source file>:<unknown line>
67.18 s
gammaloop-nextest-core> 4: std[bcb96dfbba0ab899]::panicking::panic_handler::{closure#0}<unknown>
67.18 s
gammaloop-nextest-core> at <unknown source file>:<unknown line>
67.18 s
gammaloop-nextest-core> 5: std[bcb96dfbba0ab899]::sys::backtrace::__rust_end_short_backtrace::<std[bcb96dfbba0ab899]::panicking::panic_handler::{closure#0}, !><unknown>
67.18 s
gammaloop-nextest-core> at <unknown source file>:<unknown line>
67.18 s
gammaloop-nextest-core> 6: __rustc[6c289b9f9c454d21]::rust_begin_unwind<unknown>
67.18 s
gammaloop-nextest-core> at <unknown source file>:<unknown line>
67.18 s
gammaloop-nextest-core> 7: core[940e698046960fd5]::panicking::panic_fmt<unknown>
67.18 s
gammaloop-nextest-core> at <unknown source file>:<unknown line>
67.18 s
gammaloop-nextest-core> 8: core[940e698046960fd5]::result::unwrap_failed<unknown>
67.18 s
gammaloop-nextest-core> at <unknown source file>:<unknown line>
67.18 s
gammaloop-nextest-core> 9: gammalooprs[e90c332ffd68fb1e]::integrands::process::param_builder::tests::thermal_tanh_remains_finite_at_uv_scales_and_preserves_derivatives<unknown>
67.18 s
gammaloop-nextest-core> at <unknown source file>:<unknown line>
67.18 s
gammaloop-nextest-core> 10: <gammalooprs[e90c332ffd68fb1e]::integrands::process::param_builder::tests::thermal_tanh_remains_finite_at_uv_scales_and_preserves_derivatives::{closure#0} as core[940e698046960fd5]::ops::function::FnOnce<()>>::call_once<unknown>
67.18 s
gammaloop-nextest-core> at <unknown source file>:<unknown line>
67.18 s
gammaloop-nextest-core> 11: test[75d6903177b1d7e9]::__rust_begin_short_backtrace::<core[940e698046960fd5]::result::Result<(), alloc[2ea6bcb46fca0c42]::string::String>, fn() -> core[940e698046960fd5]::result::Result<(), alloc[2ea6bcb46fca0c42]::string::String>><unknown>
67.18 s
gammaloop-nextest-core> at <unknown source file>:<unknown line>
67.18 s
gammaloop-nextest-core> 12: test[75d6903177b1d7e9]::run_test::{closure#0}<unknown>
67.18 s
gammaloop-nextest-core> at <unknown source file>:<unknown line>
67.18 s
gammaloop-nextest-core> 13: std[bcb96dfbba0ab899]::sys::backtrace::__rust_begin_short_backtrace::<test[75d6903177b1d7e9]::run_test::{closure#1}, ()><unknown>
67.18 s
gammaloop-nextest-core> at <unknown source file>:<unknown line>
67.18 s
gammaloop-nextest-core> 14: <std[bcb96dfbba0ab899]::thread::lifecycle::spawn_unchecked<test[75d6903177b1d7e9]::run_test::{closure#1}, ()>::{closure#1} as core[940e698046960fd5]::ops::function::FnOnce<()>>::call_once::{shim:vtable#0}<unknown>
67.18 s
gammaloop-nextest-core> at <unknown source file>:<unknown line>
67.18 s
gammaloop-nextest-core> 15: <std[bcb96dfbba0ab899]::sys::thread::unix::Thread>::new::thread_start<unknown>
67.18 s
gammaloop-nextest-core> at <unknown source file>:<unknown line>
67.18 s
gammaloop-nextest-core> 16: start_thread<unknown>
67.18 s
gammaloop-nextest-core> at <unknown source file>:<unknown line>
67.18 s
gammaloop-nextest-core> 17: __clone3<unknown>
67.18 s
gammaloop-nextest-core> at <unknown source file>:<unknown line>
67.18 s
gammaloop-nextest-core>
67.18 s
gammaloop-nextest-core> Run with COLORBT_SHOW_HIDDEN=1 environment variable to disable frame filtering.
67.18 s
gammaloop-nextest-core> Run with RUST_BACKTRACE=full to include source snippets.
67.18 s
gammaloop-nextest-core>
67.18 s
gammaloop-nextest-core> 2. gammalooprs::graph::feynman_graph::tests::native_thermal_distributions
67.18 s
gammaloop-nextest-core> failure: test failure with exit code 101
67.18 s
gammaloop-nextest-core> system-out
67.18 s
gammaloop-nextest-core> running 1 test
67.18 s
gammaloop-nextest-core> test graph::feynman_graph::tests::native_thermal_distributions ... FAILED
67.18 s
gammaloop-nextest-core>
67.18 s
gammaloop-nextest-core> failures:
67.18 s
gammaloop-nextest-core>
67.18 s
gammaloop-nextest-core> failures:
67.18 s
gammaloop-nextest-core> graph::feynman_graph::tests::native_thermal_distributions
67.18 s
gammaloop-nextest-core>
67.18 s
gammaloop-nextest-core> test result: FAILED. 0 passed; 1 failed; 0 ignored; 0 measured; 737 filtered out; finished in 2.32s
67.18 s
gammaloop-nextest-core> system-err
67.18 s
gammaloop-nextest-core> The application panicked (crashed).
67.18 s
gammaloop-nextest-core> Message: called `Result::unwrap()` on an `Err` value: Custom { kind: Other, error: "Could not compile code: g++ -shared -O3 -fPIC -ffast-math -funsafe-math-optimizations -march=native -o /build/gammaloop-native-thermal-1614/thermal_0_0.so /build/gammaloop-native-thermal-1614/thermal_0_0.cpp\nwarning: Skipping impure flag -march=native because NIX_ENFORCE_NO_NATIVE is set\n/build/gammaloop-native-thermal-1614/thermal_0_0.cpp: In function 'void thermal_realf64(const double*, double*, double*)':\n/build/gammaloop-native-thermal-1614/thermal_0_0.cpp:27:16: error: 'symbolica_tanh' was not declared in this scope\n 27 | Z[6] = symbolica_tanh(Z[6]);\n | ^~~~~~~~~~~~~~\n" }
67.18 s
gammaloop-nextest-core> Location: crates/gammalooprs/src/graph/feynman_graph.rs:1165
67.18 s
gammaloop-nextest-core>
67.18 s
gammaloop-nextest-core> ━━━━━━━━━━━━━━━━━━━━━━━━━━━━━━━━━━ BACKTRACE ━━━━━━━━━━━━━━━━━━━━━━━━━━━━━━━━━━━
67.18 s
gammaloop-nextest-core> 1: <color_eyre[51793ea62743adbd]::config::PanicHook>::panic_report<unknown>
67.18 s
gammaloop-nextest-core> at <unknown source file>:<unknown line>
67.18 s
gammaloop-nextest-core> 2: <color_eyre[51793ea62743adbd]::config::PanicHook>::into_panic_hook::{closure#0}<unknown>
67.18 s
gammaloop-nextest-core> at <unknown source file>:<unknown line>
67.18 s
gammaloop-nextest-core> 3: std[bcb96dfbba0ab899]::panicking::panic_with_hook<unknown>
67.18 s
gammaloop-nextest-core> at <unknown source file>:<unknown line>
67.18 s
gammaloop-nextest-core> 4: std[bcb96dfbba0ab899]::panicking::panic_handler::{closure#0}<unknown>
67.18 s
gammaloop-nextest-core> at <unknown source file>:<unknown line>
67.18 s
gammaloop-nextest-core> 5: std[bcb96dfbba0ab899]::sys::backtrace::__rust_end_short_backtrace::<std[bcb96dfbba0ab899]::panicking::panic_handler::{closure#0}, !><unknown>
67.18 s
gammaloop-nextest-core> at <unknown source file>:<unknown line>
67.18 s
gammaloop-nextest-core> 6: __rustc[6c289b9f9c454d21]::rust_begin_unwind<unknown>
67.18 s
gammaloop-nextest-core> at <unknown source file>:<unknown line>
67.18 s
gammaloop-nextest-core> 7: core[940e698046960fd5]::panicking::panic_fmt<unknown>
67.18 s
gammaloop-nextest-core> at <unknown source file>:<unknown line>
67.18 s
gammaloop-nextest-core> 8: core[940e698046960fd5]::result::unwrap_failed<unknown>
67.18 s
gammaloop-nextest-core> at <unknown source file>:<unknown line>
67.18 s
gammaloop-nextest-core> 9: gammalooprs[e90c332ffd68fb1e]::graph::feynman_graph::tests::native_thermal_distributions<unknown>
67.18 s
gammaloop-nextest-core> at <unknown source file>:<unknown line>
67.18 s
gammaloop-nextest-core> 10: <gammalooprs[e90c332ffd68fb1e]::graph::feynman_graph::tests::native_thermal_distributions::{closure#0} as core[940e698046960fd5]::ops::function::FnOnce<()>>::call_once<unknown>
67.18 s
gammaloop-nextest-core> at <unknown source file>:<unknown line>
67.18 s
gammaloop-nextest-core> 11: test[75d6903177b1d7e9]::__rust_begin_short_backtrace::<core[940e698046960fd5]::result::Result<(), alloc[2ea6bcb46fca0c42]::string::String>, fn() -> core[940e698046960fd5]::result::Result<(), alloc[2ea6bcb46fca0c42]::string::String>><unknown>
67.18 s
gammaloop-nextest-core> at <unknown source file>:<unknown line>
67.18 s
gammaloop-nextest-core> 12: test[75d6903177b1d7e9]::run_test::{closure#0}<unknown>
67.18 s
gammaloop-nextest-core> at <unknown source file>:<unknown line>
67.18 s
gammaloop-nextest-core> 13: std[bcb96dfbba0ab899]::sys::backtrace::__rust_begin_short_backtrace::<test[75d6903177b1d7e9]::run_test::{closure#1}, ()><unknown>
67.18 s
gammaloop-nextest-core> at <unknown source file>:<unknown line>
67.18 s
gammaloop-nextest-core> 14: <std[bcb96dfbba0ab899]::thread::lifecycle::spawn_unchecked<test[75d6903177b1d7e9]::run_test::{closure#1}, ()>::{closure#1} as core[940e698046960fd5]::ops::function::FnOnce<()>>::call_once::{shim:vtable#0}<unknown>
67.18 s
gammaloop-nextest-core> at <unknown source file>:<unknown line>
67.18 s
gammaloop-nextest-core> 15: <std[bcb96dfbba0ab899]::sys::thread::unix::Thread>::new::thread_start<unknown>
67.18 s
gammaloop-nextest-core> at <unknown source file>:<unknown line>
67.18 s
gammaloop-nextest-core> 16: start_thread<unknown>
67.18 s
gammaloop-nextest-core> at <unknown source file>:<unknown line>
67.18 s
gammaloop-nextest-core> 17: __clone3<unknown>
67.18 s
gammaloop-nextest-core> at <unknown source file>:<unknown line>
67.18 s
gammaloop-nextest-core>
67.18 s
gammaloop-nextest-core> Run with COLORBT_SHOW_HIDDEN=1 environment variable to disable frame filtering.
67.18 s
gammaloop-nextest-core> Run with RUST_BACKTRACE=full to include source snippets.
67.18 s
gammaloop-nextest-core> =========================================
67.22 s
gammaloop-nextest-core> Extracting 1 binary, 1 build script output directory, and 1 linked path to /build/nextest-archive-C5mgRk
67.36 s
gammaloop-nextest-core> Extracted 7 files to /build/nextest-archive-C5mgRk in 0.14s
67.40 s
gammaloop-nextest-core> ------------
67.40 s
gammaloop-nextest-core> Nextest run ID a5b754ab-17d6-4407-86c1-d2515c8cb8fe with nextest profile: ci_gammaloop
67.40 s
gammaloop-nextest-core> Starting 136 tests across 1 binary
96.20 s
gammaloop-nextest-core> ------------
96.20 s
gammaloop-nextest-core> Summary [ 28.806s] 136 tests run: 136 passed , 0 skipped
96.28 s
gammaloop-nextest-core>
96.28 s
gammaloop-nextest-core> ========== nextest test summary ==========
96.28 s
gammaloop-nextest-core> report: target/nextest/ci_gammaloop/junit.xml
96.28 s
gammaloop-nextest-core> tests: 136, failures: 0, errors: 0
96.28 s
gammaloop-nextest-core> No failing testcases found.
96.28 s
gammaloop-nextest-core> =========================================
96.40 s
error: Cannot build '/nix/store/bz3ms1n5n6isd5x84wsdypx5bbhzhv0k-gammaloop-nextest-core.drv '.
96.40 s
Reason: builder failed with exit code 100 .
96.40 s
Output paths:
96.40 s
/nix/store/ylbfr4kniksirnd140mwk1hz1dnr11lb-gammaloop-nextest-core
96.40 s
Last 405 log lines:
96.40 s
> Extracting 4 binaries (including 1 non-test binary), 1 build script output directory, and 2 linked paths to /build/nextest-archive-CALvVq
96.40 s
> Extracted 20 files to /build/nextest-archive-CALvVq in 1.43s
96.40 s
> ------------
96.40 s
> Nextest run ID 9ac193f2-3ba1-45b9-9cd9-e3f78ceb7e74 with nextest profile: ci_gammaloop
96.40 s
> Starting 380 tests across 3 binaries
96.40 s
> ------------
96.40 s
> Summary [ 2.641s] 380 tests run: 380 passed , 0 skipped
96.40 s
>
96.40 s
> ========== nextest test summary ==========
96.40 s
> report: target/nextest/ci_gammaloop/junit.xml
96.40 s
> tests: 380, failures: 0, errors: 0
96.40 s
> No failing testcases found.
96.40 s
> =========================================
96.40 s
> Extracting 1 binary and 1 linked path to /build/nextest-archive-qhxnwv
96.40 s
> Extracted 7 files to /build/nextest-archive-qhxnwv in 0.15s
96.40 s
> ------------
96.40 s
> Nextest run ID 543b11e8-cda0-4f84-bdfa-56ee29b11fb9 with nextest profile: ci_gammaloop
96.40 s
> Starting 19 tests across 1 binary
96.40 s
> ------------
96.40 s
> Summary [ 0.045s] 19 tests run: 19 passed , 0 skipped
96.40 s
>
96.40 s
> ========== nextest test summary ==========
96.40 s
> report: target/nextest/ci_gammaloop/junit.xml
96.40 s
> tests: 19, failures: 0, errors: 0
96.40 s
> No failing testcases found.
96.40 s
> =========================================
96.40 s
> Extracting 1 binary to /build/nextest-archive-xsHsve
96.40 s
> Extracted 4 files to /build/nextest-archive-xsHsve in 0.06s
96.40 s
> ------------
96.40 s
> Nextest run ID 3e59b117-f4d5-4248-985a-7dd42766c3a4 with nextest profile: ci_gammaloop
96.40 s
> Starting 0 tests across 1 binary
96.40 s
> ------------
96.40 s
> Summary [ 0.004s] 0 tests run: 0 passed , 0 skipped
96.40 s
>
96.40 s
> ========== nextest test summary ==========
96.40 s
> report: target/nextest/ci_gammaloop/junit.xml
96.40 s
> tests: 0, failures: 0, errors: 0
96.40 s
> No failing testcases found.
96.40 s
> =========================================
96.40 s
> Extracting 4 binaries, 1 build script output directory, and 2 linked paths to /build/nextest-archive-3uQ6KP
96.40 s
> Extracted 18 files to /build/nextest-archive-3uQ6KP in 1.02s
96.40 s
> ------------
96.40 s
> Nextest run ID 069eb123-6875-494b-a27b-9059b5c3fbe5 with nextest profile: ci_gammaloop
96.40 s
> Starting 687 tests across 4 binaries (60 tests skipped , including 59 tests via profile.ci_gammaloop.default-filter )
96.40 s
> FAIL [ 0.211s] (235/687) gammalooprs integrands::process::param_builder::tests :: thermal_tanh_remains_finite_at_uv_scales_and_preserves_derivatives
96.40 s
> stdout ---
96.40 s
>
96.40 s
> running 1 test
96.40 s
> test integrands::process::param_builder::tests::thermal_tanh_remains_finite_at_uv_scales_and_preserves_derivatives ... FAILED
96.40 s
>
96.40 s
> failures:
96.40 s
>
96.40 s
> failures:
96.40 s
> integrands::process::param_builder::tests::thermal_tanh_remains_finite_at_uv_scales_and_preserves_derivatives
96.40 s
>
96.40 s
> test result: FAILED. 0 passed; 1 failed; 0 ignored; 0 measured; 737 filtered out; finished in 0.19s
96.40 s
>
96.40 s
> stderr ---
96.40 s
> The application panicked (crashed).
96.40 s
> Message: called `Result::unwrap()` on an `Err` value: "To vectorize the function 'symbolica::tanh', the symbol 'symbolica::tanh_v' must be defined that takes the vector index as an additional tag"
96.40 s
> Location: crates/gammalooprs/src/integrands/process/param_builder.rs :1958
96.40 s
>
96.40 s
> ━━━━━━━━━━━━━━━━━━━━━━━━━━━━━━━━━━ BACKTRACE ━━━━━━━━━━━━━━━━━━━━━━━━━━━━━━━━━━━
96.40 s
> 1: <color_eyre[51793ea62743adbd]::config::PanicHook>::panic_report <unknown>
96.40 s
> at <unknown source file> :<unknown line>
96.40 s
> 2: <color_eyre[51793ea62743adbd]::config::PanicHook>::into_panic_hook::{closure#0} <unknown>
96.40 s
> at <unknown source file> :<unknown line>
96.40 s
> 3: std[bcb96dfbba0ab899]::panicking::panic_with_hook <unknown>
96.40 s
> at <unknown source file> :<unknown line>
96.40 s
> 4: std[bcb96dfbba0ab899]::panicking::panic_handler::{closure#0} <unknown>
96.40 s
> at <unknown source file> :<unknown line>
96.40 s
> 5: std[bcb96dfbba0ab899]::sys::backtrace::__rust_end_short_backtrace::<std[bcb96dfbba0ab899]::panicking::panic_handler::{closure#0}, !> <unknown>
96.40 s
> at <unknown source file> :<unknown line>
96.40 s
> 6: __rustc[6c289b9f9c454d21]::rust_begin_unwind <unknown>
96.40 s
> at <unknown source file> :<unknown line>
96.40 s
> 7: core[940e698046960fd5]::panicking::panic_fmt <unknown>
96.40 s
> at <unknown source file> :<unknown line>
96.40 s
> 8: core[940e698046960fd5]::result::unwrap_failed <unknown>
96.40 s
> at <unknown source file> :<unknown line>
96.40 s
> 9: gammalooprs[e90c332ffd68fb1e]::integrands::process::param_builder::tests::thermal_tanh_remains_finite_at_uv_scales_and_preserves_derivatives <unknown>
96.40 s
> at <unknown source file> :<unknown line>
96.40 s
> 10: <gammalooprs[e90c332ffd68fb1e]::integrands::process::param_builder::tests::thermal_tanh_remains_finite_at_uv_scales_and_preserves_derivatives::{closure#0} as core[940e698046960fd5]::ops::function::FnOnce<()>>::call_once <unknown>
96.40 s
> at <unknown source file> :<unknown line>
96.40 s
> 11: test[75d6903177b1d7e9]::__rust_begin_short_backtrace::<core[940e698046960fd5]::result::Result<(), alloc[2ea6bcb46fca0c42]::string::String>, fn() -> core[940e698046960fd5]::result::Result<(), alloc[2ea6bcb46fca0c42]::string::String>> <unknown>
96.40 s
> at <unknown source file> :<unknown line>
96.40 s
> 12: test[75d6903177b1d7e9]::run_test::{closure#0} <unknown>
96.40 s
> at <unknown source file> :<unknown line>
96.40 s
> 13: std[bcb96dfbba0ab899]::sys::backtrace::__rust_begin_short_backtrace::<test[75d6903177b1d7e9]::run_test::{closure#1}, ()> <unknown>
96.40 s
> at <unknown source file> :<unknown line>
96.40 s
> 14: <std[bcb96dfbba0ab899]::thread::lifecycle::spawn_unchecked<test[75d6903177b1d7e9]::run_test::{closure#1}, ()>::{closure#1} as core[940e698046960fd5]::ops::function::FnOnce<()>>::call_once::{shim:vtable#0} <unknown>
96.40 s
> at <unknown source file> :<unknown line>
96.40 s
> 15: <std[bcb96dfbba0ab899]::sys::thread::unix::Thread>::new::thread_start <unknown>
96.40 s
> at <unknown source file> :<unknown line>
96.40 s
> 16: start_thread <unknown>
96.40 s
> at <unknown source file> :<unknown line>
96.40 s
> 17: __clone3 <unknown>
96.40 s
> at <unknown source file> :<unknown line>
96.40 s
>
96.40 s
> Run with COLORBT_SHOW_HIDDEN=1 environment variable to disable frame filtering.
96.40 s
> Run with RUST_BACKTRACE=full to include source snippets.
96.40 s
>
96.40 s
> FAIL [ 2.350s] (325/687) gammalooprs graph::feynman_graph::tests :: native_thermal_distributions
96.40 s
> stdout ---
96.40 s
>
96.40 s
> running 1 test
96.40 s
> test graph::feynman_graph::tests::native_thermal_distributions ... FAILED
96.40 s
>
96.40 s
> failures:
96.40 s
>
96.40 s
> failures:
96.40 s
> graph::feynman_graph::tests::native_thermal_distributions
96.40 s
>
96.40 s
> test result: FAILED. 0 passed; 1 failed; 0 ignored; 0 measured; 737 filtered out; finished in 2.32s
96.40 s
>
96.40 s
> stderr ---
96.40 s
> The application panicked (crashed).
96.40 s
> Message: called `Result::unwrap()` on an `Err` value: Custom { kind: Other, error: "Could not compile code: g++ -shared -O3 -fPIC -ffast-math -funsafe-math-optimizations -march=native -o /build/gammaloop-native-thermal-1614/thermal_0_0.so /build/gammaloop-native-thermal-1614/thermal_0_0.cpp\nwarning: Skipping impure flag -march=native because NIX_ENFORCE_NO_NATIVE is set\n/build/gammaloop-native-thermal-1614/thermal_0_0.cpp: In function 'void thermal_realf64(const double*, double*, double*)':\n/build/gammaloop-native-thermal-1614/thermal_0_0.cpp:27:16: error: 'symbolica_tanh' was not declared in this scope\n 27 | Z[6] = symbolica_tanh(Z[6]);\n | ^~~~~~~~~~~~~~\n" }
96.40 s
> Location: crates/gammalooprs/src/graph/feynman_graph.rs :1165
96.40 s
>
96.40 s
> ━━━━━━━━━━━━━━━━━━━━━━━━━━━━━━━━━━ BACKTRACE ━━━━━━━━━━━━━━━━━━━━━━━━━━━━━━━━━━━
96.40 s
> 1: <color_eyre[51793ea62743adbd]::config::PanicHook>::panic_report <unknown>
96.40 s
> at <unknown source file> :<unknown line>
96.40 s
> 2: <color_eyre[51793ea62743adbd]::config::PanicHook>::into_panic_hook::{closure#0} <unknown>
96.40 s
> at <unknown source file> :<unknown line>
96.40 s
> 3: std[bcb96dfbba0ab899]::panicking::panic_with_hook <unknown>
96.40 s
> at <unknown source file> :<unknown line>
96.40 s
> 4: std[bcb96dfbba0ab899]::panicking::panic_handler::{closure#0} <unknown>
96.40 s
> at <unknown source file> :<unknown line>
96.40 s
> 5: std[bcb96dfbba0ab899]::sys::backtrace::__rust_end_short_backtrace::<std[bcb96dfbba0ab899]::panicking::panic_handler::{closure#0}, !> <unknown>
96.40 s
> at <unknown source file> :<unknown line>
96.40 s
> 6: __rustc[6c289b9f9c454d21]::rust_begin_unwind <unknown>
96.40 s
> at <unknown source file> :<unknown line>
96.40 s
> 7: core[940e698046960fd5]::panicking::panic_fmt <unknown>
96.40 s
> at <unknown source file> :<unknown line>
96.40 s
> 8: core[940e698046960fd5]::result::unwrap_failed <unknown>
96.40 s
> at <unknown source file> :<unknown line>
96.40 s
> 9: gammalooprs[e90c332ffd68fb1e]::graph::feynman_graph::tests::native_thermal_distributions <unknown>
96.40 s
> at <unknown source file> :<unknown line>
96.40 s
> 10: <gammalooprs[e90c332ffd68fb1e]::graph::feynman_graph::tests::native_thermal_distributions::{closure#0} as core[940e698046960fd5]::ops::function::FnOnce<()>>::call_once <unknown>
96.40 s
> at <unknown source file> :<unknown line>
96.40 s
> 11: test[75d6903177b1d7e9]::__rust_begin_short_backtrace::<core[940e698046960fd5]::result::Result<(), alloc[2ea6bcb46fca0c42]::string::String>, fn() -> core[940e698046960fd5]::result::Result<(), alloc[2ea6bcb46fca0c42]::string::String>> <unknown>
96.40 s
> at <unknown source file> :<unknown line>
96.40 s
> 12: test[75d6903177b1d7e9]::run_test::{closure#0} <unknown>
96.40 s
> at <unknown source file> :<unknown line>
96.40 s
> 13: std[bcb96dfbba0ab899]::sys::backtrace::__rust_begin_short_backtrace::<test[75d6903177b1d7e9]::run_test::{closure#1}, ()> <unknown>
96.40 s
> at <unknown source file> :<unknown line>
96.40 s
> 14: <std[bcb96dfbba0ab899]::thread::lifecycle::spawn_unchecked<test[75d6903177b1d7e9]::run_test::{closure#1}, ()>::{closure#1} as core[940e698046960fd5]::ops::function::FnOnce<()>>::call_once::{shim:vtable#0} <unknown>
96.40 s
> at <unknown source file> :<unknown line>
96.40 s
> 15: <std[bcb96dfbba0ab899]::sys::thread::unix::Thread>::new::thread_start <unknown>
96.40 s
> at <unknown source file> :<unknown line>
96.40 s
> 16: start_thread <unknown>
96.40 s
> at <unknown source file> :<unknown line>
96.40 s
> 17: __clone3 <unknown>
96.40 s
> at <unknown source file> :<unknown line>
96.40 s
>
96.40 s
> Run with COLORBT_SHOW_HIDDEN=1 environment variable to disable frame filtering.
96.40 s
> Run with RUST_BACKTRACE=full to include source snippets.
96.40 s
>
96.40 s
> ------------
96.40 s
> Summary [ 26.776s] 687 tests run: 685 passed , 2 failed , 60 skipped
96.40 s
> FAIL [ 0.211s] (235/687) gammalooprs integrands::process::param_builder::tests :: thermal_tanh_remains_finite_at_uv_scales_and_preserves_derivatives
96.40 s
> stdout ---
96.40 s
>
96.40 s
> running 1 test
96.40 s
> test integrands::process::param_builder::tests::thermal_tanh_remains_finite_at_uv_scales_and_preserves_derivatives ... FAILED
96.40 s
>
96.40 s
> failures:
96.40 s
>
96.40 s
> failures:
96.40 s
> integrands::process::param_builder::tests::thermal_tanh_remains_finite_at_uv_scales_and_preserves_derivatives
96.40 s
>
96.40 s
> test result: FAILED. 0 passed; 1 failed; 0 ignored; 0 measured; 737 filtered out; finished in 0.19s
96.40 s
>
96.40 s
> stderr ---
96.40 s
> The application panicked (crashed).
96.40 s
> Message: called `Result::unwrap()` on an `Err` value: "To vectorize the function 'symbolica::tanh', the symbol 'symbolica::tanh_v' must be defined that takes the vector index as an additional tag"
96.40 s
> Location: crates/gammalooprs/src/integrands/process/param_builder.rs :1958
96.40 s
>
96.40 s
> ━━━━━━━━━━━━━━━━━━━━━━━━━━━━━━━━━━ BACKTRACE ━━━━━━━━━━━━━━━━━━━━━━━━━━━━━━━━━━━
96.40 s
> 1: <color_eyre[51793ea62743adbd]::config::PanicHook>::panic_report <unknown>
96.40 s
> at <unknown source file> :<unknown line>
96.40 s
> 2: <color_eyre[51793ea62743adbd]::config::PanicHook>::into_panic_hook::{closure#0} <unknown>
96.40 s
> at <unknown source file> :<unknown line>
96.40 s
> 3: std[bcb96dfbba0ab899]::panicking::panic_with_hook <unknown>
96.40 s
> at <unknown source file> :<unknown line>
96.40 s
> 4: std[bcb96dfbba0ab899]::panicking::panic_handler::{closure#0} <unknown>
96.40 s
> at <unknown source file> :<unknown line>
96.40 s
> 5: std[bcb96dfbba0ab899]::sys::backtrace::__rust_end_short_backtrace::<std[bcb96dfbba0ab899]::panicking::panic_handler::{closure#0}, !> <unknown>
96.40 s
> at <unknown source file> :<unknown line>
96.40 s
> 6: __rustc[6c289b9f9c454d21]::rust_begin_unwind <unknown>
96.40 s
> at <unknown source file> :<unknown line>
96.40 s
> 7: core[940e698046960fd5]::panicking::panic_fmt <unknown>
96.40 s
> at <unknown source file> :<unknown line>
96.40 s
> 8: core[940e698046960fd5]::result::unwrap_failed <unknown>
96.40 s
> at <unknown source file> :<unknown line>
96.40 s
> 9: gammalooprs[e90c332ffd68fb1e]::integrands::process::param_builder::tests::thermal_tanh_remains_finite_at_uv_scales_and_preserves_derivatives <unknown>
96.40 s
> at <unknown source file> :<unknown line>
96.40 s
> 10: <gammalooprs[e90c332ffd68fb1e]::integrands::process::param_builder::tests::thermal_tanh_remains_finite_at_uv_scales_and_preserves_derivatives::{closure#0} as core[940e698046960fd5]::ops::function::FnOnce<()>>::call_once <unknown>
96.40 s
> at <unknown source file> :<unknown line>
96.40 s
> 11: test[75d6903177b1d7e9]::__rust_begin_short_backtrace::<core[940e698046960fd5]::result::Result<(), alloc[2ea6bcb46fca0c42]::string::String>, fn() -> core[940e698046960fd5]::result::Result<(), alloc[2ea6bcb46fca0c42]::string::String>> <unknown>
96.40 s
> at <unknown source file> :<unknown line>
96.40 s
> 12: test[75d6903177b1d7e9]::run_test::{closure#0} <unknown>
96.40 s
> at <unknown source file> :<unknown line>
96.40 s
> 13: std[bcb96dfbba0ab899]::sys::backtrace::__rust_begin_short_backtrace::<test[75d6903177b1d7e9]::run_test::{closure#1}, ()> <unknown>
96.40 s
> at <unknown source file> :<unknown line>
96.40 s
> 14: <std[bcb96dfbba0ab899]::thread::lifecycle::spawn_unchecked<test[75d6903177b1d7e9]::run_test::{closure#1}, ()>::{closure#1} as core[940e698046960fd5]::ops::function::FnOnce<()>>::call_once::{shim:vtable#0} <unknown>
96.40 s
> at <unknown source file> :<unknown line>
96.40 s
> 15: <std[bcb96dfbba0ab899]::sys::thread::unix::Thread>::new::thread_start <unknown>
96.40 s
> at <unknown source file> :<unknown line>
96.40 s
> 16: start_thread <unknown>
96.40 s
> at <unknown source file> :<unknown line>
96.40 s
> 17: __clone3 <unknown>
96.40 s
> at <unknown source file> :<unknown line>
96.40 s
>
96.40 s
> Run with COLORBT_SHOW_HIDDEN=1 environment variable to disable frame filtering.
96.40 s
> Run with RUST_BACKTRACE=full to include source snippets.
96.40 s
>
96.40 s
> FAIL [ 2.350s] (325/687) gammalooprs graph::feynman_graph::tests :: native_thermal_distributions
96.40 s
> stdout ---
96.40 s
>
96.40 s
> running 1 test
96.40 s
> test graph::feynman_graph::tests::native_thermal_distributions ... FAILED
96.40 s
>
96.40 s
> failures:
96.40 s
>
96.40 s
> failures:
96.40 s
> graph::feynman_graph::tests::native_thermal_distributions
96.40 s
>
96.40 s
> test result: FAILED. 0 passed; 1 failed; 0 ignored; 0 measured; 737 filtered out; finished in 2.32s
96.40 s
>
96.40 s
> stderr ---
96.40 s
> The application panicked (crashed).
96.40 s
> Message: called `Result::unwrap()` on an `Err` value: Custom { kind: Other, error: "Could not compile code: g++ -shared -O3 -fPIC -ffast-math -funsafe-math-optimizations -march=native -o /build/gammaloop-native-thermal-1614/thermal_0_0.so /build/gammaloop-native-thermal-1614/thermal_0_0.cpp\nwarning: Skipping impure flag -march=native because NIX_ENFORCE_NO_NATIVE is set\n/build/gammaloop-native-thermal-1614/thermal_0_0.cpp: In function 'void thermal_realf64(const double*, double*, double*)':\n/build/gammaloop-native-thermal-1614/thermal_0_0.cpp:27:16: error: 'symbolica_tanh' was not declared in this scope\n 27 | Z[6] = symbolica_tanh(Z[6]);\n | ^~~~~~~~~~~~~~\n" }
96.40 s
> Location: crates/gammalooprs/src/graph/feynman_graph.rs :1165
96.40 s
>
96.40 s
> ━━━━━━━━━━━━━━━━━━━━━━━━━━━━━━━━━━ BACKTRACE ━━━━━━━━━━━━━━━━━━━━━━━━━━━━━━━━━━━
96.40 s
> 1: <color_eyre[51793ea62743adbd]::config::PanicHook>::panic_report <unknown>
96.40 s
> at <unknown source file> :<unknown line>
96.40 s
> 2: <color_eyre[51793ea62743adbd]::config::PanicHook>::into_panic_hook::{closure#0} <unknown>
96.40 s
> at <unknown source file> :<unknown line>
96.40 s
> 3: std[bcb96dfbba0ab899]::panicking::panic_with_hook <unknown>
96.40 s
> at <unknown source file> :<unknown line>
96.40 s
> 4: std[bcb96dfbba0ab899]::panicking::panic_handler::{closure#0} <unknown>
96.40 s
> at <unknown source file> :<unknown line>
96.40 s
> 5: std[bcb96dfbba0ab899]::sys::backtrace::__rust_end_short_backtrace::<std[bcb96dfbba0ab899]::panicking::panic_handler::{closure#0}, !> <unknown>
96.40 s
> at <unknown source file> :<unknown line>
96.40 s
> 6: __rustc[6c289b9f9c454d21]::rust_begin_unwind <unknown>
96.40 s
> at <unknown source file> :<unknown line>
96.40 s
> 7: core[940e698046960fd5]::panicking::panic_fmt <unknown>
96.40 s
> at <unknown source file> :<unknown line>
96.40 s
> 8: core[940e698046960fd5]::result::unwrap_failed <unknown>
96.40 s
> at <unknown source file> :<unknown line>
96.40 s
> 9: gammalooprs[e90c332ffd68fb1e]::graph::feynman_graph::tests::native_thermal_distributions <unknown>
96.40 s
> at <unknown source file> :<unknown line>
96.40 s
> 10: <gammalooprs[e90c332ffd68fb1e]::graph::feynman_graph::tests::native_thermal_distributions::{closure#0} as core[940e698046960fd5]::ops::function::FnOnce<()>>::call_once <unknown>
96.40 s
> at <unknown source file> :<unknown line>
96.40 s
> 11: test[75d6903177b1d7e9]::__rust_begin_short_backtrace::<core[940e698046960fd5]::result::Result<(), alloc[2ea6bcb46fca0c42]::string::String>, fn() -> core[940e698046960fd5]::result::Result<(), alloc[2ea6bcb46fca0c42]::string::String>> <unknown>
96.40 s
> at <unknown source file> :<unknown line>
96.40 s
> 12: test[75d6903177b1d7e9]::run_test::{closure#0} <unknown>
96.40 s
> at <unknown source file> :<unknown line>
96.40 s
> 13: std[bcb96dfbba0ab899]::sys::backtrace::__rust_begin_short_backtrace::<test[75d6903177b1d7e9]::run_test::{closure#1}, ()> <unknown>
96.40 s
> at <unknown source file> :<unknown line>
96.40 s
> 14: <std[bcb96dfbba0ab899]::thread::lifecycle::spawn_unchecked<test[75d6903177b1d7e9]::run_test::{closure#1}, ()>::{closure#1} as core[940e698046960fd5]::ops::function::FnOnce<()>>::call_once::{shim:vtable#0} <unknown>
96.40 s
> at <unknown source file> :<unknown line>
96.40 s
> 15: <std[bcb96dfbba0ab899]::sys::thread::unix::Thread>::new::thread_start <unknown>
96.40 s
> at <unknown source file> :<unknown line>
96.40 s
> 16: start_thread <unknown>
96.40 s
> at <unknown source file> :<unknown line>
96.40 s
> 17: __clone3 <unknown>
96.40 s
> at <unknown source file> :<unknown line>
96.40 s
>
96.40 s
> Run with COLORBT_SHOW_HIDDEN=1 environment variable to disable frame filtering.
96.40 s
> Run with RUST_BACKTRACE=full to include source snippets.
96.40 s
>
96.40 s
> error : test run failed
96.40 s
>
96.40 s
> ========== nextest test summary ==========
96.40 s
> report: target/nextest/ci_gammaloop/junit.xml
96.40 s
> tests: 687, failures: 2, errors: 0
96.40 s
>
96.40 s
> 1. gammalooprs::integrands::process::param_builder::tests::thermal_tanh_remains_finite_at_uv_scales_and_preserves_derivatives
96.40 s
> failure: test failure with exit code 101
96.40 s
> system-out
96.40 s
> running 1 test
96.40 s
> test integrands::process::param_builder::tests::thermal_tanh_remains_finite_at_uv_scales_and_preserves_derivatives ... FAILED
96.40 s
>
96.40 s
> failures:
96.40 s
>
96.40 s
> failures:
96.40 s
> integrands::process::param_builder::tests::thermal_tanh_remains_finite_at_uv_scales_and_preserves_derivatives
96.40 s
>
96.40 s
> test result: FAILED. 0 passed; 1 failed; 0 ignored; 0 measured; 737 filtered out; finished in 0.19s
96.40 s
> system-err
96.40 s
> The application panicked (crashed).
96.40 s
> Message: called `Result::unwrap()` on an `Err` value: "To vectorize the function 'symbolica::tanh', the symbol 'symbolica::tanh_v' must be defined that takes the vector index as an additional tag"
96.40 s
> Location: crates/gammalooprs/src/integrands/process/param_builder.rs:1958
96.40 s
>
96.40 s
> ━━━━━━━━━━━━━━━━━━━━━━━━━━━━━━━━━━ BACKTRACE ━━━━━━━━━━━━━━━━━━━━━━━━━━━━━━━━━━━
96.40 s
> 1: <color_eyre[51793ea62743adbd]::config::PanicHook>::panic_report<unknown>
96.40 s
> at <unknown source file>:<unknown line>
96.40 s
> 2: <color_eyre[51793ea62743adbd]::config::PanicHook>::into_panic_hook::{closure#0}<unknown>
96.40 s
> at <unknown source file>:<unknown line>
96.40 s
> 3: std[bcb96dfbba0ab899]::panicking::panic_with_hook<unknown>
96.40 s
> at <unknown source file>:<unknown line>
96.40 s
> 4: std[bcb96dfbba0ab899]::panicking::panic_handler::{closure#0}<unknown>
96.40 s
> at <unknown source file>:<unknown line>
96.40 s
> 5: std[bcb96dfbba0ab899]::sys::backtrace::__rust_end_short_backtrace::<std[bcb96dfbba0ab899]::panicking::panic_handler::{closure#0}, !><unknown>
96.40 s
> at <unknown source file>:<unknown line>
96.40 s
> 6: __rustc[6c289b9f9c454d21]::rust_begin_unwind<unknown>
96.40 s
> at <unknown source file>:<unknown line>
96.40 s
> 7: core[940e698046960fd5]::panicking::panic_fmt<unknown>
96.40 s
> at <unknown source file>:<unknown line>
96.40 s
> 8: core[940e698046960fd5]::result::unwrap_failed<unknown>
96.40 s
> at <unknown source file>:<unknown line>
96.40 s
> 9: gammalooprs[e90c332ffd68fb1e]::integrands::process::param_builder::tests::thermal_tanh_remains_finite_at_uv_scales_and_preserves_derivatives<unknown>
96.40 s
> at <unknown source file>:<unknown line>
96.41 s
> 10: <gammalooprs[e90c332ffd68fb1e]::integrands::process::param_builder::tests::thermal_tanh_remains_finite_at_uv_scales_and_preserves_derivatives::{closure#0} as core[940e698046960fd5]::ops::function::FnOnce<()>>::call_once<unknown>
96.41 s
> at <unknown source file>:<unknown line>
96.41 s
> 11: test[75d6903177b1d7e9]::__rust_begin_short_backtrace::<core[940e698046960fd5]::result::Result<(), alloc[2ea6bcb46fca0c42]::string::String>, fn() -> core[940e698046960fd5]::result::Result<(), alloc[2ea6bcb46fca0c42]::string::String>><unknown>
96.41 s
> at <unknown source file>:<unknown line>
96.41 s
> 12: test[75d6903177b1d7e9]::run_test::{closure#0}<unknown>
96.41 s
> at <unknown source file>:<unknown line>
96.41 s
> 13: std[bcb96dfbba0ab899]::sys::backtrace::__rust_begin_short_backtrace::<test[75d6903177b1d7e9]::run_test::{closure#1}, ()><unknown>
96.41 s
> at <unknown source file>:<unknown line>
96.41 s
> 14: <std[bcb96dfbba0ab899]::thread::lifecycle::spawn_unchecked<test[75d6903177b1d7e9]::run_test::{closure#1}, ()>::{closure#1} as core[940e698046960fd5]::ops::function::FnOnce<()>>::call_once::{shim:vtable#0}<unknown>
96.41 s
> at <unknown source file>:<unknown line>
96.41 s
> 15: <std[bcb96dfbba0ab899]::sys::thread::unix::Thread>::new::thread_start<unknown>
96.41 s
> at <unknown source file>:<unknown line>
96.41 s
> 16: start_thread<unknown>
96.41 s
> at <unknown source file>:<unknown line>
96.41 s
> 17: __clone3<unknown>
96.41 s
> at <unknown source file>:<unknown line>
96.41 s
>
96.41 s
> Run with COLORBT_SHOW_HIDDEN=1 environment variable to disable frame filtering.
96.41 s
> Run with RUST_BACKTRACE=full to include source snippets.
96.41 s
>
96.41 s
> 2. gammalooprs::graph::feynman_graph::tests::native_thermal_distributions
96.41 s
> failure: test failure with exit code 101
96.41 s
> system-out
96.41 s
> running 1 test
96.41 s
> test graph::feynman_graph::tests::native_thermal_distributions ... FAILED
96.41 s
>
96.41 s
> failures:
96.41 s
>
96.41 s
> failures:
96.41 s
> graph::feynman_graph::tests::native_thermal_distributions
96.41 s
>
96.41 s
> test result: FAILED. 0 passed; 1 failed; 0 ignored; 0 measured; 737 filtered out; finished in 2.32s
96.41 s
> system-err
96.41 s
> The application panicked (crashed).
96.41 s
> Message: called `Result::unwrap()` on an `Err` value: Custom { kind: Other, error: "Could not compile code: g++ -shared -O3 -fPIC -ffast-math -funsafe-math-optimizations -march=native -o /build/gammaloop-native-thermal-1614/thermal_0_0.so /build/gammaloop-native-thermal-1614/thermal_0_0.cpp\nwarning: Skipping impure flag -march=native because NIX_ENFORCE_NO_NATIVE is set\n/build/gammaloop-native-thermal-1614/thermal_0_0.cpp: In function 'void thermal_realf64(const double*, double*, double*)':\n/build/gammaloop-native-thermal-1614/thermal_0_0.cpp:27:16: error: 'symbolica_tanh' was not declared in this scope\n 27 | Z[6] = symbolica_tanh(Z[6]);\n | ^~~~~~~~~~~~~~\n" }
96.41 s
> Location: crates/gammalooprs/src/graph/feynman_graph.rs:1165
96.41 s
>
96.41 s
> ━━━━━━━━━━━━━━━━━━━━━━━━━━━━━━━━━━ BACKTRACE ━━━━━━━━━━━━━━━━━━━━━━━━━━━━━━━━━━━
96.41 s
> 1: <color_eyre[51793ea62743adbd]::config::PanicHook>::panic_report<unknown>
96.41 s
> at <unknown source file>:<unknown line>
96.41 s
> 2: <color_eyre[51793ea62743adbd]::config::PanicHook>::into_panic_hook::{closure#0}<unknown>
96.41 s
> at <unknown source file>:<unknown line>
96.41 s
> 3: std[bcb96dfbba0ab899]::panicking::panic_with_hook<unknown>
96.41 s
> at <unknown source file>:<unknown line>
96.41 s
> 4: std[bcb96dfbba0ab899]::panicking::panic_handler::{closure#0}<unknown>
96.41 s
> at <unknown source file>:<unknown line>
96.41 s
> 5: std[bcb96dfbba0ab899]::sys::backtrace::__rust_end_short_backtrace::<std[bcb96dfbba0ab899]::panicking::panic_handler::{closure#0}, !><unknown>
96.41 s
> at <unknown source file>:<unknown line>
96.41 s
> 6: __rustc[6c289b9f9c454d21]::rust_begin_unwind<unknown>
96.41 s
> at <unknown source file>:<unknown line>
96.41 s
> 7: core[940e698046960fd5]::panicking::panic_fmt<unknown>
96.41 s
> at <unknown source file>:<unknown line>
96.41 s
> 8: core[940e698046960fd5]::result::unwrap_failed<unknown>
96.41 s
> at <unknown source file>:<unknown line>
96.41 s
> 9: gammalooprs[e90c332ffd68fb1e]::graph::feynman_graph::tests::native_thermal_distributions<unknown>
96.41 s
> at <unknown source file>:<unknown line>
96.41 s
> 10: <gammalooprs[e90c332ffd68fb1e]::graph::feynman_graph::tests::native_thermal_distributions::{closure#0} as core[940e698046960fd5]::ops::function::FnOnce<()>>::call_once<unknown>
96.41 s
> at <unknown source file>:<unknown line>
96.41 s
> 11: test[75d6903177b1d7e9]::__rust_begin_short_backtrace::<core[940e698046960fd5]::result::Result<(), alloc[2ea6bcb46fca0c42]::string::String>, fn() -> core[940e698046960fd5]::result::Result<(), alloc[2ea6bcb46fca0c42]::string::String>><unknown>
96.41 s
> at <unknown source file>:<unknown line>
96.41 s
> 12: test[75d6903177b1d7e9]::run_test::{closure#0}<unknown>
96.41 s
> at <unknown source file>:<unknown line>
96.41 s
> 13: std[bcb96dfbba0ab899]::sys::backtrace::__rust_begin_short_backtrace::<test[75d6903177b1d7e9]::run_test::{closure#1}, ()><unknown>
96.41 s
> at <unknown source file>:<unknown line>
96.41 s
> 14: <std[bcb96dfbba0ab899]::thread::lifecycle::spawn_unchecked<test[75d6903177b1d7e9]::run_test::{closure#1}, ()>::{closure#1} as core[940e698046960fd5]::ops::function::FnOnce<()>>::call_once::{shim:vtable#0}<unknown>
96.41 s
> at <unknown source file>:<unknown line>
96.41 s
> 15: <std[bcb96dfbba0ab899]::sys::thread::unix::Thread>::new::thread_start<unknown>
96.41 s
> at <unknown source file>:<unknown line>
96.41 s
> 16: start_thread<unknown>
96.41 s
> at <unknown source file>:<unknown line>
96.41 s
> 17: __clone3<unknown>
96.41 s
> at <unknown source file>:<unknown line>
96.41 s
>
96.41 s
> Run with COLORBT_SHOW_HIDDEN=1 environment variable to disable frame filtering.
96.41 s
> Run with RUST_BACKTRACE=full to include source snippets.
96.41 s
> =========================================
96.41 s
> Extracting 1 binary, 1 build script output directory, and 1 linked path to /build/nextest-archive-C5mgRk
96.41 s
> Extracted 7 files to /build/nextest-archive-C5mgRk in 0.14s
96.41 s
> ------------
96.41 s
> Nextest run ID a5b754ab-17d6-4407-86c1-d2515c8cb8fe with nextest profile: ci_gammaloop
96.41 s
> Starting 136 tests across 1 binary
96.41 s
> ------------
96.41 s
> Summary [ 28.806s] 136 tests run: 136 passed , 0 skipped
96.41 s
>
96.41 s
> ========== nextest test summary ==========
96.41 s
> report: target/nextest/ci_gammaloop/junit.xml
96.41 s
> tests: 136, failures: 0, errors: 0
96.41 s
> No failing testcases found.
96.41 s
> =========================================
96.41 s
For full logs, run:
96.41 s
nix log /nix/store/bz3ms1n5n6isd5x84wsdypx5bbhzhv0k-gammaloop-nextest-core.drv
96.63 s
[0 built (1 failed ), 1 cRun failed.