test packages.x86_64-linux.nix-ci-check-gammaloop-nextest-core

Reproduce this run
Original Run
  1. 0.00 s $ /nix/store/9ypz3flqsrl5xl495mm8h645gadjsxi1-coreutils-9.11/bin/timeout --kill-after=15s 7200s /nix/store/23zk8sgzamrbmj1fday15szf7f2279s8-nix-2.34.7/bin/nix --extra-experimental-features nix-command --extra-experimental-features flakes flake clone git+https://github.com/alphal00p/gammaloop --dest /tmp/nix-ci-worker/stable-pwd/repo/
  2. 0.44 s Cloning into '/tmp/nix-ci-worker/stable-pwd/repo'...
  3. 1.48 s remote: Enumerating objects: 83706, done.
  4. 1.59 s remote: Counting objects: 0% (1/10144) remote: Counting objects: 1% (102/10144) remote: Counting objects: 2% (203/10144) remote: Counting objects: 3% (305/10144) remote: Counting objects: 4% (406/10144) remote: Counting objects: 5% (508/10144) remote: Counting objects: 6% (609/10144) remote: Counting objects: 7% (711/10144) remote: Counting objects: 8% (812/10144) remote: Counting objects: 9% (913/10144) remote: Counting objects: 10% (1015/10144) remote: Counting objects: 11% (1116/10144) remote: Counting objects: 12% (1218/10144) remote: Counting objects: 13% (1319/10144) remote: Counting objects: 14% (1421/10144) remote: Counting objects: 15% (1522/10144) remote: Counting objects: 16% (1624/10144) remote: Counting objects: 17% (1725/10144) remote: Counting objects: 18% (1826/10144) remote: Counting objects: 19% (1928/10144) remote: Counting objects: 20% (2029/10144) remote: Counting objects: 21% (2131/10144) remote: Counting objects: 22% (2232/10144) remote: Counting objects: 23% (2334/10144) remote: Counting objects: 24% (2435/10144) remote: Counting objects: 25% (2536/10144) remote: Counting objects: 26% (2638/10144) remote: Counting objects: 27% (2739/10144) remote: Counting objects: 28% (2841/10144) remote: Counting objects: 29% (2942/10144) remote: Counting objects: 30% (3044/10144) remote: Counting objects: 31% (3145/10144) remote: Counting objects: 32% (3247/10144) remote: Counting objects: 33% (3348/10144) remote: Counting objects: 34% (3449/10144) remote: Counting objects: 35% (3551/10144) remote: Counting objects: 36% (3652/10144) remote: Counting objects: 37% (3754/10144) remote: Counting objects: 38% (3855/10144) remote: Counting objects: 39% (3957/10144) remote: Counting objects: 40% (4058/10144) remote: Counting objects: 41% (4160/10144) remote: Counting objects: 42% (4261/10144) remote: Counting objects: 43% (4362/10144) remote: Counting objects: 44% (4464/10144) remote: Counting objects: 45% (4565/10144) remote: Counting objects: 46% (4667/10144) remote: Counting objects: 47% (4768/10144) remote: Counting objects: 48% (4870/10144) remote: Counting objects: 49% (4971/10144) remote: Counting objects: 50% (5072/10144) remote: Counting objects: 51% (5174/10144) remote: Counting objects: 52% (5275/10144) remote: Counting objects: 53% (5377/10144) remote: Counting objects: 54% (5478/10144) remote: Counting objects: 55% (5580/10144) remote: Counting objects: 56% (5681/10144) remote: Counting objects: 57% (5783/10144) remote: Counting objects: 58% (5884/10144) remote: Counting objects: 59% (5985/10144) remote: Counting objects: 60% (6087/10144) remote: Counting objects: 61% (6188/10144) remote: Counting objects: 62% (6290/10144) remote: Counting objects: 63% (6391/10144) remote: Counting objects: 64% (6493/10144) remote: Counting objects: 65% (6594/10144) remote: Counting objects: 66% (6696/10144) remote: Counting objects: 67% (6797/10144) remote: Counting objects: 68% (6898/10144) remote: Counting objects: 69% (7000/10144) remote: Counting objects: 70% (7101/10144) remote: Counting objects: 71% (7203/10144) remote: Counting objects: 72% (7304/10144) remote: Counting objects: 73% (7406/10144) remote: Counting objects: 74% (7507/10144) remote: Counting objects: 75% (7608/10144) remote: Counting objects: 76% (7710/10144) remote: Counting objects: 77% (7811/10144) remote: Counting objects: 78% (7913/10144) remote: Counting objects: 79% (8014/10144) remote: Counting objects: 80% (8116/10144) remote: Counting objects: 81% (8217/10144) remote: Counting objects: 82% (8319/10144) remote: Counting objects: 83% (8420/10144) remote: Counting objects: 84% (8521/10144) remote: Counting objects: 85% (8623/10144) remote: Counting objects: 86% (8724/10144) remote: Counting objects: 87% (8826/10144) remote: Counting objects: 88% (8927/10144) remote: Counting objects: 89% (9029/10144) remote: Counting objects: 90% (9130/10144) remote: Counting objects: 91% (9232/10144) remote: Counting objects: 92% (9333/10144) remote: Counting objects: 93% (9434/10144) remote: Counting objects: 94% (9536/10144) remote: Counting objects: 95% (9637/10144) remote: Counting objects: 96% (9739/10144) remote: Counting objects: 97% (9840/10144) remote: Counting objects: 98% (9942/10144) remote: Counting objects: 99% (10043/10144) remote: Counting objects: 100% (10144/10144) remote: Counting objects: 100% (10144/10144), done.
  5. 4.55 s remote: Compressing objects: 0% (1/2271) remote: Compressing objects: 1% (23/2271) remote: Compressing objects: 2% (46/2271) remote: Compressing objects: 3% (69/2271) remote: Compressing objects: 4% (91/2271) remote: Compressing objects: 5% (114/2271) remote: Compressing objects: 6% (137/2271) remote: Compressing objects: 7% (159/2271) remote: Compressing objects: 8% (182/2271) remote: Compressing objects: 9% (205/2271) remote: Compressing objects: 10% (228/2271) remote: Compressing objects: 11% (250/2271) remote: Compressing objects: 12% (273/2271) remote: Compressing objects: 13% (296/2271) remote: Compressing objects: 14% (318/2271) remote: Compressing objects: 15% (341/2271) remote: Compressing objects: 16% (364/2271) remote: Compressing objects: 17% (387/2271) remote: Compressing objects: 18% (409/2271) remote: Compressing objects: 19% (432/2271) remote: Compressing objects: 20% (455/2271) remote: Compressing objects: 20% (459/2271) remote: Compressing objects: 21% (477/2271) remote: Compressing objects: 22% (500/2271) remote: Compressing objects: 23% (523/2271) remote: Compressing objects: 24% (546/2271) remote: Compressing objects: 25% (568/2271) remote: Compressing objects: 26% (591/2271) remote: Compressing objects: 27% (614/2271) remote: Compressing objects: 28% (636/2271) remote: Compressing objects: 29% (659/2271) remote: Compressing objects: 30% (682/2271) remote: Compressing objects: 31% (705/2271) remote: Compressing objects: 32% (727/2271) remote: Compressing objects: 33% (750/2271) remote: Compressing objects: 34% (773/2271) remote: Compressing objects: 35% (795/2271) remote: Compressing objects: 36% (818/2271) remote: Compressing objects: 37% (841/2271) remote: Compressing objects: 38% (863/2271) remote: Compressing objects: 38% (883/2271) remote: Compressing objects: 39% (886/2271) remote: Compressing objects: 40% (909/2271) remote: Compressing objects: 41% (932/2271) remote: Compressing objects: 42% (954/2271) remote: Compressing objects: 43% (977/2271) remote: Compressing objects: 44% (1000/2271) remote: Compressing objects: 45% (1022/2271) remote: Compressing objects: 46% (1045/2271) remote: Compressing objects: 47% (1068/2271) remote: Compressing objects: 48% (1091/2271) remote: Compressing objects: 49% (1113/2271) remote: Compressing objects: 50% (1136/2271) remote: Compressing objects: 51% (1159/2271) remote: Compressing objects: 52% (1181/2271) remote: Compressing objects: 53% (1204/2271) remote: Compressing objects: 54% (1227/2271) remote: Compressing objects: 55% (1250/2271) remote: Compressing objects: 56% (1272/2271) remote: Compressing objects: 57% (1295/2271) remote: Compressing objects: 58% (1318/2271) remote: Compressing objects: 59% (1340/2271) remote: Compressing objects: 60% (1363/2271) remote: Compressing objects: 61% (1386/2271) remote: Compressing objects: 62% (1409/2271) remote: Compressing objects: 63% (1431/2271) remote: Compressing objects: 64% (1454/2271) remote: Compressing objects: 65% (1477/2271) remote: Compressing objects: 66% (1499/2271) remote: Compressing objects: 67% (1522/2271) remote: Compressing objects: 68% (1545/2271) remote: Compressing objects: 69% (1567/2271) remote: Compressing objects: 70% (1590/2271) remote: Compressing objects: 71% (1613/2271) remote: Compressing objects: 72% (1636/2271) remote: Compressing objects: 73% (1658/2271) remote: Compressing objects: 74% (1681/2271) remote: Compressing objects: 75% (1704/2271) remote: Compressing objects: 76% (1726/2271) remote: Compressing objects: 77% (1749/2271) remote: Compressing objects: 78% (1772/2271) remote: Compressing objects: 79% (1795/2271) remote: Compressing objects: 80% (1817/2271) remote: Compressing objects: 81% (1840/2271) remote: Compressing objects: 82% (1863/2271) remote: Compressing objects: 83% (1885/2271) remote: Compressing objects: 84% (1908/2271) remote: Compressing objects: 85% (1931/2271) remote: Compressing objects: 86% (1954/2271) remote: Compressing objects: 87% (1976/2271) remote: Compressing objects: 88% (1999/2271) remote: Compressing objects: 89% (2022/2271) remote: Compressing objects: 90% (2044/2271) remote: Compressing objects: 91% (2067/2271) remote: Compressing objects: 92% (2090/2271) remote: Compressing objects: 93% (2113/2271) remote: Compressing objects: 94% (2135/2271) remote: Compressing objects: 95% (2158/2271) remote: Compressing objects: 96% (2181/2271) remote: Compressing objects: 97% (2203/2271) remote: Compressing objects: 98% (2226/2271) remote: Compressing objects: 99% (2249/2271) remote: Compressing objects: 100% (2271/2271) remote: Compressing objects: 100% (2271/2271), done.
  6. 9.22 s Receiving objects: 0% (1/83706) Receiving objects: 1% (838/83706) Receiving objects: 2% (1675/83706) Receiving objects: 3% (2512/83706) Receiving objects: 4% (3349/83706) Receiving objects: 5% (4186/83706) Receiving objects: 6% (5023/83706), 9.09 MiB | 18.16 MiB/s Receiving objects: 7% (5860/83706), 9.09 MiB | 18.16 MiB/s Receiving objects: 8% (6697/83706), 9.09 MiB | 18.16 MiB/s Receiving objects: 9% (7534/83706), 9.09 MiB | 18.16 MiB/s Receiving objects: 10% (8371/83706), 9.09 MiB | 18.16 MiB/s Receiving objects: 11% (9208/83706), 9.09 MiB | 18.16 MiB/s Receiving objects: 12% (10045/83706), 9.09 MiB | 18.16 MiB/s Receiving objects: 13% (10882/83706), 9.09 MiB | 18.16 MiB/s Receiving objects: 14% (11719/83706), 9.09 MiB | 18.16 MiB/s Receiving objects: 15% (12556/83706), 9.09 MiB | 18.16 MiB/s Receiving objects: 16% (13393/83706), 9.09 MiB | 18.16 MiB/s Receiving objects: 17% (14231/83706), 9.09 MiB | 18.16 MiB/s Receiving objects: 18% (15068/83706), 9.09 MiB | 18.16 MiB/s Receiving objects: 19% (15905/83706), 9.09 MiB | 18.16 MiB/s Receiving objects: 20% (16742/83706), 9.09 MiB | 18.16 MiB/s Receiving objects: 21% (17579/83706), 9.09 MiB | 18.16 MiB/s Receiving objects: 22% (18416/83706), 9.09 MiB | 18.16 MiB/s Receiving objects: 23% (19253/83706), 9.09 MiB | 18.16 MiB/s Receiving objects: 24% (20090/83706), 9.09 MiB | 18.16 MiB/s Receiving objects: 25% (20927/83706), 9.09 MiB | 18.16 MiB/s Receiving objects: 25% (21409/83706), 9.09 MiB | 18.16 MiB/s Receiving objects: 26% (21764/83706), 22.66 MiB | 22.65 MiB/s Receiving objects: 27% (22601/83706), 22.66 MiB | 22.65 MiB/s Receiving objects: 28% (23438/83706), 22.66 MiB | 22.65 MiB/s Receiving objects: 29% (24275/83706), 22.66 MiB | 22.65 MiB/s Receiving objects: 30% (25112/83706), 22.66 MiB | 22.65 MiB/s Receiving objects: 31% (25949/83706), 22.66 MiB | 22.65 MiB/s Receiving objects: 32% (26786/83706), 22.66 MiB | 22.65 MiB/s Receiving objects: 33% (27623/83706), 22.66 MiB | 22.65 MiB/s Receiving objects: 34% (28461/83706), 22.66 MiB | 22.65 MiB/s Receiving objects: 35% (29298/83706), 22.66 MiB | 22.65 MiB/s Receiving objects: 36% (30135/83706), 22.66 MiB | 22.65 MiB/s Receiving objects: 37% (30972/83706), 22.66 MiB | 22.65 MiB/s Receiving objects: 38% (31809/83706), 22.66 MiB | 22.65 MiB/s Receiving objects: 39% (32646/83706), 22.66 MiB | 22.65 MiB/s Receiving objects: 40% (33483/83706), 22.66 MiB | 22.65 MiB/s Receiving objects: 41% (34320/83706), 22.66 MiB | 22.65 MiB/s Receiving objects: 42% (35157/83706), 22.66 MiB | 22.65 MiB/s Receiving objects: 43% (35994/83706), 22.66 MiB | 22.65 MiB/s Receiving objects: 44% (36831/83706), 22.66 MiB | 22.65 MiB/s Receiving objects: 45% (37668/83706), 40.50 MiB | 26.98 MiB/s Receiving objects: 46% (38505/83706), 40.50 MiB | 26.98 MiB/s Receiving objects: 47% (39342/83706), 40.50 MiB | 26.98 MiB/s Receiving objects: 48% (40179/83706), 40.50 MiB | 26.98 MiB/s Receiving objects: 49% (41016/83706), 40.50 MiB | 26.98 MiB/s Receiving objects: 50% (41853/83706), 40.50 MiB | 26.98 MiB/s Receiving objects: 51% (42691/83706), 40.50 MiB | 26.98 MiB/s Receiving objects: 52% (43528/83706), 40.50 MiB | 26.98 MiB/s Receiving objects: 53% (44365/83706), 40.50 MiB | 26.98 MiB/s Receiving objects: 54% (45202/83706), 40.50 MiB | 26.98 MiB/s Receiving objects: 55% (46039/83706), 40.50 MiB | 26.98 MiB/s Receiving objects: 55% (46265/83706), 40.50 MiB | 26.98 MiB/s Receiving objects: 56% (46876/83706), 55.35 MiB | 27.66 MiB/s Receiving objects: 57% (47713/83706), 55.35 MiB | 27.66 MiB/s Receiving objects: 58% (48550/83706), 55.35 MiB | 27.66 MiB/s Receiving objects: 59% (49387/83706), 55.35 MiB | 27.66 MiB/s Receiving objects: 60% (50224/83706), 55.35 MiB | 27.66 MiB/s Receiving objects: 61% (51061/83706), 70.52 MiB | 28.19 MiB/s Receiving objects: 62% (51898/83706), 70.52 MiB | 28.19 MiB/s Receiving objects: 63% (52735/83706), 70.52 MiB | 28.19 MiB/s Receiving objects: 64% (53572/83706), 70.52 MiB | 28.19 MiB/s Receiving objects: 65% (54409/83706), 70.52 MiB | 28.19 MiB/s Receiving objects: 66% (55246/83706), 70.52 MiB | 28.19 MiB/s Receiving objects: 67% (56084/83706), 70.52 MiB | 28.19 MiB/s Receiving objects: 68% (56921/83706), 70.52 MiB | 28.19 MiB/s Receiving objects: 69% (57758/83706), 70.52 MiB | 28.19 MiB/s Receiving objects: 69% (58077/83706), 70.52 MiB | 28.19 MiB/s Receiving objects: 70% (58595/83706), 86.10 MiB | 28.69 MiB/s Receiving objects: 71% (59432/83706), 86.10 MiB | 28.69 MiB/s Receiving objects: 72% (60269/83706), 86.10 MiB | 28.69 MiB/s Receiving objects: 73% (61106/83706), 86.10 MiB | 28.69 MiB/s Receiving objects: 74% (61943/83706), 86.10 MiB | 28.69 MiB/s Receiving objects: 75% (62780/83706), 86.10 MiB | 28.69 MiB/s Receiving objects: 76% (63617/83706), 102.11 MiB | 29.16 MiB/s Receiving objects: 77% (64454/83706), 102.11 MiB | 29.16 MiB/s Receiving objects: 78% (65291/83706), 102.11 MiB | 29.16 MiB/s Receiving objects: 79% (66128/83706), 102.11 MiB | 29.16 MiB/s Receiving objects: 80% (66965/83706), 102.11 MiB | 29.16 MiB/s Receiving objects: 81% (67802/83706), 102.11 MiB | 29.16 MiB/s Receiving objects: 82% (68639/83706), 102.11 MiB | 29.16 MiB/s Receiving objects: 83% (69476/83706), 102.11 MiB | 29.16 MiB/s Receiving objects: 84% (70314/83706), 102.11 MiB | 29.16 MiB/s Receiving objects: 85% (71151/83706), 102.11 MiB | 29.16 MiB/s Receiving objects: 85% (71221/83706), 118.13 MiB | 29.52 MiB/s Receiving objects: 86% (71988/83706), 118.13 MiB | 29.52 MiB/s Receiving objects: 87% (72825/83706), 118.13 MiB | 29.52 MiB/s Receiving objects: 88% (73662/83706), 118.13 MiB | 29.52 MiB/s Receiving objects: 89% (74499/83706), 118.13 MiB | 29.52 MiB/s Receiving objects: 90% (75336/83706), 118.13 MiB | 29.52 MiB/s Receiving objects: 91% (76173/83706), 118.13 MiB | 29.52 MiB/s Receiving objects: 92% (77010/83706), 118.13 MiB | 29.52 MiB/s Receiving objects: 93% (77847/83706), 118.13 MiB | 29.52 MiB/s Receiving objects: 94% (78684/83706), 118.13 MiB | 29.52 MiB/s Receiving objects: 95% (79521/83706), 118.13 MiB | 29.52 MiB/s Receiving objects: 96% (80358/83706), 118.13 MiB | 29.52 MiB/s Receiving objects: 97% (81195/83706), 118.13 MiB | 29.52 MiB/s Receiving objects: 98% (82032/83706), 118.13 MiB | 29.52 MiB/s Receiving objects: 99% (82869/83706), 118.13 MiB | 29.52 MiB/s remote: Total 83706 (delta 8088), reused 8207 (delta 7340), pack-reused 73562 (from 3)
  7. 9.22 s Receiving objects: 100% (83706/83706), 133.24 MiB | 29.59 MiB/s Receiving objects: 100% (83706/83706), 139.61 MiB | 29.93 MiB/s, done.
  8. 12.22 s Resolving deltas: 0% (0/56176) Resolving deltas: 1% (562/56176) Resolving deltas: 2% (1124/56176) Resolving deltas: 3% (1686/56176) Resolving deltas: 4% (2248/56176) Resolving deltas: 5% (2809/56176) Resolving deltas: 6% (3371/56176) Resolving deltas: 7% (3933/56176) Resolving deltas: 8% (4495/56176) Resolving deltas: 9% (5056/56176) Resolving deltas: 10% (5618/56176) Resolving deltas: 11% (6180/56176) Resolving deltas: 12% (6742/56176) Resolving deltas: 13% (7303/56176) Resolving deltas: 14% (7865/56176) Resolving deltas: 15% (8427/56176) Resolving deltas: 16% (8989/56176) Resolving deltas: 17% (9550/56176) Resolving deltas: 18% (10112/56176) Resolving deltas: 19% (10674/56176) Resolving deltas: 20% (11236/56176) Resolving deltas: 21% (11797/56176) Resolving deltas: 22% (12359/56176) Resolving deltas: 23% (12921/56176) Resolving deltas: 24% (13483/56176) Resolving deltas: 25% (14044/56176) Resolving deltas: 26% (14606/56176) Resolving deltas: 27% (15168/56176) Resolving deltas: 28% (15730/56176) Resolving deltas: 29% (16292/56176) Resolving deltas: 30% (16853/56176) Resolving deltas: 31% (17415/56176) Resolving deltas: 32% (17977/56176) Resolving deltas: 33% (18539/56176) Resolving deltas: 34% (19100/56176) Resolving deltas: 35% (19662/56176) Resolving deltas: 36% (20224/56176) Resolving deltas: 37% (20786/56176) Resolving deltas: 38% (21347/56176) Resolving deltas: 39% (21909/56176) Resolving deltas: 40% (22471/56176) Resolving deltas: 41% (23033/56176) Resolving deltas: 42% (23594/56176) Resolving deltas: 43% (24156/56176) Resolving deltas: 44% (24718/56176) Resolving deltas: 45% (25280/56176) Resolving deltas: 46% (25842/56176) Resolving deltas: 47% (26403/56176) Resolving deltas: 48% (26965/56176) Resolving deltas: 49% (27527/56176) Resolving deltas: 50% (28088/56176) Resolving deltas: 50% (28562/56176) Resolving deltas: 51% (28651/56176) Resolving deltas: 52% (29212/56176) Resolving deltas: 53% (29774/56176) Resolving deltas: 54% (30336/56176) Resolving deltas: 55% (30897/56176) Resolving deltas: 56% (31459/56176) Resolving deltas: 57% (32021/56176) Resolving deltas: 58% (32583/56176) Resolving deltas: 59% (33144/56176) Resolving deltas: 60% (33706/56176) Resolving deltas: 61% (34268/56176) Resolving deltas: 62% (34830/56176) Resolving deltas: 63% (35391/56176) Resolving deltas: 64% (35953/56176) Resolving deltas: 65% (36515/56176) Resolving deltas: 66% (37077/56176) Resolving deltas: 67% (37638/56176) Resolving deltas: 68% (38200/56176) Resolving deltas: 69% (38762/56176) Resolving deltas: 69% (38852/56176) Resolving deltas: 70% (39324/56176) Resolving deltas: 71% (39885/56176) Resolving deltas: 72% (40447/56176) Resolving deltas: 73% (41009/56176) Resolving deltas: 74% (41571/56176) Resolving deltas: 75% (42132/56176) Resolving deltas: 76% (42694/56176) Resolving deltas: 77% (43256/56176) Resolving deltas: 78% (43819/56176) Resolving deltas: 79% (44380/56176) Resolving deltas: 80% (44941/56176) Resolving deltas: 81% (45504/56176) Resolving deltas: 82% (46065/56176) Resolving deltas: 83% (46627/56176) Resolving deltas: 84% (47188/56176) Resolving deltas: 85% (47750/56176) Resolving deltas: 86% (48312/56176) Resolving deltas: 87% (48874/56176) Resolving deltas: 88% (49435/56176) Resolving deltas: 89% (49997/56176) Resolving deltas: 90% (50559/56176) Resolving deltas: 91% (51121/56176) Resolving deltas: 92% (51683/56176) Resolving deltas: 93% (52244/56176) Resolving deltas: 94% (52806/56176) Resolving deltas: 95% (53368/56176) Resolving deltas: 96% (53929/56176) Resolving deltas: 97% (54491/56176) Resolving deltas: 98% (55053/56176) Resolving deltas: 99% (55615/56176) Resolving deltas: 100% (56176/56176) Resolving deltas: 100% (56176/56176), done.
  9. 14.13 s Fetching commit 8d66059f66a723e7d44e7159b3db9cbce5d88b16 for wip/native-symbolica-hyperbolics ...
  10. 14.13 s $ /nix/store/bcnisk3ydfgv26v2gw3zlky24g00yww2-git-2.54.0/bin/git fetch origin 8d66059f66a723e7d44e7159b3db9cbce5d88b16
  11. 14.74 s From https://github.com/alphal00p/gammaloop
  12. 14.74 s * branch 8d66059f66a723e7d44e7159b3db9cbce5d88b16 -> FETCH_HEAD
  13. 14.78 s $ /nix/store/9ypz3flqsrl5xl495mm8h645gadjsxi1-coreutils-9.11/bin/timeout --kill-after=15s 7200s /nix/store/bcnisk3ydfgv26v2gw3zlky24g00yww2-git-2.54.0/bin/git -c advice.detachedHead=false checkout 8d66059f66a723e7d44e7159b3db9cbce5d88b16
  14. 15.16 s HEAD is now at 8d66059f6 update symjit to 2.25.3
  15. 15.19 s $ /nix/store/9ypz3flqsrl5xl495mm8h645gadjsxi1-coreutils-9.11/bin/timeout --kill-after=15s 7200s /nix/store/23zk8sgzamrbmj1fday15szf7f2279s8-nix-2.34.7/bin/nix --extra-experimental-features nix-command --extra-experimental-features flakes --log-format internal-json run .#packages.x86_64-linux.nix-ci-check-gammaloop-nextest-core --print-build-logs
  16. 22.25 s
  17. 29.21 s evaluating derivation 'g copying '/nix/store/z98r evaluating derivation 'g copying '/nix/store/z98r evaluating derivation 'g copying '/nix/store/z98r evaluating derivation 'g copying '/nix/store/z98r evaluating derivation 'g copying '/nix/store/z98r evaluating derivation 'g copying '/nix/store/z98r evaluating derivation 'g copying '/nix/store/z98r evaluating derivation 'g copying '/nix/store/z98r evaluating derivation 'g [0/3 built] [0/1 built] [1/0/1 built] building ggammaloop-nextest-core> Extracting 4 binaries (including 1 non-test binary), 1 build script output directory, and 2 linked paths to /build/nextest-archive-QwwD9J
  18. 30.30 s gammaloop-nextest-core> Extracted 20 files to /build/nextest-archive-QwwD9J in 1.09s
  19. 30.32 s gammaloop-nextest-core> ------------
  20. 30.32 s gammaloop-nextest-core> Nextest run ID 89fb0d2f-3b75-4dfc-a923-9a7f10936857 with nextest profile: ci_gammaloop
  21. 30.32 s gammaloop-nextest-core> Starting 380 tests across 3 binaries
  22. 31.81 s gammaloop-nextest-core> ------------
  23. 31.81 s gammaloop-nextest-core> Summary [ 1.493s] 380 tests run: 380 passed, 0 skipped
  24. 31.98 s gammaloop-nextest-core>
  25. 31.98 s gammaloop-nextest-core> ========== nextest test summary ==========
  26. 31.98 s gammaloop-nextest-core> report: target/nextest/ci_gammaloop/junit.xml
  27. 31.98 s gammaloop-nextest-core> tests: 380, failures: 0, errors: 0
  28. 31.98 s gammaloop-nextest-core> No failing testcases found.
  29. 31.98 s gammaloop-nextest-core> =========================================
  30. 32.00 s gammaloop-nextest-core> Extracting 1 binary and 1 linked path to /build/nextest-archive-d1v52l
  31. 32.08 s gammaloop-nextest-core> Extracted 7 files to /build/nextest-archive-d1v52l in 0.08s
  32. 32.09 s gammaloop-nextest-core> ------------
  33. 32.09 s gammaloop-nextest-core> Nextest run ID 2955db53-9120-4e66-bb2d-c6ae737947a1 with nextest profile: ci_gammaloop
  34. 32.09 s gammaloop-nextest-core> Starting 19 tests across 1 binary
  35. 32.10 s gammaloop-nextest-core> ------------
  36. 32.10 s gammaloop-nextest-core> Summary [ 0.015s] 19 tests run: 19 passed, 0 skipped
  37. 32.15 s gammaloop-nextest-core>
  38. 32.15 s gammaloop-nextest-core> ========== nextest test summary ==========
  39. 32.15 s gammaloop-nextest-core> report: target/nextest/ci_gammaloop/junit.xml
  40. 32.15 s gammaloop-nextest-core> tests: 19, failures: 0, errors: 0
  41. 32.15 s gammaloop-nextest-core> No failing testcases found.
  42. 32.15 s gammaloop-nextest-core> =========================================
  43. 32.17 s gammaloop-nextest-core> Extracting 1 binary to /build/nextest-archive-96YFlK
  44. 32.21 s gammaloop-nextest-core> Extracted 4 files to /build/nextest-archive-96YFlK in 0.04s
  45. 32.22 s gammaloop-nextest-core> ------------
  46. 32.22 s gammaloop-nextest-core> Nextest run ID 35d7274f-d676-43dd-a92f-c3bd9c61eae8 with nextest profile: ci_gammaloop
  47. 32.22 s gammaloop-nextest-core> Starting 0 tests across 1 binary
  48. 32.22 s gammaloop-nextest-core> ------------
  49. 32.22 s gammaloop-nextest-core> Summary [ 0.000s] 0 tests run: 0 passed, 0 skipped
  50. 32.27 s gammaloop-nextest-core>
  51. 32.27 s gammaloop-nextest-core> ========== nextest test summary ==========
  52. 32.27 s gammaloop-nextest-core> report: target/nextest/ci_gammaloop/junit.xml
  53. 32.27 s gammaloop-nextest-core> tests: 0, failures: 0, errors: 0
  54. 32.27 s gammaloop-nextest-core> No failing testcases found.
  55. 32.27 s gammaloop-nextest-core> =========================================
  56. 32.29 s gammaloop-nextest-core> Extracting 4 binaries, 1 build script output directory, and 2 linked paths to /build/nextest-archive-c9FlCu
  57. 32.89 s gammaloop-nextest-core> Extracted 18 files to /build/nextest-archive-c9FlCu in 0.61s
  58. 32.91 s gammaloop-nextest-core> ------------
  59. 32.91 s gammaloop-nextest-core> Nextest run ID c95d6f45-b5a6-47ec-abdc-5044741c355a with nextest profile: ci_gammaloop
  60. 32.91 s gammaloop-nextest-core> Starting 687 tests across 4 binaries (60 tests skipped, including 59 tests via profile.ci_gammaloop.default-filter)
  61. 34.18 s gammaloop-nextest-core> FAIL [ 0.811s] (191/687) gammalooprs graph::feynman_graph::tests::native_thermal_distributions
  62. 34.18 s gammaloop-nextest-core> stdout ---
  63. 34.18 s gammaloop-nextest-core>
  64. 34.18 s gammaloop-nextest-core> running 1 test
  65. 34.18 s gammaloop-nextest-core> test graph::feynman_graph::tests::native_thermal_distributions ... FAILED
  66. 34.18 s gammaloop-nextest-core>
  67. 34.18 s gammaloop-nextest-core> failures:
  68. 34.18 s gammaloop-nextest-core>
  69. 34.18 s gammaloop-nextest-core> failures:
  70. 34.18 s gammaloop-nextest-core> graph::feynman_graph::tests::native_thermal_distributions
  71. 34.18 s gammaloop-nextest-core>
  72. 34.18 s gammaloop-nextest-core> test result: FAILED. 0 passed; 1 failed; 0 ignored; 0 measured; 737 filtered out; finished in 0.79s
  73. 34.18 s gammaloop-nextest-core>
  74. 34.18 s gammaloop-nextest-core> stderr ---
  75. 34.18 s gammaloop-nextest-core> The application panicked (crashed).
  76. 34.18 s gammaloop-nextest-core> Message: called `Result::unwrap()` on an `Err` value: Custom { kind: Other, error: "Could not compile code: g++ -shared -O3 -fPIC -ffast-math -funsafe-math-optimizations -march=native -o /build/gammaloop-native-thermal-1603/thermal_0_0.so /build/gammaloop-native-thermal-1603/thermal_0_0.cpp\nwarning: Skipping impure flag -march=native because NIX_ENFORCE_NO_NATIVE is set\n/build/gammaloop-native-thermal-1603/thermal_0_0.cpp: In function 'void thermal_realf64(const double*, double*, double*)':\n/build/gammaloop-native-thermal-1603/thermal_0_0.cpp:27:16: error: 'symbolica_tanh' was not declared in this scope\n 27 | Z[6] = symbolica_tanh(Z[6]);\n | ^~~~~~~~~~~~~~\n" }
  77. 34.18 s gammaloop-nextest-core> Location: crates/gammalooprs/src/graph/feynman_graph.rs:1165
  78. 34.18 s gammaloop-nextest-core>
  79. 34.18 s gammaloop-nextest-core> ━━━━━━━━━━━━━━━━━━━━━━━━━━━━━━━━━━ BACKTRACE ━━━━━━━━━━━━━━━━━━━━━━━━━━━━━━━━━━━
  80. 34.18 s gammaloop-nextest-core> 1: <color_eyre[51793ea62743adbd]::config::PanicHook>::panic_report<unknown>
  81. 34.18 s gammaloop-nextest-core> at <unknown source file>:<unknown line>
  82. 34.18 s gammaloop-nextest-core> 2: <color_eyre[51793ea62743adbd]::config::PanicHook>::into_panic_hook::{closure#0}<unknown>
  83. 34.18 s gammaloop-nextest-core> at <unknown source file>:<unknown line>
  84. 34.18 s gammaloop-nextest-core> 3: std[bcb96dfbba0ab899]::panicking::panic_with_hook<unknown>
  85. 34.18 s gammaloop-nextest-core> at <unknown source file>:<unknown line>
  86. 34.18 s gammaloop-nextest-core> 4: std[bcb96dfbba0ab899]::panicking::panic_handler::{closure#0}<unknown>
  87. 34.18 s gammaloop-nextest-core> at <unknown source file>:<unknown line>
  88. 34.18 s gammaloop-nextest-core> 5: std[bcb96dfbba0ab899]::sys::backtrace::__rust_end_short_backtrace::<std[bcb96dfbba0ab899]::panicking::panic_handler::{closure#0}, !><unknown>
  89. 34.18 s gammaloop-nextest-core> at <unknown source file>:<unknown line>
  90. 34.18 s gammaloop-nextest-core> 6: __rustc[6c289b9f9c454d21]::rust_begin_unwind<unknown>
  91. 34.18 s gammaloop-nextest-core> at <unknown source file>:<unknown line>
  92. 34.18 s gammaloop-nextest-core> 7: core[940e698046960fd5]::panicking::panic_fmt<unknown>
  93. 34.18 s gammaloop-nextest-core> at <unknown source file>:<unknown line>
  94. 34.18 s gammaloop-nextest-core> 8: core[940e698046960fd5]::result::unwrap_failed<unknown>
  95. 34.18 s gammaloop-nextest-core> at <unknown source file>:<unknown line>
  96. 34.18 s gammaloop-nextest-core> 9: gammalooprs[e90c332ffd68fb1e]::graph::feynman_graph::tests::native_thermal_distributions<unknown>
  97. 34.18 s gammaloop-nextest-core> at <unknown source file>:<unknown line>
  98. 34.18 s gammaloop-nextest-core> 10: <gammalooprs[e90c332ffd68fb1e]::graph::feynman_graph::tests::native_thermal_distributions::{closure#0} as core[940e698046960fd5]::ops::function::FnOnce<()>>::call_once<unknown>
  99. 34.18 s gammaloop-nextest-core> at <unknown source file>:<unknown line>
  100. 34.18 s gammaloop-nextest-core> 11: test[75d6903177b1d7e9]::__rust_begin_short_backtrace::<core[940e698046960fd5]::result::Result<(), alloc[2ea6bcb46fca0c42]::string::String>, fn() -> core[940e698046960fd5]::result::Result<(), alloc[2ea6bcb46fca0c42]::string::String>><unknown>
  101. 34.18 s gammaloop-nextest-core> at <unknown source file>:<unknown line>
  102. 34.18 s gammaloop-nextest-core> 12: test[75d6903177b1d7e9]::run_test::{closure#0}<unknown>
  103. 34.18 s gammaloop-nextest-core> at <unknown source file>:<unknown line>
  104. 34.18 s gammaloop-nextest-core> 13: std[bcb96dfbba0ab899]::sys::backtrace::__rust_begin_short_backtrace::<test[75d6903177b1d7e9]::run_test::{closure#1}, ()><unknown>
  105. 34.18 s gammaloop-nextest-core> at <unknown source file>:<unknown line>
  106. 34.18 s gammaloop-nextest-core> 14: <std[bcb96dfbba0ab899]::thread::lifecycle::spawn_unchecked<test[75d6903177b1d7e9]::run_test::{closure#1}, ()>::{closure#1} as core[940e698046960fd5]::ops::function::FnOnce<()>>::call_once::{shim:vtable#0}<unknown>
  107. 34.18 s gammaloop-nextest-core> at <unknown source file>:<unknown line>
  108. 34.18 s gammaloop-nextest-core> 15: <std[bcb96dfbba0ab899]::sys::thread::unix::Thread>::new::thread_start<unknown>
  109. 34.18 s gammaloop-nextest-core> at <unknown source file>:<unknown line>
  110. 34.18 s gammaloop-nextest-core> 16: start_thread<unknown>
  111. 34.18 s gammaloop-nextest-core> at <unknown source file>:<unknown line>
  112. 34.18 s gammaloop-nextest-core> 17: __clone3<unknown>
  113. 34.18 s gammaloop-nextest-core> at <unknown source file>:<unknown line>
  114. 34.18 s gammaloop-nextest-core>
  115. 34.18 s gammaloop-nextest-core> Run with COLORBT_SHOW_HIDDEN=1 environment variable to disable frame filtering.
  116. 34.18 s gammaloop-nextest-core> Run with RUST_BACKTRACE=full to include source snippets.
  117. 34.18 s gammaloop-nextest-core>
  118. 34.27 s gammaloop-nextest-core> FAIL [ 0.095s] (243/687) gammalooprs integrands::process::param_builder::tests::thermal_tanh_remains_finite_at_uv_scales_and_preserves_derivatives
  119. 34.27 s gammaloop-nextest-core> stdout ---
  120. 34.27 s gammaloop-nextest-core>
  121. 34.27 s gammaloop-nextest-core> running 1 test
  122. 34.27 s gammaloop-nextest-core> test integrands::process::param_builder::tests::thermal_tanh_remains_finite_at_uv_scales_and_preserves_derivatives ... FAILED
  123. 34.27 s gammaloop-nextest-core>
  124. 34.27 s gammaloop-nextest-core> failures:
  125. 34.27 s gammaloop-nextest-core>
  126. 34.27 s gammaloop-nextest-core> failures:
  127. 34.27 s gammaloop-nextest-core> integrands::process::param_builder::tests::thermal_tanh_remains_finite_at_uv_scales_and_preserves_derivatives
  128. 34.27 s gammaloop-nextest-core>
  129. 34.27 s gammaloop-nextest-core> test result: FAILED. 0 passed; 1 failed; 0 ignored; 0 measured; 737 filtered out; finished in 0.08s
  130. 34.27 s gammaloop-nextest-core>
  131. 34.27 s gammaloop-nextest-core> stderr ---
  132. 34.27 s gammaloop-nextest-core> The application panicked (crashed).
  133. 34.27 s gammaloop-nextest-core> Message: called `Result::unwrap()` on an `Err` value: "To vectorize the function 'symbolica::tanh', the symbol 'symbolica::tanh_v' must be defined that takes the vector index as an additional tag"
  134. 34.27 s gammaloop-nextest-core> Location: crates/gammalooprs/src/integrands/process/param_builder.rs:1958
  135. 34.27 s gammaloop-nextest-core>
  136. 34.27 s gammaloop-nextest-core> ━━━━━━━━━━━━━━━━━━━━━━━━━━━━━━━━━━ BACKTRACE ━━━━━━━━━━━━━━━━━━━━━━━━━━━━━━━━━━━
  137. 34.27 s gammaloop-nextest-core> 1: <color_eyre[51793ea62743adbd]::config::PanicHook>::panic_report<unknown>
  138. 34.27 s gammaloop-nextest-core> at <unknown source file>:<unknown line>
  139. 34.27 s gammaloop-nextest-core> 2: <color_eyre[51793ea62743adbd]::config::PanicHook>::into_panic_hook::{closure#0}<unknown>
  140. 34.27 s gammaloop-nextest-core> at <unknown source file>:<unknown line>
  141. 34.27 s gammaloop-nextest-core> 3: std[bcb96dfbba0ab899]::panicking::panic_with_hook<unknown>
  142. 34.27 s gammaloop-nextest-core> at <unknown source file>:<unknown line>
  143. 34.27 s gammaloop-nextest-core> 4: std[bcb96dfbba0ab899]::panicking::panic_handler::{closure#0}<unknown>
  144. 34.27 s gammaloop-nextest-core> at <unknown source file>:<unknown line>
  145. 34.27 s gammaloop-nextest-core> 5: std[bcb96dfbba0ab899]::sys::backtrace::__rust_end_short_backtrace::<std[bcb96dfbba0ab899]::panicking::panic_handler::{closure#0}, !><unknown>
  146. 34.27 s gammaloop-nextest-core> at <unknown source file>:<unknown line>
  147. 34.27 s gammaloop-nextest-core> 6: __rustc[6c289b9f9c454d21]::rust_begin_unwind<unknown>
  148. 34.27 s gammaloop-nextest-core> at <unknown source file>:<unknown line>
  149. 34.27 s gammaloop-nextest-core> 7: core[940e698046960fd5]::panicking::panic_fmt<unknown>
  150. 34.27 s gammaloop-nextest-core> at <unknown source file>:<unknown line>
  151. 34.27 s gammaloop-nextest-core> 8: core[940e698046960fd5]::result::unwrap_failed<unknown>
  152. 34.27 s gammaloop-nextest-core> at <unknown source file>:<unknown line>
  153. 34.27 s gammaloop-nextest-core> 9: gammalooprs[e90c332ffd68fb1e]::integrands::process::param_builder::tests::thermal_tanh_remains_finite_at_uv_scales_and_preserves_derivatives<unknown>
  154. 34.27 s gammaloop-nextest-core> at <unknown source file>:<unknown line>
  155. 34.27 s gammaloop-nextest-core> 10: <gammalooprs[e90c332ffd68fb1e]::integrands::process::param_builder::tests::thermal_tanh_remains_finite_at_uv_scales_and_preserves_derivatives::{closure#0} as core[940e698046960fd5]::ops::function::FnOnce<()>>::call_once<unknown>
  156. 34.27 s gammaloop-nextest-core> at <unknown source file>:<unknown line>
  157. 34.27 s gammaloop-nextest-core> 11: test[75d6903177b1d7e9]::__rust_begin_short_backtrace::<core[940e698046960fd5]::result::Result<(), alloc[2ea6bcb46fca0c42]::string::String>, fn() -> core[940e698046960fd5]::result::Result<(), alloc[2ea6bcb46fca0c42]::string::String>><unknown>
  158. 34.27 s gammaloop-nextest-core> at <unknown source file>:<unknown line>
  159. 34.27 s gammaloop-nextest-core> 12: test[75d6903177b1d7e9]::run_test::{closure#0}<unknown>
  160. 34.27 s gammaloop-nextest-core> at <unknown source file>:<unknown line>
  161. 34.27 s gammaloop-nextest-core> 13: std[bcb96dfbba0ab899]::sys::backtrace::__rust_begin_short_backtrace::<test[75d6903177b1d7e9]::run_test::{closure#1}, ()><unknown>
  162. 34.27 s gammaloop-nextest-core> at <unknown source file>:<unknown line>
  163. 34.27 s gammaloop-nextest-core> 14: <std[bcb96dfbba0ab899]::thread::lifecycle::spawn_unchecked<test[75d6903177b1d7e9]::run_test::{closure#1}, ()>::{closure#1} as core[940e698046960fd5]::ops::function::FnOnce<()>>::call_once::{shim:vtable#0}<unknown>
  164. 34.27 s gammaloop-nextest-core> at <unknown source file>:<unknown line>
  165. 34.27 s gammaloop-nextest-core> 15: <std[bcb96dfbba0ab899]::sys::thread::unix::Thread>::new::thread_start<unknown>
  166. 34.27 s gammaloop-nextest-core> at <unknown source file>:<unknown line>
  167. 34.27 s gammaloop-nextest-core> 16: start_thread<unknown>
  168. 34.27 s gammaloop-nextest-core> at <unknown source file>:<unknown line>
  169. 34.27 s gammaloop-nextest-core> 17: __clone3<unknown>
  170. 34.27 s gammaloop-nextest-core> at <unknown source file>:<unknown line>
  171. 34.27 s gammaloop-nextest-core>
  172. 34.27 s gammaloop-nextest-core> Run with COLORBT_SHOW_HIDDEN=1 environment variable to disable frame filtering.
  173. 34.27 s gammaloop-nextest-core> Run with RUST_BACKTRACE=full to include source snippets.
  174. 34.27 s gammaloop-nextest-core>
  175. 48.84 s gammaloop-nextest-core> ------------
  176. 48.84 s gammaloop-nextest-core> Summary [ 15.932s] 687 tests run: 685 passed, 2 failed, 60 skipped
  177. 48.84 s gammaloop-nextest-core> FAIL [ 0.811s] (191/687) gammalooprs graph::feynman_graph::tests::native_thermal_distributions
  178. 48.84 s gammaloop-nextest-core> stdout ---
  179. 48.84 s gammaloop-nextest-core>
  180. 48.84 s gammaloop-nextest-core> running 1 test
  181. 48.84 s gammaloop-nextest-core> test graph::feynman_graph::tests::native_thermal_distributions ... FAILED
  182. 48.84 s gammaloop-nextest-core>
  183. 48.84 s gammaloop-nextest-core> failures:
  184. 48.84 s gammaloop-nextest-core>
  185. 48.84 s gammaloop-nextest-core> failures:
  186. 48.84 s gammaloop-nextest-core> graph::feynman_graph::tests::native_thermal_distributions
  187. 48.84 s gammaloop-nextest-core>
  188. 48.84 s gammaloop-nextest-core> test result: FAILED. 0 passed; 1 failed; 0 ignored; 0 measured; 737 filtered out; finished in 0.79s
  189. 48.84 s gammaloop-nextest-core>
  190. 48.84 s gammaloop-nextest-core> stderr ---
  191. 48.84 s gammaloop-nextest-core> The application panicked (crashed).
  192. 48.84 s gammaloop-nextest-core> Message: called `Result::unwrap()` on an `Err` value: Custom { kind: Other, error: "Could not compile code: g++ -shared -O3 -fPIC -ffast-math -funsafe-math-optimizations -march=native -o /build/gammaloop-native-thermal-1603/thermal_0_0.so /build/gammaloop-native-thermal-1603/thermal_0_0.cpp\nwarning: Skipping impure flag -march=native because NIX_ENFORCE_NO_NATIVE is set\n/build/gammaloop-native-thermal-1603/thermal_0_0.cpp: In function 'void thermal_realf64(const double*, double*, double*)':\n/build/gammaloop-native-thermal-1603/thermal_0_0.cpp:27:16: error: 'symbolica_tanh' was not declared in this scope\n 27 | Z[6] = symbolica_tanh(Z[6]);\n | ^~~~~~~~~~~~~~\n" }
  193. 48.84 s gammaloop-nextest-core> Location: crates/gammalooprs/src/graph/feynman_graph.rs:1165
  194. 48.84 s gammaloop-nextest-core>
  195. 48.84 s gammaloop-nextest-core> ━━━━━━━━━━━━━━━━━━━━━━━━━━━━━━━━━━ BACKTRACE ━━━━━━━━━━━━━━━━━━━━━━━━━━━━━━━━━━━
  196. 48.84 s gammaloop-nextest-core> 1: <color_eyre[51793ea62743adbd]::config::PanicHook>::panic_report<unknown>
  197. 48.84 s gammaloop-nextest-core> at <unknown source file>:<unknown line>
  198. 48.84 s gammaloop-nextest-core> 2: <color_eyre[51793ea62743adbd]::config::PanicHook>::into_panic_hook::{closure#0}<unknown>
  199. 48.84 s gammaloop-nextest-core> at <unknown source file>:<unknown line>
  200. 48.84 s gammaloop-nextest-core> 3: std[bcb96dfbba0ab899]::panicking::panic_with_hook<unknown>
  201. 48.84 s gammaloop-nextest-core> at <unknown source file>:<unknown line>
  202. 48.84 s gammaloop-nextest-core> 4: std[bcb96dfbba0ab899]::panicking::panic_handler::{closure#0}<unknown>
  203. 48.84 s gammaloop-nextest-core> at <unknown source file>:<unknown line>
  204. 48.84 s gammaloop-nextest-core> 5: std[bcb96dfbba0ab899]::sys::backtrace::__rust_end_short_backtrace::<std[bcb96dfbba0ab899]::panicking::panic_handler::{closure#0}, !><unknown>
  205. 48.84 s gammaloop-nextest-core> at <unknown source file>:<unknown line>
  206. 48.84 s gammaloop-nextest-core> 6: __rustc[6c289b9f9c454d21]::rust_begin_unwind<unknown>
  207. 48.84 s gammaloop-nextest-core> at <unknown source file>:<unknown line>
  208. 48.84 s gammaloop-nextest-core> 7: core[940e698046960fd5]::panicking::panic_fmt<unknown>
  209. 48.84 s gammaloop-nextest-core> at <unknown source file>:<unknown line>
  210. 48.84 s gammaloop-nextest-core> 8: core[940e698046960fd5]::result::unwrap_failed<unknown>
  211. 48.84 s gammaloop-nextest-core> at <unknown source file>:<unknown line>
  212. 48.84 s gammaloop-nextest-core> 9: gammalooprs[e90c332ffd68fb1e]::graph::feynman_graph::tests::native_thermal_distributions<unknown>
  213. 48.84 s gammaloop-nextest-core> at <unknown source file>:<unknown line>
  214. 48.84 s gammaloop-nextest-core> 10: <gammalooprs[e90c332ffd68fb1e]::graph::feynman_graph::tests::native_thermal_distributions::{closure#0} as core[940e698046960fd5]::ops::function::FnOnce<()>>::call_once<unknown>
  215. 48.84 s gammaloop-nextest-core> at <unknown source file>:<unknown line>
  216. 48.84 s gammaloop-nextest-core> 11: test[75d6903177b1d7e9]::__rust_begin_short_backtrace::<core[940e698046960fd5]::result::Result<(), alloc[2ea6bcb46fca0c42]::string::String>, fn() -> core[940e698046960fd5]::result::Result<(), alloc[2ea6bcb46fca0c42]::string::String>><unknown>
  217. 48.84 s gammaloop-nextest-core> at <unknown source file>:<unknown line>
  218. 48.84 s gammaloop-nextest-core> 12: test[75d6903177b1d7e9]::run_test::{closure#0}<unknown>
  219. 48.84 s gammaloop-nextest-core> at <unknown source file>:<unknown line>
  220. 48.84 s gammaloop-nextest-core> 13: std[bcb96dfbba0ab899]::sys::backtrace::__rust_begin_short_backtrace::<test[75d6903177b1d7e9]::run_test::{closure#1}, ()><unknown>
  221. 48.84 s gammaloop-nextest-core> at <unknown source file>:<unknown line>
  222. 48.84 s gammaloop-nextest-core> 14: <std[bcb96dfbba0ab899]::thread::lifecycle::spawn_unchecked<test[75d6903177b1d7e9]::run_test::{closure#1}, ()>::{closure#1} as core[940e698046960fd5]::ops::function::FnOnce<()>>::call_once::{shim:vtable#0}<unknown>
  223. 48.84 s gammaloop-nextest-core> at <unknown source file>:<unknown line>
  224. 48.84 s gammaloop-nextest-core> 15: <std[bcb96dfbba0ab899]::sys::thread::unix::Thread>::new::thread_start<unknown>
  225. 48.84 s gammaloop-nextest-core> at <unknown source file>:<unknown line>
  226. 48.84 s gammaloop-nextest-core> 16: start_thread<unknown>
  227. 48.84 s gammaloop-nextest-core> at <unknown source file>:<unknown line>
  228. 48.84 s gammaloop-nextest-core> 17: __clone3<unknown>
  229. 48.84 s gammaloop-nextest-core> at <unknown source file>:<unknown line>
  230. 48.84 s gammaloop-nextest-core>
  231. 48.84 s gammaloop-nextest-core> Run with COLORBT_SHOW_HIDDEN=1 environment variable to disable frame filtering.
  232. 48.84 s gammaloop-nextest-core> Run with RUST_BACKTRACE=full to include source snippets.
  233. 48.84 s gammaloop-nextest-core>
  234. 48.84 s gammaloop-nextest-core> FAIL [ 0.095s] (243/687) gammalooprs integrands::process::param_builder::tests::thermal_tanh_remains_finite_at_uv_scales_and_preserves_derivatives
  235. 48.84 s gammaloop-nextest-core> stdout ---
  236. 48.84 s gammaloop-nextest-core>
  237. 48.84 s gammaloop-nextest-core> running 1 test
  238. 48.84 s gammaloop-nextest-core> test integrands::process::param_builder::tests::thermal_tanh_remains_finite_at_uv_scales_and_preserves_derivatives ... FAILED
  239. 48.84 s gammaloop-nextest-core>
  240. 48.84 s gammaloop-nextest-core> failures:
  241. 48.84 s gammaloop-nextest-core>
  242. 48.84 s gammaloop-nextest-core> failures:
  243. 48.84 s gammaloop-nextest-core> integrands::process::param_builder::tests::thermal_tanh_remains_finite_at_uv_scales_and_preserves_derivatives
  244. 48.84 s gammaloop-nextest-core>
  245. 48.84 s gammaloop-nextest-core> test result: FAILED. 0 passed; 1 failed; 0 ignored; 0 measured; 737 filtered out; finished in 0.08s
  246. 48.84 s gammaloop-nextest-core>
  247. 48.84 s gammaloop-nextest-core> stderr ---
  248. 48.84 s gammaloop-nextest-core> The application panicked (crashed).
  249. 48.84 s gammaloop-nextest-core> Message: called `Result::unwrap()` on an `Err` value: "To vectorize the function 'symbolica::tanh', the symbol 'symbolica::tanh_v' must be defined that takes the vector index as an additional tag"
  250. 48.84 s gammaloop-nextest-core> Location: crates/gammalooprs/src/integrands/process/param_builder.rs:1958
  251. 48.84 s gammaloop-nextest-core>
  252. 48.84 s gammaloop-nextest-core> ━━━━━━━━━━━━━━━━━━━━━━━━━━━━━━━━━━ BACKTRACE ━━━━━━━━━━━━━━━━━━━━━━━━━━━━━━━━━━━
  253. 48.84 s gammaloop-nextest-core> 1: <color_eyre[51793ea62743adbd]::config::PanicHook>::panic_report<unknown>
  254. 48.84 s gammaloop-nextest-core> at <unknown source file>:<unknown line>
  255. 48.84 s gammaloop-nextest-core> 2: <color_eyre[51793ea62743adbd]::config::PanicHook>::into_panic_hook::{closure#0}<unknown>
  256. 48.84 s gammaloop-nextest-core> at <unknown source file>:<unknown line>
  257. 48.84 s gammaloop-nextest-core> 3: std[bcb96dfbba0ab899]::panicking::panic_with_hook<unknown>
  258. 48.84 s gammaloop-nextest-core> at <unknown source file>:<unknown line>
  259. 48.84 s gammaloop-nextest-core> 4: std[bcb96dfbba0ab899]::panicking::panic_handler::{closure#0}<unknown>
  260. 48.84 s gammaloop-nextest-core> at <unknown source file>:<unknown line>
  261. 48.84 s gammaloop-nextest-core> 5: std[bcb96dfbba0ab899]::sys::backtrace::__rust_end_short_backtrace::<std[bcb96dfbba0ab899]::panicking::panic_handler::{closure#0}, !><unknown>
  262. 48.84 s gammaloop-nextest-core> at <unknown source file>:<unknown line>
  263. 48.84 s gammaloop-nextest-core> 6: __rustc[6c289b9f9c454d21]::rust_begin_unwind<unknown>
  264. 48.84 s gammaloop-nextest-core> at <unknown source file>:<unknown line>
  265. 48.84 s gammaloop-nextest-core> 7: core[940e698046960fd5]::panicking::panic_fmt<unknown>
  266. 48.84 s gammaloop-nextest-core> at <unknown source file>:<unknown line>
  267. 48.84 s gammaloop-nextest-core> 8: core[940e698046960fd5]::result::unwrap_failed<unknown>
  268. 48.84 s gammaloop-nextest-core> at <unknown source file>:<unknown line>
  269. 48.84 s gammaloop-nextest-core> 9: gammalooprs[e90c332ffd68fb1e]::integrands::process::param_builder::tests::thermal_tanh_remains_finite_at_uv_scales_and_preserves_derivatives<unknown>
  270. 48.84 s gammaloop-nextest-core> at <unknown source file>:<unknown line>
  271. 48.84 s gammaloop-nextest-core> 10: <gammalooprs[e90c332ffd68fb1e]::integrands::process::param_builder::tests::thermal_tanh_remains_finite_at_uv_scales_and_preserves_derivatives::{closure#0} as core[940e698046960fd5]::ops::function::FnOnce<()>>::call_once<unknown>
  272. 48.84 s gammaloop-nextest-core> at <unknown source file>:<unknown line>
  273. 48.84 s gammaloop-nextest-core> 11: test[75d6903177b1d7e9]::__rust_begin_short_backtrace::<core[940e698046960fd5]::result::Result<(), alloc[2ea6bcb46fca0c42]::string::String>, fn() -> core[940e698046960fd5]::result::Result<(), alloc[2ea6bcb46fca0c42]::string::String>><unknown>
  274. 48.84 s gammaloop-nextest-core> at <unknown source file>:<unknown line>
  275. 48.84 s gammaloop-nextest-core> 12: test[75d6903177b1d7e9]::run_test::{closure#0}<unknown>
  276. 48.84 s gammaloop-nextest-core> at <unknown source file>:<unknown line>
  277. 48.84 s gammaloop-nextest-core> 13: std[bcb96dfbba0ab899]::sys::backtrace::__rust_begin_short_backtrace::<test[75d6903177b1d7e9]::run_test::{closure#1}, ()><unknown>
  278. 48.84 s gammaloop-nextest-core> at <unknown source file>:<unknown line>
  279. 48.84 s gammaloop-nextest-core> 14: <std[bcb96dfbba0ab899]::thread::lifecycle::spawn_unchecked<test[75d6903177b1d7e9]::run_test::{closure#1}, ()>::{closure#1} as core[940e698046960fd5]::ops::function::FnOnce<()>>::call_once::{shim:vtable#0}<unknown>
  280. 48.84 s gammaloop-nextest-core> at <unknown source file>:<unknown line>
  281. 48.84 s gammaloop-nextest-core> 15: <std[bcb96dfbba0ab899]::sys::thread::unix::Thread>::new::thread_start<unknown>
  282. 48.84 s gammaloop-nextest-core> at <unknown source file>:<unknown line>
  283. 48.84 s gammaloop-nextest-core> 16: start_thread<unknown>
  284. 48.84 s gammaloop-nextest-core> at <unknown source file>:<unknown line>
  285. 48.84 s gammaloop-nextest-core> 17: __clone3<unknown>
  286. 48.84 s gammaloop-nextest-core> at <unknown source file>:<unknown line>
  287. 48.84 s gammaloop-nextest-core>
  288. 48.84 s gammaloop-nextest-core> Run with COLORBT_SHOW_HIDDEN=1 environment variable to disable frame filtering.
  289. 48.84 s gammaloop-nextest-core> Run with RUST_BACKTRACE=full to include source snippets.
  290. 48.84 s gammaloop-nextest-core>
  291. 48.92 s gammaloop-nextest-core> error: test run failed
  292. 48.95 s gammaloop-nextest-core>
  293. 48.95 s gammaloop-nextest-core> ========== nextest test summary ==========
  294. 48.95 s gammaloop-nextest-core> report: target/nextest/ci_gammaloop/junit.xml
  295. 48.95 s gammaloop-nextest-core> tests: 687, failures: 2, errors: 0
  296. 48.95 s gammaloop-nextest-core>
  297. 48.95 s gammaloop-nextest-core> 1. gammalooprs::graph::feynman_graph::tests::native_thermal_distributions
  298. 48.95 s gammaloop-nextest-core> failure: test failure with exit code 101
  299. 48.95 s gammaloop-nextest-core> system-out
  300. 48.95 s gammaloop-nextest-core> running 1 test
  301. 48.95 s gammaloop-nextest-core> test graph::feynman_graph::tests::native_thermal_distributions ... FAILED
  302. 48.95 s gammaloop-nextest-core>
  303. 48.95 s gammaloop-nextest-core> failures:
  304. 48.95 s gammaloop-nextest-core>
  305. 48.95 s gammaloop-nextest-core> failures:
  306. 48.95 s gammaloop-nextest-core> graph::feynman_graph::tests::native_thermal_distributions
  307. 48.95 s gammaloop-nextest-core>
  308. 48.95 s gammaloop-nextest-core> test result: FAILED. 0 passed; 1 failed; 0 ignored; 0 measured; 737 filtered out; finished in 0.79s
  309. 48.95 s gammaloop-nextest-core> system-err
  310. 48.95 s gammaloop-nextest-core> The application panicked (crashed).
  311. 48.95 s gammaloop-nextest-core> Message: called `Result::unwrap()` on an `Err` value: Custom { kind: Other, error: "Could not compile code: g++ -shared -O3 -fPIC -ffast-math -funsafe-math-optimizations -march=native -o /build/gammaloop-native-thermal-1603/thermal_0_0.so /build/gammaloop-native-thermal-1603/thermal_0_0.cpp\nwarning: Skipping impure flag -march=native because NIX_ENFORCE_NO_NATIVE is set\n/build/gammaloop-native-thermal-1603/thermal_0_0.cpp: In function 'void thermal_realf64(const double*, double*, double*)':\n/build/gammaloop-native-thermal-1603/thermal_0_0.cpp:27:16: error: 'symbolica_tanh' was not declared in this scope\n 27 | Z[6] = symbolica_tanh(Z[6]);\n | ^~~~~~~~~~~~~~\n" }
  312. 48.95 s gammaloop-nextest-core> Location: crates/gammalooprs/src/graph/feynman_graph.rs:1165
  313. 48.95 s gammaloop-nextest-core>
  314. 48.95 s gammaloop-nextest-core> ━━━━━━━━━━━━━━━━━━━━━━━━━━━━━━━━━━ BACKTRACE ━━━━━━━━━━━━━━━━━━━━━━━━━━━━━━━━━━━
  315. 48.95 s gammaloop-nextest-core> 1: <color_eyre[51793ea62743adbd]::config::PanicHook>::panic_report<unknown>
  316. 48.95 s gammaloop-nextest-core> at <unknown source file>:<unknown line>
  317. 48.95 s gammaloop-nextest-core> 2: <color_eyre[51793ea62743adbd]::config::PanicHook>::into_panic_hook::{closure#0}<unknown>
  318. 48.95 s gammaloop-nextest-core> at <unknown source file>:<unknown line>
  319. 48.95 s gammaloop-nextest-core> 3: std[bcb96dfbba0ab899]::panicking::panic_with_hook<unknown>
  320. 48.95 s gammaloop-nextest-core> at <unknown source file>:<unknown line>
  321. 48.95 s gammaloop-nextest-core> 4: std[bcb96dfbba0ab899]::panicking::panic_handler::{closure#0}<unknown>
  322. 48.95 s gammaloop-nextest-core> at <unknown source file>:<unknown line>
  323. 48.95 s gammaloop-nextest-core> 5: std[bcb96dfbba0ab899]::sys::backtrace::__rust_end_short_backtrace::<std[bcb96dfbba0ab899]::panicking::panic_handler::{closure#0}, !><unknown>
  324. 48.95 s gammaloop-nextest-core> at <unknown source file>:<unknown line>
  325. 48.95 s gammaloop-nextest-core> 6: __rustc[6c289b9f9c454d21]::rust_begin_unwind<unknown>
  326. 48.95 s gammaloop-nextest-core> at <unknown source file>:<unknown line>
  327. 48.95 s gammaloop-nextest-core> 7: core[940e698046960fd5]::panicking::panic_fmt<unknown>
  328. 48.95 s gammaloop-nextest-core> at <unknown source file>:<unknown line>
  329. 48.95 s gammaloop-nextest-core> 8: core[940e698046960fd5]::result::unwrap_failed<unknown>
  330. 48.95 s gammaloop-nextest-core> at <unknown source file>:<unknown line>
  331. 48.95 s gammaloop-nextest-core> 9: gammalooprs[e90c332ffd68fb1e]::graph::feynman_graph::tests::native_thermal_distributions<unknown>
  332. 48.95 s gammaloop-nextest-core> at <unknown source file>:<unknown line>
  333. 48.95 s gammaloop-nextest-core> 10: <gammalooprs[e90c332ffd68fb1e]::graph::feynman_graph::tests::native_thermal_distributions::{closure#0} as core[940e698046960fd5]::ops::function::FnOnce<()>>::call_once<unknown>
  334. 48.95 s gammaloop-nextest-core> at <unknown source file>:<unknown line>
  335. 48.95 s gammaloop-nextest-core> 11: test[75d6903177b1d7e9]::__rust_begin_short_backtrace::<core[940e698046960fd5]::result::Result<(), alloc[2ea6bcb46fca0c42]::string::String>, fn() -> core[940e698046960fd5]::result::Result<(), alloc[2ea6bcb46fca0c42]::string::String>><unknown>
  336. 48.95 s gammaloop-nextest-core> at <unknown source file>:<unknown line>
  337. 48.95 s gammaloop-nextest-core> 12: test[75d6903177b1d7e9]::run_test::{closure#0}<unknown>
  338. 48.95 s gammaloop-nextest-core> at <unknown source file>:<unknown line>
  339. 48.95 s gammaloop-nextest-core> 13: std[bcb96dfbba0ab899]::sys::backtrace::__rust_begin_short_backtrace::<test[75d6903177b1d7e9]::run_test::{closure#1}, ()><unknown>
  340. 48.95 s gammaloop-nextest-core> at <unknown source file>:<unknown line>
  341. 48.95 s gammaloop-nextest-core> 14: <std[bcb96dfbba0ab899]::thread::lifecycle::spawn_unchecked<test[75d6903177b1d7e9]::run_test::{closure#1}, ()>::{closure#1} as core[940e698046960fd5]::ops::function::FnOnce<()>>::call_once::{shim:vtable#0}<unknown>
  342. 48.95 s gammaloop-nextest-core> at <unknown source file>:<unknown line>
  343. 48.95 s gammaloop-nextest-core> 15: <std[bcb96dfbba0ab899]::sys::thread::unix::Thread>::new::thread_start<unknown>
  344. 48.95 s gammaloop-nextest-core> at <unknown source file>:<unknown line>
  345. 48.95 s gammaloop-nextest-core> 16: start_thread<unknown>
  346. 48.95 s gammaloop-nextest-core> at <unknown source file>:<unknown line>
  347. 48.95 s gammaloop-nextest-core> 17: __clone3<unknown>
  348. 48.95 s gammaloop-nextest-core> at <unknown source file>:<unknown line>
  349. 48.95 s gammaloop-nextest-core>
  350. 48.95 s gammaloop-nextest-core> Run with COLORBT_SHOW_HIDDEN=1 environment variable to disable frame filtering.
  351. 48.95 s gammaloop-nextest-core> Run with RUST_BACKTRACE=full to include source snippets.
  352. 48.95 s gammaloop-nextest-core>
  353. 48.95 s gammaloop-nextest-core> 2. gammalooprs::integrands::process::param_builder::tests::thermal_tanh_remains_finite_at_uv_scales_and_preserves_derivatives
  354. 48.95 s gammaloop-nextest-core> failure: test failure with exit code 101
  355. 48.95 s gammaloop-nextest-core> system-out
  356. 48.95 s gammaloop-nextest-core> running 1 test
  357. 48.95 s gammaloop-nextest-core> test integrands::process::param_builder::tests::thermal_tanh_remains_finite_at_uv_scales_and_preserves_derivatives ... FAILED
  358. 48.95 s gammaloop-nextest-core>
  359. 48.95 s gammaloop-nextest-core> failures:
  360. 48.95 s gammaloop-nextest-core>
  361. 48.95 s gammaloop-nextest-core> failures:
  362. 48.95 s gammaloop-nextest-core> integrands::process::param_builder::tests::thermal_tanh_remains_finite_at_uv_scales_and_preserves_derivatives
  363. 48.95 s gammaloop-nextest-core>
  364. 48.95 s gammaloop-nextest-core> test result: FAILED. 0 passed; 1 failed; 0 ignored; 0 measured; 737 filtered out; finished in 0.08s
  365. 48.95 s gammaloop-nextest-core> system-err
  366. 48.95 s gammaloop-nextest-core> The application panicked (crashed).
  367. 48.95 s gammaloop-nextest-core> Message: called `Result::unwrap()` on an `Err` value: "To vectorize the function 'symbolica::tanh', the symbol 'symbolica::tanh_v' must be defined that takes the vector index as an additional tag"
  368. 48.95 s gammaloop-nextest-core> Location: crates/gammalooprs/src/integrands/process/param_builder.rs:1958
  369. 48.95 s gammaloop-nextest-core>
  370. 48.95 s gammaloop-nextest-core> ━━━━━━━━━━━━━━━━━━━━━━━━━━━━━━━━━━ BACKTRACE ━━━━━━━━━━━━━━━━━━━━━━━━━━━━━━━━━━━
  371. 48.95 s gammaloop-nextest-core> 1: <color_eyre[51793ea62743adbd]::config::PanicHook>::panic_report<unknown>
  372. 48.95 s gammaloop-nextest-core> at <unknown source file>:<unknown line>
  373. 48.95 s gammaloop-nextest-core> 2: <color_eyre[51793ea62743adbd]::config::PanicHook>::into_panic_hook::{closure#0}<unknown>
  374. 48.95 s gammaloop-nextest-core> at <unknown source file>:<unknown line>
  375. 48.95 s gammaloop-nextest-core> 3: std[bcb96dfbba0ab899]::panicking::panic_with_hook<unknown>
  376. 48.95 s gammaloop-nextest-core> at <unknown source file>:<unknown line>
  377. 48.95 s gammaloop-nextest-core> 4: std[bcb96dfbba0ab899]::panicking::panic_handler::{closure#0}<unknown>
  378. 48.95 s gammaloop-nextest-core> at <unknown source file>:<unknown line>
  379. 48.95 s gammaloop-nextest-core> 5: std[bcb96dfbba0ab899]::sys::backtrace::__rust_end_short_backtrace::<std[bcb96dfbba0ab899]::panicking::panic_handler::{closure#0}, !><unknown>
  380. 48.95 s gammaloop-nextest-core> at <unknown source file>:<unknown line>
  381. 48.95 s gammaloop-nextest-core> 6: __rustc[6c289b9f9c454d21]::rust_begin_unwind<unknown>
  382. 48.95 s gammaloop-nextest-core> at <unknown source file>:<unknown line>
  383. 48.95 s gammaloop-nextest-core> 7: core[940e698046960fd5]::panicking::panic_fmt<unknown>
  384. 48.95 s gammaloop-nextest-core> at <unknown source file>:<unknown line>
  385. 48.95 s gammaloop-nextest-core> 8: core[940e698046960fd5]::result::unwrap_failed<unknown>
  386. 48.95 s gammaloop-nextest-core> at <unknown source file>:<unknown line>
  387. 48.95 s gammaloop-nextest-core> 9: gammalooprs[e90c332ffd68fb1e]::integrands::process::param_builder::tests::thermal_tanh_remains_finite_at_uv_scales_and_preserves_derivatives<unknown>
  388. 48.95 s gammaloop-nextest-core> at <unknown source file>:<unknown line>
  389. 48.95 s gammaloop-nextest-core> 10: <gammalooprs[e90c332ffd68fb1e]::integrands::process::param_builder::tests::thermal_tanh_remains_finite_at_uv_scales_and_preserves_derivatives::{closure#0} as core[940e698046960fd5]::ops::function::FnOnce<()>>::call_once<unknown>
  390. 48.95 s gammaloop-nextest-core> at <unknown source file>:<unknown line>
  391. 48.95 s gammaloop-nextest-core> 11: test[75d6903177b1d7e9]::__rust_begin_short_backtrace::<core[940e698046960fd5]::result::Result<(), alloc[2ea6bcb46fca0c42]::string::String>, fn() -> core[940e698046960fd5]::result::Result<(), alloc[2ea6bcb46fca0c42]::string::String>><unknown>
  392. 48.95 s gammaloop-nextest-core> at <unknown source file>:<unknown line>
  393. 48.95 s gammaloop-nextest-core> 12: test[75d6903177b1d7e9]::run_test::{closure#0}<unknown>
  394. 48.95 s gammaloop-nextest-core> at <unknown source file>:<unknown line>
  395. 48.95 s gammaloop-nextest-core> 13: std[bcb96dfbba0ab899]::sys::backtrace::__rust_begin_short_backtrace::<test[75d6903177b1d7e9]::run_test::{closure#1}, ()><unknown>
  396. 48.95 s gammaloop-nextest-core> at <unknown source file>:<unknown line>
  397. 48.95 s gammaloop-nextest-core> 14: <std[bcb96dfbba0ab899]::thread::lifecycle::spawn_unchecked<test[75d6903177b1d7e9]::run_test::{closure#1}, ()>::{closure#1} as core[940e698046960fd5]::ops::function::FnOnce<()>>::call_once::{shim:vtable#0}<unknown>
  398. 48.95 s gammaloop-nextest-core> at <unknown source file>:<unknown line>
  399. 48.95 s gammaloop-nextest-core> 15: <std[bcb96dfbba0ab899]::sys::thread::unix::Thread>::new::thread_start<unknown>
  400. 48.95 s gammaloop-nextest-core> at <unknown source file>:<unknown line>
  401. 48.95 s gammaloop-nextest-core> 16: start_thread<unknown>
  402. 48.95 s gammaloop-nextest-core> at <unknown source file>:<unknown line>
  403. 48.95 s gammaloop-nextest-core> 17: __clone3<unknown>
  404. 48.95 s gammaloop-nextest-core> at <unknown source file>:<unknown line>
  405. 48.95 s gammaloop-nextest-core>
  406. 48.95 s gammaloop-nextest-core> Run with COLORBT_SHOW_HIDDEN=1 environment variable to disable frame filtering.
  407. 48.95 s gammaloop-nextest-core> Run with RUST_BACKTRACE=full to include source snippets.
  408. 48.95 s gammaloop-nextest-core> =========================================
  409. 48.97 s gammaloop-nextest-core> Extracting 1 binary, 1 build script output directory, and 1 linked path to /build/nextest-archive-kEGVd2
  410. 49.04 s gammaloop-nextest-core> Extracted 7 files to /build/nextest-archive-kEGVd2 in 0.07s
  411. 49.05 s gammaloop-nextest-core> ------------
  412. 49.05 s gammaloop-nextest-core> Nextest run ID 749f7af3-c198-4791-9ca3-fa880bb6bcf0 with nextest profile: ci_gammaloop
  413. 49.05 s gammaloop-nextest-core> Starting 136 tests across 1 binary
  414. 66.82 s gammaloop-nextest-core> ------------
  415. 66.82 s gammaloop-nextest-core> Summary [ 17.766s] 136 tests run: 136 passed, 0 skipped
  416. 66.89 s gammaloop-nextest-core>
  417. 66.89 s gammaloop-nextest-core> ========== nextest test summary ==========
  418. 66.89 s gammaloop-nextest-core> report: target/nextest/ci_gammaloop/junit.xml
  419. 66.89 s gammaloop-nextest-core> tests: 136, failures: 0, errors: 0
  420. 66.89 s gammaloop-nextest-core> No failing testcases found.
  421. 66.89 s gammaloop-nextest-core> =========================================
  422. 66.96 s [0 built (1 failed)]error: Cannot build '/nix/store/bz3ms1n5n6isd5x84wsdypx5bbhzhv0k-gammaloop-nextest-core.drv'.
  423. 66.96 s Reason: builder failed with exit code 100.
  424. 66.96 s Output paths:
  425. 66.96 s /nix/store/ylbfr4kniksirnd140mwk1hz1dnr11lb-gammaloop-nextest-core
  426. 66.96 s Last 405 log lines:
  427. 66.96 s > Extracting 4 binaries (including 1 non-test binary), 1 build script output directory, and 2 linked paths to /build/nextest-archive-QwwD9J
  428. 66.96 s > Extracted 20 files to /build/nextest-archive-QwwD9J in 1.09s
  429. 66.96 s > ------------
  430. 66.96 s > Nextest run ID 89fb0d2f-3b75-4dfc-a923-9a7f10936857 with nextest profile: ci_gammaloop
  431. 66.96 s > Starting 380 tests across 3 binaries
  432. 66.96 s > ------------
  433. 66.96 s > Summary [ 1.493s] 380 tests run: 380 passed, 0 skipped
  434. 66.96 s >
  435. 66.96 s > ========== nextest test summary ==========
  436. 66.96 s > report: target/nextest/ci_gammaloop/junit.xml
  437. 66.96 s > tests: 380, failures: 0, errors: 0
  438. 66.96 s > No failing testcases found.
  439. 66.96 s > =========================================
  440. 66.96 s > Extracting 1 binary and 1 linked path to /build/nextest-archive-d1v52l
  441. 66.96 s > Extracted 7 files to /build/nextest-archive-d1v52l in 0.08s
  442. 66.96 s > ------------
  443. 66.96 s > Nextest run ID 2955db53-9120-4e66-bb2d-c6ae737947a1 with nextest profile: ci_gammaloop
  444. 66.96 s > Starting 19 tests across 1 binary
  445. 66.96 s > ------------
  446. 66.96 s > Summary [ 0.015s] 19 tests run: 19 passed, 0 skipped
  447. 66.96 s >
  448. 66.96 s > ========== nextest test summary ==========
  449. 66.96 s > report: target/nextest/ci_gammaloop/junit.xml
  450. 66.96 s > tests: 19, failures: 0, errors: 0
  451. 66.96 s > No failing testcases found.
  452. 66.96 s > =========================================
  453. 66.96 s > Extracting 1 binary to /build/nextest-archive-96YFlK
  454. 66.96 s > Extracted 4 files to /build/nextest-archive-96YFlK in 0.04s
  455. 66.96 s > ------------
  456. 66.96 s > Nextest run ID 35d7274f-d676-43dd-a92f-c3bd9c61eae8 with nextest profile: ci_gammaloop
  457. 66.96 s > Starting 0 tests across 1 binary
  458. 66.96 s > ------------
  459. 66.96 s > Summary [ 0.000s] 0 tests run: 0 passed, 0 skipped
  460. 66.96 s >
  461. 66.96 s > ========== nextest test summary ==========
  462. 66.96 s > report: target/nextest/ci_gammaloop/junit.xml
  463. 66.96 s > tests: 0, failures: 0, errors: 0
  464. 66.96 s > No failing testcases found.
  465. 66.96 s > =========================================
  466. 66.96 s > Extracting 4 binaries, 1 build script output directory, and 2 linked paths to /build/nextest-archive-c9FlCu
  467. 66.96 s > Extracted 18 files to /build/nextest-archive-c9FlCu in 0.61s
  468. 66.96 s > ------------
  469. 66.96 s > Nextest run ID c95d6f45-b5a6-47ec-abdc-5044741c355a with nextest profile: ci_gammaloop
  470. 66.96 s > Starting 687 tests across 4 binaries (60 tests skipped, including 59 tests via profile.ci_gammaloop.default-filter)
  471. 66.96 s > FAIL [ 0.811s] (191/687) gammalooprs graph::feynman_graph::tests::native_thermal_distributions
  472. 66.96 s > stdout ---
  473. 66.96 s >
  474. 66.96 s > running 1 test
  475. 66.96 s > test graph::feynman_graph::tests::native_thermal_distributions ... FAILED
  476. 66.96 s >
  477. 66.96 s > failures:
  478. 66.96 s >
  479. 66.96 s > failures:
  480. 66.96 s > graph::feynman_graph::tests::native_thermal_distributions
  481. 66.96 s >
  482. 66.96 s > test result: FAILED. 0 passed; 1 failed; 0 ignored; 0 measured; 737 filtered out; finished in 0.79s
  483. 66.96 s >
  484. 66.96 s > stderr ---
  485. 66.96 s > The application panicked (crashed).
  486. 66.96 s > Message: called `Result::unwrap()` on an `Err` value: Custom { kind: Other, error: "Could not compile code: g++ -shared -O3 -fPIC -ffast-math -funsafe-math-optimizations -march=native -o /build/gammaloop-native-thermal-1603/thermal_0_0.so /build/gammaloop-native-thermal-1603/thermal_0_0.cpp\nwarning: Skipping impure flag -march=native because NIX_ENFORCE_NO_NATIVE is set\n/build/gammaloop-native-thermal-1603/thermal_0_0.cpp: In function 'void thermal_realf64(const double*, double*, double*)':\n/build/gammaloop-native-thermal-1603/thermal_0_0.cpp:27:16: error: 'symbolica_tanh' was not declared in this scope\n 27 | Z[6] = symbolica_tanh(Z[6]);\n | ^~~~~~~~~~~~~~\n" }
  487. 66.96 s > Location: crates/gammalooprs/src/graph/feynman_graph.rs:1165
  488. 66.96 s >
  489. 66.96 s > ━━━━━━━━━━━━━━━━━━━━━━━━━━━━━━━━━━ BACKTRACE ━━━━━━━━━━━━━━━━━━━━━━━━━━━━━━━━━━━
  490. 66.96 s > 1: <color_eyre[51793ea62743adbd]::config::PanicHook>::panic_report<unknown>
  491. 66.96 s > at <unknown source file>:<unknown line>
  492. 66.96 s > 2: <color_eyre[51793ea62743adbd]::config::PanicHook>::into_panic_hook::{closure#0}<unknown>
  493. 66.96 s > at <unknown source file>:<unknown line>
  494. 66.96 s > 3: std[bcb96dfbba0ab899]::panicking::panic_with_hook<unknown>
  495. 66.96 s > at <unknown source file>:<unknown line>
  496. 66.96 s > 4: std[bcb96dfbba0ab899]::panicking::panic_handler::{closure#0}<unknown>
  497. 66.96 s > at <unknown source file>:<unknown line>
  498. 66.96 s > 5: std[bcb96dfbba0ab899]::sys::backtrace::__rust_end_short_backtrace::<std[bcb96dfbba0ab899]::panicking::panic_handler::{closure#0}, !><unknown>
  499. 66.96 s > at <unknown source file>:<unknown line>
  500. 66.96 s > 6: __rustc[6c289b9f9c454d21]::rust_begin_unwind<unknown>
  501. 66.96 s > at <unknown source file>:<unknown line>
  502. 66.96 s > 7: core[940e698046960fd5]::panicking::panic_fmt<unknown>
  503. 66.96 s > at <unknown source file>:<unknown line>
  504. 66.96 s > 8: core[940e698046960fd5]::result::unwrap_failed<unknown>
  505. 66.96 s > at <unknown source file>:<unknown line>
  506. 66.96 s > 9: gammalooprs[e90c332ffd68fb1e]::graph::feynman_graph::tests::native_thermal_distributions<unknown>
  507. 66.96 s > at <unknown source file>:<unknown line>
  508. 66.96 s > 10: <gammalooprs[e90c332ffd68fb1e]::graph::feynman_graph::tests::native_thermal_distributions::{closure#0} as core[940e698046960fd5]::ops::function::FnOnce<()>>::call_once<unknown>
  509. 66.96 s > at <unknown source file>:<unknown line>
  510. 66.96 s > 11: test[75d6903177b1d7e9]::__rust_begin_short_backtrace::<core[940e698046960fd5]::result::Result<(), alloc[2ea6bcb46fca0c42]::string::String>, fn() -> core[940e698046960fd5]::result::Result<(), alloc[2ea6bcb46fca0c42]::string::String>><unknown>
  511. 66.96 s > at <unknown source file>:<unknown line>
  512. 66.96 s > 12: test[75d6903177b1d7e9]::run_test::{closure#0}<unknown>
  513. 66.96 s > at <unknown source file>:<unknown line>
  514. 66.96 s > 13: std[bcb96dfbba0ab899]::sys::backtrace::__rust_begin_short_backtrace::<test[75d6903177b1d7e9]::run_test::{closure#1}, ()><unknown>
  515. 66.96 s > at <unknown source file>:<unknown line>
  516. 66.96 s > 14: <std[bcb96dfbba0ab899]::thread::lifecycle::spawn_unchecked<test[75d6903177b1d7e9]::run_test::{closure#1}, ()>::{closure#1} as core[940e698046960fd5]::ops::function::FnOnce<()>>::call_once::{shim:vtable#0}<unknown>
  517. 66.96 s > at <unknown source file>:<unknown line>
  518. 66.96 s > 15: <std[bcb96dfbba0ab899]::sys::thread::unix::Thread>::new::thread_start<unknown>
  519. 66.96 s > at <unknown source file>:<unknown line>
  520. 66.96 s > 16: start_thread<unknown>
  521. 66.96 s > at <unknown source file>:<unknown line>
  522. 66.96 s > 17: __clone3<unknown>
  523. 66.96 s > at <unknown source file>:<unknown line>
  524. 66.96 s >
  525. 66.96 s > Run with COLORBT_SHOW_HIDDEN=1 environment variable to disable frame filtering.
  526. 66.96 s > Run with RUST_BACKTRACE=full to include source snippets.
  527. 66.96 s >
  528. 66.96 s > FAIL [ 0.095s] (243/687) gammalooprs integrands::process::param_builder::tests::thermal_tanh_remains_finite_at_uv_scales_and_preserves_derivatives
  529. 66.96 s > stdout ---
  530. 66.96 s >
  531. 66.96 s > running 1 test
  532. 66.96 s > test integrands::process::param_builder::tests::thermal_tanh_remains_finite_at_uv_scales_and_preserves_derivatives ... FAILED
  533. 66.96 s >
  534. 66.96 s > failures:
  535. 66.96 s >
  536. 66.96 s > failures:
  537. 66.96 s > integrands::process::param_builder::tests::thermal_tanh_remains_finite_at_uv_scales_and_preserves_derivatives
  538. 66.96 s >
  539. 66.96 s > test result: FAILED. 0 passed; 1 failed; 0 ignored; 0 measured; 737 filtered out; finished in 0.08s
  540. 66.96 s >
  541. 66.96 s > stderr ---
  542. 66.96 s > The application panicked (crashed).
  543. 66.96 s > Message: called `Result::unwrap()` on an `Err` value: "To vectorize the function 'symbolica::tanh', the symbol 'symbolica::tanh_v' must be defined that takes the vector index as an additional tag"
  544. 66.96 s > Location: crates/gammalooprs/src/integrands/process/param_builder.rs:1958
  545. 66.96 s >
  546. 66.96 s > ━━━━━━━━━━━━━━━━━━━━━━━━━━━━━━━━━━ BACKTRACE ━━━━━━━━━━━━━━━━━━━━━━━━━━━━━━━━━━━
  547. 66.96 s > 1: <color_eyre[51793ea62743adbd]::config::PanicHook>::panic_report<unknown>
  548. 66.96 s > at <unknown source file>:<unknown line>
  549. 66.96 s > 2: <color_eyre[51793ea62743adbd]::config::PanicHook>::into_panic_hook::{closure#0}<unknown>
  550. 66.96 s > at <unknown source file>:<unknown line>
  551. 66.96 s > 3: std[bcb96dfbba0ab899]::panicking::panic_with_hook<unknown>
  552. 66.96 s > at <unknown source file>:<unknown line>
  553. 66.96 s > 4: std[bcb96dfbba0ab899]::panicking::panic_handler::{closure#0}<unknown>
  554. 66.96 s > at <unknown source file>:<unknown line>
  555. 66.96 s > 5: std[bcb96dfbba0ab899]::sys::backtrace::__rust_end_short_backtrace::<std[bcb96dfbba0ab899]::panicking::panic_handler::{closure#0}, !><unknown>
  556. 66.96 s > at <unknown source file>:<unknown line>
  557. 66.96 s > 6: __rustc[6c289b9f9c454d21]::rust_begin_unwind<unknown>
  558. 66.96 s > at <unknown source file>:<unknown line>
  559. 66.96 s > 7: core[940e698046960fd5]::panicking::panic_fmt<unknown>
  560. 66.96 s > at <unknown source file>:<unknown line>
  561. 66.96 s > 8: core[940e698046960fd5]::result::unwrap_failed<unknown>
  562. 66.96 s > at <unknown source file>:<unknown line>
  563. 66.96 s > 9: gammalooprs[e90c332ffd68fb1e]::integrands::process::param_builder::tests::thermal_tanh_remains_finite_at_uv_scales_and_preserves_derivatives<unknown>
  564. 66.96 s > at <unknown source file>:<unknown line>
  565. 66.96 s > 10: <gammalooprs[e90c332ffd68fb1e]::integrands::process::param_builder::tests::thermal_tanh_remains_finite_at_uv_scales_and_preserves_derivatives::{closure#0} as core[940e698046960fd5]::ops::function::FnOnce<()>>::call_once<unknown>
  566. 66.96 s > at <unknown source file>:<unknown line>
  567. 66.96 s > 11: test[75d6903177b1d7e9]::__rust_begin_short_backtrace::<core[940e698046960fd5]::result::Result<(), alloc[2ea6bcb46fca0c42]::string::String>, fn() -> core[940e698046960fd5]::result::Result<(), alloc[2ea6bcb46fca0c42]::string::String>><unknown>
  568. 66.96 s > at <unknown source file>:<unknown line>
  569. 66.96 s > 12: test[75d6903177b1d7e9]::run_test::{closure#0}<unknown>
  570. 66.96 s > at <unknown source file>:<unknown line>
  571. 66.96 s > 13: std[bcb96dfbba0ab899]::sys::backtrace::__rust_begin_short_backtrace::<test[75d6903177b1d7e9]::run_test::{closure#1}, ()><unknown>
  572. 66.96 s > at <unknown source file>:<unknown line>
  573. 66.96 s > 14: <std[bcb96dfbba0ab899]::thread::lifecycle::spawn_unchecked<test[75d6903177b1d7e9]::run_test::{closure#1}, ()>::{closure#1} as core[940e698046960fd5]::ops::function::FnOnce<()>>::call_once::{shim:vtable#0}<unknown>
  574. 66.96 s > at <unknown source file>:<unknown line>
  575. 66.96 s > 15: <std[bcb96dfbba0ab899]::sys::thread::unix::Thread>::new::thread_start<unknown>
  576. 66.96 s > at <unknown source file>:<unknown line>
  577. 66.96 s > 16: start_thread<unknown>
  578. 66.96 s > at <unknown source file>:<unknown line>
  579. 66.96 s > 17: __clone3<unknown>
  580. 66.96 s > at <unknown source file>:<unknown line>
  581. 66.96 s >
  582. 66.96 s > Run with COLORBT_SHOW_HIDDEN=1 environment variable to disable frame filtering.
  583. 66.96 s > Run with RUST_BACKTRACE=full to include source snippets.
  584. 66.96 s >
  585. 66.96 s > ------------
  586. 66.96 s > Summary [ 15.932s] 687 tests run: 685 passed, 2 failed, 60 skipped
  587. 66.96 s > FAIL [ 0.811s] (191/687) gammalooprs graph::feynman_graph::tests::native_thermal_distributions
  588. 66.96 s > stdout ---
  589. 66.96 s >
  590. 66.96 s > running 1 test
  591. 66.96 s > test graph::feynman_graph::tests::native_thermal_distributions ... FAILED
  592. 66.96 s >
  593. 66.96 s > failures:
  594. 66.96 s >
  595. 66.96 s > failures:
  596. 66.96 s > graph::feynman_graph::tests::native_thermal_distributions
  597. 66.96 s >
  598. 66.96 s > test result: FAILED. 0 passed; 1 failed; 0 ignored; 0 measured; 737 filtered out; finished in 0.79s
  599. 66.96 s >
  600. 66.96 s > stderr ---
  601. 66.96 s > The application panicked (crashed).
  602. 66.96 s > Message: called `Result::unwrap()` on an `Err` value: Custom { kind: Other, error: "Could not compile code: g++ -shared -O3 -fPIC -ffast-math -funsafe-math-optimizations -march=native -o /build/gammaloop-native-thermal-1603/thermal_0_0.so /build/gammaloop-native-thermal-1603/thermal_0_0.cpp\nwarning: Skipping impure flag -march=native because NIX_ENFORCE_NO_NATIVE is set\n/build/gammaloop-native-thermal-1603/thermal_0_0.cpp: In function 'void thermal_realf64(const double*, double*, double*)':\n/build/gammaloop-native-thermal-1603/thermal_0_0.cpp:27:16: error: 'symbolica_tanh' was not declared in this scope\n 27 | Z[6] = symbolica_tanh(Z[6]);\n | ^~~~~~~~~~~~~~\n" }
  603. 66.96 s > Location: crates/gammalooprs/src/graph/feynman_graph.rs:1165
  604. 66.96 s >
  605. 66.96 s > ━━━━━━━━━━━━━━━━━━━━━━━━━━━━━━━━━━ BACKTRACE ━━━━━━━━━━━━━━━━━━━━━━━━━━━━━━━━━━━
  606. 66.96 s > 1: <color_eyre[51793ea62743adbd]::config::PanicHook>::panic_report<unknown>
  607. 66.96 s > at <unknown source file>:<unknown line>
  608. 66.96 s > 2: <color_eyre[51793ea62743adbd]::config::PanicHook>::into_panic_hook::{closure#0}<unknown>
  609. 66.96 s > at <unknown source file>:<unknown line>
  610. 66.96 s > 3: std[bcb96dfbba0ab899]::panicking::panic_with_hook<unknown>
  611. 66.96 s > at <unknown source file>:<unknown line>
  612. 66.96 s > 4: std[bcb96dfbba0ab899]::panicking::panic_handler::{closure#0}<unknown>
  613. 66.96 s > at <unknown source file>:<unknown line>
  614. 66.96 s > 5: std[bcb96dfbba0ab899]::sys::backtrace::__rust_end_short_backtrace::<std[bcb96dfbba0ab899]::panicking::panic_handler::{closure#0}, !><unknown>
  615. 66.96 s > at <unknown source file>:<unknown line>
  616. 66.96 s > 6: __rustc[6c289b9f9c454d21]::rust_begin_unwind<unknown>
  617. 66.96 s > at <unknown source file>:<unknown line>
  618. 66.96 s > 7: core[940e698046960fd5]::panicking::panic_fmt<unknown>
  619. 66.96 s > at <unknown source file>:<unknown line>
  620. 66.96 s > 8: core[940e698046960fd5]::result::unwrap_failed<unknown>
  621. 66.96 s > at <unknown source file>:<unknown line>
  622. 66.96 s > 9: gammalooprs[e90c332ffd68fb1e]::graph::feynman_graph::tests::native_thermal_distributions<unknown>
  623. 66.96 s > at <unknown source file>:<unknown line>
  624. 66.96 s > 10: <gammalooprs[e90c332ffd68fb1e]::graph::feynman_graph::tests::native_thermal_distributions::{closure#0} as core[940e698046960fd5]::ops::function::FnOnce<()>>::call_once<unknown>
  625. 66.96 s > at <unknown source file>:<unknown line>
  626. 66.96 s > 11: test[75d6903177b1d7e9]::__rust_begin_short_backtrace::<core[940e698046960fd5]::result::Result<(), alloc[2ea6bcb46fca0c42]::string::String>, fn() -> core[940e698046960fd5]::result::Result<(), alloc[2ea6bcb46fca0c42]::string::String>><unknown>
  627. 66.96 s > at <unknown source file>:<unknown line>
  628. 66.96 s > 12: test[75d6903177b1d7e9]::run_test::{closure#0}<unknown>
  629. 66.96 s > at <unknown source file>:<unknown line>
  630. 66.96 s > 13: std[bcb96dfbba0ab899]::sys::backtrace::__rust_begin_short_backtrace::<test[75d6903177b1d7e9]::run_test::{closure#1}, ()><unknown>
  631. 66.96 s > at <unknown source file>:<unknown line>
  632. 66.96 s > 14: <std[bcb96dfbba0ab899]::thread::lifecycle::spawn_unchecked<test[75d6903177b1d7e9]::run_test::{closure#1}, ()>::{closure#1} as core[940e698046960fd5]::ops::function::FnOnce<()>>::call_once::{shim:vtable#0}<unknown>
  633. 66.96 s > at <unknown source file>:<unknown line>
  634. 66.96 s > 15: <std[bcb96dfbba0ab899]::sys::thread::unix::Thread>::new::thread_start<unknown>
  635. 66.96 s > at <unknown source file>:<unknown line>
  636. 66.96 s > 16: start_thread<unknown>
  637. 66.96 s > at <unknown source file>:<unknown line>
  638. 66.96 s > 17: __clone3<unknown>
  639. 66.96 s > at <unknown source file>:<unknown line>
  640. 66.96 s >
  641. 66.96 s > Run with COLORBT_SHOW_HIDDEN=1 environment variable to disable frame filtering.
  642. 66.96 s > Run with RUST_BACKTRACE=full to include source snippets.
  643. 66.96 s >
  644. 66.96 s > FAIL [ 0.095s] (243/687) gammalooprs integrands::process::param_builder::tests::thermal_tanh_remains_finite_at_uv_scales_and_preserves_derivatives
  645. 66.96 s > stdout ---
  646. 66.96 s >
  647. 66.96 s > running 1 test
  648. 66.96 s > test integrands::process::param_builder::tests::thermal_tanh_remains_finite_at_uv_scales_and_preserves_derivatives ... FAILED
  649. 66.96 s >
  650. 66.96 s > failures:
  651. 66.96 s >
  652. 66.96 s > failures:
  653. 66.96 s > integrands::process::param_builder::tests::thermal_tanh_remains_finite_at_uv_scales_and_preserves_derivatives
  654. 66.96 s >
  655. 66.96 s > test result: FAILED. 0 passed; 1 failed; 0 ignored; 0 measured; 737 filtered out; finished in 0.08s
  656. 66.96 s >
  657. 66.96 s > stderr ---
  658. 66.96 s > The application panicked (crashed).
  659. 66.96 s > Message: called `Result::unwrap()` on an `Err` value: "To vectorize the function 'symbolica::tanh', the symbol 'symbolica::tanh_v' must be defined that takes the vector index as an additional tag"
  660. 66.96 s > Location: crates/gammalooprs/src/integrands/process/param_builder.rs:1958
  661. 66.96 s >
  662. 66.96 s > ━━━━━━━━━━━━━━━━━━━━━━━━━━━━━━━━━━ BACKTRACE ━━━━━━━━━━━━━━━━━━━━━━━━━━━━━━━━━━━
  663. 66.96 s > 1: <color_eyre[51793ea62743adbd]::config::PanicHook>::panic_report<unknown>
  664. 66.96 s > at <unknown source file>:<unknown line>
  665. 66.96 s > 2: <color_eyre[51793ea62743adbd]::config::PanicHook>::into_panic_hook::{closure#0}<unknown>
  666. 66.96 s > at <unknown source file>:<unknown line>
  667. 66.96 s > 3: std[bcb96dfbba0ab899]::panicking::panic_with_hook<unknown>
  668. 66.96 s > at <unknown source file>:<unknown line>
  669. 66.96 s > 4: std[bcb96dfbba0ab899]::panicking::panic_handler::{closure#0}<unknown>
  670. 66.96 s > at <unknown source file>:<unknown line>
  671. 66.96 s > 5: std[bcb96dfbba0ab899]::sys::backtrace::__rust_end_short_backtrace::<std[bcb96dfbba0ab899]::panicking::panic_handler::{closure#0}, !><unknown>
  672. 66.96 s > at <unknown source file>:<unknown line>
  673. 66.96 s > 6: __rustc[6c289b9f9c454d21]::rust_begin_unwind<unknown>
  674. 66.96 s > at <unknown source file>:<unknown line>
  675. 66.96 s > 7: core[940e698046960fd5]::panicking::panic_fmt<unknown>
  676. 66.96 s > at <unknown source file>:<unknown line>
  677. 66.96 s > 8: core[940e698046960fd5]::result::unwrap_failed<unknown>
  678. 66.96 s > at <unknown source file>:<unknown line>
  679. 66.96 s > 9: gammalooprs[e90c332ffd68fb1e]::integrands::process::param_builder::tests::thermal_tanh_remains_finite_at_uv_scales_and_preserves_derivatives<unknown>
  680. 66.96 s > at <unknown source file>:<unknown line>
  681. 66.96 s > 10: <gammalooprs[e90c332ffd68fb1e]::integrands::process::param_builder::tests::thermal_tanh_remains_finite_at_uv_scales_and_preserves_derivatives::{closure#0} as core[940e698046960fd5]::ops::function::FnOnce<()>>::call_once<unknown>
  682. 66.96 s > at <unknown source file>:<unknown line>
  683. 66.96 s > 11: test[75d6903177b1d7e9]::__rust_begin_short_backtrace::<core[940e698046960fd5]::result::Result<(), alloc[2ea6bcb46fca0c42]::string::String>, fn() -> core[940e698046960fd5]::result::Result<(), alloc[2ea6bcb46fca0c42]::string::String>><unknown>
  684. 66.96 s > at <unknown source file>:<unknown line>
  685. 66.96 s > 12: test[75d6903177b1d7e9]::run_test::{closure#0}<unknown>
  686. 66.96 s > at <unknown source file>:<unknown line>
  687. 66.96 s > 13: std[bcb96dfbba0ab899]::sys::backtrace::__rust_begin_short_backtrace::<test[75d6903177b1d7e9]::run_test::{closure#1}, ()><unknown>
  688. 66.96 s > at <unknown source file>:<unknown line>
  689. 66.96 s > 14: <std[bcb96dfbba0ab899]::thread::lifecycle::spawn_unchecked<test[75d6903177b1d7e9]::run_test::{closure#1}, ()>::{closure#1} as core[940e698046960fd5]::ops::function::FnOnce<()>>::call_once::{shim:vtable#0}<unknown>
  690. 66.96 s > at <unknown source file>:<unknown line>
  691. 66.96 s > 15: <std[bcb96dfbba0ab899]::sys::thread::unix::Thread>::new::thread_start<unknown>
  692. 66.96 s > at <unknown source file>:<unknown line>
  693. 66.96 s > 16: start_thread<unknown>
  694. 66.96 s > at <unknown source file>:<unknown line>
  695. 66.96 s > 17: __clone3<unknown>
  696. 66.96 s > at <unknown source file>:<unknown line>
  697. 66.96 s >
  698. 66.96 s > Run with COLORBT_SHOW_HIDDEN=1 environment variable to disable frame filtering.
  699. 66.96 s > Run with RUST_BACKTRACE=full to include source snippets.
  700. 66.96 s >
  701. 66.96 s > error: test run failed
  702. 66.96 s >
  703. 66.96 s > ========== nextest test summary ==========
  704. 66.96 s > report: target/nextest/ci_gammaloop/junit.xml
  705. 66.96 s > tests: 687, failures: 2, errors: 0
  706. 66.96 s >
  707. 66.96 s > 1. gammalooprs::graph::feynman_graph::tests::native_thermal_distributions
  708. 66.96 s > failure: test failure with exit code 101
  709. 66.96 s > system-out
  710. 66.96 s > running 1 test
  711. 66.96 s > test graph::feynman_graph::tests::native_thermal_distributions ... FAILED
  712. 66.96 s >
  713. 66.96 s > failures:
  714. 66.96 s >
  715. 66.96 s > failures:
  716. 66.96 s > graph::feynman_graph::tests::native_thermal_distributions
  717. 66.96 s >
  718. 66.96 s > test result: FAILED. 0 passed; 1 failed; 0 ignored; 0 measured; 737 filtered out; finished in 0.79s
  719. 66.96 s > system-err
  720. 66.96 s > The application panicked (crashed).
  721. 66.96 s > Message: called `Result::unwrap()` on an `Err` value: Custom { kind: Other, error: "Could not compile code: g++ -shared -O3 -fPIC -ffast-math -funsafe-math-optimizations -march=native -o /build/gammaloop-native-thermal-1603/thermal_0_0.so /build/gammaloop-native-thermal-1603/thermal_0_0.cpp\nwarning: Skipping impure flag -march=native because NIX_ENFORCE_NO_NATIVE is set\n/build/gammaloop-native-thermal-1603/thermal_0_0.cpp: In function 'void thermal_realf64(const double*, double*, double*)':\n/build/gammaloop-native-thermal-1603/thermal_0_0.cpp:27:16: error: 'symbolica_tanh' was not declared in this scope\n 27 | Z[6] = symbolica_tanh(Z[6]);\n | ^~~~~~~~~~~~~~\n" }
  722. 66.96 s > Location: crates/gammalooprs/src/graph/feynman_graph.rs:1165
  723. 66.96 s >
  724. 66.96 s > ━━━━━━━━━━━━━━━━━━━━━━━━━━━━━━━━━━ BACKTRACE ━━━━━━━━━━━━━━━━━━━━━━━━━━━━━━━━━━━
  725. 66.96 s > 1: <color_eyre[51793ea62743adbd]::config::PanicHook>::panic_report<unknown>
  726. 66.96 s > at <unknown source file>:<unknown line>
  727. 66.96 s > 2: <color_eyre[51793ea62743adbd]::config::PanicHook>::into_panic_hook::{closure#0}<unknown>
  728. 66.96 s > at <unknown source file>:<unknown line>
  729. 66.96 s > 3: std[bcb96dfbba0ab899]::panicking::panic_with_hook<unknown>
  730. 66.96 s > at <unknown source file>:<unknown line>
  731. 66.96 s > 4: std[bcb96dfbba0ab899]::panicking::panic_handler::{closure#0}<unknown>
  732. 66.96 s > at <unknown source file>:<unknown line>
  733. 66.96 s > 5: std[bcb96dfbba0ab899]::sys::backtrace::__rust_end_short_backtrace::<std[bcb96dfbba0ab899]::panicking::panic_handler::{closure#0}, !><unknown>
  734. 66.96 s > at <unknown source file>:<unknown line>
  735. 66.96 s > 6: __rustc[6c289b9f9c454d21]::rust_begin_unwind<unknown>
  736. 66.96 s > at <unknown source file>:<unknown line>
  737. 66.96 s > 7: core[940e698046960fd5]::panicking::panic_fmt<unknown>
  738. 66.96 s > at <unknown source file>:<unknown line>
  739. 66.96 s > 8: core[940e698046960fd5]::result::unwrap_failed<unknown>
  740. 66.96 s > at <unknown source file>:<unknown line>
  741. 66.96 s > 9: gammalooprs[e90c332ffd68fb1e]::graph::feynman_graph::tests::native_thermal_distributions<unknown>
  742. 66.96 s > at <unknown source file>:<unknown line>
  743. 66.96 s > 10: <gammalooprs[e90c332ffd68fb1e]::graph::feynman_graph::tests::native_thermal_distributions::{closure#0} as core[940e698046960fd5]::ops::function::FnOnce<()>>::call_once<unknown>
  744. 66.96 s > at <unknown source file>:<unknown line>
  745. 66.96 s > 11: test[75d6903177b1d7e9]::__rust_begin_short_backtrace::<core[940e698046960fd5]::result::Result<(), alloc[2ea6bcb46fca0c42]::string::String>, fn() -> core[940e698046960fd5]::result::Result<(), alloc[2ea6bcb46fca0c42]::string::String>><unknown>
  746. 66.96 s > at <unknown source file>:<unknown line>
  747. 66.96 s > 12: test[75d6903177b1d7e9]::run_test::{closure#0}<unknown>
  748. 66.96 s > at <unknown source file>:<unknown line>
  749. 66.96 s > 13: std[bcb96dfbba0ab899]::sys::backtrace::__rust_begin_short_backtrace::<test[75d6903177b1d7e9]::run_test::{closure#1}, ()><unknown>
  750. 66.96 s > at <unknown source file>:<unknown line>
  751. 66.96 s > 14: <std[bcb96dfbba0ab899]::thread::lifecycle::spawn_unchecked<test[75d6903177b1d7e9]::run_test::{closure#1}, ()>::{closure#1} as core[940e698046960fd5]::ops::function::FnOnce<()>>::call_once::{shim:vtable#0}<unknown>
  752. 66.96 s > at <unknown source file>:<unknown line>
  753. 66.96 s > 15: <std[bcb96dfbba0ab899]::sys::thread::unix::Thread>::new::thread_start<unknown>
  754. 66.96 s > at <unknown source file>:<unknown line>
  755. 66.96 s > 16: start_thread<unknown>
  756. 66.96 s > at <unknown source file>:<unknown line>
  757. 66.96 s > 17: __clone3<unknown>
  758. 66.96 s > at <unknown source file>:<unknown line>
  759. 66.96 s >
  760. 66.96 s > Run with COLORBT_SHOW_HIDDEN=1 environment variable to disable frame filtering.
  761. 66.96 s > Run with RUST_BACKTRACE=full to include source snippets.
  762. 66.96 s >
  763. 66.96 s > 2. gammalooprs::integrands::process::param_builder::tests::thermal_tanh_remains_finite_at_uv_scales_and_preserves_derivatives
  764. 66.96 s > failure: test failure with exit code 101
  765. 66.96 s > system-out
  766. 66.96 s > running 1 test
  767. 66.96 s > test integrands::process::param_builder::tests::thermal_tanh_remains_finite_at_uv_scales_and_preserves_derivatives ... FAILED
  768. 66.96 s >
  769. 66.96 s > failures:
  770. 66.96 s >
  771. 66.96 s > failures:
  772. 66.96 s > integrands::process::param_builder::tests::thermal_tanh_remains_finite_at_uv_scales_and_preserves_derivatives
  773. 66.96 s >
  774. 66.96 s > test result: FAILED. 0 passed; 1 failed; 0 ignored; 0 measured; 737 filtered out; finished in 0.08s
  775. 66.96 s > system-err
  776. 66.96 s > The application panicked (crashed).
  777. 66.96 s > Message: called `Result::unwrap()` on an `Err` value: "To vectorize the function 'symbolica::tanh', the symbol 'symbolica::tanh_v' must be defined that takes the vector index as an additional tag"
  778. 66.96 s > Location: crates/gammalooprs/src/integrands/process/param_builder.rs:1958
  779. 66.96 s >
  780. 66.96 s > ━━━━━━━━━━━━━━━━━━━━━━━━━━━━━━━━━━ BACKTRACE ━━━━━━━━━━━━━━━━━━━━━━━━━━━━━━━━━━━
  781. 66.96 s > 1: <color_eyre[51793ea62743adbd]::config::PanicHook>::panic_report<unknown>
  782. 66.96 s > at <unknown source file>:<unknown line>
  783. 66.96 s > 2: <color_eyre[51793ea62743adbd]::config::PanicHook>::into_panic_hook::{closure#0}<unknown>
  784. 66.96 s > at <unknown source file>:<unknown line>
  785. 66.96 s > 3: std[bcb96dfbba0ab899]::panicking::panic_with_hook<unknown>
  786. 66.96 s > at <unknown source file>:<unknown line>
  787. 66.96 s > 4: std[bcb96dfbba0ab899]::panicking::panic_handler::{closure#0}<unknown>
  788. 66.96 s > at <unknown source file>:<unknown line>
  789. 66.96 s > 5: std[bcb96dfbba0ab899]::sys::backtrace::__rust_end_short_backtrace::<std[bcb96dfbba0ab899]::panicking::panic_handler::{closure#0}, !><unknown>
  790. 66.96 s > at <unknown source file>:<unknown line>
  791. 66.96 s > 6: __rustc[6c289b9f9c454d21]::rust_begin_unwind<unknown>
  792. 66.96 s > at <unknown source file>:<unknown line>
  793. 66.96 s > 7: core[940e698046960fd5]::panicking::panic_fmt<unknown>
  794. 66.96 s > at <unknown source file>:<unknown line>
  795. 66.96 s > 8: core[940e698046960fd5]::result::unwrap_failed<unknown>
  796. 66.96 s > at <unknown source file>:<unknown line>
  797. 66.96 s > 9: gammalooprs[e90c332ffd68fb1e]::integrands::process::param_builder::tests::thermal_tanh_remains_finite_at_uv_scales_and_preserves_derivatives<unknown>
  798. 66.96 s > at <unknown source file>:<unknown line>
  799. 66.96 s > 10: <gammalooprs[e90c332ffd68fb1e]::integrands::process::param_builder::tests::thermal_tanh_remains_finite_at_uv_scales_and_preserves_derivatives::{closure#0} as core[940e698046960fd5]::ops::function::FnOnce<()>>::call_once<unknown>
  800. 66.96 s > at <unknown source file>:<unknown line>
  801. 66.96 s > 11: test[75d6903177b1d7e9]::__rust_begin_short_backtrace::<core[940e698046960fd5]::result::Result<(), alloc[2ea6bcb46fca0c42]::string::String>, fn() -> core[940e698046960fd5]::result::Result<(), alloc[2ea6bcb46fca0c42]::string::String>><unknown>
  802. 66.96 s > at <unknown source file>:<unknown line>
  803. 66.96 s > 12: test[75d6903177b1d7e9]::run_test::{closure#0}<unknown>
  804. 66.96 s > at <unknown source file>:<unknown line>
  805. 66.96 s > 13: std[bcb96dfbba0ab899]::sys::backtrace::__rust_begin_short_backtrace::<test[75d6903177b1d7e9]::run_test::{closure#1}, ()><unknown>
  806. 66.96 s > at <unknown source file>:<unknown line>
  807. 66.96 s > 14: <std[bcb96dfbba0ab899]::thread::lifecycle::spawn_unchecked<test[75d6903177b1d7e9]::run_test::{closure#1}, ()>::{closure#1} as core[940e698046960fd5]::ops::function::FnOnce<()>>::call_once::{shim:vtable#0}<unknown>
  808. 66.96 s > at <unknown source file>:<unknown line>
  809. 66.96 s > 15: <std[bcb96dfbba0ab899]::sys::thread::unix::Thread>::new::thread_start<unknown>
  810. 66.96 s > at <unknown source file>:<unknown line>
  811. 66.96 s > 16: start_thread<unknown>
  812. 66.96 s > at <unknown source file>:<unknown line>
  813. 66.96 s > 17: __clone3<unknown>
  814. 66.96 s > at <unknown source file>:<unknown line>
  815. 66.96 s >
  816. 66.96 s > Run with COLORBT_SHOW_HIDDEN=1 environment variable to disable frame filtering.
  817. 66.96 s > Run with RUST_BACKTRACE=full to include source snippets.
  818. 66.96 s > =========================================
  819. 66.96 s > Extracting 1 binary, 1 build script output directory, and 1 linked path to /build/nextest-archive-kEGVd2
  820. 66.96 s > Extracted 7 files to /build/nextest-archive-kEGVd2 in 0.07s
  821. 66.96 s > ------------
  822. 66.96 s > Nextest run ID 749f7af3-c198-4791-9ca3-fa880bb6bcf0 with nextest profile: ci_gammaloop
  823. 66.96 s > Starting 136 tests across 1 binary
  824. 66.96 s > ------------
  825. 66.96 s > Summary [ 17.766s] 136 tests run: 136 passed, 0 skipped
  826. 66.96 s >
  827. 66.96 s > ========== nextest test summary ==========
  828. 66.96 s > report: target/nextest/ci_gammaloop/junit.xml
  829. 66.96 s > tests: 136, failures: 0, errors: 0
  830. 66.96 s > No failing testcases found.
  831. 66.96 s > =========================================
  832. 66.96 s For full logs, run:
  833. 66.96 s nix log /nix/store/bz3ms1n5n6isd5x84wsdypx5bbhzhv0k-gammaloop-nextest-core.drv
  834. 67.15 s Run failed.