1. 0.00 s $ /nix/store/9ypz3flqsrl5xl495mm8h645gadjsxi1-coreutils-9.11/bin/timeout --kill-after=15s 7200s /nix/store/23zk8sgzamrbmj1fday15szf7f2279s8-nix-2.34.7/bin/nix --extra-experimental-features nix-command --extra-experimental-features flakes flake clone git+https://github.com/alphal00p/gammaloop --dest /tmp/nix-ci-worker/stable-pwd/repo/
  2. 0.07 s Cloning into '/tmp/nix-ci-worker/stable-pwd/repo'...
  3. 1.81 s remote: Enumerating objects: 73803 remote: Enumerating objects: 83699, done.
  4. 1.93 s remote: Counting objects: 0% (1/9896) remote: Counting objects: 1% (99/9896) remote: Counting objects: 2% (198/9896) remote: Counting objects: 3% (297/9896) remote: Counting objects: 4% (396/9896) remote: Counting objects: 5% (495/9896) remote: Counting objects: 6% (594/9896) remote: Counting objects: 7% (693/9896) remote: Counting objects: 8% (792/9896) remote: Counting objects: 9% (891/9896) remote: Counting objects: 10% (990/9896) remote: Counting objects: 11% (1089/9896) remote: Counting objects: 12% (1188/9896) remote: Counting objects: 13% (1287/9896) remote: Counting objects: 14% (1386/9896) remote: Counting objects: 15% (1485/9896) remote: Counting objects: 16% (1584/9896) remote: Counting objects: 17% (1683/9896) remote: Counting objects: 18% (1782/9896) remote: Counting objects: 19% (1881/9896) remote: Counting objects: 20% (1980/9896) remote: Counting objects: 21% (2079/9896) remote: Counting objects: 22% (2178/9896) remote: Counting objects: 23% (2277/9896) remote: Counting objects: 24% (2376/9896) remote: Counting objects: 25% (2474/9896) remote: Counting objects: 26% (2573/9896) remote: Counting objects: 27% (2672/9896) remote: Counting objects: 28% (2771/9896) remote: Counting objects: 29% (2870/9896) remote: Counting objects: 30% (2969/9896) remote: Counting objects: 31% (3068/9896) remote: Counting objects: 32% (3167/9896) remote: Counting objects: 33% (3266/9896) remote: Counting objects: 34% (3365/9896) remote: Counting objects: 35% (3464/9896) remote: Counting objects: 36% (3563/9896) remote: Counting objects: 37% (3662/9896) remote: Counting objects: 38% (3761/9896) remote: Counting objects: 39% (3860/9896) remote: Counting objects: 40% (3959/9896) remote: Counting objects: 41% (4058/9896) remote: Counting objects: 42% (4157/9896) remote: Counting objects: 43% (4256/9896) remote: Counting objects: 44% (4355/9896) remote: Counting objects: 45% (4454/9896) remote: Counting objects: 46% (4553/9896) remote: Counting objects: 47% (4652/9896) remote: Counting objects: 48% (4751/9896) remote: Counting objects: 49% (4850/9896) remote: Counting objects: 50% (4948/9896) remote: Counting objects: 51% (5047/9896) remote: Counting objects: 52% (5146/9896) remote: Counting objects: 53% (5245/9896) remote: Counting objects: 54% (5344/9896) remote: Counting objects: 55% (5443/9896) remote: Counting objects: 56% (5542/9896) remote: Counting objects: 57% (5641/9896) remote: Counting objects: 58% (5740/9896) remote: Counting objects: 59% (5839/9896) remote: Counting objects: 60% (5938/9896) remote: Counting objects: 61% (6037/9896) remote: Counting objects: 62% (6136/9896) remote: Counting objects: 63% (6235/9896) remote: Counting objects: 64% (6334/9896) remote: Counting objects: 65% (6433/9896) remote: Counting objects: 66% (6532/9896) remote: Counting objects: 67% (6631/9896) remote: Counting objects: 68% (6730/9896) remote: Counting objects: 69% (6829/9896) remote: Counting objects: 70% (6928/9896) remote: Counting objects: 71% (7027/9896) remote: Counting objects: 72% (7126/9896) remote: Counting objects: 73% (7225/9896) remote: Counting objects: 74% (7324/9896) remote: Counting objects: 75% (7422/9896) remote: Counting objects: 76% (7521/9896) remote: Counting objects: 77% (7620/9896) remote: Counting objects: 78% (7719/9896) remote: Counting objects: 79% (7818/9896) remote: Counting objects: 80% (7917/9896) remote: Counting objects: 81% (8016/9896) remote: Counting objects: 82% (8115/9896) remote: Counting objects: 83% (8214/9896) remote: Counting objects: 84% (8313/9896) remote: Counting objects: 85% (8412/9896) remote: Counting objects: 86% (8511/9896) remote: Counting objects: 87% (8610/9896) remote: Counting objects: 88% (8709/9896) remote: Counting objects: 89% (8808/9896) remote: Counting objects: 90% (8907/9896) remote: Counting objects: 91% (9006/9896) remote: Counting objects: 92% (9105/9896) remote: Counting objects: 93% (9204/9896) remote: Counting objects: 94% (9303/9896) remote: Counting objects: 95% (9402/9896) remote: Counting objects: 96% (9501/9896) remote: Counting objects: 97% (9600/9896) remote: Counting objects: 98% (9699/9896) remote: Counting objects: 99% (9798/9896) remote: Counting objects: 100% (9896/9896) remote: Counting objects: 100% (9896/9896), done.
  5. 4.44 s remote: Compressing objects: 0% (1/2141) remote: Compressing objects: 1% (22/2141) remote: Compressing objects: 2% (43/2141) remote: Compressing objects: 3% (65/2141) remote: Compressing objects: 4% (86/2141) remote: Compressing objects: 5% (108/2141) remote: Compressing objects: 6% (129/2141) remote: Compressing objects: 7% (150/2141) remote: Compressing objects: 8% (172/2141) remote: Compressing objects: 9% (193/2141) remote: Compressing objects: 10% (215/2141) remote: Compressing objects: 11% (236/2141) remote: Compressing objects: 12% (257/2141) remote: Compressing objects: 13% (279/2141) remote: Compressing objects: 14% (300/2141) remote: Compressing objects: 15% (322/2141) remote: Compressing objects: 15% (335/2141) remote: Compressing objects: 16% (343/2141) remote: Compressing objects: 17% (364/2141) remote: Compressing objects: 18% (386/2141) remote: Compressing objects: 19% (407/2141) remote: Compressing objects: 20% (429/2141) remote: Compressing objects: 21% (450/2141) remote: Compressing objects: 22% (472/2141) remote: Compressing objects: 22% (488/2141) remote: Compressing objects: 23% (493/2141) remote: Compressing objects: 24% (514/2141) remote: Compressing objects: 25% (536/2141) remote: Compressing objects: 26% (557/2141) remote: Compressing objects: 27% (579/2141) remote: Compressing objects: 28% (600/2141) remote: Compressing objects: 29% (621/2141) remote: Compressing objects: 30% (643/2141) remote: Compressing objects: 31% (664/2141) remote: Compressing objects: 32% (686/2141) remote: Compressing objects: 33% (707/2141) remote: Compressing objects: 34% (728/2141) remote: Compressing objects: 35% (750/2141) remote: Compressing objects: 36% (771/2141) remote: Compressing objects: 37% (793/2141) remote: Compressing objects: 38% (814/2141) remote: Compressing objects: 39% (835/2141) remote: Compressing objects: 40% (857/2141) remote: Compressing objects: 41% (878/2141) remote: Compressing objects: 42% (900/2141) remote: Compressing objects: 43% (921/2141) remote: Compressing objects: 44% (943/2141) remote: Compressing objects: 45% (964/2141) remote: Compressing objects: 46% (985/2141) remote: Compressing objects: 47% (1007/2141) remote: Compressing objects: 48% (1028/2141) remote: Compressing objects: 49% (1050/2141) remote: Compressing objects: 50% (1071/2141) remote: Compressing objects: 51% (1092/2141) remote: Compressing objects: 52% (1114/2141) remote: Compressing objects: 53% (1135/2141) remote: Compressing objects: 54% (1157/2141) remote: Compressing objects: 55% (1178/2141) remote: Compressing objects: 56% (1199/2141) remote: Compressing objects: 57% (1221/2141) remote: Compressing objects: 58% (1242/2141) remote: Compressing objects: 59% (1264/2141) remote: Compressing objects: 60% (1285/2141) remote: Compressing objects: 61% (1307/2141) remote: Compressing objects: 62% (1328/2141) remote: Compressing objects: 63% (1349/2141) remote: Compressing objects: 64% (1371/2141) remote: Compressing objects: 65% (1392/2141) remote: Compressing objects: 66% (1414/2141) remote: Compressing objects: 67% (1435/2141) remote: Compressing objects: 68% (1456/2141) remote: Compressing objects: 69% (1478/2141) remote: Compressing objects: 70% (1499/2141) remote: Compressing objects: 71% (1521/2141) remote: Compressing objects: 72% (1542/2141) remote: Compressing objects: 73% (1563/2141) remote: Compressing objects: 74% (1585/2141) remote: Compressing objects: 75% (1606/2141) remote: Compressing objects: 76% (1628/2141) remote: Compressing objects: 77% (1649/2141) remote: Compressing objects: 78% (1670/2141) remote: Compressing objects: 79% (1692/2141) remote: Compressing objects: 80% (1713/2141) remote: Compressing objects: 81% (1735/2141) remote: Compressing objects: 82% (1756/2141) remote: Compressing objects: 83% (1778/2141) remote: Compressing objects: 84% (1799/2141) remote: Compressing objects: 85% (1820/2141) remote: Compressing objects: 86% (1842/2141) remote: Compressing objects: 87% (1863/2141) remote: Compressing objects: 88% (1885/2141) remote: Compressing objects: 89% (1906/2141) remote: Compressing objects: 90% (1927/2141) remote: Compressing objects: 91% (1949/2141) remote: Compressing objects: 92% (1970/2141) remote: Compressing objects: 93% (1992/2141) remote: Compressing objects: 94% (2013/2141) remote: Compressing objects: 95% (2034/2141) remote: Compressing objects: 96% (2056/2141) remote: Compressing objects: 97% (2077/2141) remote: Compressing objects: 98% (2099/2141) remote: Compressing objects: 99% (2120/2141) remote: Compressing objects: 100% (2141/2141) remote: Compressing objects: 100% (2141/2141), done.
  6. 8.60 s Receiving objects: 0% (1/83699) Receiving objects: 1% (837/83699) Receiving objects: 2% (1674/83699) Receiving objects: 3% (2511/83699) Receiving objects: 4% (3348/83699) Receiving objects: 5% (4185/83699) Receiving objects: 6% (5022/83699) Receiving objects: 7% (5859/83699) Receiving objects: 8% (6696/83699) Receiving objects: 9% (7533/83699), 15.96 MiB | 31.91 MiB/s Receiving objects: 10% (8370/83699), 15.96 MiB | 31.91 MiB/s Receiving objects: 11% (9207/83699), 15.96 MiB | 31.91 MiB/s Receiving objects: 12% (10044/83699), 15.96 MiB | 31.91 MiB/s Receiving objects: 13% (10881/83699), 15.96 MiB | 31.91 MiB/s Receiving objects: 14% (11718/83699), 15.96 MiB | 31.91 MiB/s Receiving objects: 15% (12555/83699), 15.96 MiB | 31.91 MiB/s Receiving objects: 16% (13392/83699), 15.96 MiB | 31.91 MiB/s Receiving objects: 17% (14229/83699), 15.96 MiB | 31.91 MiB/s Receiving objects: 18% (15066/83699), 15.96 MiB | 31.91 MiB/s Receiving objects: 19% (15903/83699), 15.96 MiB | 31.91 MiB/s Receiving objects: 20% (16740/83699), 15.96 MiB | 31.91 MiB/s Receiving objects: 21% (17577/83699), 15.96 MiB | 31.91 MiB/s Receiving objects: 22% (18414/83699), 15.96 MiB | 31.91 MiB/s Receiving objects: 23% (19251/83699), 15.96 MiB | 31.91 MiB/s Receiving objects: 24% (20088/83699), 15.96 MiB | 31.91 MiB/s Receiving objects: 25% (20925/83699), 15.96 MiB | 31.91 MiB/s Receiving objects: 26% (21762/83699), 15.96 MiB | 31.91 MiB/s Receiving objects: 27% (22599/83699), 15.96 MiB | 31.91 MiB/s Receiving objects: 28% (23436/83699), 15.96 MiB | 31.91 MiB/s Receiving objects: 29% (24273/83699), 15.96 MiB | 31.91 MiB/s Receiving objects: 30% (25110/83699), 15.96 MiB | 31.91 MiB/s Receiving objects: 31% (25947/83699), 15.96 MiB | 31.91 MiB/s Receiving objects: 32% (26784/83699), 15.96 MiB | 31.91 MiB/s Receiving objects: 33% (27621/83699), 15.96 MiB | 31.91 MiB/s Receiving objects: 34% (28458/83699), 15.96 MiB | 31.91 MiB/s Receiving objects: 35% (29295/83699), 15.96 MiB | 31.91 MiB/s Receiving objects: 36% (30132/83699), 15.96 MiB | 31.91 MiB/s Receiving objects: 37% (30969/83699), 15.96 MiB | 31.91 MiB/s Receiving objects: 38% (31806/83699), 15.96 MiB | 31.91 MiB/s Receiving objects: 39% (32643/83699), 15.96 MiB | 31.91 MiB/s Receiving objects: 40% (33480/83699), 15.96 MiB | 31.91 MiB/s Receiving objects: 40% (34119/83699), 34.31 MiB | 33.55 MiB/s Receiving objects: 41% (34317/83699), 34.31 MiB | 33.55 MiB/s Receiving objects: 42% (35154/83699), 34.31 MiB | 33.55 MiB/s Receiving objects: 43% (35991/83699), 34.31 MiB | 33.55 MiB/s Receiving objects: 44% (36828/83699), 34.31 MiB | 33.55 MiB/s Receiving objects: 45% (37665/83699), 34.31 MiB | 33.55 MiB/s Receiving objects: 46% (38502/83699), 34.31 MiB | 33.55 MiB/s Receiving objects: 47% (39339/83699), 34.31 MiB | 33.55 MiB/s Receiving objects: 48% (40176/83699), 34.31 MiB | 33.55 MiB/s Receiving objects: 49% (41013/83699), 34.31 MiB | 33.55 MiB/s Receiving objects: 50% (41850/83699), 34.31 MiB | 33.55 MiB/s Receiving objects: 51% (42687/83699), 34.31 MiB | 33.55 MiB/s Receiving objects: 52% (43524/83699), 51.69 MiB | 33.94 MiB/s Receiving objects: 53% (44361/83699), 51.69 MiB | 33.94 MiB/s Receiving objects: 54% (45198/83699), 51.69 MiB | 33.94 MiB/s Receiving objects: 55% (46035/83699), 51.69 MiB | 33.94 MiB/s Receiving objects: 56% (46872/83699), 51.69 MiB | 33.94 MiB/s Receiving objects: 57% (47709/83699), 51.69 MiB | 33.94 MiB/s Receiving objects: 58% (48546/83699), 51.69 MiB | 33.94 MiB/s Receiving objects: 59% (49383/83699), 51.69 MiB | 33.94 MiB/s Receiving objects: 59% (49706/83699), 68.51 MiB | 33.26 MiB/s Receiving objects: 60% (50220/83699), 68.51 MiB | 33.26 MiB/s Receiving objects: 61% (51057/83699), 68.51 MiB | 33.26 MiB/s Receiving objects: 62% (51894/83699), 68.51 MiB | 33.26 MiB/s Receiving objects: 63% (52731/83699), 68.51 MiB | 33.26 MiB/s Receiving objects: 64% (53568/83699), 68.51 MiB | 33.26 MiB/s Receiving objects: 65% (54405/83699), 68.51 MiB | 33.26 MiB/s Receiving objects: 66% (55242/83699), 68.51 MiB | 33.26 MiB/s Receiving objects: 67% (56079/83699), 68.51 MiB | 33.26 MiB/s Receiving objects: 68% (56916/83699), 68.51 MiB | 33.26 MiB/s Receiving objects: 69% (57753/83699), 68.51 MiB | 33.26 MiB/s Receiving objects: 70% (58590/83699), 86.00 MiB | 33.60 MiB/s Receiving objects: 71% (59427/83699), 86.00 MiB | 33.60 MiB/s Receiving objects: 72% (60264/83699), 86.00 MiB | 33.60 MiB/s Receiving objects: 73% (61101/83699), 86.00 MiB | 33.60 MiB/s Receiving objects: 74% (61938/83699), 86.00 MiB | 33.60 MiB/s Receiving objects: 75% (62775/83699), 86.00 MiB | 33.60 MiB/s Receiving objects: 76% (63612/83699), 86.00 MiB | 33.60 MiB/s Receiving objects: 76% (64237/83699), 86.00 MiB | 33.60 MiB/s Receiving objects: 77% (64449/83699), 86.00 MiB | 33.60 MiB/s Receiving objects: 78% (65286/83699), 86.00 MiB | 33.60 MiB/s Receiving objects: 79% (66123/83699), 103.11 MiB | 33.31 MiB/s Receiving objects: 80% (66960/83699), 103.11 MiB | 33.31 MiB/s Receiving objects: 81% (67797/83699), 103.11 MiB | 33.31 MiB/s Receiving objects: 82% (68634/83699), 103.11 MiB | 33.31 MiB/s Receiving objects: 83% (69471/83699), 103.11 MiB | 33.31 MiB/s Receiving objects: 84% (70308/83699), 103.11 MiB | 33.31 MiB/s Receiving objects: 85% (71145/83699), 103.11 MiB | 33.31 MiB/s Receiving objects: 86% (71982/83699), 121.23 MiB | 33.72 MiB/s Receiving objects: 87% (72819/83699), 121.23 MiB | 33.72 MiB/s Receiving objects: 88% (73656/83699), 121.23 MiB | 33.72 MiB/s Receiving objects: 89% (74493/83699), 121.23 MiB | 33.72 MiB/s Receiving objects: 90% (75330/83699), 121.23 MiB | 33.72 MiB/s Receiving objects: 91% (76167/83699), 121.23 MiB | 33.72 MiB/s Receiving objects: 92% (77004/83699), 121.23 MiB | 33.72 MiB/s Receiving objects: 93% (77841/83699), 121.23 MiB | 33.72 MiB/s Receiving objects: 94% (78678/83699), 121.23 MiB | 33.72 MiB/s Receiving objects: 95% (79515/83699), 121.23 MiB | 33.72 MiB/s Receiving objects: 96% (80352/83699), 121.23 MiB | 33.72 MiB/s Receiving objects: 97% (81189/83699), 121.23 MiB | 33.72 MiB/s Receiving objects: 98% (82026/83699), 121.23 MiB | 33.72 MiB/s Receiving objects: 99% (82863/83699), 121.23 MiB | 33.72 MiB/s Receiving objects: 99% (83594/83699), 121.23 MiB | 33.72 MiB/s remote: Total 83699 (delta 7946), reused 8039 (delta 7222), pack-reused 73803 (from 3)
  7. 8.60 s Receiving objects: 100% (83699/83699), 137.75 MiB | 33.35 MiB/s Receiving objects: 100% (83699/83699), 139.23 MiB | 33.47 MiB/s, done.
  8. 9.61 s Resolving deltas: 0% (0/56220) Resolving deltas: 1% (563/56220) Resolving deltas: 2% (1125/56220) Resolving deltas: 3% (1687/56220) Resolving deltas: 4% (2249/56220) Resolving deltas: 5% (2811/56220) Resolving deltas: 6% (3374/56220) Resolving deltas: 7% (3936/56220) Resolving deltas: 8% (4498/56220) Resolving deltas: 9% (5060/56220) Resolving deltas: 10% (5623/56220) Resolving deltas: 11% (6185/56220) Resolving deltas: 12% (6747/56220) Resolving deltas: 13% (7309/56220) Resolving deltas: 14% (7871/56220) Resolving deltas: 15% (8434/56220) Resolving deltas: 16% (8996/56220) Resolving deltas: 17% (9558/56220) Resolving deltas: 18% (10124/56220) Resolving deltas: 19% (10682/56220) Resolving deltas: 20% (11245/56220) Resolving deltas: 21% (11807/56220) Resolving deltas: 22% (12369/56220) Resolving deltas: 23% (12931/56220) Resolving deltas: 24% (13493/56220) Resolving deltas: 25% (14055/56220) Resolving deltas: 26% (14618/56220) Resolving deltas: 27% (15180/56220) Resolving deltas: 28% (15742/56220) Resolving deltas: 29% (16305/56220) Resolving deltas: 30% (16866/56220) Resolving deltas: 31% (17429/56220) Resolving deltas: 32% (17991/56220) Resolving deltas: 33% (18553/56220) Resolving deltas: 34% (19115/56220) Resolving deltas: 35% (19677/56220) Resolving deltas: 36% (20240/56220) Resolving deltas: 37% (20802/56220) Resolving deltas: 38% (21365/56220) Resolving deltas: 39% (21927/56220) Resolving deltas: 40% (22489/56220) Resolving deltas: 41% (23053/56220) Resolving deltas: 42% (23613/56220) Resolving deltas: 43% (24175/56220) Resolving deltas: 44% (24738/56220) Resolving deltas: 45% (25299/56220) Resolving deltas: 46% (25862/56220) Resolving deltas: 47% (26424/56220) Resolving deltas: 48% (26987/56220) Resolving deltas: 49% (27550/56220) Resolving deltas: 50% (28110/56220) Resolving deltas: 51% (28673/56220) Resolving deltas: 52% (29237/56220) Resolving deltas: 53% (29797/56220) Resolving deltas: 54% (30359/56220) Resolving deltas: 55% (30921/56220) Resolving deltas: 56% (31484/56220) Resolving deltas: 57% (32046/56220) Resolving deltas: 58% (32608/56220) Resolving deltas: 59% (33176/56220) Resolving deltas: 60% (33734/56220) Resolving deltas: 61% (34295/56220) Resolving deltas: 62% (34857/56220) Resolving deltas: 63% (35420/56220) Resolving deltas: 64% (35981/56220) Resolving deltas: 65% (36546/56220) Resolving deltas: 66% (37107/56220) Resolving deltas: 67% (37668/56220) Resolving deltas: 68% (38230/56220) Resolving deltas: 69% (38792/56220) Resolving deltas: 70% (39355/56220) Resolving deltas: 71% (39920/56220) Resolving deltas: 72% (40479/56220) Resolving deltas: 73% (41041/56220) Resolving deltas: 74% (41605/56220) Resolving deltas: 75% (42165/56220) Resolving deltas: 76% (42728/56220) Resolving deltas: 77% (43290/56220) Resolving deltas: 78% (43854/56220) Resolving deltas: 79% (44414/56220) Resolving deltas: 80% (44976/56220) Resolving deltas: 81% (45539/56220) Resolving deltas: 82% (46101/56220) Resolving deltas: 83% (46663/56220) Resolving deltas: 84% (47226/56220) Resolving deltas: 85% (47787/56220) Resolving deltas: 86% (48350/56220) Resolving deltas: 87% (48913/56220) Resolving deltas: 88% (49474/56220) Resolving deltas: 89% (50036/56220) Resolving deltas: 90% (50598/56220) Resolving deltas: 91% (51161/56220) Resolving deltas: 92% (51723/56220) Resolving deltas: 93% (52285/56220) Resolving deltas: 94% (52848/56220) Resolving deltas: 95% (53409/56220) Resolving deltas: 96% (53972/56220) Resolving deltas: 97% (54534/56220) Resolving deltas: 98% (55096/56220) Resolving deltas: 99% (55658/56220) Resolving deltas: 99% (56114/56220) Resolving deltas: 100% (56220/56220) Resolving deltas: 100% (56220/56220), done.
  9. 10.05 s Fetching commit a7bf806f7ac4a7ccc06080a3ebab9e3e4e0e1258 for wip/native-symbolica-hyperbolics ...
  10. 10.05 s $ /nix/store/bcnisk3ydfgv26v2gw3zlky24g00yww2-git-2.54.0/bin/git fetch origin a7bf806f7ac4a7ccc06080a3ebab9e3e4e0e1258
  11. 10.47 s From https://github.com/alphal00p/gammaloop
  12. 10.47 s * branch a7bf806f7ac4a7ccc06080a3ebab9e3e4e0e1258 -> FETCH_HEAD
  13. 10.48 s $ /nix/store/9ypz3flqsrl5xl495mm8h645gadjsxi1-coreutils-9.11/bin/timeout --kill-after=15s 7200s /nix/store/bcnisk3ydfgv26v2gw3zlky24g00yww2-git-2.54.0/bin/git -c advice.detachedHead=false checkout a7bf806f7ac4a7ccc06080a3ebab9e3e4e0e1258
  14. 10.67 s HEAD is now at a7bf806f7 update symjit
  15. 10.68 s $ /nix/store/9ypz3flqsrl5xl495mm8h645gadjsxi1-coreutils-9.11/bin/timeout --kill-after=15s 7200s /nix/store/23zk8sgzamrbmj1fday15szf7f2279s8-nix-2.34.7/bin/nix --extra-experimental-features nix-command --extra-experimental-features flakes --log-format internal-json run .#packages.x86_64-linux.nix-ci-check-gammaloop-nextest-core --print-build-logs
  16. 15.39 s
  17. 15.76 s Downloading cached gammaloop-nextest-binaries-core-gammaloop-api from https://cache.nix-ci.com
  18. 15.76 s Downloading cached gammaloop-nextest-binaries-core-gammaloop-tracing-filter from https://cache.nix-ci.com
  19. 15.77 s Downloading cached gammaloop-nextest-binaries-core-gammaloop-tracing-filter-macros from https://cache.nix-ci.com
  20. 15.77 s Downloading cached gammaloop-nextest-binaries-core-gammalooprs from https://cache.nix-ci.com
  21. 15.82 s Downloaded cached gammaloop-nextest-binaries-core-gammaloop-tracing-filter-macros (1.7 MiB) in 51ms
  22. 15.82 s Progress: 0 of 1 built, 1 of 6 downloaded from cache (3 downloading)
  23. 15.93 s Downloaded cached gammaloop-nextest-binaries-core-gammaloop-tracing-filter (8.1 MiB) in 165ms
  24. 15.93 s Progress: 0 of 1 built, 2 of 6 downloaded from cache (2 downloading)
  25. 16.64 s Downloaded cached gammaloop-nextest-binaries-core-gammaloop-api (68.6 MiB) in 879ms
  26. 16.64 s Progress: 0 of 1 built, 3 of 6 downloaded from cache (1 downloading)
  27. 16.72 s Downloaded cached gammaloop-nextest-binaries-core-gammalooprs (79.6 MiB) in 952ms
  28. 16.72 s Progress: 0 of 1 built, 4 of 6 downloaded from cache
  29. 16.72 s Downloading cached gammaloop-nextest-binaries-core from https://cache.nix-ci.com
  30. 16.72 s Downloaded cached gammaloop-nextest-binaries-core (1640 B) in 3ms
  31. 16.72 s Progress: 0 of 1 built, 5 of 6 downloaded from cache
  32. 16.72 s Downloading cached nix-ci-check-gammaloop-nextest-core from https://cache.nix-ci.com
  33. 16.73 s Downloaded cached nix-ci-check-gammaloop-nextest-core (1016 B) in 3ms
  34. 16.73 s Progress: 0 of 1 built, 6 of 6 downloaded from cache
  35. 21.45 s evaluating derivation 'g copying '/nix/store/cplq evaluating derivation 'g copying '/nix/store/cplq evaluating derivation 'g copying '/nix/store/cplq evaluating derivation 'g copying '/nix/store/cplq evaluating derivation 'g copying '/nix/store/cplq evaluating derivation 'g copying '/nix/store/cplq evaluating derivation 'g copying '/nix/store/cplq evaluating derivation 'g querying gammaloop-nexte querying info about miss querying gammaloop-nexte [0/1 built, 0.0 KiB DL] [1/0/1 built, 0.0 KiB DLgammaloop-nextest-core> Extracting 3 binaries (including 1 non-test binary), 1 build script output directory, and 2 linked paths to /build/nextest-archive-RNg2jC
  36. 21.89 s gammaloop-nextest-core> Extracted 18 files to /build/nextest-archive-RNg2jC in 0.45s
  37. 21.90 s gammaloop-nextest-core> ------------
  38. 21.90 s gammaloop-nextest-core> Nextest run ID f2c7b904-11b7-4066-85cc-e0c3ac25fb12 with nextest profile: ci_gammaloop
  39. 21.90 s gammaloop-nextest-core> Starting 339 tests across 2 binaries
  40. 22.36 s gammaloop-nextest-core> ------------
  41. 22.36 s gammaloop-nextest-core> Summary [ 0.456s] 339 tests run: 339 passed, 0 skipped
  42. 22.46 s gammaloop-nextest-core>
  43. 22.46 s gammaloop-nextest-core> ========== nextest test summary ==========
  44. 22.46 s gammaloop-nextest-core> report: target/nextest/ci_gammaloop/junit.xml
  45. 22.46 s gammaloop-nextest-core> tests: 339, failures: 0, errors: 0
  46. 22.46 s gammaloop-nextest-core> No failing testcases found.
  47. 22.46 s gammaloop-nextest-core> =========================================
  48. 22.48 s gammaloop-nextest-core> Extracting 1 binary and 1 linked path to /build/nextest-archive-Mor6bs
  49. 22.55 s gammaloop-nextest-core> Extracted 7 files to /build/nextest-archive-Mor6bs in 0.07s
  50. 22.55 s gammaloop-nextest-core> ------------
  51. 22.55 s gammaloop-nextest-core> Nextest run ID c3a623ba-8f5a-42cf-b11c-940db536c07d with nextest profile: ci_gammaloop
  52. 22.55 s gammaloop-nextest-core> Starting 19 tests across 1 binary
  53. 22.57 s gammaloop-nextest-core> ------------
  54. 22.57 s gammaloop-nextest-core> Summary [ 0.011s] 19 tests run: 19 passed, 0 skipped
  55. 22.60 s gammaloop-nextest-core>
  56. 22.60 s gammaloop-nextest-core> ========== nextest test summary ==========
  57. 22.60 s gammaloop-nextest-core> report: target/nextest/ci_gammaloop/junit.xml
  58. 22.60 s gammaloop-nextest-core> tests: 19, failures: 0, errors: 0
  59. 22.60 s gammaloop-nextest-core> No failing testcases found.
  60. 22.60 s gammaloop-nextest-core> =========================================
  61. 22.61 s gammaloop-nextest-core> Extracting 1 binary to /build/nextest-archive-u3FYWf
  62. 22.65 s gammaloop-nextest-core> Extracted 4 files to /build/nextest-archive-u3FYWf in 0.04s
  63. 22.66 s gammaloop-nextest-core> ------------
  64. 22.66 s gammaloop-nextest-core> Nextest run ID 263e48c4-4b6f-4e21-80f3-bfa815629113 with nextest profile: ci_gammaloop
  65. 22.66 s gammaloop-nextest-core> Starting 0 tests across 1 binary
  66. 22.66 s gammaloop-nextest-core> ------------
  67. 22.66 s gammaloop-nextest-core> Summary [ 0.000s] 0 tests run: 0 passed, 0 skipped
  68. 22.69 s gammaloop-nextest-core>
  69. 22.69 s gammaloop-nextest-core> ========== nextest test summary ==========
  70. 22.69 s gammaloop-nextest-core> report: target/nextest/ci_gammaloop/junit.xml
  71. 22.69 s gammaloop-nextest-core> tests: 0, failures: 0, errors: 0
  72. 22.69 s gammaloop-nextest-core> No failing testcases found.
  73. 22.69 s gammaloop-nextest-core> =========================================
  74. 22.71 s gammaloop-nextest-core> Extracting 4 binaries, 1 build script output directory, and 2 linked paths to /build/nextest-archive-clXqxy
  75. 23.15 s gammaloop-nextest-core> Extracted 18 files to /build/nextest-archive-clXqxy in 0.44s
  76. 23.16 s gammaloop-nextest-core> ------------
  77. 23.16 s gammaloop-nextest-core> Nextest run ID 63d91ff3-71a1-4887-b340-ed19d530a89f with nextest profile: ci_gammaloop
  78. 23.16 s gammaloop-nextest-core> Starting 488 tests across 4 binaries (61 tests skipped, including 60 tests via profile.ci_gammaloop.default-filter)
  79. 23.83 s gammaloop-nextest-core> FAIL [ 0.610s] (258/488) gammalooprs graph::feynman_graph::tests::native_thermal_distributions
  80. 23.83 s gammaloop-nextest-core> stdout ---
  81. 23.83 s gammaloop-nextest-core>
  82. 23.83 s gammaloop-nextest-core> running 1 test
  83. 23.83 s gammaloop-nextest-core> test graph::feynman_graph::tests::native_thermal_distributions ... FAILED
  84. 23.83 s gammaloop-nextest-core>
  85. 23.83 s gammaloop-nextest-core> failures:
  86. 23.83 s gammaloop-nextest-core>
  87. 23.83 s gammaloop-nextest-core> failures:
  88. 23.83 s gammaloop-nextest-core> graph::feynman_graph::tests::native_thermal_distributions
  89. 23.83 s gammaloop-nextest-core>
  90. 23.83 s gammaloop-nextest-core> test result: FAILED. 0 passed; 1 failed; 0 ignored; 0 measured; 540 filtered out; finished in 0.60s
  91. 23.83 s gammaloop-nextest-core>
  92. 23.83 s gammaloop-nextest-core> stderr ---
  93. 23.83 s gammaloop-nextest-core> The application panicked (crashed).
  94. 23.83 s gammaloop-nextest-core> Message: called `Result::unwrap()` on an `Err` value: Custom { kind: Other, error: "Could not compile code: g++ -shared -O3 -fPIC -ffast-math -funsafe-math-optimizations -march=native -o /build/gammaloop-native-thermal-1339/thermal_0_0.so /build/gammaloop-native-thermal-1339/thermal_0_0.cpp\nwarning: Skipping impure flag -march=native because NIX_ENFORCE_NO_NATIVE is set\n/build/gammaloop-native-thermal-1339/thermal_0_0.cpp: In function 'void thermal_realf64(const double*, double*, double*)':\n/build/gammaloop-native-thermal-1339/thermal_0_0.cpp:27:16: error: 'symbolica_tanh' was not declared in this scope\n 27 | Z[6] = symbolica_tanh(Z[6]);\n | ^~~~~~~~~~~~~~\n" }
  95. 23.83 s gammaloop-nextest-core> Location: crates/gammalooprs/src/graph/feynman_graph.rs:937
  96. 23.83 s gammaloop-nextest-core>
  97. 23.83 s gammaloop-nextest-core> ━━━━━━━━━━━━━━━━━━━━━━━━━━━━━━━━━━ BACKTRACE ━━━━━━━━━━━━━━━━━━━━━━━━━━━━━━━━━━━
  98. 23.83 s gammaloop-nextest-core> 1: <color_eyre[b0c9e66060e883b2]::config::PanicHook>::panic_report<unknown>
  99. 23.83 s gammaloop-nextest-core> at <unknown source file>:<unknown line>
  100. 23.83 s gammaloop-nextest-core> 2: <color_eyre[b0c9e66060e883b2]::config::PanicHook>::into_panic_hook::{closure#0}<unknown>
  101. 23.83 s gammaloop-nextest-core> at <unknown source file>:<unknown line>
  102. 23.83 s gammaloop-nextest-core> 3: std[bcb96dfbba0ab899]::panicking::panic_with_hook<unknown>
  103. 23.83 s gammaloop-nextest-core> at <unknown source file>:<unknown line>
  104. 23.83 s gammaloop-nextest-core> 4: std[bcb96dfbba0ab899]::panicking::panic_handler::{closure#0}<unknown>
  105. 23.83 s gammaloop-nextest-core> at <unknown source file>:<unknown line>
  106. 23.83 s gammaloop-nextest-core> 5: std[bcb96dfbba0ab899]::sys::backtrace::__rust_end_short_backtrace::<std[bcb96dfbba0ab899]::panicking::panic_handler::{closure#0}, !><unknown>
  107. 23.83 s gammaloop-nextest-core> at <unknown source file>:<unknown line>
  108. 23.83 s gammaloop-nextest-core> 6: __rustc[6c289b9f9c454d21]::rust_begin_unwind<unknown>
  109. 23.83 s gammaloop-nextest-core> at <unknown source file>:<unknown line>
  110. 23.83 s gammaloop-nextest-core> 7: core[940e698046960fd5]::panicking::panic_fmt<unknown>
  111. 23.83 s gammaloop-nextest-core> at <unknown source file>:<unknown line>
  112. 23.83 s gammaloop-nextest-core> 8: core[940e698046960fd5]::result::unwrap_failed<unknown>
  113. 23.83 s gammaloop-nextest-core> at <unknown source file>:<unknown line>
  114. 23.83 s gammaloop-nextest-core> 9: gammalooprs[99a2022df78a4f41]::graph::feynman_graph::tests::native_thermal_distributions<unknown>
  115. 23.83 s gammaloop-nextest-core> at <unknown source file>:<unknown line>
  116. 23.83 s gammaloop-nextest-core> 10: <gammalooprs[99a2022df78a4f41]::graph::feynman_graph::tests::native_thermal_distributions::{closure#0} as core[940e698046960fd5]::ops::function::FnOnce<()>>::call_once<unknown>
  117. 23.83 s gammaloop-nextest-core> at <unknown source file>:<unknown line>
  118. 23.83 s gammaloop-nextest-core> 11: test[75d6903177b1d7e9]::__rust_begin_short_backtrace::<core[940e698046960fd5]::result::Result<(), alloc[2ea6bcb46fca0c42]::string::String>, fn() -> core[940e698046960fd5]::result::Result<(), alloc[2ea6bcb46fca0c42]::string::String>><unknown>
  119. 23.83 s gammaloop-nextest-core> at <unknown source file>:<unknown line>
  120. 23.83 s gammaloop-nextest-core> 12: test[75d6903177b1d7e9]::run_test::{closure#0}<unknown>
  121. 23.83 s gammaloop-nextest-core> at <unknown source file>:<unknown line>
  122. 23.83 s gammaloop-nextest-core> 13: std[bcb96dfbba0ab899]::sys::backtrace::__rust_begin_short_backtrace::<test[75d6903177b1d7e9]::run_test::{closure#1}, ()><unknown>
  123. 23.83 s gammaloop-nextest-core> at <unknown source file>:<unknown line>
  124. 23.83 s gammaloop-nextest-core> 14: <std[bcb96dfbba0ab899]::thread::lifecycle::spawn_unchecked<test[75d6903177b1d7e9]::run_test::{closure#1}, ()>::{closure#1} as core[940e698046960fd5]::ops::function::FnOnce<()>>::call_once::{shim:vtable#0}<unknown>
  125. 23.83 s gammaloop-nextest-core> at <unknown source file>:<unknown line>
  126. 23.83 s gammaloop-nextest-core> 15: <std[bcb96dfbba0ab899]::sys::thread::unix::Thread>::new::thread_start<unknown>
  127. 23.83 s gammaloop-nextest-core> at <unknown source file>:<unknown line>
  128. 23.83 s gammaloop-nextest-core> 16: start_thread<unknown>
  129. 23.83 s gammaloop-nextest-core> at <unknown source file>:<unknown line>
  130. 23.83 s gammaloop-nextest-core> 17: __clone3<unknown>
  131. 23.83 s gammaloop-nextest-core> at <unknown source file>:<unknown line>
  132. 23.83 s gammaloop-nextest-core>
  133. 23.83 s gammaloop-nextest-core> Run with COLORBT_SHOW_HIDDEN=1 environment variable to disable frame filtering.
  134. 23.83 s gammaloop-nextest-core> Run with RUST_BACKTRACE=full to include source snippets.
  135. 23.83 s gammaloop-nextest-core>
  136. 32.80 s gammaloop-nextest-core> ------------
  137. 32.80 s gammaloop-nextest-core> Summary [ 9.635s] 488 tests run: 487 passed, 1 failed, 61 skipped
  138. 32.80 s gammaloop-nextest-core> FAIL [ 0.610s] (258/488) gammalooprs graph::feynman_graph::tests::native_thermal_distributions
  139. 32.80 s gammaloop-nextest-core> stdout ---
  140. 32.80 s gammaloop-nextest-core>
  141. 32.80 s gammaloop-nextest-core> running 1 test
  142. 32.80 s gammaloop-nextest-core> test graph::feynman_graph::tests::native_thermal_distributions ... FAILED
  143. 32.80 s gammaloop-nextest-core>
  144. 32.80 s gammaloop-nextest-core> failures:
  145. 32.80 s gammaloop-nextest-core>
  146. 32.80 s gammaloop-nextest-core> failures:
  147. 32.80 s gammaloop-nextest-core> graph::feynman_graph::tests::native_thermal_distributions
  148. 32.80 s gammaloop-nextest-core>
  149. 32.80 s gammaloop-nextest-core> test result: FAILED. 0 passed; 1 failed; 0 ignored; 0 measured; 540 filtered out; finished in 0.60s
  150. 32.80 s gammaloop-nextest-core>
  151. 32.80 s gammaloop-nextest-core> stderr ---
  152. 32.80 s gammaloop-nextest-core> The application panicked (crashed).
  153. 32.80 s gammaloop-nextest-core> Message: called `Result::unwrap()` on an `Err` value: Custom { kind: Other, error: "Could not compile code: g++ -shared -O3 -fPIC -ffast-math -funsafe-math-optimizations -march=native -o /build/gammaloop-native-thermal-1339/thermal_0_0.so /build/gammaloop-native-thermal-1339/thermal_0_0.cpp\nwarning: Skipping impure flag -march=native because NIX_ENFORCE_NO_NATIVE is set\n/build/gammaloop-native-thermal-1339/thermal_0_0.cpp: In function 'void thermal_realf64(const double*, double*, double*)':\n/build/gammaloop-native-thermal-1339/thermal_0_0.cpp:27:16: error: 'symbolica_tanh' was not declared in this scope\n 27 | Z[6] = symbolica_tanh(Z[6]);\n | ^~~~~~~~~~~~~~\n" }
  154. 32.80 s gammaloop-nextest-core> Location: crates/gammalooprs/src/graph/feynman_graph.rs:937
  155. 32.80 s gammaloop-nextest-core>
  156. 32.80 s gammaloop-nextest-core> ━━━━━━━━━━━━━━━━━━━━━━━━━━━━━━━━━━ BACKTRACE ━━━━━━━━━━━━━━━━━━━━━━━━━━━━━━━━━━━
  157. 32.80 s gammaloop-nextest-core> 1: <color_eyre[b0c9e66060e883b2]::config::PanicHook>::panic_report<unknown>
  158. 32.80 s gammaloop-nextest-core> at <unknown source file>:<unknown line>
  159. 32.80 s gammaloop-nextest-core> 2: <color_eyre[b0c9e66060e883b2]::config::PanicHook>::into_panic_hook::{closure#0}<unknown>
  160. 32.80 s gammaloop-nextest-core> at <unknown source file>:<unknown line>
  161. 32.80 s gammaloop-nextest-core> 3: std[bcb96dfbba0ab899]::panicking::panic_with_hook<unknown>
  162. 32.80 s gammaloop-nextest-core> at <unknown source file>:<unknown line>
  163. 32.80 s gammaloop-nextest-core> 4: std[bcb96dfbba0ab899]::panicking::panic_handler::{closure#0}<unknown>
  164. 32.80 s gammaloop-nextest-core> at <unknown source file>:<unknown line>
  165. 32.80 s gammaloop-nextest-core> 5: std[bcb96dfbba0ab899]::sys::backtrace::__rust_end_short_backtrace::<std[bcb96dfbba0ab899]::panicking::panic_handler::{closure#0}, !><unknown>
  166. 32.80 s gammaloop-nextest-core> at <unknown source file>:<unknown line>
  167. 32.80 s gammaloop-nextest-core> 6: __rustc[6c289b9f9c454d21]::rust_begin_unwind<unknown>
  168. 32.80 s gammaloop-nextest-core> at <unknown source file>:<unknown line>
  169. 32.80 s gammaloop-nextest-core> 7: core[940e698046960fd5]::panicking::panic_fmt<unknown>
  170. 32.80 s gammaloop-nextest-core> at <unknown source file>:<unknown line>
  171. 32.80 s gammaloop-nextest-core> 8: core[940e698046960fd5]::result::unwrap_failed<unknown>
  172. 32.80 s gammaloop-nextest-core> at <unknown source file>:<unknown line>
  173. 32.80 s gammaloop-nextest-core> 9: gammalooprs[99a2022df78a4f41]::graph::feynman_graph::tests::native_thermal_distributions<unknown>
  174. 32.80 s gammaloop-nextest-core> at <unknown source file>:<unknown line>
  175. 32.80 s gammaloop-nextest-core> 10: <gammalooprs[99a2022df78a4f41]::graph::feynman_graph::tests::native_thermal_distributions::{closure#0} as core[940e698046960fd5]::ops::function::FnOnce<()>>::call_once<unknown>
  176. 32.80 s gammaloop-nextest-core> at <unknown source file>:<unknown line>
  177. 32.80 s gammaloop-nextest-core> 11: test[75d6903177b1d7e9]::__rust_begin_short_backtrace::<core[940e698046960fd5]::result::Result<(), alloc[2ea6bcb46fca0c42]::string::String>, fn() -> core[940e698046960fd5]::result::Result<(), alloc[2ea6bcb46fca0c42]::string::String>><unknown>
  178. 32.80 s gammaloop-nextest-core> at <unknown source file>:<unknown line>
  179. 32.80 s gammaloop-nextest-core> 12: test[75d6903177b1d7e9]::run_test::{closure#0}<unknown>
  180. 32.80 s gammaloop-nextest-core> at <unknown source file>:<unknown line>
  181. 32.80 s gammaloop-nextest-core> 13: std[bcb96dfbba0ab899]::sys::backtrace::__rust_begin_short_backtrace::<test[75d6903177b1d7e9]::run_test::{closure#1}, ()><unknown>
  182. 32.80 s gammaloop-nextest-core> at <unknown source file>:<unknown line>
  183. 32.80 s gammaloop-nextest-core> 14: <std[bcb96dfbba0ab899]::thread::lifecycle::spawn_unchecked<test[75d6903177b1d7e9]::run_test::{closure#1}, ()>::{closure#1} as core[940e698046960fd5]::ops::function::FnOnce<()>>::call_once::{shim:vtable#0}<unknown>
  184. 32.80 s gammaloop-nextest-core> at <unknown source file>:<unknown line>
  185. 32.80 s gammaloop-nextest-core> 15: <std[bcb96dfbba0ab899]::sys::thread::unix::Thread>::new::thread_start<unknown>
  186. 32.80 s gammaloop-nextest-core> at <unknown source file>:<unknown line>
  187. 32.80 s gammaloop-nextest-core> 16: start_thread<unknown>
  188. 32.80 s gammaloop-nextest-core> at <unknown source file>:<unknown line>
  189. 32.80 s gammaloop-nextest-core> 17: __clone3<unknown>
  190. 32.80 s gammaloop-nextest-core> at <unknown source file>:<unknown line>
  191. 32.80 s gammaloop-nextest-core>
  192. 32.80 s gammaloop-nextest-core> Run with COLORBT_SHOW_HIDDEN=1 environment variable to disable frame filtering.
  193. 32.80 s gammaloop-nextest-core> Run with RUST_BACKTRACE=full to include source snippets.
  194. 32.80 s gammaloop-nextest-core>
  195. 32.85 s gammaloop-nextest-core> error: test run failed
  196. 32.88 s gammaloop-nextest-core>
  197. 32.88 s gammaloop-nextest-core> ========== nextest test summary ==========
  198. 32.88 s gammaloop-nextest-core> report: target/nextest/ci_gammaloop/junit.xml
  199. 32.88 s gammaloop-nextest-core> tests: 488, failures: 1, errors: 0
  200. 32.88 s gammaloop-nextest-core>
  201. 32.88 s gammaloop-nextest-core> 1. gammalooprs::graph::feynman_graph::tests::native_thermal_distributions
  202. 32.88 s gammaloop-nextest-core> failure: test failure with exit code 101
  203. 32.88 s gammaloop-nextest-core> system-out
  204. 32.88 s gammaloop-nextest-core> running 1 test
  205. 32.88 s gammaloop-nextest-core> test graph::feynman_graph::tests::native_thermal_distributions ... FAILED
  206. 32.88 s gammaloop-nextest-core>
  207. 32.88 s gammaloop-nextest-core> failures:
  208. 32.88 s gammaloop-nextest-core>
  209. 32.88 s gammaloop-nextest-core> failures:
  210. 32.88 s gammaloop-nextest-core> graph::feynman_graph::tests::native_thermal_distributions
  211. 32.88 s gammaloop-nextest-core>
  212. 32.88 s gammaloop-nextest-core> test result: FAILED. 0 passed; 1 failed; 0 ignored; 0 measured; 540 filtered out; finished in 0.60s
  213. 32.88 s gammaloop-nextest-core> system-err
  214. 32.88 s gammaloop-nextest-core> The application panicked (crashed).
  215. 32.88 s gammaloop-nextest-core> Message: called `Result::unwrap()` on an `Err` value: Custom { kind: Other, error: "Could not compile code: g++ -shared -O3 -fPIC -ffast-math -funsafe-math-optimizations -march=native -o /build/gammaloop-native-thermal-1339/thermal_0_0.so /build/gammaloop-native-thermal-1339/thermal_0_0.cpp\nwarning: Skipping impure flag -march=native because NIX_ENFORCE_NO_NATIVE is set\n/build/gammaloop-native-thermal-1339/thermal_0_0.cpp: In function 'void thermal_realf64(const double*, double*, double*)':\n/build/gammaloop-native-thermal-1339/thermal_0_0.cpp:27:16: error: 'symbolica_tanh' was not declared in this scope\n 27 | Z[6] = symbolica_tanh(Z[6]);\n | ^~~~~~~~~~~~~~\n" }
  216. 32.88 s gammaloop-nextest-core> Location: crates/gammalooprs/src/graph/feynman_graph.rs:937
  217. 32.88 s gammaloop-nextest-core>
  218. 32.88 s gammaloop-nextest-core> ━━━━━━━━━━━━━━━━━━━━━━━━━━━━━━━━━━ BACKTRACE ━━━━━━━━━━━━━━━━━━━━━━━━━━━━━━━━━━━
  219. 32.88 s gammaloop-nextest-core> 1: <color_eyre[b0c9e66060e883b2]::config::PanicHook>::panic_report<unknown>
  220. 32.88 s gammaloop-nextest-core> at <unknown source file>:<unknown line>
  221. 32.88 s gammaloop-nextest-core> 2: <color_eyre[b0c9e66060e883b2]::config::PanicHook>::into_panic_hook::{closure#0}<unknown>
  222. 32.88 s gammaloop-nextest-core> at <unknown source file>:<unknown line>
  223. 32.88 s gammaloop-nextest-core> 3: std[bcb96dfbba0ab899]::panicking::panic_with_hook<unknown>
  224. 32.88 s gammaloop-nextest-core> at <unknown source file>:<unknown line>
  225. 32.88 s gammaloop-nextest-core> 4: std[bcb96dfbba0ab899]::panicking::panic_handler::{closure#0}<unknown>
  226. 32.88 s gammaloop-nextest-core> at <unknown source file>:<unknown line>
  227. 32.88 s gammaloop-nextest-core> 5: std[bcb96dfbba0ab899]::sys::backtrace::__rust_end_short_backtrace::<std[bcb96dfbba0ab899]::panicking::panic_handler::{closure#0}, !><unknown>
  228. 32.88 s gammaloop-nextest-core> at <unknown source file>:<unknown line>
  229. 32.88 s gammaloop-nextest-core> 6: __rustc[6c289b9f9c454d21]::rust_begin_unwind<unknown>
  230. 32.88 s gammaloop-nextest-core> at <unknown source file>:<unknown line>
  231. 32.88 s gammaloop-nextest-core> 7: core[940e698046960fd5]::panicking::panic_fmt<unknown>
  232. 32.88 s gammaloop-nextest-core> at <unknown source file>:<unknown line>
  233. 32.88 s gammaloop-nextest-core> 8: core[940e698046960fd5]::result::unwrap_failed<unknown>
  234. 32.88 s gammaloop-nextest-core> at <unknown source file>:<unknown line>
  235. 32.88 s gammaloop-nextest-core> 9: gammalooprs[99a2022df78a4f41]::graph::feynman_graph::tests::native_thermal_distributions<unknown>
  236. 32.88 s gammaloop-nextest-core> at <unknown source file>:<unknown line>
  237. 32.88 s gammaloop-nextest-core> 10: <gammalooprs[99a2022df78a4f41]::graph::feynman_graph::tests::native_thermal_distributions::{closure#0} as core[940e698046960fd5]::ops::function::FnOnce<()>>::call_once<unknown>
  238. 32.88 s gammaloop-nextest-core> at <unknown source file>:<unknown line>
  239. 32.88 s gammaloop-nextest-core> 11: test[75d6903177b1d7e9]::__rust_begin_short_backtrace::<core[940e698046960fd5]::result::Result<(), alloc[2ea6bcb46fca0c42]::string::String>, fn() -> core[940e698046960fd5]::result::Result<(), alloc[2ea6bcb46fca0c42]::string::String>><unknown>
  240. 32.88 s gammaloop-nextest-core> at <unknown source file>:<unknown line>
  241. 32.88 s gammaloop-nextest-core> 12: test[75d6903177b1d7e9]::run_test::{closure#0}<unknown>
  242. 32.88 s gammaloop-nextest-core> at <unknown source file>:<unknown line>
  243. 32.88 s gammaloop-nextest-core> 13: std[bcb96dfbba0ab899]::sys::backtrace::__rust_begin_short_backtrace::<test[75d6903177b1d7e9]::run_test::{closure#1}, ()><unknown>
  244. 32.88 s gammaloop-nextest-core> at <unknown source file>:<unknown line>
  245. 32.88 s gammaloop-nextest-core> 14: <std[bcb96dfbba0ab899]::thread::lifecycle::spawn_unchecked<test[75d6903177b1d7e9]::run_test::{closure#1}, ()>::{closure#1} as core[940e698046960fd5]::ops::function::FnOnce<()>>::call_once::{shim:vtable#0}<unknown>
  246. 32.88 s gammaloop-nextest-core> at <unknown source file>:<unknown line>
  247. 32.88 s gammaloop-nextest-core> 15: <std[bcb96dfbba0ab899]::sys::thread::unix::Thread>::new::thread_start<unknown>
  248. 32.88 s gammaloop-nextest-core> at <unknown source file>:<unknown line>
  249. 32.88 s gammaloop-nextest-core> 16: start_thread<unknown>
  250. 32.88 s gammaloop-nextest-core> at <unknown source file>:<unknown line>
  251. 32.88 s gammaloop-nextest-core> 17: __clone3<unknown>
  252. 32.88 s gammaloop-nextest-core> at <unknown source file>:<unknown line>
  253. 32.88 s gammaloop-nextest-core>
  254. 32.88 s gammaloop-nextest-core> Run with COLORBT_SHOW_HIDDEN=1 environment variable to disable frame filtering.
  255. 32.88 s gammaloop-nextest-core> Run with RUST_BACKTRACE=full to include source snippets.
  256. 32.88 s gammaloop-nextest-core> =========================================
  257. 32.93 s error: Cannot build '/nix/store/kmbwnz7qn7m6zsnr5x139hrrypyr7sj5-gammaloop-nextest-core.drv'.
  258. 32.93 s Reason: builder failed with exit code 100.
  259. 32.93 s Output paths:
  260. 32.93 s /nix/store/lijra80npamzzx3a31800fwgjc63bch8-gammaloop-nextest-core
  261. 32.93 s Last 222 log lines:
  262. 32.93 s > Extracting 3 binaries (including 1 non-test binary), 1 build script output directory, and 2 linked paths to /build/nextest-archive-RNg2jC
  263. 32.93 s > Extracted 18 files to /build/nextest-archive-RNg2jC in 0.45s
  264. 32.93 s > ------------
  265. 32.93 s > Nextest run ID f2c7b904-11b7-4066-85cc-e0c3ac25fb12 with nextest profile: ci_gammaloop
  266. 32.93 s > Starting 339 tests across 2 binaries
  267. 32.93 s > ------------
  268. 32.93 s > Summary [ 0.456s] 339 tests run: 339 passed, 0 skipped
  269. 32.93 s >
  270. 32.93 s > ========== nextest test summary ==========
  271. 32.93 s > report: target/nextest/ci_gammaloop/junit.xml
  272. 32.93 s > tests: 339, failures: 0, errors: 0
  273. 32.93 s > No failing testcases found.
  274. 32.93 s > =========================================
  275. 32.93 s > Extracting 1 binary and 1 linked path to /build/nextest-archive-Mor6bs
  276. 32.93 s > Extracted 7 files to /build/nextest-archive-Mor6bs in 0.07s
  277. 32.93 s > ------------
  278. 32.93 s > Nextest run ID c3a623ba-8f5a-42cf-b11c-940db536c07d with nextest profile: ci_gammaloop
  279. 32.93 s > Starting 19 tests across 1 binary
  280. 32.93 s > ------------
  281. 32.93 s > Summary [ 0.011s] 19 tests run: 19 passed, 0 skipped
  282. 32.93 s >
  283. 32.93 s > ========== nextest test summary ==========
  284. 32.93 s > report: target/nextest/ci_gammaloop/junit.xml
  285. 32.93 s > tests: 19, failures: 0, errors: 0
  286. 32.93 s > No failing testcases found.
  287. 32.93 s > =========================================
  288. 32.93 s > Extracting 1 binary to /build/nextest-archive-u3FYWf
  289. 32.93 s > Extracted 4 files to /build/nextest-archive-u3FYWf in 0.04s
  290. 32.93 s > ------------
  291. 32.93 s > Nextest run ID 263e48c4-4b6f-4e21-80f3-bfa815629113 with nextest profile: ci_gammaloop
  292. 32.93 s > Starting 0 tests across 1 binary
  293. 32.93 s > ------------
  294. 32.93 s > Summary [ 0.000s] 0 tests run: 0 passed, 0 skipped
  295. 32.93 s >
  296. 32.93 s > ========== nextest test summary ==========
  297. 32.93 s > report: target/nextest/ci_gammaloop/junit.xml
  298. 32.93 s > tests: 0, failures: 0, errors: 0
  299. 32.93 s > No failing testcases found.
  300. 32.93 s > =========================================
  301. 32.93 s > Extracting 4 binaries, 1 build script output directory, and 2 linked paths to /build/nextest-archive-clXqxy
  302. 32.93 s > Extracted 18 files to /build/nextest-archive-clXqxy in 0.44s
  303. 32.93 s > ------------
  304. 32.93 s > Nextest run ID 63d91ff3-71a1-4887-b340-ed19d530a89f with nextest profile: ci_gammaloop
  305. 32.93 s > Starting 488 tests across 4 binaries (61 tests skipped, including 60 tests via profile.ci_gammaloop.default-filter)
  306. 32.93 s > FAIL [ 0.610s] (258/488) gammalooprs graph::feynman_graph::tests::native_thermal_distributions
  307. 32.93 s > stdout ---
  308. 32.93 s >
  309. 32.93 s > running 1 test
  310. 32.93 s > test graph::feynman_graph::tests::native_thermal_distributions ... FAILED
  311. 32.93 s >
  312. 32.93 s > failures:
  313. 32.93 s >
  314. 32.93 s > failures:
  315. 32.93 s > graph::feynman_graph::tests::native_thermal_distributions
  316. 32.93 s >
  317. 32.93 s > test result: FAILED. 0 passed; 1 failed; 0 ignored; 0 measured; 540 filtered out; finished in 0.60s
  318. 32.93 s >
  319. 32.93 s > stderr ---
  320. 32.93 s > The application panicked (crashed).
  321. 32.93 s > Message: called `Result::unwrap()` on an `Err` value: Custom { kind: Other, error: "Could not compile code: g++ -shared -O3 -fPIC -ffast-math -funsafe-math-optimizations -march=native -o /build/gammaloop-native-thermal-1339/thermal_0_0.so /build/gammaloop-native-thermal-1339/thermal_0_0.cpp\nwarning: Skipping impure flag -march=native because NIX_ENFORCE_NO_NATIVE is set\n/build/gammaloop-native-thermal-1339/thermal_0_0.cpp: In function 'void thermal_realf64(const double*, double*, double*)':\n/build/gammaloop-native-thermal-1339/thermal_0_0.cpp:27:16: error: 'symbolica_tanh' was not declared in this scope\n 27 | Z[6] = symbolica_tanh(Z[6]);\n | ^~~~~~~~~~~~~~\n" }
  322. 32.93 s > Location: crates/gammalooprs/src/graph/feynman_graph.rs:937
  323. 32.93 s >
  324. 32.93 s > ━━━━━━━━━━━━━━━━━━━━━━━━━━━━━━━━━━ BACKTRACE ━━━━━━━━━━━━━━━━━━━━━━━━━━━━━━━━━━━
  325. 32.93 s > 1: <color_eyre[b0c9e66060e883b2]::config::PanicHook>::panic_report<unknown>
  326. 32.93 s > at <unknown source file>:<unknown line>
  327. 32.93 s > 2: <color_eyre[b0c9e66060e883b2]::config::PanicHook>::into_panic_hook::{closure#0}<unknown>
  328. 32.93 s > at <unknown source file>:<unknown line>
  329. 32.93 s > 3: std[bcb96dfbba0ab899]::panicking::panic_with_hook<unknown>
  330. 32.93 s > at <unknown source file>:<unknown line>
  331. 32.93 s > 4: std[bcb96dfbba0ab899]::panicking::panic_handler::{closure#0}<unknown>
  332. 32.93 s > at <unknown source file>:<unknown line>
  333. 32.93 s > 5: std[bcb96dfbba0ab899]::sys::backtrace::__rust_end_short_backtrace::<std[bcb96dfbba0ab899]::panicking::panic_handler::{closure#0}, !><unknown>
  334. 32.93 s > at <unknown source file>:<unknown line>
  335. 32.93 s > 6: __rustc[6c289b9f9c454d21]::rust_begin_unwind<unknown>
  336. 32.93 s > at <unknown source file>:<unknown line>
  337. 32.93 s > 7: core[940e698046960fd5]::panicking::panic_fmt<unknown>
  338. 32.93 s > at <unknown source file>:<unknown line>
  339. 32.93 s > 8: core[940e698046960fd5]::result::unwrap_failed<unknown>
  340. 32.93 s > at <unknown source file>:<unknown line>
  341. 32.93 s > 9: gammalooprs[99a2022df78a4f41]::graph::feynman_graph::tests::native_thermal_distributions<unknown>
  342. 32.93 s > at <unknown source file>:<unknown line>
  343. 32.93 s > 10: <gammalooprs[99a2022df78a4f41]::graph::feynman_graph::tests::native_thermal_distributions::{closure#0} as core[940e698046960fd5]::ops::function::FnOnce<()>>::call_once<unknown>
  344. 32.93 s > at <unknown source file>:<unknown line>
  345. 32.93 s > 11: test[75d6903177b1d7e9]::__rust_begin_short_backtrace::<core[940e698046960fd5]::result::Result<(), alloc[2ea6bcb46fca0c42]::string::String>, fn() -> core[940e698046960fd5]::result::Result<(), alloc[2ea6bcb46fca0c42]::string::String>><unknown>
  346. 32.93 s > at <unknown source file>:<unknown line>
  347. 32.93 s > 12: test[75d6903177b1d7e9]::run_test::{closure#0}<unknown>
  348. 32.93 s > at <unknown source file>:<unknown line>
  349. 32.93 s > 13: std[bcb96dfbba0ab899]::sys::backtrace::__rust_begin_short_backtrace::<test[75d6903177b1d7e9]::run_test::{closure#1}, ()><unknown>
  350. 32.93 s > at <unknown source file>:<unknown line>
  351. 32.93 s > 14: <std[bcb96dfbba0ab899]::thread::lifecycle::spawn_unchecked<test[75d6903177b1d7e9]::run_test::{closure#1}, ()>::{closure#1} as core[940e698046960fd5]::ops::function::FnOnce<()>>::call_once::{shim:vtable#0}<unknown>
  352. 32.93 s > at <unknown source file>:<unknown line>
  353. 32.93 s > 15: <std[bcb96dfbba0ab899]::sys::thread::unix::Thread>::new::thread_start<unknown>
  354. 32.93 s > at <unknown source file>:<unknown line>
  355. 32.93 s > 16: start_thread<unknown>
  356. 32.93 s > at <unknown source file>:<unknown line>
  357. 32.93 s > 17: __clone3<unknown>
  358. 32.93 s > at <unknown source file>:<unknown line>
  359. 32.93 s >
  360. 32.93 s > Run with COLORBT_SHOW_HIDDEN=1 environment variable to disable frame filtering.
  361. 32.93 s > Run with RUST_BACKTRACE=full to include source snippets.
  362. 32.93 s >
  363. 32.93 s > ------------
  364. 32.93 s > Summary [ 9.635s] 488 tests run: 487 passed, 1 failed, 61 skipped
  365. 32.93 s > FAIL [ 0.610s] (258/488) gammalooprs graph::feynman_graph::tests::native_thermal_distributions
  366. 32.93 s > stdout ---
  367. 32.93 s >
  368. 32.93 s > running 1 test
  369. 32.93 s > test graph::feynman_graph::tests::native_thermal_distributions ... FAILED
  370. 32.93 s >
  371. 32.93 s > failures:
  372. 32.93 s >
  373. 32.93 s > failures:
  374. 32.93 s > graph::feynman_graph::tests::native_thermal_distributions
  375. 32.93 s >
  376. 32.93 s > test result: FAILED. 0 passed; 1 failed; 0 ignored; 0 measured; 540 filtered out; finished in 0.60s
  377. 32.93 s >
  378. 32.93 s > stderr ---
  379. 32.93 s > The application panicked (crashed).
  380. 32.93 s > Message: called `Result::unwrap()` on an `Err` value: Custom { kind: Other, error: "Could not compile code: g++ -shared -O3 -fPIC -ffast-math -funsafe-math-optimizations -march=native -o /build/gammaloop-native-thermal-1339/thermal_0_0.so /build/gammaloop-native-thermal-1339/thermal_0_0.cpp\nwarning: Skipping impure flag -march=native because NIX_ENFORCE_NO_NATIVE is set\n/build/gammaloop-native-thermal-1339/thermal_0_0.cpp: In function 'void thermal_realf64(const double*, double*, double*)':\n/build/gammaloop-native-thermal-1339/thermal_0_0.cpp:27:16: error: 'symbolica_tanh' was not declared in this scope\n 27 | Z[6] = symbolica_tanh(Z[6]);\n | ^~~~~~~~~~~~~~\n" }
  381. 32.93 s > Location: crates/gammalooprs/src/graph/feynman_graph.rs:937
  382. 32.93 s >
  383. 32.93 s > ━━━━━━━━━━━━━━━━━━━━━━━━━━━━━━━━━━ BACKTRACE ━━━━━━━━━━━━━━━━━━━━━━━━━━━━━━━━━━━
  384. 32.93 s > 1: <color_eyre[b0c9e66060e883b2]::config::PanicHook>::panic_report<unknown>
  385. 32.93 s > at <unknown source file>:<unknown line>
  386. 32.93 s > 2: <color_eyre[b0c9e66060e883b2]::config::PanicHook>::into_panic_hook::{closure#0}<unknown>
  387. 32.93 s > at <unknown source file>:<unknown line>
  388. 32.93 s > 3: std[bcb96dfbba0ab899]::panicking::panic_with_hook<unknown>
  389. 32.93 s > at <unknown source file>:<unknown line>
  390. 32.93 s > 4: std[bcb96dfbba0ab899]::panicking::panic_handler::{closure#0}<unknown>
  391. 32.93 s > at <unknown source file>:<unknown line>
  392. 32.93 s > 5: std[bcb96dfbba0ab899]::sys::backtrace::__rust_end_short_backtrace::<std[bcb96dfbba0ab899]::panicking::panic_handler::{closure#0}, !><unknown>
  393. 32.93 s > at <unknown source file>:<unknown line>
  394. 32.93 s > 6: __rustc[6c289b9f9c454d21]::rust_begin_unwind<unknown>
  395. 32.93 s > at <unknown source file>:<unknown line>
  396. 32.93 s > 7: core[940e698046960fd5]::panicking::panic_fmt<unknown>
  397. 32.93 s > at <unknown source file>:<unknown line>
  398. 32.93 s > 8: core[940e698046960fd5]::result::unwrap_failed<unknown>
  399. 32.93 s > at <unknown source file>:<unknown line>
  400. 32.93 s > 9: gammalooprs[99a2022df78a4f41]::graph::feynman_graph::tests::native_thermal_distributions<unknown>
  401. 32.93 s > at <unknown source file>:<unknown line>
  402. 32.93 s > 10: <gammalooprs[99a2022df78a4f41]::graph::feynman_graph::tests::native_thermal_distributions::{closure#0} as core[940e698046960fd5]::ops::function::FnOnce<()>>::call_once<unknown>
  403. 32.93 s > at <unknown source file>:<unknown line>
  404. 32.93 s > 11: test[75d6903177b1d7e9]::__rust_begin_short_backtrace::<core[940e698046960fd5]::result::Result<(), alloc[2ea6bcb46fca0c42]::string::String>, fn() -> core[940e698046960fd5]::result::Result<(), alloc[2ea6bcb46fca0c42]::string::String>><unknown>
  405. 32.93 s > at <unknown source file>:<unknown line>
  406. 32.93 s > 12: test[75d6903177b1d7e9]::run_test::{closure#0}<unknown>
  407. 32.93 s > at <unknown source file>:<unknown line>
  408. 32.93 s > 13: std[bcb96dfbba0ab899]::sys::backtrace::__rust_begin_short_backtrace::<test[75d6903177b1d7e9]::run_test::{closure#1}, ()><unknown>
  409. 32.93 s > at <unknown source file>:<unknown line>
  410. 32.93 s > 14: <std[bcb96dfbba0ab899]::thread::lifecycle::spawn_unchecked<test[75d6903177b1d7e9]::run_test::{closure#1}, ()>::{closure#1} as core[940e698046960fd5]::ops::function::FnOnce<()>>::call_once::{shim:vtable#0}<unknown>
  411. 32.93 s > at <unknown source file>:<unknown line>
  412. 32.93 s > 15: <std[bcb96dfbba0ab899]::sys::thread::unix::Thread>::new::thread_start<unknown>
  413. 32.93 s > at <unknown source file>:<unknown line>
  414. 32.93 s > 16: start_thread<unknown>
  415. 32.93 s > at <unknown source file>:<unknown line>
  416. 32.93 s > 17: __clone3<unknown>
  417. 32.93 s > at <unknown source file>:<unknown line>
  418. 32.93 s >
  419. 32.93 s > Run with COLORBT_SHOW_HIDDEN=1 environment variable to disable frame filtering.
  420. 32.93 s > Run with RUST_BACKTRACE=full to include source snippets.
  421. 32.93 s >
  422. 32.93 s > error: test run failed
  423. 32.93 s >
  424. 32.93 s > ========== nextest test summary ==========
  425. 32.93 s > report: target/nextest/ci_gammaloop/junit.xml
  426. 32.93 s > tests: 488, failures: 1, errors: 0
  427. 32.93 s >
  428. 32.93 s > 1. gammalooprs::graph::feynman_graph::tests::native_thermal_distributions
  429. 32.93 s > failure: test failure with exit code 101
  430. 32.93 s > system-out
  431. 32.93 s > running 1 test
  432. 32.93 s > test graph::feynman_graph::tests::native_thermal_distributions ... FAILED
  433. 32.93 s >
  434. 32.93 s > failures:
  435. 32.93 s >
  436. 32.93 s > failures:
  437. 32.93 s > graph::feynman_graph::tests::native_thermal_distributions
  438. 32.93 s >
  439. 32.93 s > test result: FAILED. 0 passed; 1 failed; 0 ignored; 0 measured; 540 filtered out; finished in 0.60s
  440. 32.93 s > system-err
  441. 32.93 s > The application panicked (crashed).
  442. 32.93 s > Message: called `Result::unwrap()` on an `Err` value: Custom { kind: Other, error: "Could not compile code: g++ -shared -O3 -fPIC -ffast-math -funsafe-math-optimizations -march=native -o /build/gammaloop-native-thermal-1339/thermal_0_0.so /build/gammaloop-native-thermal-1339/thermal_0_0.cpp\nwarning: Skipping impure flag -march=native because NIX_ENFORCE_NO_NATIVE is set\n/build/gammaloop-native-thermal-1339/thermal_0_0.cpp: In function 'void thermal_realf64(const double*, double*, double*)':\n/build/gammaloop-native-thermal-1339/thermal_0_0.cpp:27:16: error: 'symbolica_tanh' was not declared in this scope\n 27 | Z[6] = symbolica_tanh(Z[6]);\n | ^~~~~~~~~~~~~~\n" }
  443. 32.93 s > Location: crates/gammalooprs/src/graph/feynman_graph.rs:937
  444. 32.93 s >
  445. 32.93 s > ━━━━━━━━━━━━━━━━━━━━━━━━━━━━━━━━━━ BACKTRACE ━━━━━━━━━━━━━━━━━━━━━━━━━━━━━━━━━━━
  446. 32.93 s > 1: <color_eyre[b0c9e66060e883b2]::config::PanicHook>::panic_report<unknown>
  447. 32.93 s > at <unknown source file>:<unknown line>
  448. 32.93 s > 2: <color_eyre[b0c9e66060e883b2]::config::PanicHook>::into_panic_hook::{closure#0}<unknown>
  449. 32.93 s > at <unknown source file>:<unknown line>
  450. 32.93 s > 3: std[bcb96dfbba0ab899]::panicking::panic_with_hook<unknown>
  451. 32.93 s > at <unknown source file>:<unknown line>
  452. 32.93 s > 4: std[bcb96dfbba0ab899]::panicking::panic_handler::{closure#0}<unknown>
  453. 32.93 s > at <unknown source file>:<unknown line>
  454. 32.93 s > 5: std[bcb96dfbba0ab899]::sys::backtrace::__rust_end_short_backtrace::<std[bcb96dfbba0ab899]::panicking::panic_handler::{closure#0}, !><unknown>
  455. 32.93 s > at <unknown source file>:<unknown line>
  456. 32.93 s > 6: __rustc[6c289b9f9c454d21]::rust_begin_unwind<unknown>
  457. 32.93 s > at <unknown source file>:<unknown line>
  458. 32.93 s > 7: core[940e698046960fd5]::panicking::panic_fmt<unknown>
  459. 32.93 s > at <unknown source file>:<unknown line>
  460. 32.93 s > 8: core[940e698046960fd5]::result::unwrap_failed<unknown>
  461. 32.93 s > at <unknown source file>:<unknown line>
  462. 32.93 s > 9: gammalooprs[99a2022df78a4f41]::graph::feynman_graph::tests::native_thermal_distributions<unknown>
  463. 32.93 s > at <unknown source file>:<unknown line>
  464. 32.93 s > 10: <gammalooprs[99a2022df78a4f41]::graph::feynman_graph::tests::native_thermal_distributions::{closure#0} as core[940e698046960fd5]::ops::function::FnOnce<()>>::call_once<unknown>
  465. 32.93 s > at <unknown source file>:<unknown line>
  466. 32.93 s > 11: test[75d6903177b1d7e9]::__rust_begin_short_backtrace::<core[940e698046960fd5]::result::Result<(), alloc[2ea6bcb46fca0c42]::string::String>, fn() -> core[940e698046960fd5]::result::Result<(), alloc[2ea6bcb46fca0c42]::string::String>><unknown>
  467. 32.93 s > at <unknown source file>:<unknown line>
  468. 32.93 s > 12: test[75d6903177b1d7e9]::run_test::{closure#0}<unknown>
  469. 32.93 s > at <unknown source file>:<unknown line>
  470. 32.93 s > 13: std[bcb96dfbba0ab899]::sys::backtrace::__rust_begin_short_backtrace::<test[75d6903177b1d7e9]::run_test::{closure#1}, ()><unknown>
  471. 32.93 s > at <unknown source file>:<unknown line>
  472. 32.93 s > 14: <std[bcb96dfbba0ab899]::thread::lifecycle::spawn_unchecked<test[75d6903177b1d7e9]::run_test::{closure#1}, ()>::{closure#1} as core[940e698046960fd5]::ops::function::FnOnce<()>>::call_once::{shim:vtable#0}<unknown>
  473. 32.93 s > at <unknown source file>:<unknown line>
  474. 32.93 s > 15: <std[bcb96dfbba0ab899]::sys::thread::unix::Thread>::new::thread_start<unknown>
  475. 32.93 s > at <unknown source file>:<unknown line>
  476. 32.93 s > 16: start_thread<unknown>
  477. 32.93 s > at <unknown source file>:<unknown line>
  478. 32.93 s > 17: __clone3<unknown>
  479. 32.93 s > at <unknown source file>:<unknown line>
  480. 32.93 s >
  481. 32.93 s > Run with COLORBT_SHOW_HIDDEN=1 environment variable to disable frame filtering.
  482. 32.93 s > Run with RUST_BACKTRACE=full to include source snippets.
  483. 32.93 s > =========================================
  484. 32.93 s For full logs, run:
  485. 32.93 s nix log /nix/store/kmbwnz7qn7m6zsnr5x139hrrypyr7sj5-gammaloop-nextest-core.drv
  486. 33.03 s [0 built (1 failed), 0.0Run failed.