1. 0.00 s $ /nix/store/9ypz3flqsrl5xl495mm8h645gadjsxi1-coreutils-9.11/bin/timeout --kill-after=15s 7200s /nix/store/23zk8sgzamrbmj1fday15szf7f2279s8-nix-2.34.7/bin/nix --extra-experimental-features nix-command --extra-experimental-features flakes flake clone git+https://github.com/alphal00p/gammaloop --dest /tmp/nix-ci-worker/stable-pwd/repo/
  2. 0.08 s Cloning into '/tmp/nix-ci-worker/stable-pwd/repo'...
  3. 1.75 s remote: Enumerating objects: 83699, done.
  4. 1.86 s remote: Counting objects: 0% (1/9854) remote: Counting objects: 1% (99/9854) remote: Counting objects: 2% (198/9854) remote: Counting objects: 3% (296/9854) remote: Counting objects: 4% (395/9854) remote: Counting objects: 5% (493/9854) remote: Counting objects: 6% (592/9854) remote: Counting objects: 7% (690/9854) remote: Counting objects: 8% (789/9854) remote: Counting objects: 9% (887/9854) remote: Counting objects: 10% (986/9854) remote: Counting objects: 11% (1084/9854) remote: Counting objects: 12% (1183/9854) remote: Counting objects: 13% (1282/9854) remote: Counting objects: 14% (1380/9854) remote: Counting objects: 15% (1479/9854) remote: Counting objects: 16% (1577/9854) remote: Counting objects: 17% (1676/9854) remote: Counting objects: 18% (1774/9854) remote: Counting objects: 19% (1873/9854) remote: Counting objects: 20% (1971/9854) remote: Counting objects: 21% (2070/9854) remote: Counting objects: 22% (2168/9854) remote: Counting objects: 23% (2267/9854) remote: Counting objects: 24% (2365/9854) remote: Counting objects: 25% (2464/9854) remote: Counting objects: 26% (2563/9854) remote: Counting objects: 27% (2661/9854) remote: Counting objects: 28% (2760/9854) remote: Counting objects: 29% (2858/9854) remote: Counting objects: 30% (2957/9854) remote: Counting objects: 31% (3055/9854) remote: Counting objects: 32% (3154/9854) remote: Counting objects: 33% (3252/9854) remote: Counting objects: 34% (3351/9854) remote: Counting objects: 35% (3449/9854) remote: Counting objects: 36% (3548/9854) remote: Counting objects: 37% (3646/9854) remote: Counting objects: 38% (3745/9854) remote: Counting objects: 39% (3844/9854) remote: Counting objects: 40% (3942/9854) remote: Counting objects: 41% (4041/9854) remote: Counting objects: 42% (4139/9854) remote: Counting objects: 43% (4238/9854) remote: Counting objects: 44% (4336/9854) remote: Counting objects: 45% (4435/9854) remote: Counting objects: 46% (4533/9854) remote: Counting objects: 47% (4632/9854) remote: Counting objects: 48% (4730/9854) remote: Counting objects: 49% (4829/9854) remote: Counting objects: 50% (4927/9854) remote: Counting objects: 51% (5026/9854) remote: Counting objects: 52% (5125/9854) remote: Counting objects: 53% (5223/9854) remote: Counting objects: 54% (5322/9854) remote: Counting objects: 55% (5420/9854) remote: Counting objects: 56% (5519/9854) remote: Counting objects: 57% (5617/9854) remote: Counting objects: 58% (5716/9854) remote: Counting objects: 59% (5814/9854) remote: Counting objects: 60% (5913/9854) remote: Counting objects: 61% (6011/9854) remote: Counting objects: 62% (6110/9854) remote: Counting objects: 63% (6209/9854) remote: Counting objects: 64% (6307/9854) remote: Counting objects: 65% (6406/9854) remote: Counting objects: 66% (6504/9854) remote: Counting objects: 67% (6603/9854) remote: Counting objects: 68% (6701/9854) remote: Counting objects: 69% (6800/9854) remote: Counting objects: 70% (6898/9854) remote: Counting objects: 71% (6997/9854) remote: Counting objects: 72% (7095/9854) remote: Counting objects: 73% (7194/9854) remote: Counting objects: 74% (7292/9854) remote: Counting objects: 75% (7391/9854) remote: Counting objects: 76% (7490/9854) remote: Counting objects: 77% (7588/9854) remote: Counting objects: 78% (7687/9854) remote: Counting objects: 79% (7785/9854) remote: Counting objects: 80% (7884/9854) remote: Counting objects: 81% (7982/9854) remote: Counting objects: 82% (8081/9854) remote: Counting objects: 83% (8179/9854) remote: Counting objects: 84% (8278/9854) remote: Counting objects: 85% (8376/9854) remote: Counting objects: 86% (8475/9854) remote: Counting objects: 87% (8573/9854) remote: Counting objects: 88% (8672/9854) remote: Counting objects: 89% (8771/9854) remote: Counting objects: 90% (8869/9854) remote: Counting objects: 91% (8968/9854) remote: Counting objects: 92% (9066/9854) remote: Counting objects: 93% (9165/9854) remote: Counting objects: 94% (9263/9854) remote: Counting objects: 95% (9362/9854) remote: Counting objects: 96% (9460/9854) remote: Counting objects: 97% (9559/9854) remote: Counting objects: 98% (9657/9854) remote: Counting objects: 99% (9756/9854) remote: Counting objects: 100% (9854/9854) remote: Counting objects: 100% (9854/9854), done.
  5. 4.44 s remote: Compressing objects: 0% (1/2138) remote: Compressing objects: 1% (22/2138) remote: Compressing objects: 2% (43/2138) remote: Compressing objects: 3% (65/2138) remote: Compressing objects: 4% (86/2138) remote: Compressing objects: 5% (107/2138) remote: Compressing objects: 6% (129/2138) remote: Compressing objects: 7% (150/2138) remote: Compressing objects: 8% (172/2138) remote: Compressing objects: 9% (193/2138) remote: Compressing objects: 10% (214/2138) remote: Compressing objects: 11% (236/2138) remote: Compressing objects: 12% (257/2138) remote: Compressing objects: 13% (278/2138) remote: Compressing objects: 14% (300/2138) remote: Compressing objects: 15% (321/2138) remote: Compressing objects: 15% (333/2138) remote: Compressing objects: 16% (343/2138) remote: Compressing objects: 17% (364/2138) remote: Compressing objects: 18% (385/2138) remote: Compressing objects: 19% (407/2138) remote: Compressing objects: 20% (428/2138) remote: Compressing objects: 21% (449/2138) remote: Compressing objects: 22% (471/2138) remote: Compressing objects: 22% (476/2138) remote: Compressing objects: 23% (492/2138) remote: Compressing objects: 24% (514/2138) remote: Compressing objects: 25% (535/2138) remote: Compressing objects: 26% (556/2138) remote: Compressing objects: 27% (578/2138) remote: Compressing objects: 28% (599/2138) remote: Compressing objects: 29% (621/2138) remote: Compressing objects: 30% (642/2138) remote: Compressing objects: 31% (663/2138) remote: Compressing objects: 32% (685/2138) remote: Compressing objects: 33% (706/2138) remote: Compressing objects: 34% (727/2138) remote: Compressing objects: 35% (749/2138) remote: Compressing objects: 36% (770/2138) remote: Compressing objects: 37% (792/2138) remote: Compressing objects: 38% (813/2138) remote: Compressing objects: 39% (834/2138) remote: Compressing objects: 40% (856/2138) remote: Compressing objects: 41% (877/2138) remote: Compressing objects: 42% (898/2138) remote: Compressing objects: 43% (920/2138) remote: Compressing objects: 44% (941/2138) remote: Compressing objects: 45% (963/2138) remote: Compressing objects: 46% (984/2138) remote: Compressing objects: 47% (1005/2138) remote: Compressing objects: 48% (1027/2138) remote: Compressing objects: 49% (1048/2138) remote: Compressing objects: 50% (1069/2138) remote: Compressing objects: 51% (1091/2138) remote: Compressing objects: 52% (1112/2138) remote: Compressing objects: 53% (1134/2138) remote: Compressing objects: 54% (1155/2138) remote: Compressing objects: 55% (1176/2138) remote: Compressing objects: 56% (1198/2138) remote: Compressing objects: 57% (1219/2138) remote: Compressing objects: 58% (1241/2138) remote: Compressing objects: 59% (1262/2138) remote: Compressing objects: 60% (1283/2138) remote: Compressing objects: 61% (1305/2138) remote: Compressing objects: 62% (1326/2138) remote: Compressing objects: 63% (1347/2138) remote: Compressing objects: 64% (1369/2138) remote: Compressing objects: 65% (1390/2138) remote: Compressing objects: 66% (1412/2138) remote: Compressing objects: 67% (1433/2138) remote: Compressing objects: 68% (1454/2138) remote: Compressing objects: 69% (1476/2138) remote: Compressing objects: 70% (1497/2138) remote: Compressing objects: 71% (1518/2138) remote: Compressing objects: 72% (1540/2138) remote: Compressing objects: 73% (1561/2138) remote: Compressing objects: 74% (1583/2138) remote: Compressing objects: 75% (1604/2138) remote: Compressing objects: 76% (1625/2138) remote: Compressing objects: 77% (1647/2138) remote: Compressing objects: 78% (1668/2138) remote: Compressing objects: 79% (1690/2138) remote: Compressing objects: 80% (1711/2138) remote: Compressing objects: 81% (1732/2138) remote: Compressing objects: 82% (1754/2138) remote: Compressing objects: 83% (1775/2138) remote: Compressing objects: 84% (1796/2138) remote: Compressing objects: 85% (1818/2138) remote: Compressing objects: 86% (1839/2138) remote: Compressing objects: 87% (1861/2138) remote: Compressing objects: 88% (1882/2138) remote: Compressing objects: 89% (1903/2138) remote: Compressing objects: 90% (1925/2138) remote: Compressing objects: 91% (1946/2138) remote: Compressing objects: 92% (1967/2138) remote: Compressing objects: 93% (1989/2138) remote: Compressing objects: 94% (2010/2138) remote: Compressing objects: 95% (2032/2138) remote: Compressing objects: 96% (2053/2138) remote: Compressing objects: 97% (2074/2138) remote: Compressing objects: 98% (2096/2138) remote: Compressing objects: 99% (2117/2138) remote: Compressing objects: 100% (2138/2138) remote: Compressing objects: 100% (2138/2138), done.
  6. 8.92 s Receiving objects: 0% (1/83699) Receiving objects: 1% (837/83699) Receiving objects: 2% (1674/83699) Receiving objects: 3% (2511/83699) Receiving objects: 4% (3348/83699) Receiving objects: 5% (4185/83699) Receiving objects: 6% (5022/83699) Receiving objects: 7% (5859/83699) Receiving objects: 8% (6696/83699) Receiving objects: 9% (7533/83699) Receiving objects: 10% (8370/83699), 17.95 MiB | 35.88 MiB/s Receiving objects: 11% (9207/83699), 17.95 MiB | 35.88 MiB/s Receiving objects: 12% (10044/83699), 17.95 MiB | 35.88 MiB/s Receiving objects: 13% (10881/83699), 17.95 MiB | 35.88 MiB/s Receiving objects: 14% (11718/83699), 17.95 MiB | 35.88 MiB/s Receiving objects: 15% (12555/83699), 17.95 MiB | 35.88 MiB/s Receiving objects: 16% (13392/83699), 17.95 MiB | 35.88 MiB/s Receiving objects: 17% (14229/83699), 17.95 MiB | 35.88 MiB/s Receiving objects: 18% (15066/83699), 17.95 MiB | 35.88 MiB/s Receiving objects: 19% (15903/83699), 17.95 MiB | 35.88 MiB/s Receiving objects: 20% (16740/83699), 17.95 MiB | 35.88 MiB/s Receiving objects: 21% (17577/83699), 17.95 MiB | 35.88 MiB/s Receiving objects: 22% (18414/83699), 17.95 MiB | 35.88 MiB/s Receiving objects: 22% (19125/83699), 17.95 MiB | 35.88 MiB/s Receiving objects: 23% (19251/83699), 17.95 MiB | 35.88 MiB/s Receiving objects: 24% (20088/83699), 17.95 MiB | 35.88 MiB/s Receiving objects: 25% (20925/83699), 17.95 MiB | 35.88 MiB/s Receiving objects: 26% (21762/83699), 17.95 MiB | 35.88 MiB/s Receiving objects: 27% (22599/83699), 17.95 MiB | 35.88 MiB/s Receiving objects: 28% (23436/83699), 17.95 MiB | 35.88 MiB/s Receiving objects: 29% (24273/83699), 17.95 MiB | 35.88 MiB/s Receiving objects: 30% (25110/83699), 17.95 MiB | 35.88 MiB/s Receiving objects: 31% (25947/83699), 17.95 MiB | 35.88 MiB/s Receiving objects: 32% (26784/83699), 17.95 MiB | 35.88 MiB/s Receiving objects: 33% (27621/83699), 17.95 MiB | 35.88 MiB/s Receiving objects: 34% (28458/83699), 17.95 MiB | 35.88 MiB/s Receiving objects: 35% (29295/83699), 17.95 MiB | 35.88 MiB/s Receiving objects: 36% (30132/83699), 17.95 MiB | 35.88 MiB/s Receiving objects: 37% (30969/83699), 17.95 MiB | 35.88 MiB/s Receiving objects: 38% (31806/83699), 17.95 MiB | 35.88 MiB/s Receiving objects: 39% (32643/83699), 17.95 MiB | 35.88 MiB/s Receiving objects: 40% (33480/83699), 17.95 MiB | 35.88 MiB/s Receiving objects: 41% (34317/83699), 17.95 MiB | 35.88 MiB/s Receiving objects: 42% (35154/83699), 35.58 MiB | 35.57 MiB/s Receiving objects: 43% (35991/83699), 35.58 MiB | 35.57 MiB/s Receiving objects: 44% (36828/83699), 35.58 MiB | 35.57 MiB/s Receiving objects: 45% (37665/83699), 35.58 MiB | 35.57 MiB/s Receiving objects: 46% (38502/83699), 35.58 MiB | 35.57 MiB/s Receiving objects: 47% (39339/83699), 35.58 MiB | 35.57 MiB/s Receiving objects: 48% (40176/83699), 35.58 MiB | 35.57 MiB/s Receiving objects: 49% (41013/83699), 35.58 MiB | 35.57 MiB/s Receiving objects: 50% (41850/83699), 35.58 MiB | 35.57 MiB/s Receiving objects: 51% (42687/83699), 35.58 MiB | 35.57 MiB/s Receiving objects: 52% (43524/83699), 35.58 MiB | 35.57 MiB/s Receiving objects: 53% (44361/83699), 51.96 MiB | 33.86 MiB/s Receiving objects: 54% (45198/83699), 51.96 MiB | 33.86 MiB/s Receiving objects: 55% (46035/83699), 51.96 MiB | 33.86 MiB/s Receiving objects: 55% (46297/83699), 51.96 MiB | 33.86 MiB/s Receiving objects: 56% (46872/83699), 51.96 MiB | 33.86 MiB/s Receiving objects: 57% (47709/83699), 51.96 MiB | 33.86 MiB/s Receiving objects: 58% (48546/83699), 51.96 MiB | 33.86 MiB/s Receiving objects: 59% (49383/83699), 51.96 MiB | 33.86 MiB/s Receiving objects: 60% (50220/83699), 69.50 MiB | 33.44 MiB/s Receiving objects: 61% (51057/83699), 69.50 MiB | 33.44 MiB/s Receiving objects: 62% (51894/83699), 69.50 MiB | 33.44 MiB/s Receiving objects: 63% (52731/83699), 69.50 MiB | 33.44 MiB/s Receiving objects: 64% (53568/83699), 69.50 MiB | 33.44 MiB/s Receiving objects: 65% (54405/83699), 69.50 MiB | 33.44 MiB/s Receiving objects: 66% (55242/83699), 69.50 MiB | 33.44 MiB/s Receiving objects: 67% (56079/83699), 69.50 MiB | 33.44 MiB/s Receiving objects: 68% (56916/83699), 69.50 MiB | 33.44 MiB/s Receiving objects: 69% (57753/83699), 69.50 MiB | 33.44 MiB/s Receiving objects: 70% (58590/83699), 69.50 MiB | 33.44 MiB/s Receiving objects: 71% (59427/83699), 69.50 MiB | 33.44 MiB/s Receiving objects: 71% (59591/83699), 88.50 MiB | 33.75 MiB/s Receiving objects: 72% (60264/83699), 88.50 MiB | 33.75 MiB/s Receiving objects: 73% (61101/83699), 88.50 MiB | 33.75 MiB/s Receiving objects: 74% (61938/83699), 88.50 MiB | 33.75 MiB/s Receiving objects: 75% (62775/83699), 88.50 MiB | 33.75 MiB/s Receiving objects: 76% (63612/83699), 88.50 MiB | 33.75 MiB/s Receiving objects: 77% (64449/83699), 107.32 MiB | 33.90 MiB/s Receiving objects: 78% (65286/83699), 107.32 MiB | 33.90 MiB/s Receiving objects: 79% (66123/83699), 107.32 MiB | 33.90 MiB/s Receiving objects: 80% (66960/83699), 107.32 MiB | 33.90 MiB/s Receiving objects: 81% (67797/83699), 107.32 MiB | 33.90 MiB/s Receiving objects: 82% (68634/83699), 107.32 MiB | 33.90 MiB/s Receiving objects: 83% (69471/83699), 107.32 MiB | 33.90 MiB/s Receiving objects: 84% (70308/83699), 107.32 MiB | 33.90 MiB/s Receiving objects: 85% (71145/83699), 107.32 MiB | 33.90 MiB/s Receiving objects: 86% (71982/83699), 107.32 MiB | 33.90 MiB/s Receiving objects: 87% (72819/83699), 107.32 MiB | 33.90 MiB/s Receiving objects: 87% (73500/83699), 107.32 MiB | 33.90 MiB/s Receiving objects: 88% (73656/83699), 107.32 MiB | 33.90 MiB/s Receiving objects: 89% (74493/83699), 107.32 MiB | 33.90 MiB/s Receiving objects: 90% (75330/83699), 107.32 MiB | 33.90 MiB/s Receiving objects: 91% (76167/83699), 107.32 MiB | 33.90 MiB/s Receiving objects: 92% (77004/83699), 107.32 MiB | 33.90 MiB/s Receiving objects: 93% (77841/83699), 107.32 MiB | 33.90 MiB/s Receiving objects: 94% (78678/83699), 107.32 MiB | 33.90 MiB/s Receiving objects: 95% (79515/83699), 107.32 MiB | 33.90 MiB/s Receiving objects: 96% (80352/83699), 126.17 MiB | 34.41 MiB/s Receiving objects: 97% (81189/83699), 126.17 MiB | 34.41 MiB/s Receiving objects: 98% (82026/83699), 126.17 MiB | 34.41 MiB/s Receiving objects: 99% (82863/83699), 126.17 MiB | 34.41 MiB/s remote: Total 83699 (delta 7905), reused 8000 (delta 7183), pack-reused 73845 (from 3)
  7. 8.92 s Receiving objects: 100% (83699/83699), 126.17 MiB | 34.41 MiB/s Receiving objects: 100% (83699/83699), 139.23 MiB | 31.15 MiB/s, done.
  8. 9.89 s Resolving deltas: 0% (0/56221) Resolving deltas: 1% (564/56221) Resolving deltas: 2% (1125/56221) Resolving deltas: 3% (1687/56221) Resolving deltas: 4% (2249/56221) Resolving deltas: 5% (2812/56221) Resolving deltas: 6% (3374/56221) Resolving deltas: 7% (3936/56221) Resolving deltas: 8% (4498/56221) Resolving deltas: 9% (5060/56221) Resolving deltas: 10% (5624/56221) Resolving deltas: 11% (6188/56221) Resolving deltas: 12% (6747/56221) Resolving deltas: 13% (7309/56221) Resolving deltas: 14% (7871/56221) Resolving deltas: 15% (8434/56221) Resolving deltas: 16% (8996/56221) Resolving deltas: 17% (9561/56221) Resolving deltas: 18% (10120/56221) Resolving deltas: 19% (10682/56221) Resolving deltas: 20% (11245/56221) Resolving deltas: 21% (11807/56221) Resolving deltas: 22% (12369/56221) Resolving deltas: 23% (12931/56221) Resolving deltas: 24% (13494/56221) Resolving deltas: 25% (14056/56221) Resolving deltas: 26% (14618/56221) Resolving deltas: 27% (15180/56221) Resolving deltas: 28% (15742/56221) Resolving deltas: 29% (16305/56221) Resolving deltas: 30% (16867/56221) Resolving deltas: 31% (17430/56221) Resolving deltas: 32% (17991/56221) Resolving deltas: 33% (18553/56221) Resolving deltas: 34% (19116/56221) Resolving deltas: 35% (19678/56221) Resolving deltas: 36% (20240/56221) Resolving deltas: 37% (20802/56221) Resolving deltas: 38% (21364/56221) Resolving deltas: 39% (21927/56221) Resolving deltas: 40% (22489/56221) Resolving deltas: 41% (23051/56221) Resolving deltas: 42% (23613/56221) Resolving deltas: 43% (24176/56221) Resolving deltas: 44% (24738/56221) Resolving deltas: 45% (25300/56221) Resolving deltas: 46% (25862/56221) Resolving deltas: 47% (26424/56221) Resolving deltas: 48% (26987/56221) Resolving deltas: 49% (27549/56221) Resolving deltas: 50% (28111/56221) Resolving deltas: 51% (28673/56221) Resolving deltas: 52% (29236/56221) Resolving deltas: 53% (29798/56221) Resolving deltas: 54% (30360/56221) Resolving deltas: 55% (30922/56221) Resolving deltas: 56% (31484/56221) Resolving deltas: 57% (32046/56221) Resolving deltas: 58% (32609/56221) Resolving deltas: 59% (33171/56221) Resolving deltas: 60% (33733/56221) Resolving deltas: 61% (34295/56221) Resolving deltas: 62% (34858/56221) Resolving deltas: 63% (35420/56221) Resolving deltas: 64% (35983/56221) Resolving deltas: 65% (36544/56221) Resolving deltas: 66% (37107/56221) Resolving deltas: 67% (37669/56221) Resolving deltas: 68% (38231/56221) Resolving deltas: 69% (38793/56221) Resolving deltas: 70% (39355/56221) Resolving deltas: 71% (39917/56221) Resolving deltas: 72% (40480/56221) Resolving deltas: 73% (41042/56221) Resolving deltas: 74% (41604/56221) Resolving deltas: 75% (42171/56221) Resolving deltas: 76% (42728/56221) Resolving deltas: 77% (43292/56221) Resolving deltas: 78% (43853/56221) Resolving deltas: 79% (44415/56221) Resolving deltas: 80% (44978/56221) Resolving deltas: 81% (45540/56221) Resolving deltas: 82% (46102/56221) Resolving deltas: 83% (46664/56221) Resolving deltas: 84% (47227/56221) Resolving deltas: 85% (47788/56221) Resolving deltas: 86% (48352/56221) Resolving deltas: 87% (48913/56221) Resolving deltas: 88% (49475/56221) Resolving deltas: 89% (50037/56221) Resolving deltas: 90% (50599/56221) Resolving deltas: 91% (51163/56221) Resolving deltas: 92% (51724/56221) Resolving deltas: 93% (52286/56221) Resolving deltas: 94% (52848/56221) Resolving deltas: 95% (53410/56221) Resolving deltas: 96% (53973/56221) Resolving deltas: 97% (54535/56221) Resolving deltas: 98% (55099/56221) Resolving deltas: 99% (55660/56221) Resolving deltas: 100% (56221/56221) Resolving deltas: 100% (56221/56221), done.
  9. 10.29 s Fetching commit a7bf806f7ac4a7ccc06080a3ebab9e3e4e0e1258 for wip/native-symbolica-hyperbolics ...
  10. 10.29 s $ /nix/store/bcnisk3ydfgv26v2gw3zlky24g00yww2-git-2.54.0/bin/git fetch origin a7bf806f7ac4a7ccc06080a3ebab9e3e4e0e1258
  11. 10.69 s From https://github.com/alphal00p/gammaloop
  12. 10.69 s * branch a7bf806f7ac4a7ccc06080a3ebab9e3e4e0e1258 -> FETCH_HEAD
  13. 10.70 s $ /nix/store/9ypz3flqsrl5xl495mm8h645gadjsxi1-coreutils-9.11/bin/timeout --kill-after=15s 7200s /nix/store/bcnisk3ydfgv26v2gw3zlky24g00yww2-git-2.54.0/bin/git -c advice.detachedHead=false checkout a7bf806f7ac4a7ccc06080a3ebab9e3e4e0e1258
  14. 10.87 s HEAD is now at a7bf806f7 update symjit
  15. 10.87 s $ /nix/store/9ypz3flqsrl5xl495mm8h645gadjsxi1-coreutils-9.11/bin/timeout --kill-after=15s 7200s /nix/store/23zk8sgzamrbmj1fday15szf7f2279s8-nix-2.34.7/bin/nix --extra-experimental-features nix-command --extra-experimental-features flakes --log-format internal-json run .#packages.x86_64-linux.nix-ci-check-gammaloop-nextest-core --print-build-logs
  16. 10.97 s
  17. 16.86 s evaluating derivation 'g copying '/nix/store/cplq evaluating derivation 'g copying '/nix/store/cplq evaluating derivation 'g copying '/nix/store/cplq evaluating derivation 'g copying '/nix/store/cplq evaluating derivation 'g copying '/nix/store/cplq evaluating derivation 'g copying '/nix/store/cplq evaluating derivation 'g copying '/nix/store/cplq evaluating derivation 'g copying '/nix/store/cplq evaluating derivation 'g copying '/nix/store/cplq evaluating derivation 'g [0/1 built] [1/0/1 built] building ggammaloop-nextest-core> Extracting 3 binaries (including 1 non-test binary), 1 build script output directory, and 2 linked paths to /build/nextest-archive-5boRYD
  18. 17.50 s gammaloop-nextest-core> Extracted 18 files to /build/nextest-archive-5boRYD in 0.64s
  19. 17.54 s gammaloop-nextest-core> ------------
  20. 17.54 s gammaloop-nextest-core> Nextest run ID c178bece-22c8-4153-a05c-a1e42c4e87f4 with nextest profile: ci_gammaloop
  21. 17.54 s gammaloop-nextest-core> Starting 339 tests across 2 binaries
  22. 18.23 s gammaloop-nextest-core> ------------
  23. 18.23 s gammaloop-nextest-core> Summary [ 0.688s] 339 tests run: 339 passed, 0 skipped
  24. 18.32 s gammaloop-nextest-core>
  25. 18.32 s gammaloop-nextest-core> ========== nextest test summary ==========
  26. 18.32 s gammaloop-nextest-core> report: target/nextest/ci_gammaloop/junit.xml
  27. 18.32 s gammaloop-nextest-core> tests: 339, failures: 0, errors: 0
  28. 18.32 s gammaloop-nextest-core> No failing testcases found.
  29. 18.32 s gammaloop-nextest-core> =========================================
  30. 18.34 s gammaloop-nextest-core> Extracting 1 binary and 1 linked path to /build/nextest-archive-tdDJxh
  31. 18.42 s gammaloop-nextest-core> Extracted 7 files to /build/nextest-archive-tdDJxh in 0.07s
  32. 18.45 s gammaloop-nextest-core> ------------
  33. 18.45 s gammaloop-nextest-core> Nextest run ID a42118eb-fe3b-431c-80a5-e9fc087daf3d with nextest profile: ci_gammaloop
  34. 18.45 s gammaloop-nextest-core> Starting 19 tests across 1 binary
  35. 18.51 s gammaloop-nextest-core> ------------
  36. 18.51 s gammaloop-nextest-core> Summary [ 0.058s] 19 tests run: 19 passed, 0 skipped
  37. 18.55 s gammaloop-nextest-core>
  38. 18.55 s gammaloop-nextest-core> ========== nextest test summary ==========
  39. 18.55 s gammaloop-nextest-core> report: target/nextest/ci_gammaloop/junit.xml
  40. 18.55 s gammaloop-nextest-core> tests: 19, failures: 0, errors: 0
  41. 18.55 s gammaloop-nextest-core> No failing testcases found.
  42. 18.55 s gammaloop-nextest-core> =========================================
  43. 18.57 s gammaloop-nextest-core> Extracting 1 binary to /build/nextest-archive-IkaYNj
  44. 18.61 s gammaloop-nextest-core> Extracted 4 files to /build/nextest-archive-IkaYNj in 0.04s
  45. 18.64 s gammaloop-nextest-core> ------------
  46. 18.64 s gammaloop-nextest-core> Nextest run ID 7988cdf0-bc56-4f0a-a1f4-e26ff6508ed4 with nextest profile: ci_gammaloop
  47. 18.64 s gammaloop-nextest-core> Starting 0 tests across 1 binary
  48. 18.65 s gammaloop-nextest-core> ------------
  49. 18.65 s gammaloop-nextest-core> Summary [ 0.004s] 0 tests run: 0 passed, 0 skipped
  50. 18.69 s gammaloop-nextest-core>
  51. 18.69 s gammaloop-nextest-core> ========== nextest test summary ==========
  52. 18.69 s gammaloop-nextest-core> report: target/nextest/ci_gammaloop/junit.xml
  53. 18.69 s gammaloop-nextest-core> tests: 0, failures: 0, errors: 0
  54. 18.69 s gammaloop-nextest-core> No failing testcases found.
  55. 18.69 s gammaloop-nextest-core> =========================================
  56. 18.71 s gammaloop-nextest-core> Extracting 4 binaries, 1 build script output directory, and 2 linked paths to /build/nextest-archive-yMMgqg
  57. 19.20 s gammaloop-nextest-core> Extracted 18 files to /build/nextest-archive-yMMgqg in 0.49s
  58. 19.25 s gammaloop-nextest-core> ------------
  59. 19.25 s gammaloop-nextest-core> Nextest run ID f67d4985-57fc-4628-a560-43ecd9cfb7a5 with nextest profile: ci_gammaloop
  60. 19.25 s gammaloop-nextest-core> Starting 488 tests across 4 binaries (61 tests skipped, including 60 tests via profile.ci_gammaloop.default-filter)
  61. 19.87 s gammaloop-nextest-core> FAIL [ 0.505s] (184/488) gammalooprs graph::feynman_graph::tests::native_thermal_distributions
  62. 19.87 s gammaloop-nextest-core> stdout ---
  63. 19.87 s gammaloop-nextest-core>
  64. 19.87 s gammaloop-nextest-core> running 1 test
  65. 19.87 s gammaloop-nextest-core> test graph::feynman_graph::tests::native_thermal_distributions ... FAILED
  66. 19.87 s gammaloop-nextest-core>
  67. 19.87 s gammaloop-nextest-core> failures:
  68. 19.87 s gammaloop-nextest-core>
  69. 19.87 s gammaloop-nextest-core> failures:
  70. 19.87 s gammaloop-nextest-core> graph::feynman_graph::tests::native_thermal_distributions
  71. 19.87 s gammaloop-nextest-core>
  72. 19.87 s gammaloop-nextest-core> test result: FAILED. 0 passed; 1 failed; 0 ignored; 0 measured; 540 filtered out; finished in 0.49s
  73. 19.87 s gammaloop-nextest-core>
  74. 19.87 s gammaloop-nextest-core> stderr ---
  75. 19.87 s gammaloop-nextest-core> The application panicked (crashed).
  76. 19.87 s gammaloop-nextest-core> Message: called `Result::unwrap()` on an `Err` value: Custom { kind: Other, error: "Could not compile code: g++ -shared -O3 -fPIC -ffast-math -funsafe-math-optimizations -march=native -o /build/gammaloop-native-thermal-1339/thermal_0_0.so /build/gammaloop-native-thermal-1339/thermal_0_0.cpp\nwarning: Skipping impure flag -march=native because NIX_ENFORCE_NO_NATIVE is set\n/build/gammaloop-native-thermal-1339/thermal_0_0.cpp: In function 'void thermal_realf64(const double*, double*, double*)':\n/build/gammaloop-native-thermal-1339/thermal_0_0.cpp:27:16: error: 'symbolica_tanh' was not declared in this scope\n 27 | Z[6] = symbolica_tanh(Z[6]);\n | ^~~~~~~~~~~~~~\n" }
  77. 19.87 s gammaloop-nextest-core> Location: crates/gammalooprs/src/graph/feynman_graph.rs:937
  78. 19.87 s gammaloop-nextest-core>
  79. 19.87 s gammaloop-nextest-core> ━━━━━━━━━━━━━━━━━━━━━━━━━━━━━━━━━━ BACKTRACE ━━━━━━━━━━━━━━━━━━━━━━━━━━━━━━━━━━━
  80. 19.87 s gammaloop-nextest-core> 1: <color_eyre[b0c9e66060e883b2]::config::PanicHook>::panic_report<unknown>
  81. 19.87 s gammaloop-nextest-core> at <unknown source file>:<unknown line>
  82. 19.87 s gammaloop-nextest-core> 2: <color_eyre[b0c9e66060e883b2]::config::PanicHook>::into_panic_hook::{closure#0}<unknown>
  83. 19.87 s gammaloop-nextest-core> at <unknown source file>:<unknown line>
  84. 19.87 s gammaloop-nextest-core> 3: std[bcb96dfbba0ab899]::panicking::panic_with_hook<unknown>
  85. 19.87 s gammaloop-nextest-core> at <unknown source file>:<unknown line>
  86. 19.87 s gammaloop-nextest-core> 4: std[bcb96dfbba0ab899]::panicking::panic_handler::{closure#0}<unknown>
  87. 19.87 s gammaloop-nextest-core> at <unknown source file>:<unknown line>
  88. 19.87 s gammaloop-nextest-core> 5: std[bcb96dfbba0ab899]::sys::backtrace::__rust_end_short_backtrace::<std[bcb96dfbba0ab899]::panicking::panic_handler::{closure#0}, !><unknown>
  89. 19.87 s gammaloop-nextest-core> at <unknown source file>:<unknown line>
  90. 19.87 s gammaloop-nextest-core> 6: __rustc[6c289b9f9c454d21]::rust_begin_unwind<unknown>
  91. 19.87 s gammaloop-nextest-core> at <unknown source file>:<unknown line>
  92. 19.87 s gammaloop-nextest-core> 7: core[940e698046960fd5]::panicking::panic_fmt<unknown>
  93. 19.87 s gammaloop-nextest-core> at <unknown source file>:<unknown line>
  94. 19.87 s gammaloop-nextest-core> 8: core[940e698046960fd5]::result::unwrap_failed<unknown>
  95. 19.87 s gammaloop-nextest-core> at <unknown source file>:<unknown line>
  96. 19.87 s gammaloop-nextest-core> 9: gammalooprs[99a2022df78a4f41]::graph::feynman_graph::tests::native_thermal_distributions<unknown>
  97. 19.87 s gammaloop-nextest-core> at <unknown source file>:<unknown line>
  98. 19.87 s gammaloop-nextest-core> 10: <gammalooprs[99a2022df78a4f41]::graph::feynman_graph::tests::native_thermal_distributions::{closure#0} as core[940e698046960fd5]::ops::function::FnOnce<()>>::call_once<unknown>
  99. 19.87 s gammaloop-nextest-core> at <unknown source file>:<unknown line>
  100. 19.87 s gammaloop-nextest-core> 11: test[75d6903177b1d7e9]::__rust_begin_short_backtrace::<core[940e698046960fd5]::result::Result<(), alloc[2ea6bcb46fca0c42]::string::String>, fn() -> core[940e698046960fd5]::result::Result<(), alloc[2ea6bcb46fca0c42]::string::String>><unknown>
  101. 19.87 s gammaloop-nextest-core> at <unknown source file>:<unknown line>
  102. 19.87 s gammaloop-nextest-core> 12: test[75d6903177b1d7e9]::run_test::{closure#0}<unknown>
  103. 19.87 s gammaloop-nextest-core> at <unknown source file>:<unknown line>
  104. 19.87 s gammaloop-nextest-core> 13: std[bcb96dfbba0ab899]::sys::backtrace::__rust_begin_short_backtrace::<test[75d6903177b1d7e9]::run_test::{closure#1}, ()><unknown>
  105. 19.87 s gammaloop-nextest-core> at <unknown source file>:<unknown line>
  106. 19.87 s gammaloop-nextest-core> 14: <std[bcb96dfbba0ab899]::thread::lifecycle::spawn_unchecked<test[75d6903177b1d7e9]::run_test::{closure#1}, ()>::{closure#1} as core[940e698046960fd5]::ops::function::FnOnce<()>>::call_once::{shim:vtable#0}<unknown>
  107. 19.87 s gammaloop-nextest-core> at <unknown source file>:<unknown line>
  108. 19.87 s gammaloop-nextest-core> 15: <std[bcb96dfbba0ab899]::sys::thread::unix::Thread>::new::thread_start<unknown>
  109. 19.87 s gammaloop-nextest-core> at <unknown source file>:<unknown line>
  110. 19.87 s gammaloop-nextest-core> 16: start_thread<unknown>
  111. 19.87 s gammaloop-nextest-core> at <unknown source file>:<unknown line>
  112. 19.87 s gammaloop-nextest-core> 17: __clone3<unknown>
  113. 19.87 s gammaloop-nextest-core> at <unknown source file>:<unknown line>
  114. 19.87 s gammaloop-nextest-core>
  115. 19.87 s gammaloop-nextest-core> Run with COLORBT_SHOW_HIDDEN=1 environment variable to disable frame filtering.
  116. 19.87 s gammaloop-nextest-core> Run with RUST_BACKTRACE=full to include source snippets.
  117. 19.87 s gammaloop-nextest-core>
  118. 30.73 s gammaloop-nextest-core> ------------
  119. 30.73 s gammaloop-nextest-core> Summary [ 11.478s] 488 tests run: 487 passed, 1 failed, 61 skipped
  120. 30.73 s gammaloop-nextest-core> FAIL [ 0.505s] (184/488) gammalooprs graph::feynman_graph::tests::native_thermal_distributions
  121. 30.73 s gammaloop-nextest-core> stdout ---
  122. 30.73 s gammaloop-nextest-core>
  123. 30.73 s gammaloop-nextest-core> running 1 test
  124. 30.73 s gammaloop-nextest-core> test graph::feynman_graph::tests::native_thermal_distributions ... FAILED
  125. 30.73 s gammaloop-nextest-core>
  126. 30.73 s gammaloop-nextest-core> failures:
  127. 30.73 s gammaloop-nextest-core>
  128. 30.73 s gammaloop-nextest-core> failures:
  129. 30.73 s gammaloop-nextest-core> graph::feynman_graph::tests::native_thermal_distributions
  130. 30.73 s gammaloop-nextest-core>
  131. 30.73 s gammaloop-nextest-core> test result: FAILED. 0 passed; 1 failed; 0 ignored; 0 measured; 540 filtered out; finished in 0.49s
  132. 30.73 s gammaloop-nextest-core>
  133. 30.73 s gammaloop-nextest-core> stderr ---
  134. 30.73 s gammaloop-nextest-core> The application panicked (crashed).
  135. 30.73 s gammaloop-nextest-core> Message: called `Result::unwrap()` on an `Err` value: Custom { kind: Other, error: "Could not compile code: g++ -shared -O3 -fPIC -ffast-math -funsafe-math-optimizations -march=native -o /build/gammaloop-native-thermal-1339/thermal_0_0.so /build/gammaloop-native-thermal-1339/thermal_0_0.cpp\nwarning: Skipping impure flag -march=native because NIX_ENFORCE_NO_NATIVE is set\n/build/gammaloop-native-thermal-1339/thermal_0_0.cpp: In function 'void thermal_realf64(const double*, double*, double*)':\n/build/gammaloop-native-thermal-1339/thermal_0_0.cpp:27:16: error: 'symbolica_tanh' was not declared in this scope\n 27 | Z[6] = symbolica_tanh(Z[6]);\n | ^~~~~~~~~~~~~~\n" }
  136. 30.73 s gammaloop-nextest-core> Location: crates/gammalooprs/src/graph/feynman_graph.rs:937
  137. 30.73 s gammaloop-nextest-core>
  138. 30.73 s gammaloop-nextest-core> ━━━━━━━━━━━━━━━━━━━━━━━━━━━━━━━━━━ BACKTRACE ━━━━━━━━━━━━━━━━━━━━━━━━━━━━━━━━━━━
  139. 30.73 s gammaloop-nextest-core> 1: <color_eyre[b0c9e66060e883b2]::config::PanicHook>::panic_report<unknown>
  140. 30.73 s gammaloop-nextest-core> at <unknown source file>:<unknown line>
  141. 30.73 s gammaloop-nextest-core> 2: <color_eyre[b0c9e66060e883b2]::config::PanicHook>::into_panic_hook::{closure#0}<unknown>
  142. 30.73 s gammaloop-nextest-core> at <unknown source file>:<unknown line>
  143. 30.73 s gammaloop-nextest-core> 3: std[bcb96dfbba0ab899]::panicking::panic_with_hook<unknown>
  144. 30.73 s gammaloop-nextest-core> at <unknown source file>:<unknown line>
  145. 30.73 s gammaloop-nextest-core> 4: std[bcb96dfbba0ab899]::panicking::panic_handler::{closure#0}<unknown>
  146. 30.73 s gammaloop-nextest-core> at <unknown source file>:<unknown line>
  147. 30.73 s gammaloop-nextest-core> 5: std[bcb96dfbba0ab899]::sys::backtrace::__rust_end_short_backtrace::<std[bcb96dfbba0ab899]::panicking::panic_handler::{closure#0}, !><unknown>
  148. 30.73 s gammaloop-nextest-core> at <unknown source file>:<unknown line>
  149. 30.73 s gammaloop-nextest-core> 6: __rustc[6c289b9f9c454d21]::rust_begin_unwind<unknown>
  150. 30.73 s gammaloop-nextest-core> at <unknown source file>:<unknown line>
  151. 30.73 s gammaloop-nextest-core> 7: core[940e698046960fd5]::panicking::panic_fmt<unknown>
  152. 30.73 s gammaloop-nextest-core> at <unknown source file>:<unknown line>
  153. 30.73 s gammaloop-nextest-core> 8: core[940e698046960fd5]::result::unwrap_failed<unknown>
  154. 30.73 s gammaloop-nextest-core> at <unknown source file>:<unknown line>
  155. 30.73 s gammaloop-nextest-core> 9: gammalooprs[99a2022df78a4f41]::graph::feynman_graph::tests::native_thermal_distributions<unknown>
  156. 30.73 s gammaloop-nextest-core> at <unknown source file>:<unknown line>
  157. 30.73 s gammaloop-nextest-core> 10: <gammalooprs[99a2022df78a4f41]::graph::feynman_graph::tests::native_thermal_distributions::{closure#0} as core[940e698046960fd5]::ops::function::FnOnce<()>>::call_once<unknown>
  158. 30.73 s gammaloop-nextest-core> at <unknown source file>:<unknown line>
  159. 30.73 s gammaloop-nextest-core> 11: test[75d6903177b1d7e9]::__rust_begin_short_backtrace::<core[940e698046960fd5]::result::Result<(), alloc[2ea6bcb46fca0c42]::string::String>, fn() -> core[940e698046960fd5]::result::Result<(), alloc[2ea6bcb46fca0c42]::string::String>><unknown>
  160. 30.73 s gammaloop-nextest-core> at <unknown source file>:<unknown line>
  161. 30.73 s gammaloop-nextest-core> 12: test[75d6903177b1d7e9]::run_test::{closure#0}<unknown>
  162. 30.73 s gammaloop-nextest-core> at <unknown source file>:<unknown line>
  163. 30.73 s gammaloop-nextest-core> 13: std[bcb96dfbba0ab899]::sys::backtrace::__rust_begin_short_backtrace::<test[75d6903177b1d7e9]::run_test::{closure#1}, ()><unknown>
  164. 30.73 s gammaloop-nextest-core> at <unknown source file>:<unknown line>
  165. 30.73 s gammaloop-nextest-core> 14: <std[bcb96dfbba0ab899]::thread::lifecycle::spawn_unchecked<test[75d6903177b1d7e9]::run_test::{closure#1}, ()>::{closure#1} as core[940e698046960fd5]::ops::function::FnOnce<()>>::call_once::{shim:vtable#0}<unknown>
  166. 30.73 s gammaloop-nextest-core> at <unknown source file>:<unknown line>
  167. 30.73 s gammaloop-nextest-core> 15: <std[bcb96dfbba0ab899]::sys::thread::unix::Thread>::new::thread_start<unknown>
  168. 30.73 s gammaloop-nextest-core> at <unknown source file>:<unknown line>
  169. 30.73 s gammaloop-nextest-core> 16: start_thread<unknown>
  170. 30.73 s gammaloop-nextest-core> at <unknown source file>:<unknown line>
  171. 30.73 s gammaloop-nextest-core> 17: __clone3<unknown>
  172. 30.73 s gammaloop-nextest-core> at <unknown source file>:<unknown line>
  173. 30.73 s gammaloop-nextest-core>
  174. 30.73 s gammaloop-nextest-core> Run with COLORBT_SHOW_HIDDEN=1 environment variable to disable frame filtering.
  175. 30.73 s gammaloop-nextest-core> Run with RUST_BACKTRACE=full to include source snippets.
  176. 30.73 s gammaloop-nextest-core>
  177. 30.83 s gammaloop-nextest-core> error: test run failed
  178. 30.87 s gammaloop-nextest-core>
  179. 30.87 s gammaloop-nextest-core> ========== nextest test summary ==========
  180. 30.87 s gammaloop-nextest-core> report: target/nextest/ci_gammaloop/junit.xml
  181. 30.87 s gammaloop-nextest-core> tests: 488, failures: 1, errors: 0
  182. 30.87 s gammaloop-nextest-core>
  183. 30.87 s gammaloop-nextest-core> 1. gammalooprs::graph::feynman_graph::tests::native_thermal_distributions
  184. 30.87 s gammaloop-nextest-core> failure: test failure with exit code 101
  185. 30.87 s gammaloop-nextest-core> system-out
  186. 30.87 s gammaloop-nextest-core> running 1 test
  187. 30.87 s gammaloop-nextest-core> test graph::feynman_graph::tests::native_thermal_distributions ... FAILED
  188. 30.87 s gammaloop-nextest-core>
  189. 30.87 s gammaloop-nextest-core> failures:
  190. 30.87 s gammaloop-nextest-core>
  191. 30.87 s gammaloop-nextest-core> failures:
  192. 30.87 s gammaloop-nextest-core> graph::feynman_graph::tests::native_thermal_distributions
  193. 30.87 s gammaloop-nextest-core>
  194. 30.87 s gammaloop-nextest-core> test result: FAILED. 0 passed; 1 failed; 0 ignored; 0 measured; 540 filtered out; finished in 0.49s
  195. 30.87 s gammaloop-nextest-core> system-err
  196. 30.87 s gammaloop-nextest-core> The application panicked (crashed).
  197. 30.87 s gammaloop-nextest-core> Message: called `Result::unwrap()` on an `Err` value: Custom { kind: Other, error: "Could not compile code: g++ -shared -O3 -fPIC -ffast-math -funsafe-math-optimizations -march=native -o /build/gammaloop-native-thermal-1339/thermal_0_0.so /build/gammaloop-native-thermal-1339/thermal_0_0.cpp\nwarning: Skipping impure flag -march=native because NIX_ENFORCE_NO_NATIVE is set\n/build/gammaloop-native-thermal-1339/thermal_0_0.cpp: In function 'void thermal_realf64(const double*, double*, double*)':\n/build/gammaloop-native-thermal-1339/thermal_0_0.cpp:27:16: error: 'symbolica_tanh' was not declared in this scope\n 27 | Z[6] = symbolica_tanh(Z[6]);\n | ^~~~~~~~~~~~~~\n" }
  198. 30.87 s gammaloop-nextest-core> Location: crates/gammalooprs/src/graph/feynman_graph.rs:937
  199. 30.87 s gammaloop-nextest-core>
  200. 30.87 s gammaloop-nextest-core> ━━━━━━━━━━━━━━━━━━━━━━━━━━━━━━━━━━ BACKTRACE ━━━━━━━━━━━━━━━━━━━━━━━━━━━━━━━━━━━
  201. 30.87 s gammaloop-nextest-core> 1: <color_eyre[b0c9e66060e883b2]::config::PanicHook>::panic_report<unknown>
  202. 30.87 s gammaloop-nextest-core> at <unknown source file>:<unknown line>
  203. 30.87 s gammaloop-nextest-core> 2: <color_eyre[b0c9e66060e883b2]::config::PanicHook>::into_panic_hook::{closure#0}<unknown>
  204. 30.87 s gammaloop-nextest-core> at <unknown source file>:<unknown line>
  205. 30.87 s gammaloop-nextest-core> 3: std[bcb96dfbba0ab899]::panicking::panic_with_hook<unknown>
  206. 30.87 s gammaloop-nextest-core> at <unknown source file>:<unknown line>
  207. 30.87 s gammaloop-nextest-core> 4: std[bcb96dfbba0ab899]::panicking::panic_handler::{closure#0}<unknown>
  208. 30.87 s gammaloop-nextest-core> at <unknown source file>:<unknown line>
  209. 30.87 s gammaloop-nextest-core> 5: std[bcb96dfbba0ab899]::sys::backtrace::__rust_end_short_backtrace::<std[bcb96dfbba0ab899]::panicking::panic_handler::{closure#0}, !><unknown>
  210. 30.87 s gammaloop-nextest-core> at <unknown source file>:<unknown line>
  211. 30.87 s gammaloop-nextest-core> 6: __rustc[6c289b9f9c454d21]::rust_begin_unwind<unknown>
  212. 30.87 s gammaloop-nextest-core> at <unknown source file>:<unknown line>
  213. 30.87 s gammaloop-nextest-core> 7: core[940e698046960fd5]::panicking::panic_fmt<unknown>
  214. 30.87 s gammaloop-nextest-core> at <unknown source file>:<unknown line>
  215. 30.87 s gammaloop-nextest-core> 8: core[940e698046960fd5]::result::unwrap_failed<unknown>
  216. 30.87 s gammaloop-nextest-core> at <unknown source file>:<unknown line>
  217. 30.87 s gammaloop-nextest-core> 9: gammalooprs[99a2022df78a4f41]::graph::feynman_graph::tests::native_thermal_distributions<unknown>
  218. 30.87 s gammaloop-nextest-core> at <unknown source file>:<unknown line>
  219. 30.87 s gammaloop-nextest-core> 10: <gammalooprs[99a2022df78a4f41]::graph::feynman_graph::tests::native_thermal_distributions::{closure#0} as core[940e698046960fd5]::ops::function::FnOnce<()>>::call_once<unknown>
  220. 30.87 s gammaloop-nextest-core> at <unknown source file>:<unknown line>
  221. 30.87 s gammaloop-nextest-core> 11: test[75d6903177b1d7e9]::__rust_begin_short_backtrace::<core[940e698046960fd5]::result::Result<(), alloc[2ea6bcb46fca0c42]::string::String>, fn() -> core[940e698046960fd5]::result::Result<(), alloc[2ea6bcb46fca0c42]::string::String>><unknown>
  222. 30.87 s gammaloop-nextest-core> at <unknown source file>:<unknown line>
  223. 30.87 s gammaloop-nextest-core> 12: test[75d6903177b1d7e9]::run_test::{closure#0}<unknown>
  224. 30.87 s gammaloop-nextest-core> at <unknown source file>:<unknown line>
  225. 30.87 s gammaloop-nextest-core> 13: std[bcb96dfbba0ab899]::sys::backtrace::__rust_begin_short_backtrace::<test[75d6903177b1d7e9]::run_test::{closure#1}, ()><unknown>
  226. 30.87 s gammaloop-nextest-core> at <unknown source file>:<unknown line>
  227. 30.87 s gammaloop-nextest-core> 14: <std[bcb96dfbba0ab899]::thread::lifecycle::spawn_unchecked<test[75d6903177b1d7e9]::run_test::{closure#1}, ()>::{closure#1} as core[940e698046960fd5]::ops::function::FnOnce<()>>::call_once::{shim:vtable#0}<unknown>
  228. 30.87 s gammaloop-nextest-core> at <unknown source file>:<unknown line>
  229. 30.87 s gammaloop-nextest-core> 15: <std[bcb96dfbba0ab899]::sys::thread::unix::Thread>::new::thread_start<unknown>
  230. 30.87 s gammaloop-nextest-core> at <unknown source file>:<unknown line>
  231. 30.87 s gammaloop-nextest-core> 16: start_thread<unknown>
  232. 30.87 s gammaloop-nextest-core> at <unknown source file>:<unknown line>
  233. 30.87 s gammaloop-nextest-core> 17: __clone3<unknown>
  234. 30.87 s gammaloop-nextest-core> at <unknown source file>:<unknown line>
  235. 30.87 s gammaloop-nextest-core>
  236. 30.87 s gammaloop-nextest-core> Run with COLORBT_SHOW_HIDDEN=1 environment variable to disable frame filtering.
  237. 30.87 s gammaloop-nextest-core> Run with RUST_BACKTRACE=full to include source snippets.
  238. 30.87 s gammaloop-nextest-core> =========================================
  239. 30.93 s error: Cannot build '/nix/store/kmbwnz7qn7m6zsnr5x139hrrypyr7sj5-gammaloop-nextest-core.drv'.
  240. 30.93 s Reason: builder failed with exit code 100.
  241. 30.93 s Output paths:
  242. 30.93 s /nix/store/lijra80npamzzx3a31800fwgjc63bch8-gammaloop-nextest-core
  243. 30.93 s Last 222 log lines:
  244. 30.93 s > Extracting 3 binaries (including 1 non-test binary), 1 build script output directory, and 2 linked paths to /build/nextest-archive-5boRYD
  245. 30.93 s > Extracted 18 files to /build/nextest-archive-5boRYD in 0.64s
  246. 30.93 s > ------------
  247. 30.93 s > Nextest run ID c178bece-22c8-4153-a05c-a1e42c4e87f4 with nextest profile: ci_gammaloop
  248. 30.93 s > Starting 339 tests across 2 binaries
  249. 30.93 s > ------------
  250. 30.93 s > Summary [ 0.688s] 339 tests run: 339 passed, 0 skipped
  251. 30.93 s >
  252. 30.93 s > ========== nextest test summary ==========
  253. 30.93 s > report: target/nextest/ci_gammaloop/junit.xml
  254. 30.93 s > tests: 339, failures: 0, errors: 0
  255. 30.93 s > No failing testcases found.
  256. 30.93 s > =========================================
  257. 30.93 s > Extracting 1 binary and 1 linked path to /build/nextest-archive-tdDJxh
  258. 30.93 s > Extracted 7 files to /build/nextest-archive-tdDJxh in 0.07s
  259. 30.93 s > ------------
  260. 30.93 s > Nextest run ID a42118eb-fe3b-431c-80a5-e9fc087daf3d with nextest profile: ci_gammaloop
  261. 30.93 s > Starting 19 tests across 1 binary
  262. 30.93 s > ------------
  263. 30.93 s > Summary [ 0.058s] 19 tests run: 19 passed, 0 skipped
  264. 30.93 s >
  265. 30.93 s > ========== nextest test summary ==========
  266. 30.93 s > report: target/nextest/ci_gammaloop/junit.xml
  267. 30.93 s > tests: 19, failures: 0, errors: 0
  268. 30.93 s > No failing testcases found.
  269. 30.93 s > =========================================
  270. 30.93 s > Extracting 1 binary to /build/nextest-archive-IkaYNj
  271. 30.93 s > Extracted 4 files to /build/nextest-archive-IkaYNj in 0.04s
  272. 30.93 s > ------------
  273. 30.93 s > Nextest run ID 7988cdf0-bc56-4f0a-a1f4-e26ff6508ed4 with nextest profile: ci_gammaloop
  274. 30.93 s > Starting 0 tests across 1 binary
  275. 30.93 s > ------------
  276. 30.93 s > Summary [ 0.004s] 0 tests run: 0 passed, 0 skipped
  277. 30.93 s >
  278. 30.93 s > ========== nextest test summary ==========
  279. 30.93 s > report: target/nextest/ci_gammaloop/junit.xml
  280. 30.93 s > tests: 0, failures: 0, errors: 0
  281. 30.93 s > No failing testcases found.
  282. 30.93 s > =========================================
  283. 30.93 s > Extracting 4 binaries, 1 build script output directory, and 2 linked paths to /build/nextest-archive-yMMgqg
  284. 30.93 s > Extracted 18 files to /build/nextest-archive-yMMgqg in 0.49s
  285. 30.93 s > ------------
  286. 30.93 s > Nextest run ID f67d4985-57fc-4628-a560-43ecd9cfb7a5 with nextest profile: ci_gammaloop
  287. 30.93 s > Starting 488 tests across 4 binaries (61 tests skipped, including 60 tests via profile.ci_gammaloop.default-filter)
  288. 30.93 s > FAIL [ 0.505s] (184/488) gammalooprs graph::feynman_graph::tests::native_thermal_distributions
  289. 30.93 s > stdout ---
  290. 30.93 s >
  291. 30.93 s > running 1 test
  292. 30.93 s > test graph::feynman_graph::tests::native_thermal_distributions ... FAILED
  293. 30.93 s >
  294. 30.93 s > failures:
  295. 30.93 s >
  296. 30.93 s > failures:
  297. 30.93 s > graph::feynman_graph::tests::native_thermal_distributions
  298. 30.93 s >
  299. 30.93 s > test result: FAILED. 0 passed; 1 failed; 0 ignored; 0 measured; 540 filtered out; finished in 0.49s
  300. 30.93 s >
  301. 30.93 s > stderr ---
  302. 30.93 s > The application panicked (crashed).
  303. 30.93 s > Message: called `Result::unwrap()` on an `Err` value: Custom { kind: Other, error: "Could not compile code: g++ -shared -O3 -fPIC -ffast-math -funsafe-math-optimizations -march=native -o /build/gammaloop-native-thermal-1339/thermal_0_0.so /build/gammaloop-native-thermal-1339/thermal_0_0.cpp\nwarning: Skipping impure flag -march=native because NIX_ENFORCE_NO_NATIVE is set\n/build/gammaloop-native-thermal-1339/thermal_0_0.cpp: In function 'void thermal_realf64(const double*, double*, double*)':\n/build/gammaloop-native-thermal-1339/thermal_0_0.cpp:27:16: error: 'symbolica_tanh' was not declared in this scope\n 27 | Z[6] = symbolica_tanh(Z[6]);\n | ^~~~~~~~~~~~~~\n" }
  304. 30.93 s > Location: crates/gammalooprs/src/graph/feynman_graph.rs:937
  305. 30.93 s >
  306. 30.93 s > ━━━━━━━━━━━━━━━━━━━━━━━━━━━━━━━━━━ BACKTRACE ━━━━━━━━━━━━━━━━━━━━━━━━━━━━━━━━━━━
  307. 30.93 s > 1: <color_eyre[b0c9e66060e883b2]::config::PanicHook>::panic_report<unknown>
  308. 30.93 s > at <unknown source file>:<unknown line>
  309. 30.93 s > 2: <color_eyre[b0c9e66060e883b2]::config::PanicHook>::into_panic_hook::{closure#0}<unknown>
  310. 30.93 s > at <unknown source file>:<unknown line>
  311. 30.93 s > 3: std[bcb96dfbba0ab899]::panicking::panic_with_hook<unknown>
  312. 30.93 s > at <unknown source file>:<unknown line>
  313. 30.93 s > 4: std[bcb96dfbba0ab899]::panicking::panic_handler::{closure#0}<unknown>
  314. 30.93 s > at <unknown source file>:<unknown line>
  315. 30.93 s > 5: std[bcb96dfbba0ab899]::sys::backtrace::__rust_end_short_backtrace::<std[bcb96dfbba0ab899]::panicking::panic_handler::{closure#0}, !><unknown>
  316. 30.93 s > at <unknown source file>:<unknown line>
  317. 30.93 s > 6: __rustc[6c289b9f9c454d21]::rust_begin_unwind<unknown>
  318. 30.93 s > at <unknown source file>:<unknown line>
  319. 30.93 s > 7: core[940e698046960fd5]::panicking::panic_fmt<unknown>
  320. 30.93 s > at <unknown source file>:<unknown line>
  321. 30.93 s > 8: core[940e698046960fd5]::result::unwrap_failed<unknown>
  322. 30.93 s > at <unknown source file>:<unknown line>
  323. 30.93 s > 9: gammalooprs[99a2022df78a4f41]::graph::feynman_graph::tests::native_thermal_distributions<unknown>
  324. 30.93 s > at <unknown source file>:<unknown line>
  325. 30.93 s > 10: <gammalooprs[99a2022df78a4f41]::graph::feynman_graph::tests::native_thermal_distributions::{closure#0} as core[940e698046960fd5]::ops::function::FnOnce<()>>::call_once<unknown>
  326. 30.93 s > at <unknown source file>:<unknown line>
  327. 30.93 s > 11: test[75d6903177b1d7e9]::__rust_begin_short_backtrace::<core[940e698046960fd5]::result::Result<(), alloc[2ea6bcb46fca0c42]::string::String>, fn() -> core[940e698046960fd5]::result::Result<(), alloc[2ea6bcb46fca0c42]::string::String>><unknown>
  328. 30.93 s > at <unknown source file>:<unknown line>
  329. 30.93 s > 12: test[75d6903177b1d7e9]::run_test::{closure#0}<unknown>
  330. 30.93 s > at <unknown source file>:<unknown line>
  331. 30.93 s > 13: std[bcb96dfbba0ab899]::sys::backtrace::__rust_begin_short_backtrace::<test[75d6903177b1d7e9]::run_test::{closure#1}, ()><unknown>
  332. 30.93 s > at <unknown source file>:<unknown line>
  333. 30.93 s > 14: <std[bcb96dfbba0ab899]::thread::lifecycle::spawn_unchecked<test[75d6903177b1d7e9]::run_test::{closure#1}, ()>::{closure#1} as core[940e698046960fd5]::ops::function::FnOnce<()>>::call_once::{shim:vtable#0}<unknown>
  334. 30.93 s > at <unknown source file>:<unknown line>
  335. 30.93 s > 15: <std[bcb96dfbba0ab899]::sys::thread::unix::Thread>::new::thread_start<unknown>
  336. 30.93 s > at <unknown source file>:<unknown line>
  337. 30.93 s > 16: start_thread<unknown>
  338. 30.93 s > at <unknown source file>:<unknown line>
  339. 30.93 s > 17: __clone3<unknown>
  340. 30.93 s > at <unknown source file>:<unknown line>
  341. 30.93 s >
  342. 30.93 s > Run with COLORBT_SHOW_HIDDEN=1 environment variable to disable frame filtering.
  343. 30.93 s > Run with RUST_BACKTRACE=full to include source snippets.
  344. 30.93 s >
  345. 30.93 s > ------------
  346. 30.93 s > Summary [ 11.478s] 488 tests run: 487 passed, 1 failed, 61 skipped
  347. 30.93 s > FAIL [ 0.505s] (184/488) gammalooprs graph::feynman_graph::tests::native_thermal_distributions
  348. 30.93 s > stdout ---
  349. 30.93 s >
  350. 30.93 s > running 1 test
  351. 30.93 s > test graph::feynman_graph::tests::native_thermal_distributions ... FAILED
  352. 30.93 s >
  353. 30.93 s > failures:
  354. 30.93 s >
  355. 30.93 s > failures:
  356. 30.93 s > graph::feynman_graph::tests::native_thermal_distributions
  357. 30.93 s >
  358. 30.93 s > test result: FAILED. 0 passed; 1 failed; 0 ignored; 0 measured; 540 filtered out; finished in 0.49s
  359. 30.93 s >
  360. 30.93 s > stderr ---
  361. 30.93 s > The application panicked (crashed).
  362. 30.93 s > Message: called `Result::unwrap()` on an `Err` value: Custom { kind: Other, error: "Could not compile code: g++ -shared -O3 -fPIC -ffast-math -funsafe-math-optimizations -march=native -o /build/gammaloop-native-thermal-1339/thermal_0_0.so /build/gammaloop-native-thermal-1339/thermal_0_0.cpp\nwarning: Skipping impure flag -march=native because NIX_ENFORCE_NO_NATIVE is set\n/build/gammaloop-native-thermal-1339/thermal_0_0.cpp: In function 'void thermal_realf64(const double*, double*, double*)':\n/build/gammaloop-native-thermal-1339/thermal_0_0.cpp:27:16: error: 'symbolica_tanh' was not declared in this scope\n 27 | Z[6] = symbolica_tanh(Z[6]);\n | ^~~~~~~~~~~~~~\n" }
  363. 30.93 s > Location: crates/gammalooprs/src/graph/feynman_graph.rs:937
  364. 30.93 s >
  365. 30.93 s > ━━━━━━━━━━━━━━━━━━━━━━━━━━━━━━━━━━ BACKTRACE ━━━━━━━━━━━━━━━━━━━━━━━━━━━━━━━━━━━
  366. 30.93 s > 1: <color_eyre[b0c9e66060e883b2]::config::PanicHook>::panic_report<unknown>
  367. 30.93 s > at <unknown source file>:<unknown line>
  368. 30.93 s > 2: <color_eyre[b0c9e66060e883b2]::config::PanicHook>::into_panic_hook::{closure#0}<unknown>
  369. 30.93 s > at <unknown source file>:<unknown line>
  370. 30.93 s > 3: std[bcb96dfbba0ab899]::panicking::panic_with_hook<unknown>
  371. 30.93 s > at <unknown source file>:<unknown line>
  372. 30.93 s > 4: std[bcb96dfbba0ab899]::panicking::panic_handler::{closure#0}<unknown>
  373. 30.93 s > at <unknown source file>:<unknown line>
  374. 30.93 s > 5: std[bcb96dfbba0ab899]::sys::backtrace::__rust_end_short_backtrace::<std[bcb96dfbba0ab899]::panicking::panic_handler::{closure#0}, !><unknown>
  375. 30.93 s > at <unknown source file>:<unknown line>
  376. 30.93 s > 6: __rustc[6c289b9f9c454d21]::rust_begin_unwind<unknown>
  377. 30.93 s > at <unknown source file>:<unknown line>
  378. 30.93 s > 7: core[940e698046960fd5]::panicking::panic_fmt<unknown>
  379. 30.93 s > at <unknown source file>:<unknown line>
  380. 30.93 s > 8: core[940e698046960fd5]::result::unwrap_failed<unknown>
  381. 30.93 s > at <unknown source file>:<unknown line>
  382. 30.93 s > 9: gammalooprs[99a2022df78a4f41]::graph::feynman_graph::tests::native_thermal_distributions<unknown>
  383. 30.93 s > at <unknown source file>:<unknown line>
  384. 30.93 s > 10: <gammalooprs[99a2022df78a4f41]::graph::feynman_graph::tests::native_thermal_distributions::{closure#0} as core[940e698046960fd5]::ops::function::FnOnce<()>>::call_once<unknown>
  385. 30.93 s > at <unknown source file>:<unknown line>
  386. 30.94 s > 11: test[75d6903177b1d7e9]::__rust_begin_short_backtrace::<core[940e698046960fd5]::result::Result<(), alloc[2ea6bcb46fca0c42]::string::String>, fn() -> core[940e698046960fd5]::result::Result<(), alloc[2ea6bcb46fca0c42]::string::String>><unknown>
  387. 30.94 s > at <unknown source file>:<unknown line>
  388. 30.94 s > 12: test[75d6903177b1d7e9]::run_test::{closure#0}<unknown>
  389. 30.94 s > at <unknown source file>:<unknown line>
  390. 30.94 s > 13: std[bcb96dfbba0ab899]::sys::backtrace::__rust_begin_short_backtrace::<test[75d6903177b1d7e9]::run_test::{closure#1}, ()><unknown>
  391. 30.94 s > at <unknown source file>:<unknown line>
  392. 30.94 s > 14: <std[bcb96dfbba0ab899]::thread::lifecycle::spawn_unchecked<test[75d6903177b1d7e9]::run_test::{closure#1}, ()>::{closure#1} as core[940e698046960fd5]::ops::function::FnOnce<()>>::call_once::{shim:vtable#0}<unknown>
  393. 30.94 s > at <unknown source file>:<unknown line>
  394. 30.94 s > 15: <std[bcb96dfbba0ab899]::sys::thread::unix::Thread>::new::thread_start<unknown>
  395. 30.94 s > at <unknown source file>:<unknown line>
  396. 30.94 s > 16: start_thread<unknown>
  397. 30.94 s > at <unknown source file>:<unknown line>
  398. 30.94 s > 17: __clone3<unknown>
  399. 30.94 s > at <unknown source file>:<unknown line>
  400. 30.94 s >
  401. 30.94 s > Run with COLORBT_SHOW_HIDDEN=1 environment variable to disable frame filtering.
  402. 30.94 s > Run with RUST_BACKTRACE=full to include source snippets.
  403. 30.94 s >
  404. 30.94 s > error: test run failed
  405. 30.94 s >
  406. 30.94 s > ========== nextest test summary ==========
  407. 30.94 s > report: target/nextest/ci_gammaloop/junit.xml
  408. 30.94 s > tests: 488, failures: 1, errors: 0
  409. 30.94 s >
  410. 30.94 s > 1. gammalooprs::graph::feynman_graph::tests::native_thermal_distributions
  411. 30.94 s > failure: test failure with exit code 101
  412. 30.94 s > system-out
  413. 30.94 s > running 1 test
  414. 30.94 s > test graph::feynman_graph::tests::native_thermal_distributions ... FAILED
  415. 30.94 s >
  416. 30.94 s > failures:
  417. 30.94 s >
  418. 30.94 s > failures:
  419. 30.94 s > graph::feynman_graph::tests::native_thermal_distributions
  420. 30.94 s >
  421. 30.94 s > test result: FAILED. 0 passed; 1 failed; 0 ignored; 0 measured; 540 filtered out; finished in 0.49s
  422. 30.94 s > system-err
  423. 30.94 s > The application panicked (crashed).
  424. 30.94 s > Message: called `Result::unwrap()` on an `Err` value: Custom { kind: Other, error: "Could not compile code: g++ -shared -O3 -fPIC -ffast-math -funsafe-math-optimizations -march=native -o /build/gammaloop-native-thermal-1339/thermal_0_0.so /build/gammaloop-native-thermal-1339/thermal_0_0.cpp\nwarning: Skipping impure flag -march=native because NIX_ENFORCE_NO_NATIVE is set\n/build/gammaloop-native-thermal-1339/thermal_0_0.cpp: In function 'void thermal_realf64(const double*, double*, double*)':\n/build/gammaloop-native-thermal-1339/thermal_0_0.cpp:27:16: error: 'symbolica_tanh' was not declared in this scope\n 27 | Z[6] = symbolica_tanh(Z[6]);\n | ^~~~~~~~~~~~~~\n" }
  425. 30.94 s > Location: crates/gammalooprs/src/graph/feynman_graph.rs:937
  426. 30.94 s >
  427. 30.94 s > ━━━━━━━━━━━━━━━━━━━━━━━━━━━━━━━━━━ BACKTRACE ━━━━━━━━━━━━━━━━━━━━━━━━━━━━━━━━━━━
  428. 30.94 s > 1: <color_eyre[b0c9e66060e883b2]::config::PanicHook>::panic_report<unknown>
  429. 30.94 s > at <unknown source file>:<unknown line>
  430. 30.94 s > 2: <color_eyre[b0c9e66060e883b2]::config::PanicHook>::into_panic_hook::{closure#0}<unknown>
  431. 30.94 s > at <unknown source file>:<unknown line>
  432. 30.94 s > 3: std[bcb96dfbba0ab899]::panicking::panic_with_hook<unknown>
  433. 30.94 s > at <unknown source file>:<unknown line>
  434. 30.94 s > 4: std[bcb96dfbba0ab899]::panicking::panic_handler::{closure#0}<unknown>
  435. 30.94 s > at <unknown source file>:<unknown line>
  436. 30.94 s > 5: std[bcb96dfbba0ab899]::sys::backtrace::__rust_end_short_backtrace::<std[bcb96dfbba0ab899]::panicking::panic_handler::{closure#0}, !><unknown>
  437. 30.94 s > at <unknown source file>:<unknown line>
  438. 30.94 s > 6: __rustc[6c289b9f9c454d21]::rust_begin_unwind<unknown>
  439. 30.94 s > at <unknown source file>:<unknown line>
  440. 30.94 s > 7: core[940e698046960fd5]::panicking::panic_fmt<unknown>
  441. 30.94 s > at <unknown source file>:<unknown line>
  442. 30.94 s > 8: core[940e698046960fd5]::result::unwrap_failed<unknown>
  443. 30.94 s > at <unknown source file>:<unknown line>
  444. 30.94 s > 9: gammalooprs[99a2022df78a4f41]::graph::feynman_graph::tests::native_thermal_distributions<unknown>
  445. 30.94 s > at <unknown source file>:<unknown line>
  446. 30.94 s > 10: <gammalooprs[99a2022df78a4f41]::graph::feynman_graph::tests::native_thermal_distributions::{closure#0} as core[940e698046960fd5]::ops::function::FnOnce<()>>::call_once<unknown>
  447. 30.94 s > at <unknown source file>:<unknown line>
  448. 30.94 s > 11: test[75d6903177b1d7e9]::__rust_begin_short_backtrace::<core[940e698046960fd5]::result::Result<(), alloc[2ea6bcb46fca0c42]::string::String>, fn() -> core[940e698046960fd5]::result::Result<(), alloc[2ea6bcb46fca0c42]::string::String>><unknown>
  449. 30.94 s > at <unknown source file>:<unknown line>
  450. 30.94 s > 12: test[75d6903177b1d7e9]::run_test::{closure#0}<unknown>
  451. 30.94 s > at <unknown source file>:<unknown line>
  452. 30.94 s > 13: std[bcb96dfbba0ab899]::sys::backtrace::__rust_begin_short_backtrace::<test[75d6903177b1d7e9]::run_test::{closure#1}, ()><unknown>
  453. 30.94 s > at <unknown source file>:<unknown line>
  454. 30.94 s > 14: <std[bcb96dfbba0ab899]::thread::lifecycle::spawn_unchecked<test[75d6903177b1d7e9]::run_test::{closure#1}, ()>::{closure#1} as core[940e698046960fd5]::ops::function::FnOnce<()>>::call_once::{shim:vtable#0}<unknown>
  455. 30.94 s > at <unknown source file>:<unknown line>
  456. 30.94 s > 15: <std[bcb96dfbba0ab899]::sys::thread::unix::Thread>::new::thread_start<unknown>
  457. 30.94 s > at <unknown source file>:<unknown line>
  458. 30.94 s > 16: start_thread<unknown>
  459. 30.94 s > at <unknown source file>:<unknown line>
  460. 30.94 s > 17: __clone3<unknown>
  461. 30.94 s > at <unknown source file>:<unknown line>
  462. 30.94 s >
  463. 30.94 s > Run with COLORBT_SHOW_HIDDEN=1 environment variable to disable frame filtering.
  464. 30.94 s > Run with RUST_BACKTRACE=full to include source snippets.
  465. 30.94 s > =========================================
  466. 30.94 s For full logs, run:
  467. 30.94 s nix log /nix/store/kmbwnz7qn7m6zsnr5x139hrrypyr7sj5-gammaloop-nextest-core.drv
  468. 31.39 s [0 built (1 failed)]Run failed.