build packages.x86_64-linux.ghc967_all
0.29 s
$ /nix/store/9ypz3flqsrl5xl495mm8h645gadjsxi1-coreutils-9.11/bin/timeout --kill-after=15s 7200s /nix/store/23zk8sgzamrbmj1fday15szf7f2279s8-nix-2.34.7/bin/nix --extra-experimental-features nix-command --extra-experimental-features flakes --log-format internal-json build --no-link --print-out-paths git+https://github.com/sellout/pathway?ref=more-system&rev=315332dbcaa9f1016fc658995abc767abdaec679&shallow=1#packages.x86_64-linux.ghc967_all --print-build-logs
0.68 s
warning: ignoring untrusted flake configuration setting 'allow-import-from-derivation'.
0.68 s
Pass '--accept-flake-config' to trust it
0.68 s
warning: ignoring untrusted flake configuration setting 'extra-experimental-features'.
0.68 s
Pass '--accept-flake-config' to trust it
0.68 s
warning: ignoring untrusted flake configuration setting 'extra-substituters'.
0.68 s
Pass '--accept-flake-config' to trust it
0.68 s
warning: ignoring untrusted flake configuration setting 'extra-trusted-public-keys'.
0.68 s
Pass '--accept-flake-config' to trust it
0.68 s
warning: ignoring untrusted flake configuration setting 'sandbox'.
0.68 s
Pass '--accept-flake-config' to trust it
0.68 s
warning: ignoring untrusted flake configuration setting 'use-registries'.
0.68 s
Pass '--accept-flake-config' to trust it
0.68 s
error (ignored): SQLite database '/var/cache/nix-ci-worker/eval-cache-v6/966f93a0d0b73dcb8730c71854323896b63a453f918e6dbc5d822ce89957ed33.sqlite ' is busy
1.57 s
1.60 s
Building /nix/store/hbwa6ks69p7c0mk9816ax62gjy4qd1i2-cabal2nix-pathway.drv
1.66 s
[cabal2nix-pathway:post-build] Uploading to cachix cache "sellout": /nix/store/p2n1wy9xc660wpb8x5nkmz70d8r61r41-cabal2nix-pathway
2.12 s
[cabal2nix-pathway:post-build] Nothing to push - all store paths are already on Cachix.
2.14 s
[cabal2nix-pathway:post-build] Uploading to the NixCI cache: /nix/store/p2n1wy9xc660wpb8x5nkmz70d8r61r41-cabal2nix-pathway
2.19 s
[cabal2nix-pathway:post-build] warning: 'warn-short-path-literals' is deprecated, use 'lint-short-path-literals = ignore' instead
2.45 s
[cabal2nix-pathway:post-build] copying 1 paths...
2.45 s
[cabal2nix-pathway:post-build] copying path '/nix/store/p2n1wy9xc660wpb8x5nkmz70d8r61r41-cabal2nix-pathway' to 'https://cache.nix-ci.com'...
2.52 s
[cabal2nix-pathway:post-build] warning: 'warn-short-path-literals' is deprecated, use 'lint-short-path-literals = ignore' instead
2.61 s
[cabal2nix-pathway:post-build] copying 0 paths...
2.63 s
Uploaded cabal2nix-pathway in 979ms
2.63 s
Progress: 1 of 2 built
2.63 s
Built cabal2nix-pathway in 1.0s
2.63 s
Progress: 2 of 2 built
2.63 s
2.66 s
Building /nix/store/jsfc1dp99ma9qd7rlnnfr2zac3ndmgl8-cabal2nix-pathway-compat-base.drv
2.74 s
[cabal2nix-pathway-compat-base:post-build] Uploading to cachix cache "sellout": /nix/store/p835cxd3vnbj902niw7z0bwq4qysgpcw-cabal2nix-pathway-compat-base
3.13 s
[cabal2nix-pathway-compat-base:post-build] Nothing to push - all store paths are already on Cachix.
3.15 s
[cabal2nix-pathway-compat-base:post-build] Uploading to the NixCI cache: /nix/store/p835cxd3vnbj902niw7z0bwq4qysgpcw-cabal2nix-pathway-compat-base
3.20 s
[cabal2nix-pathway-compat-base:post-build] warning: 'warn-short-path-literals' is deprecated, use 'lint-short-path-literals = ignore' instead
3.34 s
[cabal2nix-pathway-compat-base:post-build] copying 1 paths...
3.34 s
[cabal2nix-pathway-compat-base:post-build] copying path '/nix/store/p835cxd3vnbj902niw7z0bwq4qysgpcw-cabal2nix-pathway-compat-base' to 'https://cache.nix-ci.com'...
3.42 s
[cabal2nix-pathway-compat-base:post-build] warning: 'warn-short-path-literals' is deprecated, use 'lint-short-path-literals = ignore' instead
3.51 s
[cabal2nix-pathway-compat-base:post-build] copying 0 paths...
3.53 s
Uploaded cabal2nix-pathway-compat-base in 802ms
3.53 s
Progress: 1 of 2 built
3.53 s
Built cabal2nix-pathway-compat-base in 865ms
3.53 s
Progress: 2 of 2 built
3.53 s
3.56 s
Building /nix/store/c43c9cc4nm7m9wc0ir0a7vvajldvagpi-cabal2nix-pathway-compat-directory.drv
3.64 s
[cabal2nix-pathway-compat-directory:post-build] Uploading to cachix cache "sellout": /nix/store/1xx3ip5cxzlkp84zw96ss1mv9spib8g3-cabal2nix-pathway-compat-directory
4.01 s
[cabal2nix-pathway-compat-directory:post-build] Nothing to push - all store paths are already on Cachix.
4.03 s
[cabal2nix-pathway-compat-directory:post-build] Uploading to the NixCI cache: /nix/store/1xx3ip5cxzlkp84zw96ss1mv9spib8g3-cabal2nix-pathway-compat-directory
4.08 s
[cabal2nix-pathway-compat-directory:post-build] warning: 'warn-short-path-literals' is deprecated, use 'lint-short-path-literals = ignore' instead
4.28 s
[cabal2nix-pathway-compat-directory:post-build] copying 1 paths...
4.28 s
[cabal2nix-pathway-compat-directory:post-build] copying path '/nix/store/1xx3ip5cxzlkp84zw96ss1mv9spib8g3-cabal2nix-pathway-compat-directory' to 'https://cache.nix-ci.com'...
4.35 s
[cabal2nix-pathway-compat-directory:post-build] warning: 'warn-short-path-literals' is deprecated, use 'lint-short-path-literals = ignore' instead
4.45 s
[cabal2nix-pathway-compat-directory:post-build] copying 0 paths...
4.47 s
Uploaded cabal2nix-pathway-compat-directory in 843ms
4.47 s
Progress: 1 of 2 built
4.47 s
Built cabal2nix-pathway-compat-directory in 907ms
4.47 s
Progress: 2 of 2 built
4.47 s
4.51 s
Building /nix/store/jabi9f2qp79ly27k3ak8gf4dnlyhi18d-cabal2nix-pathway-compat-file-io.drv
4.59 s
[cabal2nix-pathway-compat-file-io:post-build] Uploading to cachix cache "sellout": /nix/store/4nikzvkwvc16bbgw2z167rs9h5ipc9v2-cabal2nix-pathway-compat-file-io
5.29 s
[cabal2nix-pathway-compat-file-io:post-build] Nothing to push - all store paths are already on Cachix.
5.31 s
[cabal2nix-pathway-compat-file-io:post-build] Uploading to the NixCI cache: /nix/store/4nikzvkwvc16bbgw2z167rs9h5ipc9v2-cabal2nix-pathway-compat-file-io
5.38 s
[cabal2nix-pathway-compat-file-io:post-build] warning: 'warn-short-path-literals' is deprecated, use 'lint-short-path-literals = ignore' instead
5.52 s
[cabal2nix-pathway-compat-file-io:post-build] copying 1 paths...
5.52 s
[cabal2nix-pathway-compat-file-io:post-build] copying path '/nix/store/4nikzvkwvc16bbgw2z167rs9h5ipc9v2-cabal2nix-pathway-compat-file-io' to 'https://cache.nix-ci.com'...
5.60 s
[cabal2nix-pathway-compat-file-io:post-build] warning: 'warn-short-path-literals' is deprecated, use 'lint-short-path-literals = ignore' instead
5.69 s
[cabal2nix-pathway-compat-file-io:post-build] copying 0 paths...
5.72 s
Uploaded cabal2nix-pathway-compat-file-io in 1.1s
5.72 s
Progress: 1 of 2 built
5.72 s
Built cabal2nix-pathway-compat-file-io in 1.2s
5.72 s
Progress: 2 of 2 built
5.72 s
5.75 s
Building /nix/store/skqb37x4ms1v3cqvhpcjxqfpmwfdyhga-cabal2nix-pathway-compat-filepath.drv
5.83 s
[cabal2nix-pathway-compat-filepath:post-build] Uploading to cachix cache "sellout": /nix/store/2vnv9v1mxybpljj4bp6l2fd3df31p7d6-cabal2nix-pathway-compat-filepath
6.28 s
[cabal2nix-pathway-compat-filepath:post-build] Nothing to push - all store paths are already on Cachix.
6.30 s
[cabal2nix-pathway-compat-filepath:post-build] Uploading to the NixCI cache: /nix/store/2vnv9v1mxybpljj4bp6l2fd3df31p7d6-cabal2nix-pathway-compat-filepath
6.37 s
[cabal2nix-pathway-compat-filepath:post-build] warning: 'warn-short-path-literals' is deprecated, use 'lint-short-path-literals = ignore' instead
6.51 s
[cabal2nix-pathway-compat-filepath:post-build] copying 1 paths...
6.51 s
[cabal2nix-pathway-compat-filepath:post-build] copying path '/nix/store/2vnv9v1mxybpljj4bp6l2fd3df31p7d6-cabal2nix-pathway-compat-filepath' to 'https://cache.nix-ci.com'...
6.60 s
[cabal2nix-pathway-compat-filepath:post-build] warning: 'warn-short-path-literals' is deprecated, use 'lint-short-path-literals = ignore' instead
6.70 s
[cabal2nix-pathway-compat-filepath:post-build] copying 0 paths...
6.72 s
Uploaded cabal2nix-pathway-compat-filepath in 905ms
6.72 s
Progress: 1 of 2 built
6.72 s
Built cabal2nix-pathway-compat-filepath in 974ms
6.72 s
Progress: 2 of 2 built
6.73 s
6.76 s
Building /nix/store/79bixzczi8gdzwrnjsyl6k6dylh0b4c4-cabal2nix-pathway-compat-temporary.drv
6.83 s
[cabal2nix-pathway-compat-temporary:post-build] Uploading to cachix cache "sellout": /nix/store/67ldcm8fabgjiaa3nyyz2l4i95l3niz9-cabal2nix-pathway-compat-temporary
7.41 s
[cabal2nix-pathway-compat-temporary:post-build] Nothing to push - all store paths are already on Cachix.
7.43 s
[cabal2nix-pathway-compat-temporary:post-build] Uploading to the NixCI cache: /nix/store/67ldcm8fabgjiaa3nyyz2l4i95l3niz9-cabal2nix-pathway-compat-temporary
7.49 s
[cabal2nix-pathway-compat-temporary:post-build] warning: 'warn-short-path-literals' is deprecated, use 'lint-short-path-literals = ignore' instead
7.78 s
[cabal2nix-pathway-compat-temporary:post-build] copying 1 paths...
7.78 s
[cabal2nix-pathway-compat-temporary:post-build] copying path '/nix/store/67ldcm8fabgjiaa3nyyz2l4i95l3niz9-cabal2nix-pathway-compat-temporary' to 'https://cache.nix-ci.com'...
8.08 s
[cabal2nix-pathway-compat-temporary:post-build] warning: 'warn-short-path-literals' is deprecated, use 'lint-short-path-literals = ignore' instead
8.27 s
[cabal2nix-pathway-compat-temporary:post-build] copying 0 paths...
8.30 s
Uploaded cabal2nix-pathway-compat-temporary in 1.4s
8.30 s
Progress: 1 of 2 built
8.30 s
Built cabal2nix-pathway-compat-temporary in 1.5s
8.30 s
Progress: 2 of 2 built
8.30 s
8.33 s
Building /nix/store/kmpgp5rvx577m0612qans1i05b4qb4jv-cabal2nix-pathway-internal.drv
8.40 s
[cabal2nix-pathway-internal:post-build] Uploading to cachix cache "sellout": /nix/store/si6ff5a3dh40j4l6q390jzv6d0d54h3j-cabal2nix-pathway-internal
8.77 s
[cabal2nix-pathway-internal:post-build] Nothing to push - all store paths are already on Cachix.
8.79 s
[cabal2nix-pathway-internal:post-build] Uploading to the NixCI cache: /nix/store/si6ff5a3dh40j4l6q390jzv6d0d54h3j-cabal2nix-pathway-internal
8.84 s
[cabal2nix-pathway-internal:post-build] warning: 'warn-short-path-literals' is deprecated, use 'lint-short-path-literals = ignore' instead
9.00 s
[cabal2nix-pathway-internal:post-build] copying 1 paths...
9.00 s
[cabal2nix-pathway-internal:post-build] copying path '/nix/store/si6ff5a3dh40j4l6q390jzv6d0d54h3j-cabal2nix-pathway-internal' to 'https://cache.nix-ci.com'...
9.07 s
[cabal2nix-pathway-internal:post-build] warning: 'warn-short-path-literals' is deprecated, use 'lint-short-path-literals = ignore' instead
9.17 s
[cabal2nix-pathway-internal:post-build] copying 0 paths...
9.19 s
Uploaded cabal2nix-pathway-internal in 804ms
9.19 s
Progress: 1 of 2 built
9.19 s
Built cabal2nix-pathway-internal in 865ms
9.19 s
Progress: 2 of 2 built
9.20 s
9.22 s
Building /nix/store/18qj22ib0d9bm61y18w9zghkir79iw2v-cabal2nix-pathway-path.drv
9.30 s
[cabal2nix-pathway-path:post-build] Uploading to cachix cache "sellout": /nix/store/2hkaafayfy2zzb63w85wikbj61ywsf57-cabal2nix-pathway-path
10.01 s
[cabal2nix-pathway-path:post-build] Nothing to push - all store paths are already on Cachix.
10.02 s
[cabal2nix-pathway-path:post-build] Uploading to the NixCI cache: /nix/store/2hkaafayfy2zzb63w85wikbj61ywsf57-cabal2nix-pathway-path
10.08 s
[cabal2nix-pathway-path:post-build] warning: 'warn-short-path-literals' is deprecated, use 'lint-short-path-literals = ignore' instead
10.21 s
[cabal2nix-pathway-path:post-build] copying 1 paths...
10.21 s
[cabal2nix-pathway-path:post-build] copying path '/nix/store/2hkaafayfy2zzb63w85wikbj61ywsf57-cabal2nix-pathway-path' to 'https://cache.nix-ci.com'...
10.29 s
[cabal2nix-pathway-path:post-build] warning: 'warn-short-path-literals' is deprecated, use 'lint-short-path-literals = ignore' instead
10.37 s
[cabal2nix-pathway-path:post-build] copying 0 paths...
10.40 s
Uploaded cabal2nix-pathway-path in 1.1s
10.40 s
Progress: 1 of 2 built
10.40 s
Built cabal2nix-pathway-path in 1.1s
10.52 s
Progress: 2 of 2 built
10.52 s
10.52 s
Building /nix/store/88ysmwwqzy574jw0jk5737nvxgkm96a3-cabal2nix-pathway-quickcheck.drv
10.52 s
[cabal2nix-pathway-quickcheck:post-build] Uploading to cachix cache "sellout": /nix/store/cjn5d2zns0syl5gk8kzvdsjixxx4v8al-cabal2nix-pathway-quickcheck
10.95 s
[cabal2nix-pathway-quickcheck:post-build] Nothing to push - all store paths are already on Cachix.
10.97 s
[cabal2nix-pathway-quickcheck:post-build] Uploading to the NixCI cache: /nix/store/cjn5d2zns0syl5gk8kzvdsjixxx4v8al-cabal2nix-pathway-quickcheck
11.02 s
[cabal2nix-pathway-quickcheck:post-build] warning: 'warn-short-path-literals' is deprecated, use 'lint-short-path-literals = ignore' instead
11.16 s
[cabal2nix-pathway-quickcheck:post-build] copying 1 paths...
11.16 s
[cabal2nix-pathway-quickcheck:post-build] copying path '/nix/store/cjn5d2zns0syl5gk8kzvdsjixxx4v8al-cabal2nix-pathway-quickcheck' to 'https://cache.nix-ci.com'...
11.32 s
[cabal2nix-pathway-quickcheck:post-build] warning: 'warn-short-path-literals' is deprecated, use 'lint-short-path-literals = ignore' instead
11.39 s
[cabal2nix-pathway-quickcheck:post-build] copying 0 paths...
11.42 s
Uploaded cabal2nix-pathway-quickcheck in 890ms
11.42 s
Progress: 1 of 2 built
11.42 s
Built cabal2nix-pathway-quickcheck in 891ms
11.42 s
Progress: 2 of 2 built
11.42 s
11.45 s
Building /nix/store/qxgjh5iksvrckb38696m4bp5wqyq3jxn-cabal2nix-pathway-system.drv
11.51 s
[cabal2nix-pathway-system:post-build] Uploading to cachix cache "sellout": /nix/store/li2z603ljbg8fkswdr4xvvmza6qnbgh8-cabal2nix-pathway-system
11.88 s
[cabal2nix-pathway-system:post-build] Nothing to push - all store paths are already on Cachix.
11.90 s
[cabal2nix-pathway-system:post-build] Uploading to the NixCI cache: /nix/store/li2z603ljbg8fkswdr4xvvmza6qnbgh8-cabal2nix-pathway-system
11.95 s
[cabal2nix-pathway-system:post-build] warning: 'warn-short-path-literals' is deprecated, use 'lint-short-path-literals = ignore' instead
12.10 s
[cabal2nix-pathway-system:post-build] copying 1 paths...
12.10 s
[cabal2nix-pathway-system:post-build] copying path '/nix/store/li2z603ljbg8fkswdr4xvvmza6qnbgh8-cabal2nix-pathway-system' to 'https://cache.nix-ci.com'...
12.17 s
[cabal2nix-pathway-system:post-build] warning: 'warn-short-path-literals' is deprecated, use 'lint-short-path-literals = ignore' instead
12.26 s
[cabal2nix-pathway-system:post-build] copying 0 paths...
12.28 s
Uploaded cabal2nix-pathway-system in 779ms
12.28 s
Progress: 1 of 2 built
12.28 s
Built cabal2nix-pathway-system in 833ms
12.28 s
Progress: 2 of 2 built
12.59 s
15.15 s
Downloading cached colour-2.3.6-data from https://cache.nix-ci.com
15.15 s
Downloading cached ghc-9.6.7-doc from https://cache.nix-ci.com
15.15 s
Downloading cached ncurses-6.5-man from https://cache.nix-ci.com
15.15 s
Downloading cached setup-debug-info-dirs-hook from https://cache.nix-ci.com
15.15 s
Downloading cached numactl-2.0.18-dev from https://cache.nix-ci.com
15.15 s
Downloading cached dns-root-data-2025-04 from https://cache.nix-ci.com
15.15 s
Downloading cached hscolour from https://cache.nix-ci.com
15.15 s
Downloading cached libtasn1 from https://cache.nix-ci.com
15.15 s
Downloading cached nettle from https://cache.nix-ci.com
15.15 s
Downloading cached libevent from https://cache.nix-ci.com
15.20 s
Downloaded cached dns-root-data-2025-04 (4968 B) in 47ms
15.20 s
Progress: 0 of 106 built, 1 of 184 downloaded from cache (9 downloading)
15.20 s
Downloaded cached setup-debug-info-dirs-hook (592 B) in 53ms
15.20 s
Progress: 0 of 106 built, 2 of 184 downloaded from cache (8 downloading)
15.21 s
Downloaded cached numactl-2.0.18-dev (19 KiB) in 56ms
15.21 s
Progress: 0 of 106 built, 3 of 184 downloaded from cache (7 downloading)
15.22 s
Downloaded cached libtasn1 (95 KiB) in 63ms
15.22 s
Progress: 0 of 106 built, 4 of 184 downloaded from cache (6 downloading)
15.22 s
Downloading cached p11-kit from https://cache.nix-ci.com
15.24 s
Downloaded cached libevent (861 KiB) in 81ms
15.24 s
Progress: 0 of 106 built, 5 of 184 downloaded from cache (6 downloading)
15.24 s
Downloaded cached nettle (711 KiB) in 84ms
15.24 s
Progress: 0 of 106 built, 6 of 184 downloaded from cache (5 downloading)
15.24 s
Downloading cached unbound-1.24.2-lib from https://cache.nix-ci.com
15.26 s
Downloaded cached ncurses-6.5-man (623 KiB) in 116ms
15.26 s
Progress: 0 of 106 built, 7 of 184 downloaded from cache (5 downloading)
15.26 s
Downloading cached ncurses-6.5-dev from https://cache.nix-ci.com
15.26 s
Downloaded cached colour-2.3.6-data (2536 B) in 119ms
15.27 s
Progress: 0 of 106 built, 8 of 184 downloaded from cache (5 downloading)
15.28 s
Downloaded cached unbound-1.24.2-lib (1.1 MiB) in 34ms
15.28 s
Progress: 0 of 106 built, 9 of 184 downloaded from cache (4 downloading)
15.29 s
Downloaded cached p11-kit (5.2 MiB) in 70ms
15.29 s
Progress: 0 of 106 built, 10 of 184 downloaded from cache (3 downloading)
15.29 s
Downloading cached gnutls from https://cache.nix-ci.com
15.29 s
Downloaded cached ncurses-6.5-dev (377 KiB) in 25ms
15.29 s
Progress: 0 of 106 built, 11 of 184 downloaded from cache (3 downloading)
15.35 s
Downloaded cached gnutls (3.3 MiB) in 58ms
15.35 s
Progress: 0 of 106 built, 12 of 184 downloaded from cache (2 downloading)
15.35 s
Downloading cached libmicrohttpd from https://cache.nix-ci.com
15.37 s
Downloaded cached libmicrohttpd (260 KiB) in 24ms
15.37 s
Progress: 0 of 106 built, 13 of 184 downloaded from cache (2 downloading)
15.37 s
Downloading cached elfutils-0.194-bin from https://cache.nix-ci.com
15.39 s
Downloaded cached hscolour (2.5 MiB) in 235ms
15.39 s
Progress: 0 of 106 built, 14 of 184 downloaded from cache (2 downloading)
15.42 s
Downloaded cached elfutils-0.194-bin (3.5 MiB) in 48ms
15.42 s
Progress: 0 of 105 built, 15 of 184 downloaded from cache (1 downloading)
15.42 s
Downloading cached elfutils-0.194-dev from https://cache.nix-ci.com
15.46 s
Downloaded cached elfutils-0.194-dev (240 KiB) in 40ms
15.46 s
Progress: 0 of 105 built, 16 of 184 downloaded from cache (1 downloading)
23.96 s
Downloaded cached ghc-9.6.7-doc (658.4 MiB) in 8.8s
23.97 s
Progress: 0 of 105 built, 17 of 184 downloaded from cache
23.97 s
Downloading cached OneTuple-0.4.2-doc from https://cache.nix-ci.com
23.97 s
Downloading cached StateVar-1.2.2-doc from https://cache.nix-ci.com
23.97 s
Downloading cached assoc-1.1.1-doc from https://cache.nix-ci.com
23.97 s
Downloading cached base-orphans-0.9.3-doc from https://cache.nix-ci.com
23.97 s
Downloading cached cabal-doctest-1.0.12-doc from https://cache.nix-ci.com
23.97 s
Downloading cached call-stack-0.4.0-doc from https://cache.nix-ci.com
23.97 s
Downloading cached character-ps-0.1-doc from https://cache.nix-ci.com
23.97 s
Downloading cached clock-0.8.4-doc from https://cache.nix-ci.com
23.97 s
Downloading cached code-page-0.2.1-doc from https://cache.nix-ci.com
23.97 s
Downloading cached colour-2.3.6-doc from https://cache.nix-ci.com
23.97 s
Downloading cached dlist-1.0-doc from https://cache.nix-ci.com
23.97 s
Downloading cached file-io-0.1.5-doc from https://cache.nix-ci.com
23.97 s
Downloading cached generically-0.1.1-doc from https://cache.nix-ci.com
23.97 s
Downloading cached ghc from https://cache.nix-ci.com
23.97 s
Downloading cached ghc-paths-0.1.0.12-doc from https://cache.nix-ci.com
23.97 s
Downloading cached indexed-traversable-0.1.4-doc from https://cache.nix-ci.com
24.11 s
Downloaded cached StateVar-1.2.2-doc (299 KiB) in 139ms
24.11 s
Progress: 0 of 104 built, 18 of 184 downloaded from cache (15 downloading)
24.11 s
Downloading cached integer-logarithms-1.0.4-doc from https://cache.nix-ci.com
24.11 s
Downloaded cached clock-0.8.4-doc (482 KiB) in 140ms
24.11 s
Progress: 0 of 104 built, 19 of 184 downloaded from cache (15 downloading)
24.11 s
Downloading cached contravariant-1.5.5-doc from https://cache.nix-ci.com
24.12 s
Downloaded cached cabal-doctest-1.0.12-doc (357 KiB) in 149ms
24.12 s
Progress: 0 of 104 built, 20 of 184 downloaded from cache (15 downloading)
24.12 s
Downloading cached extra-1.8.1-doc from https://cache.nix-ci.com
24.12 s
Downloaded cached character-ps-0.1-doc (1 MiB) in 150ms
24.12 s
Progress: 0 of 104 built, 21 of 184 downloaded from cache (15 downloading)
24.12 s
Downloading cached old-locale-1.0.0.7-doc from https://cache.nix-ci.com
24.13 s
Downloaded cached OneTuple-0.4.2-doc (211 KiB) in 167ms
24.13 s
Progress: 0 of 104 built, 22 of 184 downloaded from cache (15 downloading)
24.13 s
Downloading cached os-string-2.0.8-doc from https://cache.nix-ci.com
24.14 s
Downloaded cached assoc-1.1.1-doc (189 KiB) in 173ms
24.14 s
Progress: 0 of 104 built, 23 of 184 downloaded from cache (15 downloading)
24.14 s
Downloading cached parallel-3.2.2.0-doc from https://cache.nix-ci.com
24.14 s
Downloaded cached code-page-0.2.1-doc (276 KiB) in 176ms
24.14 s
Progress: 0 of 104 built, 24 of 184 downloaded from cache (15 downloading)
24.14 s
Downloading cached parser-combinators-1.3.0-doc from https://cache.nix-ci.com
24.17 s
Downloaded cached base-orphans-0.9.3-doc (1.2 MiB) in 203ms
24.17 s
Progress: 0 of 104 built, 25 of 184 downloaded from cache (15 downloading)
24.17 s
Downloading cached prettyprinter-1.7.1-doc from https://cache.nix-ci.com
24.18 s
Downloaded cached colour-2.3.6-doc (2 MiB) in 211ms
24.18 s
Progress: 0 of 104 built, 26 of 184 downloaded from cache (15 downloading)
24.18 s
Downloading cached primitive-0.9.1.0-doc from https://cache.nix-ci.com
24.18 s
Downloaded cached dlist-1.0-doc (533 KiB) in 211ms
24.18 s
Progress: 0 of 104 built, 27 of 184 downloaded from cache (15 downloading)
24.18 s
Downloaded cached generically-0.1.1-doc (176 KiB) in 211ms
24.18 s
Downloading cached ansi-terminal-types-1.1.3-doc from https://cache.nix-ci.com
24.18 s
Progress: 0 of 104 built, 28 of 184 downloaded from cache (15 downloading)
24.18 s
Downloading cached reflection-2.1.9-doc from https://cache.nix-ci.com
24.19 s
Downloaded cached ghc-paths-0.1.0.12-doc (121 KiB) in 228ms
24.19 s
Progress: 0 of 104 built, 29 of 184 downloaded from cache (15 downloading)
24.19 s
Downloading cached semigroups-0.20-doc from https://cache.nix-ci.com
24.22 s
Downloaded cached indexed-traversable-0.1.4-doc (1.1 MiB) in 249ms
24.22 s
Progress: 0 of 104 built, 30 of 184 downloaded from cache (15 downloading)
24.22 s
Downloading cached splitmix-0.1.3.1-doc from https://cache.nix-ci.com
24.22 s
Downloaded cached call-stack-0.4.0-doc (173 KiB) in 251ms
24.22 s
Progress: 0 of 104 built, 31 of 184 downloaded from cache (15 downloading)
24.22 s
Downloading cached syb-0.7.2.4-doc from https://cache.nix-ci.com
24.24 s
Downloaded cached integer-logarithms-1.0.4-doc (353 KiB) in 136ms
24.24 s
Progress: 0 of 104 built, 32 of 184 downloaded from cache (15 downloading)
24.24 s
Downloading cached tagged-0.8.9-doc from https://cache.nix-ci.com
24.25 s
Downloaded cached contravariant-1.5.5-doc (935 KiB) in 138ms
24.25 s
Progress: 0 of 104 built, 33 of 184 downloaded from cache (15 downloading)
24.25 s
Downloading cached th-abstraction-0.7.1.0-doc from https://cache.nix-ci.com
24.25 s
Downloaded cached file-io-0.1.5-doc (673 KiB) in 281ms
24.25 s
Progress: 0 of 104 built, 34 of 184 downloaded from cache (15 downloading)
24.25 s
Downloading cached th-compat-0.1.6-doc from https://cache.nix-ci.com
24.26 s
Downloaded cached old-locale-1.0.0.7-doc (161 KiB) in 139ms
24.26 s
Progress: 0 of 104 built, 35 of 184 downloaded from cache (15 downloading)
24.26 s
Downloading cached transformers-base-0.4.6-doc from https://cache.nix-ci.com
24.28 s
Downloaded cached parallel-3.2.2.0-doc (1010 KiB) in 138ms
24.28 s
Progress: 0 of 104 built, 36 of 184 downloaded from cache (15 downloading)
24.28 s
Downloading cached old-time-1.1.0.4-doc from https://cache.nix-ci.com
24.28 s
Downloaded cached extra-1.8.1-doc (3 MiB) in 169ms
24.28 s
Progress: 0 of 104 built, 37 of 184 downloaded from cache (15 downloading)
24.28 s
Downloading cached transformers-compat-0.7.2-doc from https://cache.nix-ci.com
24.29 s
Downloaded cached os-string-2.0.8-doc (3.5 MiB) in 157ms
24.29 s
Progress: 0 of 104 built, 38 of 184 downloaded from cache (15 downloading)
24.29 s
Downloading cached unliftio-core-0.2.1.0-doc from https://cache.nix-ci.com
24.33 s
Downloaded cached primitive-0.9.1.0-doc (5.3 MiB) in 154ms
24.33 s
Progress: 0 of 104 built, 39 of 184 downloaded from cache (15 downloading)
24.33 s
Downloading cached hashable-1.5.0.0-doc from https://cache.nix-ci.com
24.35 s
Downloaded cached semigroups-0.20-doc (187 KiB) in 158ms
24.35 s
Progress: 0 of 104 built, 40 of 184 downloaded from cache (15 downloading)
24.35 s
Downloaded cached prettyprinter-1.7.1-doc (2.9 MiB) in 184ms
24.35 s
Downloading cached integer-conversion-0.1.1-doc from https://cache.nix-ci.com
24.35 s
Progress: 0 of 104 built, 41 of 184 downloaded from cache (15 downloading)
24.35 s
Downloading cached vector-stream-0.1.0.1-doc from https://cache.nix-ci.com
24.36 s
Downloaded cached ansi-terminal-types-1.1.3-doc (659 KiB) in 185ms
24.36 s
Progress: 0 of 104 built, 42 of 184 downloaded from cache (15 downloading)
24.36 s
Downloading cached void-0.7.3-doc from https://cache.nix-ci.com
24.37 s
Downloaded cached syb-0.7.2.4-doc (1.2 MiB) in 151ms
24.37 s
Progress: 0 of 104 built, 43 of 184 downloaded from cache (15 downloading)
24.37 s
Downloading cached ansi-terminal-1.1.3-doc from https://cache.nix-ci.com
24.39 s
Downloaded cached splitmix-0.1.3.1-doc (552 KiB) in 174ms
24.39 s
Progress: 0 of 104 built, 44 of 184 downloaded from cache (15 downloading)
24.39 s
Downloading cached random-1.2.1.3-doc from https://cache.nix-ci.com
24.39 s
Downloaded cached tagged-0.8.9-doc (602 KiB) in 150ms
24.39 s
Progress: 0 of 104 built, 45 of 184 downloaded from cache (15 downloading)
24.39 s
Downloading cached distributive-0.6.2.1-doc from https://cache.nix-ci.com
24.40 s
Downloaded cached reflection-2.1.9-doc (568 KiB) in 222ms
24.40 s
Progress: 0 of 104 built, 46 of 184 downloaded from cache (15 downloading)
24.41 s
Downloaded cached th-compat-0.1.6-doc (539 KiB) in 158ms
24.41 s
Progress: 0 of 104 built, 47 of 184 downloaded from cache (14 downloading)
24.41 s
Downloading cached network-uri-2.6.4.2-doc from https://cache.nix-ci.com
24.41 s
Downloaded cached transformers-base-0.4.6-doc (178 KiB) in 155ms
24.41 s
Progress: 0 of 104 built, 48 of 184 downloaded from cache (14 downloading)
24.42 s
Downloaded cached th-abstraction-0.7.1.0-doc (2 MiB) in 170ms
24.42 s
Progress: 0 of 104 built, 49 of 184 downloaded from cache (13 downloading)
24.46 s
Downloaded cached unliftio-core-0.2.1.0-doc (246 KiB) in 170ms
24.46 s
Progress: 0 of 104 built, 50 of 184 downloaded from cache (12 downloading)
24.46 s
Downloaded cached old-time-1.1.0.4-doc (532 KiB) in 184ms
24.46 s
Progress: 0 of 104 built, 51 of 184 downloaded from cache (11 downloading)
24.46 s
Downloaded cached transformers-compat-0.7.2-doc (1.9 MiB) in 179ms
24.46 s
Progress: 0 of 104 built, 52 of 184 downloaded from cache (10 downloading)
24.47 s
Downloaded cached parser-combinators-1.3.0-doc (895 KiB) in 331ms
24.47 s
Progress: 0 of 104 built, 53 of 184 downloaded from cache (9 downloading)
24.50 s
Downloaded cached vector-stream-0.1.0.1-doc (1.5 MiB) in 141ms
24.50 s
Progress: 0 of 104 built, 54 of 184 downloaded from cache (8 downloading)
24.51 s
Downloaded cached void-0.7.3-doc (118 KiB) in 145ms
24.51 s
Progress: 0 of 104 built, 55 of 184 downloaded from cache (7 downloading)
24.51 s
Downloaded cached ansi-terminal-1.1.3-doc (862 KiB) in 144ms
24.51 s
Progress: 0 of 104 built, 56 of 184 downloaded from cache (6 downloading)
24.51 s
Downloading cached prettyprinter-ansi-terminal-1.1.3-doc from https://cache.nix-ci.com
24.54 s
Downloaded cached random-1.2.1.3-doc (2.5 MiB) in 144ms
24.54 s
Progress: 0 of 104 built, 57 of 184 downloaded from cache (6 downloading)
24.54 s
Downloaded cached integer-conversion-0.1.1-doc (240 KiB) in 181ms
24.54 s
Downloading cached QuickCheck-2.15.0.1-doc from https://cache.nix-ci.com
24.54 s
Downloading cached temporary-1.3-doc from https://cache.nix-ci.com
24.54 s
Progress: 0 of 104 built, 58 of 184 downloaded from cache (7 downloading)
24.54 s
Downloaded cached hashable-1.5.0.0-doc (1.2 MiB) in 210ms
24.54 s
Progress: 0 of 104 built, 59 of 184 downloaded from cache (6 downloading)
24.54 s
Downloading cached case-insensitive-1.2.1.0-doc from https://cache.nix-ci.com
24.54 s
Downloading cached data-fix-0.3.4-doc from https://cache.nix-ci.com
24.54 s
Downloading cached scientific-0.3.8.0-doc from https://cache.nix-ci.com
24.54 s
Downloading cached these-1.2.1-doc from https://cache.nix-ci.com
24.54 s
Downloading cached time-compat-1.9.8-doc from https://cache.nix-ci.com
24.54 s
Downloading cached text-short-0.1.6-doc from https://cache.nix-ci.com
24.54 s
Downloading cached unordered-containers-0.2.20.1-doc from https://cache.nix-ci.com
24.54 s
Downloading cached uuid-types-1.0.6-doc from https://cache.nix-ci.com
24.56 s
Downloaded cached distributive-0.6.2.1-doc (485 KiB) in 167ms
24.56 s
Progress: 0 of 104 built, 60 of 184 downloaded from cache (13 downloading)
24.56 s
Downloading cached comonad-5.0.9-doc from https://cache.nix-ci.com
24.56 s
Downloaded cached network-uri-2.6.4.2-doc (1 MiB) in 157ms
24.56 s
Progress: 0 of 104 built, 61 of 184 downloaded from cache (13 downloading)
24.67 s
Downloaded cached temporary-1.3-doc (237 KiB) in 138ms
24.67 s
Progress: 0 of 104 built, 62 of 184 downloaded from cache (12 downloading)
24.67 s
Downloading cached doctest-0.24.2-doc from https://cache.nix-ci.com
24.68 s
Downloaded cached these-1.2.1-doc (1000 KiB) in 138ms
24.68 s
Progress: 0 of 104 built, 63 of 184 downloaded from cache (12 downloading)
24.68 s
Downloading cached strict-0.5.1-doc from https://cache.nix-ci.com
24.71 s
Downloaded cached scientific-0.3.8.0-doc (986 KiB) in 164ms
24.71 s
Progress: 0 of 104 built, 64 of 184 downloaded from cache (12 downloading)
24.71 s
Downloaded cached text-short-0.1.6-doc (1.1 MiB) in 168ms
24.71 s
Progress: 0 of 104 built, 65 of 184 downloaded from cache (11 downloading)
24.72 s
Downloaded cached data-fix-0.3.4-doc (418 KiB) in 172ms
24.72 s
Progress: 0 of 104 built, 66 of 184 downloaded from cache (10 downloading)
24.72 s
Downloaded cached unordered-containers-0.2.20.1-doc (4.5 MiB) in 173ms
24.72 s
Progress: 0 of 104 built, 67 of 184 downloaded from cache (9 downloading)
24.72 s
Downloading cached indexed-traversable-instances-0.1.2-doc from https://cache.nix-ci.com
24.72 s
Downloaded cached prettyprinter-ansi-terminal-1.1.3-doc (517 KiB) in 211ms
24.72 s
Progress: 0 of 104 built, 68 of 184 downloaded from cache (9 downloading)
24.73 s
Downloading cached optparse-applicative-0.18.1.0-doc from https://cache.nix-ci.com
24.75 s
Downloaded cached uuid-types-1.0.6-doc (596 KiB) in 204ms
24.75 s
Progress: 0 of 104 built, 69 of 184 downloaded from cache (9 downloading)
24.76 s
Downloaded cached QuickCheck-2.15.0.1-doc (6.2 MiB) in 220ms
24.76 s
Progress: 0 of 104 built, 70 of 184 downloaded from cache (8 downloading)
24.76 s
Downloaded cached case-insensitive-1.2.1.0-doc (271 KiB) in 217ms
24.76 s
Progress: 0 of 104 built, 71 of 184 downloaded from cache (7 downloading)
24.76 s
Downloading cached megaparsec-9.7.0-doc from https://cache.nix-ci.com
24.78 s
Downloaded cached time-compat-1.9.8-doc (2.3 MiB) in 233ms
24.78 s
Progress: 0 of 104 built, 72 of 184 downloaded from cache (7 downloading)
24.78 s
Downloading cached text-iso8601-0.1.1-doc from https://cache.nix-ci.com
24.79 s
Downloaded cached comonad-5.0.9-doc (1.4 MiB) in 225ms
24.79 s
Progress: 0 of 104 built, 73 of 184 downloaded from cache (7 downloading)
24.79 s
Downloading cached bifunctors-5.6.2-doc from https://cache.nix-ci.com
24.82 s
Downloaded cached doctest-0.24.2-doc (1.6 MiB) in 150ms
24.83 s
Progress: 0 of 104 built, 74 of 184 downloaded from cache (7 downloading)
24.87 s
Downloaded cached indexed-traversable-instances-0.1.2-doc (186 KiB) in 151ms
24.87 s
Progress: 0 of 104 built, 75 of 184 downloaded from cache (6 downloading)
24.87 s
Downloading cached witherable-0.5-doc from https://cache.nix-ci.com
24.87 s
Downloaded cached optparse-applicative-0.18.1.0-doc (3.8 MiB) in 149ms
24.87 s
Progress: 0 of 104 built, 76 of 184 downloaded from cache (6 downloading)
24.87 s
Downloading cached tasty-1.5.3-doc from https://cache.nix-ci.com
24.89 s
Downloaded cached strict-0.5.1-doc (1.5 MiB) in 208ms
24.89 s
Progress: 0 of 104 built, 77 of 184 downloaded from cache (6 downloading)
24.89 s
Downloading cached quickcheck-instances-0.3.33-doc from https://cache.nix-ci.com
24.91 s
Downloaded cached text-iso8601-0.1.1-doc (572 KiB) in 136ms
24.91 s
Progress: 0 of 104 built, 78 of 184 downloaded from cache (6 downloading)
24.94 s
Downloaded cached bifunctors-5.6.2-doc (3.4 MiB) in 156ms
24.94 s
Progress: 0 of 104 built, 79 of 184 downloaded from cache (5 downloading)
24.94 s
Downloading cached semigroupoids-6.0.1-doc from https://cache.nix-ci.com
24.94 s
Downloading cached profunctors-5.6.3-doc from https://cache.nix-ci.com
24.97 s
Downloaded cached megaparsec-9.7.0-doc (5 MiB) in 203ms
24.97 s
Progress: 0 of 104 built, 80 of 184 downloaded from cache (6 downloading)
25.04 s
Downloaded cached quickcheck-instances-0.3.33-doc (1.5 MiB) in 148ms
25.04 s
Progress: 0 of 104 built, 81 of 184 downloaded from cache (5 downloading)
25.04 s
Downloaded cached witherable-0.5-doc (1.1 MiB) in 171ms
25.04 s
Progress: 0 of 104 built, 82 of 184 downloaded from cache (4 downloading)
25.10 s
Downloaded cached tasty-1.5.3-doc (3.1 MiB) in 226ms
25.10 s
Progress: 0 of 104 built, 83 of 184 downloaded from cache (3 downloading)
25.17 s
Downloaded cached semigroupoids-6.0.1-doc (5.6 MiB) in 225ms
25.17 s
Progress: 0 of 104 built, 84 of 184 downloaded from cache (2 downloading)
25.17 s
Downloading cached semialign-1.3.1-doc from https://cache.nix-ci.com
25.18 s
Downloaded cached profunctors-5.6.3-doc (4.9 MiB) in 232ms
25.18 s
Progress: 0 of 104 built, 85 of 184 downloaded from cache (2 downloading)
25.18 s
Downloading cached either-5.0.3-doc from https://cache.nix-ci.com
25.18 s
Downloading cached free-5.2-doc from https://cache.nix-ci.com
25.18 s
Downloading cached invariant-0.6.4-doc from https://cache.nix-ci.com
25.31 s
Downloaded cached semialign-1.3.1-doc (1.3 MiB) in 138ms
25.31 s
Progress: 0 of 104 built, 86 of 184 downloaded from cache (4 downloading)
25.31 s
Downloading cached aeson-2.2.3.0-doc from https://cache.nix-ci.com
25.31 s
Downloaded cached invariant-0.6.4-doc (2.1 MiB) in 138ms
25.31 s
Progress: 0 of 104 built, 87 of 184 downloaded from cache (4 downloading)
25.32 s
Downloaded cached either-5.0.3-doc (447 KiB) in 139ms
25.32 s
Progress: 0 of 104 built, 88 of 184 downloaded from cache (3 downloading)
25.33 s
Downloaded cached free-5.2-doc (5.8 MiB) in 153ms
25.33 s
Progress: 0 of 104 built, 89 of 184 downloaded from cache (2 downloading)
25.33 s
Downloading cached adjunctions-4.4.3-doc from https://cache.nix-ci.com
25.33 s
Downloading cached recursion-schemes-5.2.3-doc from https://sellout.cachix.org
25.49 s
Downloaded cached adjunctions-4.4.3-doc (1.9 MiB) in 161ms
25.49 s
Progress: 0 of 104 built, 90 of 184 downloaded from cache (3 downloading)
25.49 s
Downloading cached kan-extensions-5.2.7-doc from https://cache.nix-ci.com
25.54 s
Downloaded cached aeson-2.2.3.0-doc (13.9 MiB) in 231ms
25.54 s
Progress: 0 of 104 built, 91 of 184 downloaded from cache (3 downloading)
25.67 s
Downloaded cached kan-extensions-5.2.7-doc (2.2 MiB) in 182ms
25.67 s
Progress: 0 of 104 built, 92 of 184 downloaded from cache (2 downloading)
25.67 s
Downloading cached lens-5.3.5-doc from https://cache.nix-ci.com
25.81 s
Downloaded cached recursion-schemes-5.2.3-doc (1.9 MiB) in 479ms
25.81 s
Progress: 0 of 104 built, 93 of 184 downloaded from cache (2 downloading)
25.81 s
Downloading cached variant-1.0.1-doc from https://sellout.cachix.org
26.08 s
Downloaded cached lens-5.3.5-doc (33.3 MiB) in 408ms
26.08 s
Progress: 0 of 104 built, 94 of 184 downloaded from cache (2 downloading)
26.08 s
Downloading cached yaya-0.6.2.3-doc from https://sellout.cachix.org
26.20 s
Downloaded cached variant-1.0.1-doc (4.4 MiB) in 385ms
26.20 s
Progress: 0 of 104 built, 95 of 184 downloaded from cache (2 downloading)
26.40 s
Downloaded cached yaya-0.6.2.3-doc (2.9 MiB) in 316ms
26.40 s
Progress: 0 of 104 built, 96 of 184 downloaded from cache (1 downloading)
26.40 s
Downloading cached yaya-containers-0.1.2.2-doc from https://sellout.cachix.org
26.40 s
Downloading cached yaya-quickcheck-0.2.0.3-doc from https://sellout.cachix.org
26.40 s
Downloading cached yaya-unsafe-0.4.1.4-doc from https://sellout.cachix.org
26.66 s
Downloaded cached yaya-unsafe-0.4.1.4-doc (654 KiB) in 257ms
26.66 s
Progress: 0 of 104 built, 97 of 184 downloaded from cache (3 downloading)
26.67 s
Downloaded cached yaya-quickcheck-0.2.0.3-doc (268 KiB) in 272ms
26.67 s
Progress: 0 of 104 built, 98 of 184 downloaded from cache (2 downloading)
26.72 s
Downloaded cached yaya-containers-0.1.2.2-doc (1014 KiB) in 320ms
26.72 s
Progress: 0 of 104 built, 99 of 184 downloaded from cache (1 downloading)
44.21 s
Downloaded cached ghc (1.7 GiB) in 20.2s
44.21 s
Progress: 0 of 104 built, 100 of 184 downloaded from cache
44.22 s
Downloading cached OneTuple from https://cache.nix-ci.com
44.30 s
Downloading cached StateVar from https://cache.nix-ci.com
44.30 s
Downloading cached assoc from https://cache.nix-ci.com
44.30 s
Downloading cached base-orphans from https://cache.nix-ci.com
44.30 s
Downloading cached cabal-doctest from https://cache.nix-ci.com
44.30 s
Downloading cached call-stack from https://cache.nix-ci.com
44.30 s
Downloading cached character-ps from https://cache.nix-ci.com
44.30 s
Downloading cached clock from https://cache.nix-ci.com
44.30 s
Downloading cached code-page from https://cache.nix-ci.com
44.30 s
Downloading cached colour from https://cache.nix-ci.com
44.30 s
Downloading cached dlist from https://cache.nix-ci.com
44.30 s
Downloading cached file-io from https://cache.nix-ci.com
44.30 s
Downloading cached generically from https://cache.nix-ci.com
44.30 s
Downloading cached ghc-paths from https://cache.nix-ci.com
44.30 s
Downloading cached indexed-traversable from https://cache.nix-ci.com
44.30 s
Downloading cached integer-logarithms from https://cache.nix-ci.com
44.38 s
Downloaded cached clock (1.8 MiB) in 82ms
44.38 s
Progress: 0 of 103 built, 101 of 184 downloaded from cache (15 downloading)
44.38 s
Downloading cached old-locale from https://cache.nix-ci.com
44.38 s
Downloaded cached OneTuple (74 KiB) in 163ms
44.38 s
Progress: 0 of 102 built, 102 of 184 downloaded from cache (15 downloading)
44.38 s
Downloading cached extra from https://cache.nix-ci.com
44.38 s
Downloaded cached ghc-paths (101 KiB) in 84ms
44.38 s
Progress: 0 of 101 built, 103 of 184 downloaded from cache (15 downloading)
44.38 s
Downloaded cached assoc (171 KiB) in 85ms
44.38 s
Downloading cached os-string from https://cache.nix-ci.com
44.38 s
Progress: 0 of 101 built, 104 of 184 downloaded from cache (15 downloading)
44.38 s
Downloading cached parallel from https://cache.nix-ci.com
44.38 s
Downloaded cached indexed-traversable (3.9 MiB) in 85ms
44.38 s
Progress: 0 of 100 built, 105 of 184 downloaded from cache (15 downloading)
44.38 s
Downloading cached parser-combinators from https://cache.nix-ci.com
44.39 s
Downloaded cached base-orphans (2 MiB) in 89ms
44.39 s
Progress: 0 of 99 built, 106 of 184 downloaded from cache (15 downloading)
44.39 s
Downloading cached prettyprinter from https://cache.nix-ci.com
44.39 s
Downloaded cached StateVar (382 KiB) in 91ms
44.39 s
Progress: 0 of 98 built, 107 of 184 downloaded from cache (15 downloading)
44.39 s
Downloading cached primitive from https://cache.nix-ci.com
44.39 s
Downloaded cached call-stack (281 KiB) in 92ms
44.39 s
Progress: 0 of 97 built, 108 of 184 downloaded from cache (15 downloading)
44.39 s
Downloading cached contravariant from https://cache.nix-ci.com
44.41 s
Downloaded cached cabal-doctest (768 KiB) in 110ms
44.41 s
Progress: 0 of 96 built, 109 of 184 downloaded from cache (15 downloading)
44.41 s
Downloading cached reflection from https://cache.nix-ci.com
44.42 s
Downloaded cached dlist (1.4 MiB) in 127ms
44.42 s
Progress: 0 of 95 built, 110 of 184 downloaded from cache (15 downloading)
44.42 s
Downloading cached semigroups from https://cache.nix-ci.com
44.43 s
Downloaded cached generically (31 KiB) in 129ms
44.43 s
Progress: 0 of 94 built, 111 of 184 downloaded from cache (15 downloading)
44.43 s
Downloading cached splitmix from https://cache.nix-ci.com
44.43 s
Downloaded cached character-ps (2.2 MiB) in 131ms
44.43 s
Progress: 0 of 93 built, 112 of 184 downloaded from cache (15 downloading)
44.43 s
Downloading cached syb from https://cache.nix-ci.com
44.47 s
Downloaded cached colour (5.3 MiB) in 168ms
44.47 s
Progress: 0 of 92 built, 113 of 184 downloaded from cache (15 downloading)
44.47 s
Downloading cached tagged from https://cache.nix-ci.com
44.48 s
Downloaded cached integer-logarithms (900 KiB) in 182ms
44.48 s
Progress: 0 of 91 built, 114 of 184 downloaded from cache (15 downloading)
44.48 s
Downloading cached ansi-terminal-types from https://cache.nix-ci.com
44.48 s
Downloaded cached code-page (366 KiB) in 187ms
44.48 s
Progress: 0 of 90 built, 115 of 184 downloaded from cache (15 downloading)
44.48 s
Downloading cached th-abstraction from https://cache.nix-ci.com
44.49 s
Downloaded cached file-io (1.1 MiB) in 193ms
44.49 s
Progress: 0 of 90 built, 116 of 184 downloaded from cache (15 downloading)
44.49 s
Downloading cached th-compat from https://cache.nix-ci.com
44.53 s
Downloaded cached old-locale (529 KiB) in 148ms
44.53 s
Progress: 0 of 89 built, 117 of 184 downloaded from cache (15 downloading)
44.53 s
Downloading cached transformers-compat from https://cache.nix-ci.com
44.56 s
Downloaded cached extra (4.2 MiB) in 182ms
44.56 s
Progress: 0 of 88 built, 118 of 184 downloaded from cache (15 downloading)
44.56 s
Downloading cached old-time from https://cache.nix-ci.com
44.57 s
Downloaded cached parallel (1.4 MiB) in 187ms
44.57 s
Progress: 0 of 87 built, 119 of 184 downloaded from cache (15 downloading)
44.57 s
Downloading cached unliftio-core from https://cache.nix-ci.com
44.57 s
Downloaded cached semigroups (257 KiB) in 145ms
44.57 s
Progress: 0 of 86 built, 120 of 184 downloaded from cache (15 downloading)
44.57 s
Downloading cached vector-stream from https://cache.nix-ci.com
44.58 s
Downloaded cached contravariant (1.9 MiB) in 192ms
44.58 s
Progress: 0 of 85 built, 121 of 184 downloaded from cache (15 downloading)
44.58 s
Downloading cached void from https://cache.nix-ci.com
44.58 s
Downloaded cached os-string (5.9 MiB) in 201ms
44.58 s
Progress: 0 of 84 built, 122 of 184 downloaded from cache (15 downloading)
44.58 s
Downloading cached hashable from https://cache.nix-ci.com
44.58 s
Downloaded cached splitmix (894 KiB) in 158ms
44.58 s
Progress: 0 of 83 built, 123 of 184 downloaded from cache (15 downloading)
44.59 s
Downloading cached random from https://cache.nix-ci.com
44.60 s
Downloaded cached reflection (6 MiB) in 191ms
44.60 s
Progress: 0 of 82 built, 124 of 184 downloaded from cache (15 downloading)
44.62 s
Downloaded cached parser-combinators (1.8 MiB) in 241ms
44.62 s
Progress: 0 of 81 built, 125 of 184 downloaded from cache (14 downloading)
44.64 s
Downloaded cached th-compat (569 KiB) in 150ms
44.64 s
Progress: 0 of 80 built, 126 of 184 downloaded from cache (13 downloading)
44.64 s
Downloading cached network-uri from https://cache.nix-ci.com
44.64 s
Downloaded cached prettyprinter (8.6 MiB) in 256ms
44.64 s
Progress: 0 of 79 built, 127 of 184 downloaded from cache (13 downloading)
44.65 s
Downloaded cached th-abstraction (5.7 MiB) in 165ms
44.65 s
Progress: 0 of 78 built, 128 of 184 downloaded from cache (12 downloading)
44.65 s
Downloaded cached syb (2.8 MiB) in 221ms
44.65 s
Progress: 0 of 77 built, 129 of 184 downloaded from cache (11 downloading)
44.65 s
Downloaded cached tagged (1.7 MiB) in 188ms
44.65 s
Progress: 0 of 77 built, 130 of 184 downloaded from cache (10 downloading)
44.65 s
Downloading cached distributive from https://cache.nix-ci.com
44.68 s
Downloaded cached transformers-compat (3.4 MiB) in 153ms
44.68 s
Progress: 0 of 76 built, 131 of 184 downloaded from cache (10 downloading)
44.68 s
Downloading cached transformers-base from https://cache.nix-ci.com
44.69 s
Downloaded cached ansi-terminal-types (3.3 MiB) in 208ms
44.69 s
Progress: 0 of 75 built, 132 of 184 downloaded from cache (10 downloading)
44.69 s
Downloading cached ansi-terminal from https://cache.nix-ci.com
44.71 s
Downloaded cached unliftio-core (390 KiB) in 140ms
44.71 s
Progress: 0 of 74 built, 133 of 184 downloaded from cache (10 downloading)
44.71 s
Downloaded cached old-time (2.3 MiB) in 149ms
44.71 s
Progress: 0 of 73 built, 134 of 184 downloaded from cache (9 downloading)
44.74 s
Downloaded cached void (43 KiB) in 160ms
44.74 s
Progress: 0 of 72 built, 135 of 184 downloaded from cache (8 downloading)
44.76 s
Downloaded cached random (8.9 MiB) in 177ms
44.76 s
Progress: 0 of 71 built, 136 of 184 downloaded from cache (7 downloading)
44.76 s
Downloading cached QuickCheck from https://cache.nix-ci.com
44.76 s
Downloading cached temporary from https://cache.nix-ci.com
44.78 s
Downloaded cached vector-stream (3.1 MiB) in 206ms
44.78 s
Progress: 0 of 70 built, 137 of 184 downloaded from cache (8 downloading)
44.79 s
Downloaded cached hashable (3.3 MiB) in 204ms
44.79 s
Progress: 0 of 69 built, 138 of 184 downloaded from cache (7 downloading)
44.79 s
Downloading cached case-insensitive from https://cache.nix-ci.com
44.79 s
Downloading cached data-fix from https://cache.nix-ci.com
44.79 s
Downloading cached these from https://cache.nix-ci.com
44.79 s
Downloading cached text-short from https://cache.nix-ci.com
44.79 s
Downloading cached time-compat from https://cache.nix-ci.com
44.79 s
Downloading cached unordered-containers from https://cache.nix-ci.com
44.79 s
Downloading cached uuid-types from https://cache.nix-ci.com
44.80 s
Downloaded cached distributive (1.3 MiB) in 144ms
44.80 s
Progress: 0 of 68 built, 139 of 184 downloaded from cache (13 downloading)
44.80 s
Downloading cached comonad from https://cache.nix-ci.com
44.81 s
Downloaded cached network-uri (4.8 MiB) in 166ms
44.81 s
Progress: 0 of 67 built, 140 of 184 downloaded from cache (13 downloading)
44.85 s
Downloaded cached transformers-base (645 KiB) in 172ms
44.85 s
Progress: 0 of 66 built, 141 of 184 downloaded from cache (12 downloading)
44.88 s
Downloaded cached ansi-terminal (1.2 MiB) in 193ms
44.88 s
Progress: 0 of 65 built, 142 of 184 downloaded from cache (11 downloading)
44.88 s
Downloading cached prettyprinter-ansi-terminal from https://cache.nix-ci.com
44.93 s
Downloaded cached temporary (305 KiB) in 162ms
44.93 s
Progress: 0 of 64 built, 143 of 184 downloaded from cache (11 downloading)
44.93 s
Downloading cached doctest from https://cache.nix-ci.com
44.94 s
Downloaded cached case-insensitive (947 KiB) in 151ms
44.94 s
Progress: 0 of 63 built, 144 of 184 downloaded from cache (11 downloading)
44.94 s
Downloaded cached these (3.1 MiB) in 154ms
44.94 s
Progress: 0 of 62 built, 145 of 184 downloaded from cache (10 downloading)
44.94 s
Downloading cached strict from https://cache.nix-ci.com
44.95 s
Downloaded cached uuid-types (1.6 MiB) in 156ms
44.95 s
Progress: 0 of 61 built, 146 of 184 downloaded from cache (10 downloading)
44.96 s
Downloaded cached text-short (1.7 MiB) in 169ms
44.96 s
Progress: 0 of 60 built, 147 of 184 downloaded from cache (9 downloading)
44.96 s
Downloaded cached time-compat (2.5 MiB) in 170ms
44.96 s
Progress: 0 of 59 built, 148 of 184 downloaded from cache (8 downloading)
44.96 s
Downloaded cached primitive (8.7 MiB) in 573ms
44.96 s
Progress: 0 of 58 built, 149 of 184 downloaded from cache (7 downloading)
44.96 s
Downloading cached integer-conversion from https://cache.nix-ci.com
44.96 s
Downloading cached scientific from https://cache.nix-ci.com
44.98 s
Downloaded cached comonad (3.2 MiB) in 180ms
44.98 s
Progress: 0 of 57 built, 150 of 184 downloaded from cache (8 downloading)
44.98 s
Downloading cached bifunctors from https://cache.nix-ci.com
45.02 s
Downloaded cached unordered-containers (9.4 MiB) in 226ms
45.02 s
Progress: 0 of 56 built, 151 of 184 downloaded from cache (8 downloading)
45.03 s
Downloaded cached data-fix (1.1 MiB) in 240ms
45.03 s
Progress: 0 of 55 built, 152 of 184 downloaded from cache (7 downloading)
45.05 s
Downloaded cached prettyprinter-ansi-terminal (1.4 MiB) in 170ms
45.05 s
Progress: 0 of 54 built, 153 of 184 downloaded from cache (6 downloading)
45.05 s
Downloading cached optparse-applicative from https://cache.nix-ci.com
45.10 s
Downloaded cached strict (5.2 MiB) in 160ms
45.10 s
Progress: 0 of 53 built, 154 of 184 downloaded from cache (6 downloading)
45.11 s
Downloaded cached integer-conversion (193 KiB) in 150ms
45.11 s
Progress: 0 of 52 built, 155 of 184 downloaded from cache (5 downloading)
45.11 s
Downloading cached text-iso8601 from https://cache.nix-ci.com
45.12 s
Downloaded cached QuickCheck (20.1 MiB) in 360ms
45.12 s
Progress: 0 of 51 built, 156 of 184 downloaded from cache (5 downloading)
45.19 s
Downloaded cached scientific (2.9 MiB) in 224ms
45.19 s
Progress: 0 of 50 built, 157 of 184 downloaded from cache (4 downloading)
45.19 s
Downloading cached megaparsec from https://cache.nix-ci.com
45.25 s
Downloaded cached optparse-applicative (8.7 MiB) in 199ms
45.25 s
Progress: 0 of 49 built, 158 of 184 downloaded from cache (4 downloading)
45.25 s
Downloading cached tasty from https://cache.nix-ci.com
45.26 s
Downloaded cached text-iso8601 (2.9 MiB) in 148ms
45.26 s
Progress: 0 of 48 built, 159 of 184 downloaded from cache (4 downloading)
45.27 s
Downloaded cached bifunctors (16 MiB) in 295ms
45.27 s
Progress: 0 of 47 built, 160 of 184 downloaded from cache (3 downloading)
45.28 s
Downloading cached profunctors from https://cache.nix-ci.com
45.28 s
Downloading cached semigroupoids from https://cache.nix-ci.com
45.43 s
Downloaded cached tasty (9.4 MiB) in 180ms
45.43 s
Progress: 0 of 46 built, 161 of 184 downloaded from cache (4 downloading)
45.43 s
Downloading cached vector from https://cache.nix-ci.com
45.53 s
Downloaded cached megaparsec (15.4 MiB) in 341ms
45.53 s
Progress: 0 of 45 built, 162 of 184 downloaded from cache (4 downloading)
45.53 s
Downloaded cached semigroupoids (12.2 MiB) in 253ms
45.53 s
Progress: 0 of 44 built, 163 of 184 downloaded from cache (3 downloading)
45.55 s
Downloaded cached profunctors (10.6 MiB) in 272ms
45.55 s
Progress: 0 of 43 built, 164 of 184 downloaded from cache (2 downloading)
45.55 s
Downloading cached free from https://cache.nix-ci.com
45.55 s
Downloading cached invariant from https://cache.nix-ci.com
45.55 s
Downloading cached either from https://cache.nix-ci.com
45.72 s
Downloaded cached either (891 KiB) in 172ms
45.72 s
Progress: 0 of 42 built, 165 of 184 downloaded from cache (4 downloading)
45.77 s
Downloaded cached invariant (5.5 MiB) in 219ms
45.77 s
Progress: 0 of 41 built, 166 of 184 downloaded from cache (3 downloading)
45.91 s
Downloaded cached free (22.8 MiB) in 359ms
45.91 s
Progress: 0 of 40 built, 167 of 184 downloaded from cache (2 downloading)
45.91 s
Downloading cached adjunctions from https://cache.nix-ci.com
45.91 s
Downloading cached recursion-schemes from https://sellout.cachix.org
46.09 s
Downloaded cached adjunctions (6.1 MiB) in 181ms
46.09 s
Progress: 0 of 39 built, 168 of 184 downloaded from cache (3 downloading)
46.09 s
Downloading cached kan-extensions from https://cache.nix-ci.com
46.11 s
Downloaded cached vector (57.2 MiB) in 675ms
46.11 s
Progress: 0 of 38 built, 169 of 184 downloaded from cache (3 downloading)
46.11 s
Downloading cached indexed-traversable-instances from https://cache.nix-ci.com
46.11 s
Downloading cached quickcheck-instances from https://cache.nix-ci.com
46.27 s
Downloaded cached quickcheck-instances (5.5 MiB) in 162ms
46.27 s
Progress: 0 of 37 built, 170 of 184 downloaded from cache (4 downloading)
46.30 s
Downloaded cached kan-extensions (7.1 MiB) in 204ms
46.30 s
Progress: 0 of 36 built, 171 of 184 downloaded from cache (3 downloading)
46.32 s
Downloaded cached indexed-traversable-instances (358 KiB) in 209ms
46.32 s
Progress: 0 of 35 built, 172 of 184 downloaded from cache (2 downloading)
46.32 s
Downloading cached lens from https://cache.nix-ci.com
46.32 s
Downloading cached semialign from https://cache.nix-ci.com
46.32 s
Downloading cached witherable from https://cache.nix-ci.com
46.33 s
Downloaded cached recursion-schemes (6.7 MiB) in 422ms
46.33 s
Progress: 0 of 34 built, 173 of 184 downloaded from cache (4 downloading)
46.33 s
Downloading cached variant from https://sellout.cachix.org
46.55 s
Downloaded cached witherable (4.6 MiB) in 226ms
46.55 s
Progress: 0 of 33 built, 174 of 184 downloaded from cache (4 downloading)
46.55 s
Downloaded cached semialign (3.8 MiB) in 232ms
46.55 s
Progress: 0 of 32 built, 175 of 184 downloaded from cache (3 downloading)
46.55 s
Downloading cached aeson from https://cache.nix-ci.com
46.61 s
Downloaded cached doctest (66.3 MiB) in 1.6s
46.61 s
Progress: 0 of 31 built, 176 of 184 downloaded from cache (3 downloading)
46.84 s
Downloaded cached variant (11 MiB) in 507ms
46.84 s
Progress: 0 of 30 built, 177 of 184 downloaded from cache (2 downloading)
47.10 s
Downloaded cached lens (59.8 MiB) in 776ms
47.10 s
Progress: 0 of 29 built, 178 of 184 downloaded from cache (1 downloading)
47.10 s
Downloading cached yaya from https://sellout.cachix.org
47.19 s
Downloaded cached aeson (48.4 MiB) in 637ms
47.19 s
Progress: 0 of 28 built, 179 of 184 downloaded from cache (1 downloading)
47.19 s
Downloading cached path from https://cache.nix-ci.com
47.40 s
Downloaded cached path (10 MiB) in 207ms
47.40 s
Progress: 0 of 27 built, 180 of 184 downloaded from cache (1 downloading)
47.67 s
Downloaded cached yaya (5.4 MiB) in 570ms
47.67 s
Progress: 0 of 26 built, 181 of 184 downloaded from cache
47.67 s
Downloading cached yaya-containers from https://sellout.cachix.org
47.67 s
Downloading cached yaya-quickcheck from https://sellout.cachix.org
47.67 s
Downloading cached yaya-unsafe from https://sellout.cachix.org
47.78 s
Building /nix/store/a5dxlg6lw6dxjpr4zslz0zpbw79pjyzg-pathway-internal-0.0.1.0.drv
48.00 s
[pathway-internal] Phase: setupCompilerEnvironmentPhase
48.00 s
[pathway-internal] Build with /nix/store/da9x1n5l146q0ai9wz8zfbx4zfwa9b02-ghc-9.6.7.
48.01 s
Downloaded cached yaya-unsafe (1 MiB) in 336ms
48.01 s
Progress: 0 of 25 built (1 building), 182 of 184 downloaded from cache (2 downloading)
48.04 s
Downloaded cached yaya-quickcheck (351 KiB) in 366ms
48.04 s
Progress: 0 of 24 built (1 building), 183 of 184 downloaded from cache (1 downloading)
48.19 s
Downloaded cached yaya-containers (3.5 MiB) in 524ms
48.19 s
Progress: 0 of 23 built (1 building), 184 of 184 downloaded from cache
48.22 s
[pathway-internal] Phase: unpackPhase
48.23 s
[pathway-internal] unpacking source archive /nix/store/723m6sjvk66iiqzpvcfdd74xi6id5zqq-zjizyqf4pafgh9rycgxd507dhvpisdy1-source/./internal
48.23 s
[pathway-internal] source root is internal
48.24 s
[pathway-internal] Phase: patchPhase
48.25 s
[pathway-internal] Phase: compileBuildDriverPhase
48.25 s
[pathway-internal] setupCompileFlags: -package-db=/build/tmp.A5UqPepNlC/setup-package.conf.d -threaded
48.30 s
[pathway-internal] [1 of 2] Compiling Main ( Setup.hs, /build/tmp.A5UqPepNlC/Main.o )
48.35 s
[pathway-internal] [2 of 2] Linking Setup
49.59 s
[pathway-internal] Phase: updateAutotoolsGnuConfigScriptsPhase
49.60 s
[pathway-internal] Phase: configurePhase
49.61 s
[pathway-internal] configureFlags: --verbose --prefix=/nix/store/765dgav0b62i54ly7crn1ns6x6xvny7x-pathway-internal-0.0.1.0 --libdir=$prefix/lib/$compiler/lib --libsubdir=$abi/$libname --docdir=/nix/store/hhnwp61mp302fg55dqim9lly3h0bxz5j-pathway-internal-0.0.1.0-doc/share/doc/pathway-internal-0.0.1.0 --with-gcc=gcc --package-db=/build/tmp.A5UqPepNlC/package.conf.d --ghc-option=-j16 --ghc-option=+RTS --ghc-option=-A64M --ghc-option=-RTS --enable-library-profiling --profiling-detail=exported-functions --disable-profiling --enable-shared --disable-coverage --enable-static --disable-executable-dynamic --enable-tests --disable-benchmarks --enable-library-vanilla --disable-library-for-ghci --enable-split-sections --enable-library-stripping --enable-executable-stripping --ghc-option=-haddock --ghc-options=-Werror --extra-lib-dirs=/nix/store/ffyzkisqs4vc4mg28bwwlyqjf8i9ph6b-ncurses-6.5/lib --extra-lib-dirs=/nix/store/n28qgdj8c1q41kf7n4y1jxa6ckp85m3c-libffi-3.5.2/lib --extra-lib-dirs=/nix/store/1b6h99dw7bk4wbn77kbalih42zbc67m1-elfutils-0.194/lib --extra-lib-dirs=/nix/store/hi0ar880110k6jsmmili7dh1gq3cg2a9-gmp-with-cxx-6.3.0/lib --extra-lib-dirs=/nix/store/g09cflpnp4g80q56sj9dng1qzv4v4ybc-numactl-2.0.18/lib --extra-lib-dirs=/nix/store/da9x1n5l146q0ai9wz8zfbx4zfwa9b02-ghc-9.6.7/lib
49.73 s
[pathway-internal] Using Parsec parser
49.73 s
[pathway-internal] Configuring pathway-internal-0.0.1.0...
49.93 s
[pathway-internal] Flags chosen: noisy-deprecations=True, verify-no-recursion=False
49.93 s
[pathway-internal] Dependency base >=4.14.0 && <4.15 || >=4.15.0 && <4.16 || >=4.16.0 && <4.17 ||
49.93 s
[pathway-internal] >=4.17.0 && <4.18 || >=4.18.0 && <4.19 || >=4.19.0 && <4.20 || >=4.20.0 &&
49.93 s
[pathway-internal] <4.21 || >=4.21.0 && <4.22 || >=4.22.0 && <4.23: using base-4.18.3.0
49.93 s
[pathway-internal] Dependency yaya >=0.6.2 && <0.7 || >=0.7.0 && <0.8: using yaya-0.6.2.3
49.93 s
[pathway-internal] Dependency base >=4.14.0 && <4.15 || >=4.15.0 && <4.16 || >=4.16.0 && <4.17 ||
49.93 s
[pathway-internal] >=4.17.0 && <4.18 || >=4.18.0 && <4.19 || >=4.19.0 && <4.20 || >=4.20.0 &&
49.93 s
[pathway-internal] <4.21 || >=4.21.0 && <4.22 || >=4.22.0 && <4.23: using base-4.18.3.0
49.93 s
[pathway-internal] Dependency doctest >=0.16.3 && <0.17 || >=0.18.1 && <0.19 || >=0.20.1 && <0.21
49.93 s
[pathway-internal] || >=0.21.1 && <0.22 || >=0.22.2 && <0.23 || >=0.24.2 && <0.25: using
49.93 s
[pathway-internal] doctest-0.24.2
49.93 s
[pathway-internal] Dependency pathway-internal: using pathway-internal-0.0.1.0
50.24 s
[pathway-internal] Source component graph:
50.24 s
[pathway-internal] component lib
50.24 s
[pathway-internal] component test:doctests dependency lib
50.24 s
[pathway-internal] Configured component graph:
50.24 s
[pathway-internal] component pathway-internal-0.0.1.0-6pVrF111eN4BAqGigGNQse
50.24 s
[pathway-internal] include base-4.18.3.0
50.24 s
[pathway-internal] include yaya-0.6.2.3-7sqHSSXaJnw73nWfp3Ph4M
50.24 s
[pathway-internal] component pathway-internal-0.0.1.0-ADKjHHxaGK0E0bKpzBtKqL-doctests
50.24 s
[pathway-internal] include base-4.18.3.0
50.24 s
[pathway-internal] include doctest-0.24.2-7YxPr6lrdwiBMDK2pmizgF
50.24 s
[pathway-internal] include pathway-internal-0.0.1.0-6pVrF111eN4BAqGigGNQse
50.24 s
[pathway-internal] Linked component graph:
50.24 s
[pathway-internal] unit pathway-internal-0.0.1.0-6pVrF111eN4BAqGigGNQse
50.24 s
[pathway-internal] include base-4.18.3.0
50.24 s
[pathway-internal] include yaya-0.6.2.3-7sqHSSXaJnw73nWfp3Ph4M
50.24 s
[pathway-internal] Data.Path.Internal=pathway-internal-0.0.1.0-6pVrF111eN4BAqGigGNQse:Data.Path.Internal,Data.Path.Internal.Relativity=pathway-internal-0.0.1.0-6pVrF111eN4BAqGigGNQse:Data.Path.Internal.Relativity,Data.Path.Internal.Type=pathway-internal-0.0.1.0-6pVrF111eN4BAqGigGNQse:Data.Path.Internal.Type
50.24 s
[pathway-internal] unit pathway-internal-0.0.1.0-ADKjHHxaGK0E0bKpzBtKqL-doctests
50.24 s
[pathway-internal] include base-4.18.3.0
50.24 s
[pathway-internal] include doctest-0.24.2-7YxPr6lrdwiBMDK2pmizgF
50.24 s
[pathway-internal] include pathway-internal-0.0.1.0-6pVrF111eN4BAqGigGNQse
50.24 s
[pathway-internal] Ready component graph:
50.24 s
[pathway-internal] definite pathway-internal-0.0.1.0-6pVrF111eN4BAqGigGNQse
50.24 s
[pathway-internal] depends base-4.18.3.0
50.24 s
[pathway-internal] depends yaya-0.6.2.3-7sqHSSXaJnw73nWfp3Ph4M
50.24 s
[pathway-internal] definite pathway-internal-0.0.1.0-ADKjHHxaGK0E0bKpzBtKqL-doctests
50.24 s
[pathway-internal] depends base-4.18.3.0
50.24 s
[pathway-internal] depends doctest-0.24.2-7YxPr6lrdwiBMDK2pmizgF
50.24 s
[pathway-internal] depends pathway-internal-0.0.1.0-6pVrF111eN4BAqGigGNQse
50.24 s
[pathway-internal] Using Cabal-3.10.3.0 compiled by ghc-9.6
50.24 s
[pathway-internal] Using compiler: ghc-9.6.7
50.24 s
[pathway-internal] Using install prefix:
50.24 s
[pathway-internal] /nix/store/765dgav0b62i54ly7crn1ns6x6xvny7x-pathway-internal-0.0.1.0
50.24 s
[pathway-internal] Executables installed in:
50.24 s
[pathway-internal] /nix/store/765dgav0b62i54ly7crn1ns6x6xvny7x-pathway-internal-0.0.1.0/bin
50.24 s
[pathway-internal] Libraries installed in:
50.24 s
[pathway-internal] /nix/store/765dgav0b62i54ly7crn1ns6x6xvny7x-pathway-internal-0.0.1.0/lib/ghc-9.6.7/lib/x86_64-linux-ghc-9.6.7/pathway-internal-0.0.1.0-6pVrF111eN4BAqGigGNQse
50.24 s
[pathway-internal] Dynamic Libraries installed in:
50.24 s
[pathway-internal] /nix/store/765dgav0b62i54ly7crn1ns6x6xvny7x-pathway-internal-0.0.1.0/lib/ghc-9.6.7/lib/x86_64-linux-ghc-9.6.7
50.24 s
[pathway-internal] Private executables installed in:
50.24 s
[pathway-internal] /nix/store/765dgav0b62i54ly7crn1ns6x6xvny7x-pathway-internal-0.0.1.0/libexec/x86_64-linux-ghc-9.6.7/pathway-internal-0.0.1.0
50.24 s
[pathway-internal] Data files installed in:
50.24 s
[pathway-internal] /nix/store/765dgav0b62i54ly7crn1ns6x6xvny7x-pathway-internal-0.0.1.0/share/x86_64-linux-ghc-9.6.7/pathway-internal-0.0.1.0
50.24 s
[pathway-internal] Documentation installed in:
50.24 s
[pathway-internal] /nix/store/hhnwp61mp302fg55dqim9lly3h0bxz5j-pathway-internal-0.0.1.0-doc/share/doc/pathway-internal-0.0.1.0
50.24 s
[pathway-internal] Configuration files installed in:
50.24 s
[pathway-internal] /nix/store/765dgav0b62i54ly7crn1ns6x6xvny7x-pathway-internal-0.0.1.0/etc
50.24 s
[pathway-internal] No alex found
50.24 s
[pathway-internal] Using ar found on system at:
50.24 s
[pathway-internal] /nix/store/iz5lckcsg66r223si2gck7csk2hihj0m-binutils-wrapper-2.44/bin/ar
50.24 s
[pathway-internal] No c2hs found
50.24 s
[pathway-internal] No cpphs found
50.24 s
[pathway-internal] Using doctest version 0.24.2 found on system at:
50.24 s
[pathway-internal] /nix/store/mky1glcba5jwjn0h7fa1mldfnh39g6l9-doctest-0.24.2/bin/doctest
50.24 s
[pathway-internal] Using gcc version 14.3.0 given by user at:
50.24 s
[pathway-internal] /nix/store/8v97ngkcpfzgghwnnr7fsz33p2x22gy9-gcc-wrapper-14.3.0/bin/gcc
50.24 s
[pathway-internal] Using ghc version 9.6.7 found on system at:
50.24 s
[pathway-internal] /nix/store/da9x1n5l146q0ai9wz8zfbx4zfwa9b02-ghc-9.6.7/bin/ghc
50.24 s
[pathway-internal] Using ghc-pkg version 9.6.7 found on system at:
50.24 s
[pathway-internal] /nix/store/da9x1n5l146q0ai9wz8zfbx4zfwa9b02-ghc-9.6.7/bin/ghc-pkg-9.6.7
50.24 s
[pathway-internal] No ghcjs found
50.24 s
[pathway-internal] No ghcjs-pkg found
50.24 s
[pathway-internal] No greencard found
50.24 s
[pathway-internal] Using haddock version 2.29.2 found on system at:
50.24 s
[pathway-internal] /nix/store/da9x1n5l146q0ai9wz8zfbx4zfwa9b02-ghc-9.6.7/bin/haddock-ghc-9.6.7
50.24 s
[pathway-internal] No happy found
50.24 s
[pathway-internal] Using haskell-suite found on system at: haskell-suite-dummy-location
50.24 s
[pathway-internal] Using haskell-suite-pkg found on system at: haskell-suite-pkg-dummy-location
50.24 s
[pathway-internal] No hmake found
50.24 s
[pathway-internal] Using hpc version 0.68 found on system at:
50.24 s
[pathway-internal] /nix/store/da9x1n5l146q0ai9wz8zfbx4zfwa9b02-ghc-9.6.7/bin/hpc-ghc-9.6.7
50.24 s
[pathway-internal] Using hsc2hs version 0.68.9 found on system at:
50.24 s
[pathway-internal] /nix/store/da9x1n5l146q0ai9wz8zfbx4zfwa9b02-ghc-9.6.7/bin/hsc2hs-ghc-9.6.7
50.24 s
[pathway-internal] Using hscolour version 1.25 found on system at:
50.24 s
[pathway-internal] /nix/store/7ffc07q75k5a6zk864jv9gpiphhwzjlh-hscolour-1.25/bin/HsColour
50.24 s
[pathway-internal] No jhc found
50.24 s
[pathway-internal] Using ld found on system at:
50.24 s
[pathway-internal] /nix/store/iz5lckcsg66r223si2gck7csk2hihj0m-binutils-wrapper-2.44/bin/ld.gold
50.24 s
[pathway-internal] No pkg-config found
50.24 s
[pathway-internal] Using runghc version 9.6.7 found on system at:
50.24 s
[pathway-internal] /nix/store/da9x1n5l146q0ai9wz8zfbx4zfwa9b02-ghc-9.6.7/bin/runghc-9.6.7
50.24 s
[pathway-internal] Using strip version 2.44 found on system at:
50.24 s
[pathway-internal] /nix/store/8v97ngkcpfzgghwnnr7fsz33p2x22gy9-gcc-wrapper-14.3.0/bin/strip
50.24 s
[pathway-internal] Using tar found on system at:
50.24 s
[pathway-internal] /nix/store/xl6pd2spjajwcpq09fnmnjv5psqmlmma-gnutar-1.35/bin/tar
50.24 s
[pathway-internal] No uhc found
50.48 s
[pathway-internal] Phase: buildPhase
50.54 s
[pathway-internal] Preprocessing library for pathway-internal-0.0.1.0..
50.54 s
[pathway-internal] Building library for pathway-internal-0.0.1.0..
50.60 s
[pathway-internal] [1 of 3] Compiling Data.Path.Internal.Relativity ( src/Data/Path/Internal/Relativity.hs, dist/build/Data/Path/Internal/Relativity.o, dist/build/Data/Path/Internal/Relativity.dyn_o )
50.79 s
[pathway-internal] [2 of 3] Compiling Data.Path.Internal.Type ( src/Data/Path/Internal/Type.hs, dist/build/Data/Path/Internal/Type.o, dist/build/Data/Path/Internal/Type.dyn_o )
50.79 s
[pathway-internal] [3 of 3] Compiling Data.Path.Internal ( src/Data/Path/Internal.hs, dist/build/Data/Path/Internal.o, dist/build/Data/Path/Internal.dyn_o )
52.07 s
[pathway-internal] [1 of 3] Compiling Data.Path.Internal.Relativity ( src/Data/Path/Internal/Relativity.hs, dist/build/Data/Path/Internal/Relativity.p_o )
52.30 s
[pathway-internal] [2 of 3] Compiling Data.Path.Internal.Type ( src/Data/Path/Internal/Type.hs, dist/build/Data/Path/Internal/Type.p_o )
52.30 s
[pathway-internal] [3 of 3] Compiling Data.Path.Internal ( src/Data/Path/Internal.hs, dist/build/Data/Path/Internal.p_o )
54.81 s
[pathway-internal] Preprocessing test suite 'doctests' for pathway-internal-0.0.1.0..
54.81 s
[pathway-internal] Building test suite 'doctests' for pathway-internal-0.0.1.0..
54.87 s
[pathway-internal] [1 of 2] Compiling Build_doctests ( dist/build/doctests/autogen/Build_doctests.hs, dist/build/doctests/doctests-tmp/Build_doctests.o )
55.06 s
[pathway-internal] [2 of 2] Compiling Main ( tests/doctests.hs, dist/build/doctests/doctests-tmp/Main.o )
55.30 s
[pathway-internal] [3 of 3] Linking dist/build/doctests/doctests
58.71 s
[pathway-internal] Phase: checkPhase
58.76 s
[pathway-internal] Running 1 test suites...
58.76 s
[pathway-internal] Test suite doctests: RUNNING...
59.04 s
[pathway-internal]
59.04 s
[pathway-internal] on the commandline: warning:
59.04 s
[pathway-internal] -XTemplateHaskell is not allowed in Safe Haskell; ignoring -XTemplateHaskell
59.04 s
[pathway-internal]
59.04 s
[pathway-internal] on the commandline: warning:
59.04 s
[pathway-internal] -XTemplateHaskell is not allowed in Safe Haskell; ignoring -XTemplateHaskell
59.59 s
[pathway-internal] Examples: 0 Tried: 0 Errors: 0 Failures: 0
59.65 s
[pathway-internal] Test suite doctests: PASS
59.65 s
[pathway-internal] Test suite logged to: dist/test/pathway-internal-0.0.1.0-doctests.log
59.65 s
[pathway-internal] 1 of 1 test suites (1 of 1 test cases) passed.
59.66 s
[pathway-internal] Phase: haddockPhase
59.80 s
[pathway-internal] Preprocessing library for pathway-internal-0.0.1.0..
59.80 s
[pathway-internal] Running Haddock on library for pathway-internal-0.0.1.0..
59.80 s
[pathway-internal] Warning: The documentation for the following packages are not installed. No
59.80 s
[pathway-internal] links will be generated to these packages: vector-0.13.2.0
59.86 s
[pathway-internal] Warning: --source-* options are ignored when --hyperlinked-source is enabled.
60.09 s
[pathway-internal] Warning: 'Path' is out of scope.
60.09 s
[pathway-internal] If you qualify the identifier, haddock can try to link it anyway.
60.09 s
[pathway-internal] Warning: 'True' is out of scope.
60.09 s
[pathway-internal] If you qualify the identifier, haddock can try to link it anyway.
60.09 s
[pathway-internal] Warning: 'False' is out of scope.
60.09 s
[pathway-internal] If you qualify the identifier, haddock can try to link it anyway.
60.09 s
[pathway-internal] Warning: 'Nat' is out of scope.
60.09 s
[pathway-internal] If you qualify the identifier, haddock can try to link it anyway.
60.09 s
[pathway-internal] Warning: 'Maybe' is out of scope.
60.09 s
[pathway-internal] If you qualify the identifier, haddock can try to link it anyway.
60.09 s
[pathway-internal] Warning: 'Nothing' is out of scope.
60.09 s
[pathway-internal] If you qualify the identifier, haddock can try to link it anyway.
60.09 s
[pathway-internal] 50% ( 1 / 2) in 'Data.Path.Internal.Relativity'
60.09 s
[pathway-internal] Missing documentation for:
60.09 s
[pathway-internal] Module header
60.10 s
[pathway-internal] Warning: 'Path' is out of scope.
60.10 s
[pathway-internal] If you qualify the identifier, haddock can try to link it anyway.
60.10 s
[pathway-internal] 50% ( 1 / 2) in 'Data.Path.Internal.Type'
60.10 s
[pathway-internal] Missing documentation for:
60.10 s
[pathway-internal] Module header
60.62 s
[pathway-internal] Warning: 'AnyPath' is out of scope.
60.62 s
[pathway-internal] If you qualify the identifier, haddock can try to link it anyway.
60.63 s
[pathway-internal] Warning: 'toText' is out of scope.
60.63 s
[pathway-internal] If you qualify the identifier, haddock can try to link it anyway.
60.63 s
[pathway-internal] Warning: '</?>' is out of scope.
60.63 s
[pathway-internal] If you qualify the identifier, haddock can try to link it anyway.
60.63 s
[pathway-internal] 66% ( 6 / 9) in 'Data.Path.Internal'
60.63 s
[pathway-internal] Missing documentation for:
60.63 s
[pathway-internal] Module header
60.63 s
[pathway-internal] TotalOps (src/Data/Path/Internal.hs:199)
60.63 s
[pathway-internal] Filename (src/Data/Path/Internal.hs:77)
64.97 s
[pathway-internal] Documentation created: dist/doc/html/pathway-internal/,
64.98 s
[pathway-internal] dist/doc/html/pathway-internal/pathway-internal.txt
65.03 s
[pathway-internal] Preprocessing test suite 'doctests' for pathway-internal-0.0.1.0..
65.03 s
[pathway-internal] Phase: installPhase
65.11 s
[pathway-internal] Installing library in /nix/store/765dgav0b62i54ly7crn1ns6x6xvny7x-pathway-internal-0.0.1.0/lib/ghc-9.6.7/lib/x86_64-linux-ghc-9.6.7/pathway-internal-0.0.1.0-6pVrF111eN4BAqGigGNQse
65.35 s
[pathway-internal] Phase: fixupPhase
65.36 s
[pathway-internal] shrinking RPATHs of ELF executables and libraries in /nix/store/765dgav0b62i54ly7crn1ns6x6xvny7x-pathway-internal-0.0.1.0
65.37 s
[pathway-internal] shrinking /nix/store/765dgav0b62i54ly7crn1ns6x6xvny7x-pathway-internal-0.0.1.0/lib/ghc-9.6.7/lib/x86_64-linux-ghc-9.6.7/libHSpathway-internal-0.0.1.0-6pVrF111eN4BAqGigGNQse-ghc9.6.7.so
65.38 s
[pathway-internal] checking for references to /build/ in /nix/store/765dgav0b62i54ly7crn1ns6x6xvny7x-pathway-internal-0.0.1.0...
65.40 s
[pathway-internal] patching script interpreter paths in /nix/store/765dgav0b62i54ly7crn1ns6x6xvny7x-pathway-internal-0.0.1.0
65.41 s
[pathway-internal] stripping (with command strip and flags -S -p) in /nix/store/765dgav0b62i54ly7crn1ns6x6xvny7x-pathway-internal-0.0.1.0/lib
65.50 s
[pathway-internal] shrinking RPATHs of ELF executables and libraries in /nix/store/hhnwp61mp302fg55dqim9lly3h0bxz5j-pathway-internal-0.0.1.0-doc
65.50 s
[pathway-internal] checking for references to /build/ in /nix/store/hhnwp61mp302fg55dqim9lly3h0bxz5j-pathway-internal-0.0.1.0-doc...
65.52 s
[pathway-internal] patching script interpreter paths in /nix/store/hhnwp61mp302fg55dqim9lly3h0bxz5j-pathway-internal-0.0.1.0-doc
65.61 s
[pathway-internal:post-build] Uploading to cachix cache "sellout": /nix/store/765dgav0b62i54ly7crn1ns6x6xvny7x-pathway-internal-0.0.1.0 /nix/store/hhnwp61mp302fg55dqim9lly3h0bxz5j-pathway-internal-0.0.1.0-doc
66.27 s
[pathway-internal:post-build] Pushing 2 paths (160 are already present) using zstd to cache sellout ⏳
66.27 s
[pathway-internal:post-build]
66.65 s
[pathway-internal:post-build] Pushing /nix/store/765dgav0b62i54ly7crn1ns6x6xvny7x-pathway-internal-0.0.1.0 (2.05 MiB)
66.84 s
[pathway-internal:post-build] Pushing /nix/store/hhnwp61mp302fg55dqim9lly3h0bxz5j-pathway-internal-0.0.1.0-doc (575.95 KiB)
67.73 s
[pathway-internal:post-build]
67.73 s
[pathway-internal:post-build] All done.
67.74 s
[pathway-internal:post-build] Uploading to the NixCI cache: /nix/store/765dgav0b62i54ly7crn1ns6x6xvny7x-pathway-internal-0.0.1.0 /nix/store/hhnwp61mp302fg55dqim9lly3h0bxz5j-pathway-internal-0.0.1.0-doc
67.78 s
[pathway-internal:post-build] warning: 'warn-short-path-literals' is deprecated, use 'lint-short-path-literals = ignore' instead
67.80 s
[pathway-internal:post-build] copying 4 paths...
67.80 s
[pathway-internal:post-build] copying path '/nix/store/j4cnvhiw7i60pw00414bl60l2iynpkwf-yaya-0.6.2.3-doc' to 'https://cache.nix-ci.com'...
68.39 s
[pathway-internal:post-build] copying path '/nix/store/hhnwp61mp302fg55dqim9lly3h0bxz5j-pathway-internal-0.0.1.0-doc' to 'https://cache.nix-ci.com'...
68.39 s
[pathway-internal:post-build] copying path '/nix/store/r8xlwgrdfnyys6c6cb1c32532vlag236-yaya-0.6.2.3' to 'https://cache.nix-ci.com'...
69.77 s
[pathway-internal:post-build] copying path '/nix/store/765dgav0b62i54ly7crn1ns6x6xvny7x-pathway-internal-0.0.1.0' to 'https://cache.nix-ci.com'...
70.35 s
[pathway-internal:post-build] warning: 'warn-short-path-literals' is deprecated, use 'lint-short-path-literals = ignore' instead
71.28 s
[pathway-internal:post-build] copying 20 paths...
71.31 s
[pathway-internal:post-build] copying path '/nix/store/8kqb9mjawixlmp5xi20pvghwvc04zz7v-simple-reflect-0.3.3.drv' to 'https://cache.nix-ci.com'...
71.31 s
[pathway-internal:post-build] copying path '/nix/store/fq9y59d7dlijgfhf7190994y4i6qab9i-parallel-3.2.2.0.drv' to 'https://cache.nix-ci.com'...
71.31 s
[pathway-internal:post-build] copying path '/nix/store/dh07mf70kv35dfpwpdlmfwgi05kma0pi-indexed-traversable-0.1.4.drv' to 'https://cache.nix-ci.com'...
71.31 s
[pathway-internal:post-build] copying path '/nix/store/ymxyrsqikiizbl6q0i54b2l4qnm4hjxd-semigroups-0.20.drv' to 'https://cache.nix-ci.com'...
71.31 s
[pathway-internal:post-build] copying path '/nix/store/zhhpfrwjn5y7nrrbxy4dv50zk03k10vs-StateVar-1.2.2.drv' to 'https://cache.nix-ci.com'...
71.31 s
[pathway-internal:post-build] copying path '/nix/store/qwpjyl6hhl6pqmpbh7aqgn89dvfzj15s-reflection-2.1.9.drv' to 'https://cache.nix-ci.com'...
71.45 s
[pathway-internal:post-build] copying path '/nix/store/3c31kl14rkbhz4qwc9x3kdyipa1cdrfq-indexed-traversable-instances-0.1.2.drv' to 'https://cache.nix-ci.com'...
71.45 s
[pathway-internal:post-build] copying path '/nix/store/77mzvs72452rgb252maby2c2r4p8saca-comonad-5.0.9.drv' to 'https://cache.nix-ci.com'...
71.45 s
[pathway-internal:post-build] copying path '/nix/store/kz6mmihsmcwh8szxnfyi9f8g1wm7zpg6-contravariant-1.5.5.drv' to 'https://cache.nix-ci.com'...
71.60 s
[pathway-internal:post-build] copying path '/nix/store/azg8amhhdycs5ca8brvds27j73fh23g4-bifunctors-5.6.2.drv' to 'https://cache.nix-ci.com'...
71.73 s
[pathway-internal:post-build] copying path '/nix/store/a3y96408f7ljghbgfc7r9y2cn59aq3yd-profunctors-5.6.3.drv' to 'https://cache.nix-ci.com'...
71.73 s
[pathway-internal:post-build] copying path '/nix/store/vl59whq20pfc7fqh7ssb3qb5lvn03hlq-semigroupoids-6.0.1.drv' to 'https://cache.nix-ci.com'...
71.86 s
[pathway-internal:post-build] copying path '/nix/store/qqwqgk05kq955z29kfl5dlsw01hgnjy6-invariant-0.6.4.drv' to 'https://cache.nix-ci.com'...
71.86 s
[pathway-internal:post-build] copying path '/nix/store/hcwg6k7aig7nrwssz24qymwyhldb8i9n-either-5.0.3.drv' to 'https://cache.nix-ci.com'...
71.86 s
[pathway-internal:post-build] copying path '/nix/store/qxwfygswlri8lcd4ah6h5b3gxw4ylw0y-free-5.2.drv' to 'https://cache.nix-ci.com'...
71.99 s
[pathway-internal:post-build] copying path '/nix/store/l6ml8sis1z1gzlxhjd6gafbkh7k5wmz9-adjunctions-4.4.3.drv' to 'https://cache.nix-ci.com'...
72.12 s
[pathway-internal:post-build] copying path '/nix/store/ckch3vf9dqcq94db35r80586p7a8zzbz-kan-extensions-5.2.7.drv' to 'https://cache.nix-ci.com'...
72.23 s
[pathway-internal:post-build] copying path '/nix/store/yxi1f4sv2x1irs0qywf187jc16dzrl0d-lens-5.3.5.drv' to 'https://cache.nix-ci.com'...
72.51 s
[pathway-internal:post-build] copying path '/nix/store/j3d70lig5cw0fipbsv5qbagz2w3g1z0h-yaya-0.6.2.3.drv' to 'https://cache.nix-ci.com'...
72.65 s
[pathway-internal:post-build] copying path '/nix/store/a5dxlg6lw6dxjpr4zslz0zpbw79pjyzg-pathway-internal-0.0.1.0.drv' to 'https://cache.nix-ci.com'...
72.80 s
Uploaded pathway-internal in 7.2s
72.80 s
Progress: 1 of 23 built, 184 of 184 downloaded from cache
72.80 s
Built pathway-internal in 25.0s
72.84 s
Building /nix/store/wvvai7ijpkag4s8yaa7nn71daaishhpj-pathway-quickcheck-0.0.1.0.drv
73.06 s
[pathway-quickcheck] Phase: setupCompilerEnvironmentPhase
73.07 s
[pathway-quickcheck] Build with /nix/store/da9x1n5l146q0ai9wz8zfbx4zfwa9b02-ghc-9.6.7.
73.32 s
[pathway-quickcheck] Phase: unpackPhase
73.33 s
[pathway-quickcheck] unpacking source archive /nix/store/723m6sjvk66iiqzpvcfdd74xi6id5zqq-zjizyqf4pafgh9rycgxd507dhvpisdy1-source/./quickcheck
73.33 s
[pathway-quickcheck] source root is quickcheck
73.34 s
[pathway-quickcheck] Phase: patchPhase
73.35 s
[pathway-quickcheck] Phase: compileBuildDriverPhase
73.36 s
[pathway-quickcheck] setupCompileFlags: -package-db=/build/tmp.YqEG33ywHQ/setup-package.conf.d -threaded
73.40 s
[pathway-quickcheck] [1 of 2] Compiling Main ( Setup.hs, /build/tmp.YqEG33ywHQ/Main.o )
73.45 s
[pathway-quickcheck] [2 of 2] Linking Setup
74.57 s
[pathway-quickcheck] Phase: updateAutotoolsGnuConfigScriptsPhase
74.58 s
[pathway-quickcheck] Phase: configurePhase
74.59 s
[pathway-quickcheck] configureFlags: --verbose --prefix=/nix/store/b2w7m26s8i6l8c4scrwp539xh66i6nli-pathway-quickcheck-0.0.1.0 --libdir=$prefix/lib/$compiler/lib --libsubdir=$abi/$libname --docdir=/nix/store/qmi6sfa5ydn96axf0i041iik9arj7bcm-pathway-quickcheck-0.0.1.0-doc/share/doc/pathway-quickcheck-0.0.1.0 --with-gcc=gcc --package-db=/build/tmp.YqEG33ywHQ/package.conf.d --ghc-option=-j16 --ghc-option=+RTS --ghc-option=-A64M --ghc-option=-RTS --enable-library-profiling --profiling-detail=exported-functions --disable-profiling --enable-shared --disable-coverage --enable-static --disable-executable-dynamic --enable-tests --disable-benchmarks --enable-library-vanilla --disable-library-for-ghci --enable-split-sections --enable-library-stripping --enable-executable-stripping --ghc-option=-haddock --ghc-options=-Werror --extra-lib-dirs=/nix/store/ffyzkisqs4vc4mg28bwwlyqjf8i9ph6b-ncurses-6.5/lib --extra-lib-dirs=/nix/store/n28qgdj8c1q41kf7n4y1jxa6ckp85m3c-libffi-3.5.2/lib --extra-lib-dirs=/nix/store/1b6h99dw7bk4wbn77kbalih42zbc67m1-elfutils-0.194/lib --extra-lib-dirs=/nix/store/hi0ar880110k6jsmmili7dh1gq3cg2a9-gmp-with-cxx-6.3.0/lib --extra-lib-dirs=/nix/store/g09cflpnp4g80q56sj9dng1qzv4v4ybc-numactl-2.0.18/lib --extra-lib-dirs=/nix/store/da9x1n5l146q0ai9wz8zfbx4zfwa9b02-ghc-9.6.7/lib
74.60 s
[pathway-quickcheck] Using Parsec parser
74.60 s
[pathway-quickcheck] Configuring pathway-quickcheck-0.0.1.0...
74.93 s
[pathway-quickcheck] Flags chosen: noisy-deprecations=True, verify-no-recursion=False
74.93 s
[pathway-quickcheck] Dependency QuickCheck >=2.14.2 && <2.15 || >=2.15.0 && <2.16 || >=2.16.0 &&
74.93 s
[pathway-quickcheck] <2.17 || >=2.17.1 && <2.18: using QuickCheck-2.15.0.1
74.93 s
[pathway-quickcheck] Dependency base >=4.14.0 && <4.15 || >=4.15.0 && <4.16 || >=4.16.0 && <4.17 ||
74.93 s
[pathway-quickcheck] >=4.17.0 && <4.18 || >=4.18.0 && <4.19 || >=4.19.0 && <4.20 || >=4.20.0 &&
74.93 s
[pathway-quickcheck] <4.21 || >=4.21.0 && <4.22 || >=4.22.0 && <4.23: using base-4.18.3.0
74.93 s
[pathway-quickcheck] Dependency pathway-internal >=0.0.1 && <0.1: using pathway-internal-0.0.1.0
74.93 s
[pathway-quickcheck] Dependency quickcheck-instances >=0.3.26 && <0.5: using
74.93 s
[pathway-quickcheck] quickcheck-instances-0.3.33
74.93 s
[pathway-quickcheck] Dependency yaya >=0.6.2 && <0.7 || >=0.7.0 && <0.8: using yaya-0.6.2.3
74.93 s
[pathway-quickcheck] Dependency yaya-quickcheck >=0.2.0 && <0.3 || >=0.3.0 && <0.4: using
74.93 s
[pathway-quickcheck] yaya-quickcheck-0.2.0.3
74.93 s
[pathway-quickcheck] Dependency QuickCheck >=2.14.2 && <2.15 || >=2.15.0 && <2.16 || >=2.16.0 &&
74.93 s
[pathway-quickcheck] <2.17 || >=2.17.1 && <2.18: using QuickCheck-2.15.0.1
74.93 s
[pathway-quickcheck] Dependency base >=4.14.0 && <4.15 || >=4.15.0 && <4.16 || >=4.16.0 && <4.17 ||
74.93 s
[pathway-quickcheck] >=4.17.0 && <4.18 || >=4.18.0 && <4.19 || >=4.19.0 && <4.20 || >=4.20.0 &&
74.93 s
[pathway-quickcheck] <4.21 || >=4.21.0 && <4.22 || >=4.22.0 && <4.23: using base-4.18.3.0
74.93 s
[pathway-quickcheck] Dependency doctest >=0.16.3 && <0.17 || >=0.18.1 && <0.19 || >=0.20.1 && <0.21
74.93 s
[pathway-quickcheck] || >=0.21.1 && <0.22 || >=0.22.2 && <0.23 || >=0.24.2 && <0.25: using
74.93 s
[pathway-quickcheck] doctest-0.24.2
74.93 s
[pathway-quickcheck] Dependency pathway-quickcheck: using pathway-quickcheck-0.0.1.0
75.24 s
[pathway-quickcheck] Source component graph:
75.24 s
[pathway-quickcheck] component lib
75.24 s
[pathway-quickcheck] component test:doctests dependency lib
75.24 s
[pathway-quickcheck] Configured component graph:
75.24 s
[pathway-quickcheck] component pathway-quickcheck-0.0.1.0-3oURtdbGHQOF2R72KWRQV9
75.24 s
[pathway-quickcheck] include QuickCheck-2.15.0.1-8TOXA7GkEi42wTg0ODsItP
75.24 s
[pathway-quickcheck] include base-4.18.3.0
75.24 s
[pathway-quickcheck] include pathway-internal-0.0.1.0-6pVrF111eN4BAqGigGNQse
75.24 s
[pathway-quickcheck] include quickcheck-instances-0.3.33-FVVqg59kBqgEZGRoc8T9zG
75.24 s
[pathway-quickcheck] include yaya-0.6.2.3-7sqHSSXaJnw73nWfp3Ph4M
75.24 s
[pathway-quickcheck] include yaya-quickcheck-0.2.0.3-APNTcZCYfC32bLaBr7eYMx
75.24 s
[pathway-quickcheck] component pathway-quickcheck-0.0.1.0-IJwfAmZlzgB5q4Sj9YUJVU-doctests
75.24 s
[pathway-quickcheck] include QuickCheck-2.15.0.1-8TOXA7GkEi42wTg0ODsItP
75.24 s
[pathway-quickcheck] include base-4.18.3.0
75.24 s
[pathway-quickcheck] include doctest-0.24.2-7YxPr6lrdwiBMDK2pmizgF
75.24 s
[pathway-quickcheck] include pathway-quickcheck-0.0.1.0-3oURtdbGHQOF2R72KWRQV9
75.24 s
[pathway-quickcheck] Linked component graph:
75.24 s
[pathway-quickcheck] unit pathway-quickcheck-0.0.1.0-3oURtdbGHQOF2R72KWRQV9
75.24 s
[pathway-quickcheck] include QuickCheck-2.15.0.1-8TOXA7GkEi42wTg0ODsItP
75.24 s
[pathway-quickcheck] include base-4.18.3.0
75.24 s
[pathway-quickcheck] include pathway-internal-0.0.1.0-6pVrF111eN4BAqGigGNQse
75.24 s
[pathway-quickcheck] include quickcheck-instances-0.3.33-FVVqg59kBqgEZGRoc8T9zG
75.24 s
[pathway-quickcheck] include yaya-0.6.2.3-7sqHSSXaJnw73nWfp3Ph4M
75.24 s
[pathway-quickcheck] include yaya-quickcheck-0.2.0.3-APNTcZCYfC32bLaBr7eYMx
75.24 s
[pathway-quickcheck] Test.Path.QuickCheck=pathway-quickcheck-0.0.1.0-3oURtdbGHQOF2R72KWRQV9:Test.Path.QuickCheck
75.24 s
[pathway-quickcheck] unit pathway-quickcheck-0.0.1.0-IJwfAmZlzgB5q4Sj9YUJVU-doctests
75.24 s
[pathway-quickcheck] include QuickCheck-2.15.0.1-8TOXA7GkEi42wTg0ODsItP
75.24 s
[pathway-quickcheck] include base-4.18.3.0
75.24 s
[pathway-quickcheck] include doctest-0.24.2-7YxPr6lrdwiBMDK2pmizgF
75.24 s
[pathway-quickcheck] include pathway-quickcheck-0.0.1.0-3oURtdbGHQOF2R72KWRQV9
75.24 s
[pathway-quickcheck] Ready component graph:
75.24 s
[pathway-quickcheck] definite pathway-quickcheck-0.0.1.0-3oURtdbGHQOF2R72KWRQV9
75.24 s
[pathway-quickcheck] depends QuickCheck-2.15.0.1-8TOXA7GkEi42wTg0ODsItP
75.24 s
[pathway-quickcheck] depends base-4.18.3.0
75.24 s
[pathway-quickcheck] depends pathway-internal-0.0.1.0-6pVrF111eN4BAqGigGNQse
75.24 s
[pathway-quickcheck] depends quickcheck-instances-0.3.33-FVVqg59kBqgEZGRoc8T9zG
75.24 s
[pathway-quickcheck] depends yaya-0.6.2.3-7sqHSSXaJnw73nWfp3Ph4M
75.24 s
[pathway-quickcheck] depends yaya-quickcheck-0.2.0.3-APNTcZCYfC32bLaBr7eYMx
75.24 s
[pathway-quickcheck] definite pathway-quickcheck-0.0.1.0-IJwfAmZlzgB5q4Sj9YUJVU-doctests
75.24 s
[pathway-quickcheck] depends QuickCheck-2.15.0.1-8TOXA7GkEi42wTg0ODsItP
75.24 s
[pathway-quickcheck] depends base-4.18.3.0
75.24 s
[pathway-quickcheck] depends doctest-0.24.2-7YxPr6lrdwiBMDK2pmizgF
75.24 s
[pathway-quickcheck] depends pathway-quickcheck-0.0.1.0-3oURtdbGHQOF2R72KWRQV9
75.24 s
[pathway-quickcheck] Using Cabal-3.10.3.0 compiled by ghc-9.6
75.24 s
[pathway-quickcheck] Using compiler: ghc-9.6.7
75.24 s
[pathway-quickcheck] Using install prefix:
75.24 s
[pathway-quickcheck] /nix/store/b2w7m26s8i6l8c4scrwp539xh66i6nli-pathway-quickcheck-0.0.1.0
75.24 s
[pathway-quickcheck] Executables installed in:
75.24 s
[pathway-quickcheck] /nix/store/b2w7m26s8i6l8c4scrwp539xh66i6nli-pathway-quickcheck-0.0.1.0/bin
75.24 s
[pathway-quickcheck] Libraries installed in:
75.24 s
[pathway-quickcheck] /nix/store/b2w7m26s8i6l8c4scrwp539xh66i6nli-pathway-quickcheck-0.0.1.0/lib/ghc-9.6.7/lib/x86_64-linux-ghc-9.6.7/pathway-quickcheck-0.0.1.0-3oURtdbGHQOF2R72KWRQV9
75.24 s
[pathway-quickcheck] Dynamic Libraries installed in:
75.24 s
[pathway-quickcheck] /nix/store/b2w7m26s8i6l8c4scrwp539xh66i6nli-pathway-quickcheck-0.0.1.0/lib/ghc-9.6.7/lib/x86_64-linux-ghc-9.6.7
75.24 s
[pathway-quickcheck] Private executables installed in:
75.24 s
[pathway-quickcheck] /nix/store/b2w7m26s8i6l8c4scrwp539xh66i6nli-pathway-quickcheck-0.0.1.0/libexec/x86_64-linux-ghc-9.6.7/pathway-quickcheck-0.0.1.0
75.24 s
[pathway-quickcheck] Data files installed in:
75.24 s
[pathway-quickcheck] /nix/store/b2w7m26s8i6l8c4scrwp539xh66i6nli-pathway-quickcheck-0.0.1.0/share/x86_64-linux-ghc-9.6.7/pathway-quickcheck-0.0.1.0
75.24 s
[pathway-quickcheck] Documentation installed in:
75.24 s
[pathway-quickcheck] /nix/store/qmi6sfa5ydn96axf0i041iik9arj7bcm-pathway-quickcheck-0.0.1.0-doc/share/doc/pathway-quickcheck-0.0.1.0
75.24 s
[pathway-quickcheck] Configuration files installed in:
75.24 s
[pathway-quickcheck] /nix/store/b2w7m26s8i6l8c4scrwp539xh66i6nli-pathway-quickcheck-0.0.1.0/etc
75.24 s
[pathway-quickcheck] No alex found
75.24 s
[pathway-quickcheck] Using ar found on system at:
75.24 s
[pathway-quickcheck] /nix/store/iz5lckcsg66r223si2gck7csk2hihj0m-binutils-wrapper-2.44/bin/ar
75.24 s
[pathway-quickcheck] No c2hs found
75.24 s
[pathway-quickcheck] No cpphs found
75.24 s
[pathway-quickcheck] Using doctest version 0.24.2 found on system at:
75.24 s
[pathway-quickcheck] /nix/store/mky1glcba5jwjn0h7fa1mldfnh39g6l9-doctest-0.24.2/bin/doctest
75.24 s
[pathway-quickcheck] Using gcc version 14.3.0 given by user at:
75.24 s
[pathway-quickcheck] /nix/store/8v97ngkcpfzgghwnnr7fsz33p2x22gy9-gcc-wrapper-14.3.0/bin/gcc
75.24 s
[pathway-quickcheck] Using ghc version 9.6.7 found on system at:
75.24 s
[pathway-quickcheck] /nix/store/da9x1n5l146q0ai9wz8zfbx4zfwa9b02-ghc-9.6.7/bin/ghc
75.24 s
[pathway-quickcheck] Using ghc-pkg version 9.6.7 found on system at:
75.24 s
[pathway-quickcheck] /nix/store/da9x1n5l146q0ai9wz8zfbx4zfwa9b02-ghc-9.6.7/bin/ghc-pkg-9.6.7
75.24 s
[pathway-quickcheck] No ghcjs found
75.24 s
[pathway-quickcheck] No ghcjs-pkg found
75.24 s
[pathway-quickcheck] No greencard found
75.24 s
[pathway-quickcheck] Using haddock version 2.29.2 found on system at:
75.24 s
[pathway-quickcheck] /nix/store/da9x1n5l146q0ai9wz8zfbx4zfwa9b02-ghc-9.6.7/bin/haddock-ghc-9.6.7
75.24 s
[pathway-quickcheck] No happy found
75.24 s
[pathway-quickcheck] Using haskell-suite found on system at: haskell-suite-dummy-location
75.24 s
[pathway-quickcheck] Using haskell-suite-pkg found on system at: haskell-suite-pkg-dummy-location
75.24 s
[pathway-quickcheck] No hmake found
75.24 s
[pathway-quickcheck] Using hpc version 0.68 found on system at:
75.24 s
[pathway-quickcheck] /nix/store/da9x1n5l146q0ai9wz8zfbx4zfwa9b02-ghc-9.6.7/bin/hpc-ghc-9.6.7
75.24 s
[pathway-quickcheck] Using hsc2hs version 0.68.9 found on system at:
75.24 s
[pathway-quickcheck] /nix/store/da9x1n5l146q0ai9wz8zfbx4zfwa9b02-ghc-9.6.7/bin/hsc2hs-ghc-9.6.7
75.24 s
[pathway-quickcheck] Using hscolour version 1.25 found on system at:
75.24 s
[pathway-quickcheck] /nix/store/7ffc07q75k5a6zk864jv9gpiphhwzjlh-hscolour-1.25/bin/HsColour
75.24 s
[pathway-quickcheck] No jhc found
75.24 s
[pathway-quickcheck] Using ld found on system at:
75.24 s
[pathway-quickcheck] /nix/store/iz5lckcsg66r223si2gck7csk2hihj0m-binutils-wrapper-2.44/bin/ld.gold
75.24 s
[pathway-quickcheck] No pkg-config found
75.24 s
[pathway-quickcheck] Using runghc version 9.6.7 found on system at:
75.24 s
[pathway-quickcheck] /nix/store/da9x1n5l146q0ai9wz8zfbx4zfwa9b02-ghc-9.6.7/bin/runghc-9.6.7
75.24 s
[pathway-quickcheck] Using strip version 2.44 found on system at:
75.24 s
[pathway-quickcheck] /nix/store/8v97ngkcpfzgghwnnr7fsz33p2x22gy9-gcc-wrapper-14.3.0/bin/strip
75.24 s
[pathway-quickcheck] Using tar found on system at:
75.24 s
[pathway-quickcheck] /nix/store/xl6pd2spjajwcpq09fnmnjv5psqmlmma-gnutar-1.35/bin/tar
75.24 s
[pathway-quickcheck] No uhc found
75.52 s
[pathway-quickcheck] Phase: buildPhase
75.58 s
[pathway-quickcheck] Preprocessing library for pathway-quickcheck-0.0.1.0..
75.58 s
[pathway-quickcheck] Building library for pathway-quickcheck-0.0.1.0..
75.66 s
[pathway-quickcheck] [1 of 1] Compiling Test.Path.QuickCheck ( src/Test/Path/QuickCheck.hs, dist/build/Test/Path/QuickCheck.o, dist/build/Test/Path/QuickCheck.dyn_o )
76.02 s
[pathway-quickcheck] [1 of 1] Compiling Test.Path.QuickCheck ( src/Test/Path/QuickCheck.hs, dist/build/Test/Path/QuickCheck.p_o )
77.68 s
[pathway-quickcheck] Preprocessing test suite 'doctests' for pathway-quickcheck-0.0.1.0..
77.72 s
[pathway-quickcheck] Building test suite 'doctests' for pathway-quickcheck-0.0.1.0..
77.75 s
[pathway-quickcheck] [1 of 2] Compiling Build_doctests ( dist/build/doctests/autogen/Build_doctests.hs, dist/build/doctests/doctests-tmp/Build_doctests.o )
77.95 s
[pathway-quickcheck] [2 of 2] Compiling Main ( tests/doctests.hs, dist/build/doctests/doctests-tmp/Main.o )
78.21 s
[pathway-quickcheck] [3 of 3] Linking dist/build/doctests/doctests
81.63 s
[pathway-quickcheck] Phase: checkPhase
81.68 s
[pathway-quickcheck] Running 1 test suites...
81.68 s
[pathway-quickcheck] Test suite doctests: RUNNING...
81.94 s
[pathway-quickcheck]
81.94 s
[pathway-quickcheck] on the commandline: warning:
81.94 s
[pathway-quickcheck] -XTemplateHaskell is not allowed in Safe Haskell; ignoring -XTemplateHaskell
82.14 s
[pathway-quickcheck] Examples: 0 Tried: 0 Errors: 0 Failures: 0
82.18 s
[pathway-quickcheck] Test suite doctests: PASS
82.18 s
[pathway-quickcheck] Test suite logged to: dist/test/pathway-quickcheck-0.0.1.0-doctests.log
82.18 s
[pathway-quickcheck] 1 of 1 test suites (1 of 1 test cases) passed.
82.20 s
[pathway-quickcheck] Phase: haddockPhase
82.34 s
[pathway-quickcheck] Preprocessing library for pathway-quickcheck-0.0.1.0..
82.34 s
[pathway-quickcheck] Running Haddock on library for pathway-quickcheck-0.0.1.0..
82.34 s
[pathway-quickcheck] Warning: The documentation for the following packages are not installed. No
82.34 s
[pathway-quickcheck] links will be generated to these packages: vector-0.13.2.0
82.40 s
[pathway-quickcheck] Warning: --source-* options are ignored when --hyperlinked-source is enabled.
82.79 s
[pathway-quickcheck] 0% ( 0 / 3) in 'Test.Path.QuickCheck'
82.79 s
[pathway-quickcheck] Missing documentation for:
82.79 s
[pathway-quickcheck] Module header
82.81 s
[pathway-quickcheck] arbitraryNonEmptyText (src/Test/Path/QuickCheck.hs:32)
82.81 s
[pathway-quickcheck] arbitraryPath (src/Test/Path/QuickCheck.hs:38)
86.42 s
[pathway-quickcheck] Documentation created: dist/doc/html/pathway-quickcheck/,
86.42 s
[pathway-quickcheck] dist/doc/html/pathway-quickcheck/pathway-quickcheck.txt
86.47 s
[pathway-quickcheck] Preprocessing test suite 'doctests' for pathway-quickcheck-0.0.1.0..
86.48 s
[pathway-quickcheck] Phase: installPhase
86.55 s
[pathway-quickcheck] Installing library in /nix/store/b2w7m26s8i6l8c4scrwp539xh66i6nli-pathway-quickcheck-0.0.1.0/lib/ghc-9.6.7/lib/x86_64-linux-ghc-9.6.7/pathway-quickcheck-0.0.1.0-3oURtdbGHQOF2R72KWRQV9
86.73 s
[pathway-quickcheck] Phase: fixupPhase
86.75 s
[pathway-quickcheck] shrinking RPATHs of ELF executables and libraries in /nix/store/b2w7m26s8i6l8c4scrwp539xh66i6nli-pathway-quickcheck-0.0.1.0
86.75 s
[pathway-quickcheck] shrinking /nix/store/b2w7m26s8i6l8c4scrwp539xh66i6nli-pathway-quickcheck-0.0.1.0/lib/ghc-9.6.7/lib/x86_64-linux-ghc-9.6.7/libHSpathway-quickcheck-0.0.1.0-3oURtdbGHQOF2R72KWRQV9-ghc9.6.7.so
86.77 s
[pathway-quickcheck] checking for references to /build/ in /nix/store/b2w7m26s8i6l8c4scrwp539xh66i6nli-pathway-quickcheck-0.0.1.0...
86.78 s
[pathway-quickcheck] patching script interpreter paths in /nix/store/b2w7m26s8i6l8c4scrwp539xh66i6nli-pathway-quickcheck-0.0.1.0
86.79 s
[pathway-quickcheck] stripping (with command strip and flags -S -p) in /nix/store/b2w7m26s8i6l8c4scrwp539xh66i6nli-pathway-quickcheck-0.0.1.0/lib
86.81 s
[pathway-quickcheck] shrinking RPATHs of ELF executables and libraries in /nix/store/qmi6sfa5ydn96axf0i041iik9arj7bcm-pathway-quickcheck-0.0.1.0-doc
86.81 s
[pathway-quickcheck] checking for references to /build/ in /nix/store/qmi6sfa5ydn96axf0i041iik9arj7bcm-pathway-quickcheck-0.0.1.0-doc...
86.83 s
[pathway-quickcheck] patching script interpreter paths in /nix/store/qmi6sfa5ydn96axf0i041iik9arj7bcm-pathway-quickcheck-0.0.1.0-doc
86.91 s
[pathway-quickcheck:post-build] Uploading to cachix cache "sellout": /nix/store/b2w7m26s8i6l8c4scrwp539xh66i6nli-pathway-quickcheck-0.0.1.0 /nix/store/qmi6sfa5ydn96axf0i041iik9arj7bcm-pathway-quickcheck-0.0.1.0-doc
88.88 s
[pathway-quickcheck:post-build] Pushing 2 paths (186 are already present) using zstd to cache sellout ⏳
88.88 s
[pathway-quickcheck:post-build]
89.55 s
[pathway-quickcheck:post-build] Pushing /nix/store/qmi6sfa5ydn96axf0i041iik9arj7bcm-pathway-quickcheck-0.0.1.0-doc (216.57 KiB)
89.55 s
[pathway-quickcheck:post-build] Pushing /nix/store/b2w7m26s8i6l8c4scrwp539xh66i6nli-pathway-quickcheck-0.0.1.0 (179.56 KiB)
90.83 s
[pathway-quickcheck:post-build]
90.83 s
[pathway-quickcheck:post-build] All done.
90.85 s
[pathway-quickcheck:post-build] Uploading to the NixCI cache: /nix/store/b2w7m26s8i6l8c4scrwp539xh66i6nli-pathway-quickcheck-0.0.1.0 /nix/store/qmi6sfa5ydn96axf0i041iik9arj7bcm-pathway-quickcheck-0.0.1.0-doc
90.89 s
[pathway-quickcheck:post-build] warning: 'warn-short-path-literals' is deprecated, use 'lint-short-path-literals = ignore' instead
90.91 s
[pathway-quickcheck:post-build] copying 4 paths...
90.91 s
[pathway-quickcheck:post-build] copying path '/nix/store/s3377rmqx709va1skgdr7fpiqxdz90g8-yaya-quickcheck-0.2.0.3-doc' to 'https://cache.nix-ci.com'...
91.11 s
[pathway-quickcheck:post-build] copying path '/nix/store/qmi6sfa5ydn96axf0i041iik9arj7bcm-pathway-quickcheck-0.0.1.0-doc' to 'https://cache.nix-ci.com'...
91.11 s
[pathway-quickcheck:post-build] copying path '/nix/store/j1wwjzbpwgbfw1z90lynr4g5q060k2cw-yaya-quickcheck-0.2.0.3' to 'https://cache.nix-ci.com'...
91.33 s
[pathway-quickcheck:post-build] copying path '/nix/store/b2w7m26s8i6l8c4scrwp539xh66i6nli-pathway-quickcheck-0.0.1.0' to 'https://cache.nix-ci.com'...
91.56 s
[pathway-quickcheck:post-build] warning: 'warn-short-path-literals' is deprecated, use 'lint-short-path-literals = ignore' instead
91.75 s
[pathway-quickcheck:post-build] copying 2 paths...
91.75 s
[pathway-quickcheck:post-build] copying path '/nix/store/3zkz0g60z0bz5dbfvnrwcislzkyvnns4-yaya-quickcheck-0.2.0.3.drv' to 'https://cache.nix-ci.com'...
91.89 s
[pathway-quickcheck:post-build] copying path '/nix/store/wvvai7ijpkag4s8yaa7nn71daaishhpj-pathway-quickcheck-0.0.1.0.drv' to 'https://cache.nix-ci.com'...
92.04 s
Uploaded pathway-quickcheck in 5.1s
92.04 s
Progress: 2 of 22 built, 184 of 184 downloaded from cache
92.04 s
Built pathway-quickcheck in 19.1s
92.08 s
Building /nix/store/nzw6d59fxqh64la5s4m42darvx8nsccb-pathway-0.0.1.0.drv
92.32 s
[pathway] Phase: setupCompilerEnvironmentPhase
92.32 s
[pathway] Build with /nix/store/da9x1n5l146q0ai9wz8zfbx4zfwa9b02-ghc-9.6.7.
92.61 s
[pathway] Phase: unpackPhase
92.61 s
[pathway] unpacking source archive /nix/store/723m6sjvk66iiqzpvcfdd74xi6id5zqq-zjizyqf4pafgh9rycgxd507dhvpisdy1-source/./pathway
92.62 s
[pathway] source root is pathway
92.62 s
[pathway] Phase: patchPhase
92.63 s
[pathway] Phase: compileBuildDriverPhase
92.63 s
[pathway] setupCompileFlags: -package-db=/build/tmp.8nVYme5d2x/setup-package.conf.d -threaded
92.68 s
[pathway] [1 of 2] Compiling Main ( Setup.hs, /build/tmp.8nVYme5d2x/Main.o )
92.73 s
[pathway] [2 of 2] Linking Setup
93.88 s
[pathway] Phase: updateAutotoolsGnuConfigScriptsPhase
93.89 s
[pathway] Phase: configurePhase
93.90 s
[pathway] configureFlags: --verbose --prefix=/nix/store/db5y8shva1d4611jkblnmskasks7bblx-pathway-0.0.1.0 --libdir=$prefix/lib/$compiler/lib --libsubdir=$abi/$libname --docdir=/nix/store/hzficz67yh7yrvbcjml69rh06ff2xm6w-pathway-0.0.1.0-doc/share/doc/pathway-0.0.1.0 --with-gcc=gcc --package-db=/build/tmp.8nVYme5d2x/package.conf.d --ghc-option=-j16 --ghc-option=+RTS --ghc-option=-A64M --ghc-option=-RTS --enable-library-profiling --profiling-detail=exported-functions --disable-profiling --enable-shared --disable-coverage --enable-static --disable-executable-dynamic --enable-tests --disable-benchmarks --enable-library-vanilla --disable-library-for-ghci --enable-split-sections --enable-library-stripping --enable-executable-stripping --ghc-option=-haddock --ghc-options=-Werror --extra-lib-dirs=/nix/store/ffyzkisqs4vc4mg28bwwlyqjf8i9ph6b-ncurses-6.5/lib --extra-lib-dirs=/nix/store/n28qgdj8c1q41kf7n4y1jxa6ckp85m3c-libffi-3.5.2/lib --extra-lib-dirs=/nix/store/1b6h99dw7bk4wbn77kbalih42zbc67m1-elfutils-0.194/lib --extra-lib-dirs=/nix/store/hi0ar880110k6jsmmili7dh1gq3cg2a9-gmp-with-cxx-6.3.0/lib --extra-lib-dirs=/nix/store/g09cflpnp4g80q56sj9dng1qzv4v4ybc-numactl-2.0.18/lib --extra-lib-dirs=/nix/store/da9x1n5l146q0ai9wz8zfbx4zfwa9b02-ghc-9.6.7/lib
93.92 s
[pathway] Using Parsec parser
93.92 s
[pathway] Configuring pathway-0.0.1.0...
94.25 s
[pathway] Flags chosen: noisy-deprecations=True, verify-no-recursion=False
94.25 s
[pathway] Dependency base >=4.14.0 && <4.15 || >=4.15.0 && <4.16 || >=4.16.0 && <4.17 ||
94.25 s
[pathway] >=4.17.0 && <4.18 || >=4.18.0 && <4.19 || >=4.19.0 && <4.20 || >=4.20.0 &&
94.25 s
[pathway] <4.21 || >=4.21.0 && <4.22 || >=4.22.0 && <4.23: using base-4.18.3.0
94.25 s
[pathway] Dependency containers >=0.6.2 && <0.9: using containers-0.6.7
94.25 s
[pathway] Dependency extra >=1.5 && <1.6 || >=1.7.7 && <1.8 || >=1.8.1 && <1.9: using
94.25 s
[pathway] extra-1.8.1
94.25 s
[pathway] Dependency megaparsec >=9.0.1 && <9.1 || >=9.2.1 && <9.3 || >=9.5.0 && <9.6 ||
94.25 s
[pathway] >=9.7.0 && <9.8: using megaparsec-9.7.0
94.25 s
[pathway] Dependency pathway-internal >=0.0.1 && <0.1: using pathway-internal-0.0.1.0
94.25 s
[pathway] Dependency template-haskell >=2.16.0 && <2.17 || >=2.17.0 && <2.18 || >=2.18.0
94.25 s
[pathway] && <2.19 || >=2.19.0 && <2.20 || >=2.20.0 && <2.21 || >=2.21.0 && <2.22 ||
94.25 s
[pathway] >=2.22.0 && <2.23 || >=2.23.0 && <2.24 || >=2.24.0 && <2.25: using
94.25 s
[pathway] template-haskell-2.20.0.0
94.25 s
[pathway] Dependency text >=1.2.3 && <1.3 || >=2.0.2 && <2.2: using text-2.0.2
94.25 s
[pathway] Dependency yaya >=0.6.2 && <0.7 || >=0.7.0 && <0.8: using yaya-0.6.2.3
94.25 s
[pathway] Dependency yaya-containers >=0.1.2 && <0.2 || >=0.2.0 && <0.3: using
94.25 s
[pathway] yaya-containers-0.1.2.2
94.25 s
[pathway] Dependency yaya-unsafe >=0.4.1 && <0.5 || >=0.5.0 && <0.6: using
94.25 s
[pathway] yaya-unsafe-0.4.1.4
94.25 s
[pathway] Dependency QuickCheck >=2.14.2 && <2.15 || >=2.15.0 && <2.16 || >=2.16.0 &&
94.25 s
[pathway] <2.17 || >=2.17.1 && <2.18: using QuickCheck-2.15.0.1
94.25 s
[pathway] Dependency base >=4.14.0 && <4.15 || >=4.15.0 && <4.16 || >=4.16.0 && <4.17 ||
94.25 s
[pathway] >=4.17.0 && <4.18 || >=4.18.0 && <4.19 || >=4.19.0 && <4.20 || >=4.20.0 &&
94.25 s
[pathway] <4.21 || >=4.21.0 && <4.22 || >=4.22.0 && <4.23: using base-4.18.3.0
94.25 s
[pathway] Dependency doctest >=0.16.3 && <0.17 || >=0.18.1 && <0.19 || >=0.20.1 && <0.21
94.25 s
[pathway] || >=0.21.1 && <0.22 || >=0.22.2 && <0.23 || >=0.24.2 && <0.25: using
94.25 s
[pathway] doctest-0.24.2
94.25 s
[pathway] Dependency pathway: using pathway-0.0.1.0
94.25 s
[pathway] Dependency pathway-quickcheck >=0.0.1 && <0.1: using
94.25 s
[pathway] pathway-quickcheck-0.0.1.0
94.56 s
[pathway] Source component graph:
94.56 s
[pathway] component lib
94.56 s
[pathway] component test:doctests dependency lib
94.56 s
[pathway] Configured component graph:
94.56 s
[pathway] component pathway-0.0.1.0-31EObXlLuVk60eWeEQLXMY
94.56 s
[pathway] include base-4.18.3.0
94.56 s
[pathway] include containers-0.6.7
94.56 s
[pathway] include extra-1.8.1-mqL7YRifC8HhGrjpGYIL3
94.56 s
[pathway] include megaparsec-9.7.0-9FWtFuoAKCoJPEfZ8OP0ob
94.56 s
[pathway] include pathway-internal-0.0.1.0-6pVrF111eN4BAqGigGNQse
94.56 s
[pathway] include template-haskell-2.20.0.0
94.56 s
[pathway] include text-2.0.2
94.56 s
[pathway] include yaya-0.6.2.3-7sqHSSXaJnw73nWfp3Ph4M
94.56 s
[pathway] include yaya-containers-0.1.2.2-B0Uc3hACwej7JlaQ5nsUWv
94.56 s
[pathway] include yaya-unsafe-0.4.1.4-GKzirUSXpFC6HxjkuccBOw
94.56 s
[pathway] component pathway-0.0.1.0-JQN3DMUNFwp4edftQImUoT-doctests
94.56 s
[pathway] include QuickCheck-2.15.0.1-8TOXA7GkEi42wTg0ODsItP
94.56 s
[pathway] include base-4.18.3.0
94.56 s
[pathway] include doctest-0.24.2-7YxPr6lrdwiBMDK2pmizgF
94.56 s
[pathway] include pathway-0.0.1.0-31EObXlLuVk60eWeEQLXMY
94.56 s
[pathway] include pathway-quickcheck-0.0.1.0-3oURtdbGHQOF2R72KWRQV9
94.56 s
[pathway] Linked component graph:
94.56 s
[pathway] unit pathway-0.0.1.0-31EObXlLuVk60eWeEQLXMY
94.56 s
[pathway] include base-4.18.3.0
94.56 s
[pathway] include containers-0.6.7
94.56 s
[pathway] include extra-1.8.1-mqL7YRifC8HhGrjpGYIL3
94.56 s
[pathway] include megaparsec-9.7.0-9FWtFuoAKCoJPEfZ8OP0ob
94.56 s
[pathway] include pathway-internal-0.0.1.0-6pVrF111eN4BAqGigGNQse
94.56 s
[pathway] include template-haskell-2.20.0.0
94.56 s
[pathway] include text-2.0.2
94.56 s
[pathway] include yaya-0.6.2.3-7sqHSSXaJnw73nWfp3Ph4M
94.56 s
[pathway] include yaya-containers-0.1.2.2-B0Uc3hACwej7JlaQ5nsUWv
94.56 s
[pathway] include yaya-unsafe-0.4.1.4-GKzirUSXpFC6HxjkuccBOw
94.56 s
[pathway] Data.Path=pathway-0.0.1.0-31EObXlLuVk60eWeEQLXMY:Data.Path,Data.Path.Directory=pathway-0.0.1.0-31EObXlLuVk60eWeEQLXMY:Data.Path.Directory,Data.Path.File=pathway-0.0.1.0-31EObXlLuVk60eWeEQLXMY:Data.Path.File,Data.Path.Format=pathway-0.0.1.0-31EObXlLuVk60eWeEQLXMY:Data.Path.Format,Data.Path.Parser=pathway-0.0.1.0-31EObXlLuVk60eWeEQLXMY:Data.Path.Parser,Data.Path.Relativity=pathway-0.0.1.0-31EObXlLuVk60eWeEQLXMY:Data.Path.Relativity,Data.Path.TH=pathway-0.0.1.0-31EObXlLuVk60eWeEQLXMY:Data.Path.TH,Data.Path.Type=pathway-0.0.1.0-31EObXlLuVk60eWeEQLXMY:Data.Path.Type
94.56 s
[pathway] unit pathway-0.0.1.0-JQN3DMUNFwp4edftQImUoT-doctests
94.56 s
[pathway] include QuickCheck-2.15.0.1-8TOXA7GkEi42wTg0ODsItP
94.56 s
[pathway] include base-4.18.3.0
94.56 s
[pathway] include doctest-0.24.2-7YxPr6lrdwiBMDK2pmizgF
94.56 s
[pathway] include pathway-0.0.1.0-31EObXlLuVk60eWeEQLXMY
94.56 s
[pathway] include pathway-quickcheck-0.0.1.0-3oURtdbGHQOF2R72KWRQV9
94.56 s
[pathway] Ready component graph:
94.56 s
[pathway] definite pathway-0.0.1.0-31EObXlLuVk60eWeEQLXMY
94.56 s
[pathway] depends base-4.18.3.0
94.56 s
[pathway] depends containers-0.6.7
94.56 s
[pathway] depends extra-1.8.1-mqL7YRifC8HhGrjpGYIL3
94.56 s
[pathway] depends megaparsec-9.7.0-9FWtFuoAKCoJPEfZ8OP0ob
94.56 s
[pathway] depends pathway-internal-0.0.1.0-6pVrF111eN4BAqGigGNQse
94.56 s
[pathway] depends template-haskell-2.20.0.0
94.56 s
[pathway] depends text-2.0.2
94.56 s
[pathway] depends yaya-0.6.2.3-7sqHSSXaJnw73nWfp3Ph4M
94.56 s
[pathway] depends yaya-containers-0.1.2.2-B0Uc3hACwej7JlaQ5nsUWv
94.56 s
[pathway] depends yaya-unsafe-0.4.1.4-GKzirUSXpFC6HxjkuccBOw
94.56 s
[pathway] definite pathway-0.0.1.0-JQN3DMUNFwp4edftQImUoT-doctests
94.56 s
[pathway] depends QuickCheck-2.15.0.1-8TOXA7GkEi42wTg0ODsItP
94.56 s
[pathway] depends base-4.18.3.0
94.56 s
[pathway] depends doctest-0.24.2-7YxPr6lrdwiBMDK2pmizgF
94.56 s
[pathway] depends pathway-0.0.1.0-31EObXlLuVk60eWeEQLXMY
94.56 s
[pathway] depends pathway-quickcheck-0.0.1.0-3oURtdbGHQOF2R72KWRQV9
94.56 s
[pathway] Using Cabal-3.10.3.0 compiled by ghc-9.6
94.56 s
[pathway] Using compiler: ghc-9.6.7
94.56 s
[pathway] Using install prefix:
94.56 s
[pathway] /nix/store/db5y8shva1d4611jkblnmskasks7bblx-pathway-0.0.1.0
94.56 s
[pathway] Executables installed in:
94.56 s
[pathway] /nix/store/db5y8shva1d4611jkblnmskasks7bblx-pathway-0.0.1.0/bin
94.56 s
[pathway] Libraries installed in:
94.56 s
[pathway] /nix/store/db5y8shva1d4611jkblnmskasks7bblx-pathway-0.0.1.0/lib/ghc-9.6.7/lib/x86_64-linux-ghc-9.6.7/pathway-0.0.1.0-31EObXlLuVk60eWeEQLXMY
94.56 s
[pathway] Dynamic Libraries installed in:
94.56 s
[pathway] /nix/store/db5y8shva1d4611jkblnmskasks7bblx-pathway-0.0.1.0/lib/ghc-9.6.7/lib/x86_64-linux-ghc-9.6.7
94.56 s
[pathway] Private executables installed in:
94.56 s
[pathway] /nix/store/db5y8shva1d4611jkblnmskasks7bblx-pathway-0.0.1.0/libexec/x86_64-linux-ghc-9.6.7/pathway-0.0.1.0
94.56 s
[pathway] Data files installed in:
94.56 s
[pathway] /nix/store/db5y8shva1d4611jkblnmskasks7bblx-pathway-0.0.1.0/share/x86_64-linux-ghc-9.6.7/pathway-0.0.1.0
94.56 s
[pathway] Documentation installed in:
94.56 s
[pathway] /nix/store/hzficz67yh7yrvbcjml69rh06ff2xm6w-pathway-0.0.1.0-doc/share/doc/pathway-0.0.1.0
94.56 s
[pathway] Configuration files installed in:
94.56 s
[pathway] /nix/store/db5y8shva1d4611jkblnmskasks7bblx-pathway-0.0.1.0/etc
94.56 s
[pathway] No alex found
94.56 s
[pathway] Using ar found on system at:
94.56 s
[pathway] /nix/store/iz5lckcsg66r223si2gck7csk2hihj0m-binutils-wrapper-2.44/bin/ar
94.56 s
[pathway] No c2hs found
94.56 s
[pathway] No cpphs found
94.56 s
[pathway] Using doctest version 0.24.2 found on system at:
94.56 s
[pathway] /nix/store/mky1glcba5jwjn0h7fa1mldfnh39g6l9-doctest-0.24.2/bin/doctest
94.56 s
[pathway] Using gcc version 14.3.0 given by user at:
94.56 s
[pathway] /nix/store/8v97ngkcpfzgghwnnr7fsz33p2x22gy9-gcc-wrapper-14.3.0/bin/gcc
94.56 s
[pathway] Using ghc version 9.6.7 found on system at:
94.56 s
[pathway] /nix/store/da9x1n5l146q0ai9wz8zfbx4zfwa9b02-ghc-9.6.7/bin/ghc
94.56 s
[pathway] Using ghc-pkg version 9.6.7 found on system at:
94.56 s
[pathway] /nix/store/da9x1n5l146q0ai9wz8zfbx4zfwa9b02-ghc-9.6.7/bin/ghc-pkg-9.6.7
94.56 s
[pathway] No ghcjs found
94.56 s
[pathway] No ghcjs-pkg found
94.56 s
[pathway] No greencard found
94.56 s
[pathway] Using haddock version 2.29.2 found on system at:
94.56 s
[pathway] /nix/store/da9x1n5l146q0ai9wz8zfbx4zfwa9b02-ghc-9.6.7/bin/haddock-ghc-9.6.7
94.56 s
[pathway] No happy found
94.56 s
[pathway] Using haskell-suite found on system at: haskell-suite-dummy-location
94.56 s
[pathway] Using haskell-suite-pkg found on system at: haskell-suite-pkg-dummy-location
94.56 s
[pathway] No hmake found
94.56 s
[pathway] Using hpc version 0.68 found on system at:
94.56 s
[pathway] /nix/store/da9x1n5l146q0ai9wz8zfbx4zfwa9b02-ghc-9.6.7/bin/hpc-ghc-9.6.7
94.56 s
[pathway] Using hsc2hs version 0.68.9 found on system at:
94.56 s
[pathway] /nix/store/da9x1n5l146q0ai9wz8zfbx4zfwa9b02-ghc-9.6.7/bin/hsc2hs-ghc-9.6.7
94.56 s
[pathway] Using hscolour version 1.25 found on system at:
94.56 s
[pathway] /nix/store/7ffc07q75k5a6zk864jv9gpiphhwzjlh-hscolour-1.25/bin/HsColour
94.56 s
[pathway] No jhc found
94.56 s
[pathway] Using ld found on system at:
94.56 s
[pathway] /nix/store/iz5lckcsg66r223si2gck7csk2hihj0m-binutils-wrapper-2.44/bin/ld.gold
94.56 s
[pathway] No pkg-config found
94.56 s
[pathway] Using runghc version 9.6.7 found on system at:
94.56 s
[pathway] /nix/store/da9x1n5l146q0ai9wz8zfbx4zfwa9b02-ghc-9.6.7/bin/runghc-9.6.7
94.56 s
[pathway] Using strip version 2.44 found on system at:
94.56 s
[pathway] /nix/store/8v97ngkcpfzgghwnnr7fsz33p2x22gy9-gcc-wrapper-14.3.0/bin/strip
94.56 s
[pathway] Using tar found on system at:
94.56 s
[pathway] /nix/store/xl6pd2spjajwcpq09fnmnjv5psqmlmma-gnutar-1.35/bin/tar
94.56 s
[pathway] No uhc found
94.85 s
[pathway] Phase: buildPhase
94.92 s
[pathway] Preprocessing library for pathway-0.0.1.0..
94.92 s
[pathway] Building library for pathway-0.0.1.0..
95.04 s
[pathway] [1 of 8] Compiling Data.Path.Format ( src/Data/Path/Format.hs, dist/build/Data/Path/Format.o, dist/build/Data/Path/Format.dyn_o )
95.13 s
[pathway] [2 of 8] Compiling Data.Path.Relativity ( src/Data/Path/Relativity.hs, dist/build/Data/Path/Relativity.o, dist/build/Data/Path/Relativity.dyn_o )
95.13 s
[pathway] [3 of 8] Compiling Data.Path.Type ( src/Data/Path/Type.hs, dist/build/Data/Path/Type.o, dist/build/Data/Path/Type.dyn_o )
95.13 s
[pathway] [4 of 8] Compiling Data.Path.File ( src/Data/Path/File.hs, dist/build/Data/Path/File.o, dist/build/Data/Path/File.dyn_o )
95.15 s
[pathway] [5 of 8] Compiling Data.Path.Directory ( src/Data/Path/Directory.hs, dist/build/Data/Path/Directory.o, dist/build/Data/Path/Directory.dyn_o )
95.23 s
[pathway] [6 of 8] Compiling Data.Path ( src/Data/Path.hs, dist/build/Data/Path.o, dist/build/Data/Path.dyn_o )
96.42 s
[pathway] [7 of 8] Compiling Data.Path.Parser ( src/Data/Path/Parser.hs, dist/build/Data/Path/Parser.o, dist/build/Data/Path/Parser.dyn_o )
96.59 s
[pathway] [8 of 8] Compiling Data.Path.TH ( src/Data/Path/TH.hs, dist/build/Data/Path/TH.o, dist/build/Data/Path/TH.dyn_o )
96.90 s
[pathway] [1 of 8] Compiling Data.Path.Format ( src/Data/Path/Format.hs, dist/build/Data/Path/Format.p_o )
97.09 s
[pathway] [2 of 8] Compiling Data.Path.Relativity ( src/Data/Path/Relativity.hs, dist/build/Data/Path/Relativity.p_o )
97.09 s
[pathway] [3 of 8] Compiling Data.Path.Type ( src/Data/Path/Type.hs, dist/build/Data/Path/Type.p_o )
97.09 s
[pathway] [4 of 8] Compiling Data.Path.File ( src/Data/Path/File.hs, dist/build/Data/Path/File.p_o )
97.19 s
[pathway] [5 of 8] Compiling Data.Path.Directory ( src/Data/Path/Directory.hs, dist/build/Data/Path/Directory.p_o )
97.26 s
[pathway] [6 of 8] Compiling Data.Path ( src/Data/Path.hs, dist/build/Data/Path.p_o )
98.49 s
[pathway] [7 of 8] Compiling Data.Path.Parser ( src/Data/Path/Parser.hs, dist/build/Data/Path/Parser.p_o )
98.73 s
[pathway] [8 of 8] Compiling Data.Path.TH ( src/Data/Path/TH.hs, dist/build/Data/Path/TH.p_o )
100.36 s
[pathway] Preprocessing test suite 'doctests' for pathway-0.0.1.0..
100.40 s
[pathway] Building test suite 'doctests' for pathway-0.0.1.0..
100.44 s
[pathway] [1 of 2] Compiling Build_doctests ( dist/build/doctests/autogen/Build_doctests.hs, dist/build/doctests/doctests-tmp/Build_doctests.o )
100.66 s
[pathway] [2 of 2] Compiling Main ( tests/doctests.hs, dist/build/doctests/doctests-tmp/Main.o )
100.93 s
[pathway] [3 of 3] Linking dist/build/doctests/doctests
104.36 s
[pathway] Phase: checkPhase
104.41 s
[pathway] Running 1 test suites...
104.41 s
[pathway] Test suite doctests: RUNNING...
104.80 s
[pathway]
104.80 s
[pathway] on the commandline: warning:
104.80 s
[pathway] -XTemplateHaskell is not allowed in Safe Haskell; ignoring -XTemplateHaskell
104.80 s
[pathway]
104.80 s
[pathway] on the commandline: warning:
104.80 s
[pathway] -XTemplateHaskell is not allowed in Safe Haskell; ignoring -XTemplateHaskell
104.81 s
[pathway]
104.81 s
[pathway] on the commandline: warning:
104.81 s
[pathway] -XTemplateHaskell is not allowed in Safe Haskell; ignoring -XTemplateHaskell
104.81 s
[pathway]
104.81 s
[pathway] on the commandline: warning:
104.81 s
[pathway] -XTemplateHaskell is not allowed in Safe Haskell; ignoring -XTemplateHaskell
104.82 s
[pathway]
104.82 s
[pathway] on the commandline: warning:
104.82 s
[pathway] -XTemplateHaskell is not allowed in Safe Haskell; ignoring -XTemplateHaskell
104.82 s
[pathway]
104.82 s
[pathway] on the commandline: warning:
104.82 s
[pathway] -XTemplateHaskell is not allowed in Safe Haskell; ignoring -XTemplateHaskell
104.82 s
[pathway]
104.82 s
[pathway] on the commandline: warning:
104.82 s
[pathway] -XTemplateHaskell is not allowed in Safe Haskell; ignoring -XTemplateHaskell
104.82 s
[pathway]
104.82 s
[pathway] on the commandline: warning:
104.82 s
[pathway] -XTemplateHaskell is not allowed in Safe Haskell; ignoring -XTemplateHaskell
104.82 s
[pathway]
104.82 s
[pathway] on the commandline: warning:
104.82 s
[pathway] -XTemplateHaskell is not allowed in Safe Haskell; ignoring -XTemplateHaskell
104.83 s
[pathway]
104.83 s
[pathway] on the commandline: warning:
104.83 s
[pathway] -XTemplateHaskell is not allowed in Safe Haskell; ignoring -XTemplateHaskell
104.86 s
[pathway]
104.86 s
[pathway] on the commandline: warning:
104.86 s
[pathway] -XTemplateHaskell is not allowed in Safe Haskell; ignoring -XTemplateHaskell
106.42 s
[pathway] Examples: 53 Tried: 53 Errors: 0 Failures: 0
106.50 s
[pathway] Test suite doctests: PASS
106.50 s
[pathway] Test suite logged to: dist/test/pathway-0.0.1.0-doctests.log
106.50 s
[pathway] 1 of 1 test suites (1 of 1 test cases) passed.
106.51 s
[pathway] Phase: haddockPhase
106.66 s
[pathway] Preprocessing library for pathway-0.0.1.0..
106.66 s
[pathway] Running Haddock on library for pathway-0.0.1.0..
106.66 s
[pathway] Warning: The documentation for the following packages are not installed. No
106.66 s
[pathway] links will be generated to these packages: vector-0.13.2.0
106.72 s
[pathway] Warning: --source-* options are ignored when --hyperlinked-source is enabled.
106.96 s
[pathway] 20% ( 1 / 5) in 'Data.Path.Format'
106.96 s
[pathway] Missing documentation for:
106.96 s
[pathway] Module header
106.96 s
[pathway] Format (src/Data/Path/Format.hs:25)
106.96 s
[pathway] posix (src/Data/Path/Format.hs:37)
106.96 s
[pathway] windows (src/Data/Path/Format.hs:47)
107.01 s
[pathway] 50% ( 1 / 2) in 'Data.Path.Relativity'
107.01 s
[pathway] Missing documentation for:
107.01 s
[pathway] Module header
107.01 s
[pathway] 50% ( 1 / 2) in 'Data.Path.Type'
107.01 s
[pathway] Missing documentation for:
107.01 s
[pathway] Module header
107.05 s
[pathway] 0% ( 0 / 3) in 'Data.Path.File'
107.05 s
[pathway] Missing documentation for:
107.05 s
[pathway] Module header
107.05 s
[pathway] basename (src/Data/Path/File.hs:20)
107.05 s
[pathway] directory (src/Data/Path/File.hs:23)
107.07 s
[pathway] Warning: '<$>' is out of scope.
107.07 s
[pathway] If you qualify the identifier, haddock can try to link it anyway.
107.07 s
[pathway] 36% ( 4 / 11) in 'Data.Path.Directory'
107.07 s
[pathway] Missing documentation for:
107.07 s
[pathway] Module header
107.07 s
[pathway] isCurrent (src/Data/Path/Directory.hs:93)
107.07 s
[pathway] root (src/Data/Path/Directory.hs:104)
107.07 s
[pathway] isRoot (src/Data/Path/Directory.hs:107)
107.07 s
[pathway] descendThrough (src/Data/Path/Directory.hs:96)
107.07 s
[pathway] descendTo (src/Data/Path/Directory.hs:100)
107.07 s
[pathway] selectFile (src/Data/Path/Directory.hs:110)
107.41 s
[pathway] Warning: 'None' is out of scope.
107.41 s
[pathway] If you qualify the identifier, haddock can try to link it anyway.
107.42 s
[pathway] Warning: '../' is out of scope.
107.42 s
[pathway] If you qualify the identifier, haddock can try to link it anyway.
107.42 s
[pathway] 55% ( 16 / 29) in 'Data.Path'
107.42 s
[pathway] Missing documentation for:
107.42 s
[pathway] Anchored (src/Data/Path.hs:638)
107.42 s
[pathway] Filename
107.42 s
[pathway] Pathy (src/Data/Path.hs:203)
107.42 s
[pathway] RelOps (src/Data/Path.hs:227)
107.42 s
[pathway] Relative (src/Data/Path.hs:174)
107.42 s
[pathway] Substible (src/Data/Path.hs:586)
107.42 s
[pathway] Typey (src/Data/Path.hs:190)
107.42 s
[pathway] escapeComponent (src/Data/Path.hs:600)
107.42 s
[pathway] forgetRelativity (src/Data/Path.hs:710)
107.42 s
[pathway] forgetType (src/Data/Path.hs:713)
107.42 s
[pathway] reparent (src/Data/Path.hs:359)
107.42 s
[pathway] replace (src/Data/Path.hs:587)
107.42 s
[pathway] strengthen (src/Data/Path.hs:633)
107.66 s
[pathway] Warning: 'parse' is out of scope.
107.66 s
[pathway] If you qualify the identifier, haddock can try to link it anyway.
107.66 s
[pathway] Warning: 'local' is out of scope.
107.66 s
[pathway] If you qualify the identifier, haddock can try to link it anyway.
107.67 s
[pathway] 100% ( 3 / 3) in 'Data.Path.Parser'
107.70 s
[pathway] Warning: 'IsString' is out of scope.
107.70 s
[pathway] If you qualify the identifier, haddock can try to link it anyway.
107.70 s
[pathway] 50% ( 2 / 4) in 'Data.Path.TH'
107.70 s
[pathway] Missing documentation for:
107.70 s
[pathway] Module header
107.70 s
[pathway] path (src/Data/Path/TH.hs:81)
107.94 s
[pathway] Warning: Data.Path: could not find link destinations for:
107.94 s
[pathway] - Data.Path.Routable
107.94 s
[pathway] - Data.Path.generalizeType
107.94 s
[pathway] - Data.Path.generalizeRelativity
107.94 s
[pathway] Warning: Data.Path.Parser: could not find link destinations for:
107.94 s
[pathway] - Data.Path.Parser.anchor
112.08 s
[pathway] Documentation created: dist/doc/html/pathway/,
112.08 s
[pathway] dist/doc/html/pathway/pathway.txt
112.14 s
[pathway] Preprocessing test suite 'doctests' for pathway-0.0.1.0..
112.16 s
[pathway] Phase: installPhase
112.24 s
[pathway] Installing library in /nix/store/db5y8shva1d4611jkblnmskasks7bblx-pathway-0.0.1.0/lib/ghc-9.6.7/lib/x86_64-linux-ghc-9.6.7/pathway-0.0.1.0-31EObXlLuVk60eWeEQLXMY
112.52 s
[pathway] Phase: fixupPhase
112.54 s
[pathway] shrinking RPATHs of ELF executables and libraries in /nix/store/db5y8shva1d4611jkblnmskasks7bblx-pathway-0.0.1.0
112.54 s
[pathway] shrinking /nix/store/db5y8shva1d4611jkblnmskasks7bblx-pathway-0.0.1.0/lib/ghc-9.6.7/lib/x86_64-linux-ghc-9.6.7/libHSpathway-0.0.1.0-31EObXlLuVk60eWeEQLXMY-ghc9.6.7.so
112.56 s
[pathway] checking for references to /build/ in /nix/store/db5y8shva1d4611jkblnmskasks7bblx-pathway-0.0.1.0...
112.58 s
[pathway] patching script interpreter paths in /nix/store/db5y8shva1d4611jkblnmskasks7bblx-pathway-0.0.1.0
112.58 s
[pathway] stripping (with command strip and flags -S -p) in /nix/store/db5y8shva1d4611jkblnmskasks7bblx-pathway-0.0.1.0/lib
112.64 s
[pathway] shrinking RPATHs of ELF executables and libraries in /nix/store/hzficz67yh7yrvbcjml69rh06ff2xm6w-pathway-0.0.1.0-doc
112.65 s
[pathway] checking for references to /build/ in /nix/store/hzficz67yh7yrvbcjml69rh06ff2xm6w-pathway-0.0.1.0-doc...
112.67 s
[pathway] patching script interpreter paths in /nix/store/hzficz67yh7yrvbcjml69rh06ff2xm6w-pathway-0.0.1.0-doc
112.77 s
[pathway:post-build] Uploading to cachix cache "sellout": /nix/store/db5y8shva1d4611jkblnmskasks7bblx-pathway-0.0.1.0 /nix/store/hzficz67yh7yrvbcjml69rh06ff2xm6w-pathway-0.0.1.0-doc
113.22 s
[pathway:post-build] Pushing 4 paths (178 are already present) using zstd to cache sellout ⏳
113.22 s
[pathway:post-build]
113.58 s
[pathway:post-build] Pushing /nix/store/agj742h6zh3d5xwr1z0kd83jbf466fv3-isl-0.20 (2.52 MiB)
113.60 s
[pathway:post-build] Pushing /nix/store/hzficz67yh7yrvbcjml69rh06ff2xm6w-pathway-0.0.1.0-doc (1.31 MiB)
113.60 s
[pathway:post-build] Pushing /nix/store/5vni9zvi5ba7hrbhr4hffj2200drk14p-curl-8.19.0 (1.07 MiB)
113.61 s
[pathway:post-build] Pushing /nix/store/db5y8shva1d4611jkblnmskasks7bblx-pathway-0.0.1.0 (2.69 MiB)
115.10 s
[pathway:post-build]
115.10 s
[pathway:post-build] All done.
115.12 s
[pathway:post-build] Uploading to the NixCI cache: /nix/store/db5y8shva1d4611jkblnmskasks7bblx-pathway-0.0.1.0 /nix/store/hzficz67yh7yrvbcjml69rh06ff2xm6w-pathway-0.0.1.0-doc
115.16 s
[pathway:post-build] warning: 'warn-short-path-literals' is deprecated, use 'lint-short-path-literals = ignore' instead
115.19 s
[pathway:post-build] copying 6 paths...
115.19 s
[pathway:post-build] copying path '/nix/store/8w0lwdjv6hhpv8rvx3j2y753y7hv9m09-yaya-containers-0.1.2.2-doc' to 'https://cache.nix-ci.com'...
115.19 s
[pathway:post-build] copying path '/nix/store/hddn4psind7s8sb6f9p0jhvv9p4dxhxq-yaya-unsafe-0.4.1.4-doc' to 'https://cache.nix-ci.com'...
115.88 s
[pathway:post-build] copying path '/nix/store/jga9wnv566l9srnq4m9c2zhd0aixv684-yaya-unsafe-0.4.1.4' to 'https://cache.nix-ci.com'...
115.88 s
[pathway:post-build] copying path '/nix/store/0rp98jfaa3b72m5g4w5924ksaya06jw9-yaya-containers-0.1.2.2' to 'https://cache.nix-ci.com'...
115.88 s
[pathway:post-build] copying path '/nix/store/hzficz67yh7yrvbcjml69rh06ff2xm6w-pathway-0.0.1.0-doc' to 'https://cache.nix-ci.com'...
116.75 s
[pathway:post-build] copying path '/nix/store/db5y8shva1d4611jkblnmskasks7bblx-pathway-0.0.1.0' to 'https://cache.nix-ci.com'...
117.48 s
[pathway:post-build] warning: 'warn-short-path-literals' is deprecated, use 'lint-short-path-literals = ignore' instead
117.66 s
[pathway:post-build] copying 9 paths...
117.69 s
[pathway:post-build] copying path '/nix/store/7ji5wkbj5n6zjpndk2h7ql94wqmca1hm-clock-0.8.4.drv' to 'https://cache.nix-ci.com'...
117.69 s
[pathway:post-build] copying path '/nix/store/g4kjsa4kiqwgm1b7h16917qizia8fb83-yaya-containers-0.1.2.2.drv' to 'https://cache.nix-ci.com'...
117.69 s
[pathway:post-build] copying path '/nix/store/rp7fq3g0yw3fblbgagmsmjmcb9a36wn0-parser-combinators-1.3.0.drv' to 'https://cache.nix-ci.com'...
117.69 s
[pathway:post-build] copying path '/nix/store/qzbnmrqlawv0i4l6h15kpbj51haa8al3-deriving-compat-0.6.7.drv' to 'https://cache.nix-ci.com'...
117.81 s
[pathway:post-build] copying path '/nix/store/9w7fw3b0ngn0898arnrapixvcwrnlxgj-extra-1.8.1.drv' to 'https://cache.nix-ci.com'...
117.82 s
[pathway:post-build] copying path '/nix/store/3km88yil9wpzky02b8g88aafc5pwlbn8-megaparsec-9.7.0.drv' to 'https://cache.nix-ci.com'...
117.82 s
[pathway:post-build] copying path '/nix/store/v9kgzz264rljh9b4j07pwyy4sw4jdkrq-yaya-hedgehog-0.3.0.5.drv' to 'https://cache.nix-ci.com'...
117.95 s
[pathway:post-build] copying path '/nix/store/dcpxanma55r1k9nfyg7hfrm7kl0d41q4-yaya-unsafe-0.4.1.4.drv' to 'https://cache.nix-ci.com'...
118.08 s
[pathway:post-build] copying path '/nix/store/nzw6d59fxqh64la5s4m42darvx8nsccb-pathway-0.0.1.0.drv' to 'https://cache.nix-ci.com'...
118.22 s
Uploaded pathway in 5.4s
118.22 s
Progress: 3 of 21 built, 184 of 184 downloaded from cache
118.22 s
Built pathway in 26.1s
118.27 s
Building /nix/store/8n94fqchg3sfvlkx3i3ry4vqg230s4p8-pathway-compat-base-0.0.1.0.drv
118.31 s
Building /nix/store/n51abigzrdcxmvhv96syrh1llssp1psp-pathway-path-0.0.1.0.drv
118.49 s
[pathway-compat-base] Phase: setupCompilerEnvironmentPhase
118.50 s
[pathway-compat-base] Build with /nix/store/da9x1n5l146q0ai9wz8zfbx4zfwa9b02-ghc-9.6.7.
118.58 s
[pathway-path] Phase: setupCompilerEnvironmentPhase
118.58 s
[pathway-path] Build with /nix/store/da9x1n5l146q0ai9wz8zfbx4zfwa9b02-ghc-9.6.7.
118.75 s
[pathway-compat-base] Phase: unpackPhase
118.75 s
[pathway-compat-base] unpacking source archive /nix/store/723m6sjvk66iiqzpvcfdd74xi6id5zqq-zjizyqf4pafgh9rycgxd507dhvpisdy1-source/./compat/base
118.76 s
[pathway-compat-base] source root is base
118.77 s
[pathway-compat-base] Phase: patchPhase
118.77 s
[pathway-compat-base] Phase: compileBuildDriverPhase
118.78 s
[pathway-compat-base] setupCompileFlags: -package-db=/build/tmp.jiYx3Wq6hn/setup-package.conf.d -threaded
118.82 s
[pathway-compat-base] [1 of 2] Compiling Main ( Setup.hs, /build/tmp.jiYx3Wq6hn/Main.o )
118.87 s
[pathway-compat-base] [2 of 2] Linking Setup
118.88 s
[pathway-path] Phase: unpackPhase
118.88 s
[pathway-path] unpacking source archive /nix/store/723m6sjvk66iiqzpvcfdd74xi6id5zqq-zjizyqf4pafgh9rycgxd507dhvpisdy1-source/./path
118.89 s
[pathway-path] source root is path
118.90 s
[pathway-path] Phase: patchPhase
118.90 s
[pathway-path] Phase: compileBuildDriverPhase
118.91 s
[pathway-path] setupCompileFlags: -package-db=/build/tmp.PMtat1QF4H/setup-package.conf.d -threaded
118.95 s
[pathway-path] [1 of 2] Compiling Main ( Setup.hs, /build/tmp.PMtat1QF4H/Main.o )
119.00 s
[pathway-path] [2 of 2] Linking Setup
119.96 s
[pathway-compat-base] Phase: updateAutotoolsGnuConfigScriptsPhase
119.97 s
[pathway-compat-base] Phase: configurePhase
119.97 s
[pathway-compat-base] configureFlags: --verbose --prefix=/nix/store/immjks7z3cdng833dbs7k3bhslg3ix6w-pathway-compat-base-0.0.1.0 --libdir=$prefix/lib/$compiler/lib --libsubdir=$abi/$libname --docdir=/nix/store/crzf26y06x5l6vgfsc6nkfqqwfypfild-pathway-compat-base-0.0.1.0-doc/share/doc/pathway-compat-base-0.0.1.0 --with-gcc=gcc --package-db=/build/tmp.jiYx3Wq6hn/package.conf.d --ghc-option=-j16 --ghc-option=+RTS --ghc-option=-A64M --ghc-option=-RTS --enable-library-profiling --profiling-detail=exported-functions --disable-profiling --enable-shared --disable-coverage --enable-static --disable-executable-dynamic --enable-tests --disable-benchmarks --enable-library-vanilla --disable-library-for-ghci --enable-split-sections --enable-library-stripping --enable-executable-stripping --ghc-option=-haddock --ghc-options=-Werror --extra-lib-dirs=/nix/store/ffyzkisqs4vc4mg28bwwlyqjf8i9ph6b-ncurses-6.5/lib --extra-lib-dirs=/nix/store/n28qgdj8c1q41kf7n4y1jxa6ckp85m3c-libffi-3.5.2/lib --extra-lib-dirs=/nix/store/1b6h99dw7bk4wbn77kbalih42zbc67m1-elfutils-0.194/lib --extra-lib-dirs=/nix/store/hi0ar880110k6jsmmili7dh1gq3cg2a9-gmp-with-cxx-6.3.0/lib --extra-lib-dirs=/nix/store/g09cflpnp4g80q56sj9dng1qzv4v4ybc-numactl-2.0.18/lib --extra-lib-dirs=/nix/store/da9x1n5l146q0ai9wz8zfbx4zfwa9b02-ghc-9.6.7/lib
119.98 s
[pathway-compat-base] Using Parsec parser
119.98 s
[pathway-compat-base] Configuring pathway-compat-base-0.0.1.0...
120.07 s
[pathway-path] Phase: updateAutotoolsGnuConfigScriptsPhase
120.08 s
[pathway-path] Phase: configurePhase
120.09 s
[pathway-path] configureFlags: --verbose --prefix=/nix/store/nsbihvs0yf5psjvh6bq3ijpi4nci61l0-pathway-path-0.0.1.0 --libdir=$prefix/lib/$compiler/lib --libsubdir=$abi/$libname --docdir=/nix/store/dr0s8ra5qf554rdixg2rfnzngv9v8j20-pathway-path-0.0.1.0-doc/share/doc/pathway-path-0.0.1.0 --with-gcc=gcc --package-db=/build/tmp.PMtat1QF4H/package.conf.d --ghc-option=-j16 --ghc-option=+RTS --ghc-option=-A64M --ghc-option=-RTS --enable-library-profiling --profiling-detail=exported-functions --disable-profiling --enable-shared --disable-coverage --enable-static --disable-executable-dynamic --enable-tests --disable-benchmarks --enable-library-vanilla --disable-library-for-ghci --enable-split-sections --enable-library-stripping --enable-executable-stripping --ghc-option=-haddock --ghc-options=-Werror --extra-lib-dirs=/nix/store/ffyzkisqs4vc4mg28bwwlyqjf8i9ph6b-ncurses-6.5/lib --extra-lib-dirs=/nix/store/n28qgdj8c1q41kf7n4y1jxa6ckp85m3c-libffi-3.5.2/lib --extra-lib-dirs=/nix/store/1b6h99dw7bk4wbn77kbalih42zbc67m1-elfutils-0.194/lib --extra-lib-dirs=/nix/store/hi0ar880110k6jsmmili7dh1gq3cg2a9-gmp-with-cxx-6.3.0/lib --extra-lib-dirs=/nix/store/g09cflpnp4g80q56sj9dng1qzv4v4ybc-numactl-2.0.18/lib --extra-lib-dirs=/nix/store/da9x1n5l146q0ai9wz8zfbx4zfwa9b02-ghc-9.6.7/lib
120.10 s
[pathway-path] Using Parsec parser
120.10 s
[pathway-path] Configuring pathway-path-0.0.1.0...
120.31 s
[pathway-compat-base] Flags chosen: noisy-deprecations=True, verify-no-recursion=False
120.31 s
[pathway-compat-base] Dependency base >=4.14.0 && <4.15 || >=4.15.0 && <4.16 || >=4.16.0 && <4.17 ||
120.31 s
[pathway-compat-base] >=4.17.0 && <4.18 || >=4.18.0 && <4.19 || >=4.19.0 && <4.20 || >=4.20.0 &&
120.31 s
[pathway-compat-base] <4.21 || >=4.21.0 && <4.22 || >=4.22.0 && <4.23: using base-4.18.3.0
120.31 s
[pathway-compat-base] Dependency exceptions: using exceptions-0.10.7
120.31 s
[pathway-compat-base] Dependency megaparsec >=9.0.1 && <9.1 || >=9.2.1 && <9.3 || >=9.5.0 && <9.6 ||
120.31 s
[pathway-compat-base] >=9.7.0 && <9.8: using megaparsec-9.7.0
120.31 s
[pathway-compat-base] Dependency pathway >=0.0.1 && <0.1: using pathway-0.0.1.0
120.31 s
[pathway-compat-base] Dependency variant: using variant-1.0.1
120.31 s
[pathway-compat-base] Dependency base >=4.14.0 && <4.15 || >=4.15.0 && <4.16 || >=4.16.0 && <4.17 ||
120.31 s
[pathway-compat-base] >=4.17.0 && <4.18 || >=4.18.0 && <4.19 || >=4.19.0 && <4.20 || >=4.20.0 &&
120.31 s
[pathway-compat-base] <4.21 || >=4.21.0 && <4.22 || >=4.22.0 && <4.23: using base-4.18.3.0
120.31 s
[pathway-compat-base] Dependency doctest >=0.16.3 && <0.17 || >=0.18.1 && <0.19 || >=0.20.1 && <0.21
120.31 s
[pathway-compat-base] || >=0.21.1 && <0.22 || >=0.22.2 && <0.23 || >=0.24.2 && <0.25: using
120.31 s
[pathway-compat-base] doctest-0.24.2
120.31 s
[pathway-compat-base] Dependency pathway-compat-base: using pathway-compat-base-0.0.1.0
120.47 s
[pathway-path] Flags chosen: noisy-deprecations=True, verify-no-recursion=False
120.47 s
[pathway-path] Dependency base >=4.14.0 && <4.15 || >=4.15.0 && <4.16 || >=4.16.0 && <4.17 ||
120.47 s
[pathway-path] >=4.17.0 && <4.18 || >=4.18.0 && <4.19 || >=4.19.0 && <4.20 || >=4.20.0 &&
120.47 s
[pathway-path] <4.21 || >=4.21.0 && <4.22 || >=4.22.0 && <4.23: using base-4.18.3.0
120.47 s
[pathway-path] Dependency filepath >=1.4.2 && <1.5 || >=1.5.2 && <1.6: using
120.47 s
[pathway-path] filepath-1.4.301.0
120.47 s
[pathway-path] Dependency path >=0.9.0 && <0.10: using path-0.9.6
120.47 s
[pathway-path] Dependency pathway >=0.0.1 && <0.1: using pathway-0.0.1.0
120.47 s
[pathway-path] Dependency pathway-internal >=0.0.1 && <0.1: using pathway-internal-0.0.1.0
120.47 s
[pathway-path] Dependency yaya >=0.6.2 && <0.7 || >=0.7.0 && <0.8: using yaya-0.6.2.3
120.47 s
[pathway-path] Dependency yaya-unsafe >=0.4.1 && <0.5 || >=0.5.0 && <0.6: using
120.47 s
[pathway-path] yaya-unsafe-0.4.1.4
120.47 s
[pathway-path] Dependency QuickCheck >=2.14.2 && <2.15 || >=2.15.0 && <2.16 || >=2.16.0 &&
120.47 s
[pathway-path] <2.17 || >=2.17.1 && <2.18: using QuickCheck-2.15.0.1
120.47 s
[pathway-path] Dependency base >=4.14.0 && <4.15 || >=4.15.0 && <4.16 || >=4.16.0 && <4.17 ||
120.47 s
[pathway-path] >=4.17.0 && <4.18 || >=4.18.0 && <4.19 || >=4.19.0 && <4.20 || >=4.20.0 &&
120.47 s
[pathway-path] <4.21 || >=4.21.0 && <4.22 || >=4.22.0 && <4.23: using base-4.18.3.0
120.47 s
[pathway-path] Dependency doctest >=0.16.3 && <0.17 || >=0.18.1 && <0.19 || >=0.20.1 && <0.21
120.47 s
[pathway-path] || >=0.21.1 && <0.22 || >=0.22.2 && <0.23 || >=0.24.2 && <0.25: using
120.47 s
[pathway-path] doctest-0.24.2
120.47 s
[pathway-path] Dependency pathway-path: using pathway-path-0.0.1.0
120.47 s
[pathway-path] Dependency pathway-quickcheck >=0.0.1 && <0.1: using
120.47 s
[pathway-path] pathway-quickcheck-0.0.1.0
120.62 s
[pathway-compat-base] Source component graph:
120.62 s
[pathway-compat-base] component lib
120.62 s
[pathway-compat-base] component test:doctests dependency lib
120.62 s
[pathway-compat-base] Configured component graph:
120.62 s
[pathway-compat-base] component pathway-compat-base-0.0.1.0-BRBmFEfWQlkJP9xCDIxb6w
120.62 s
[pathway-compat-base] include base-4.18.3.0
120.62 s
[pathway-compat-base] include exceptions-0.10.7
120.62 s
[pathway-compat-base] include megaparsec-9.7.0-9FWtFuoAKCoJPEfZ8OP0ob
120.62 s
[pathway-compat-base] include pathway-0.0.1.0-31EObXlLuVk60eWeEQLXMY
120.62 s
[pathway-compat-base] include variant-1.0.1-6hyP6D7a52554JhghneccZ
120.62 s
[pathway-compat-base] component pathway-compat-base-0.0.1.0-9hiQCnwyNrMJbzN0aYHqzB-doctests
120.62 s
[pathway-compat-base] include base-4.18.3.0
120.62 s
[pathway-compat-base] include doctest-0.24.2-7YxPr6lrdwiBMDK2pmizgF
120.62 s
[pathway-compat-base] include pathway-compat-base-0.0.1.0-BRBmFEfWQlkJP9xCDIxb6w
120.62 s
[pathway-compat-base] Linked component graph:
120.62 s
[pathway-compat-base] unit pathway-compat-base-0.0.1.0-BRBmFEfWQlkJP9xCDIxb6w
120.62 s
[pathway-compat-base] include base-4.18.3.0
120.62 s
[pathway-compat-base] include exceptions-0.10.7
120.62 s
[pathway-compat-base] include megaparsec-9.7.0-9FWtFuoAKCoJPEfZ8OP0ob
120.62 s
[pathway-compat-base] include pathway-0.0.1.0-31EObXlLuVk60eWeEQLXMY
120.62 s
[pathway-compat-base] include variant-1.0.1-6hyP6D7a52554JhghneccZ
120.62 s
[pathway-compat-base] Common=pathway-compat-base-0.0.1.0-BRBmFEfWQlkJP9xCDIxb6w:Common,System.Environment.DropIn=pathway-compat-base-0.0.1.0-BRBmFEfWQlkJP9xCDIxb6w:System.Environment.DropIn,System.Environment.Overlay=pathway-compat-base-0.0.1.0-BRBmFEfWQlkJP9xCDIxb6w:System.Environment.Overlay,System.Environment.Pathway=pathway-compat-base-0.0.1.0-BRBmFEfWQlkJP9xCDIxb6w:System.Environment.Pathway,System.Environment.Thin=pathway-compat-base-0.0.1.0-BRBmFEfWQlkJP9xCDIxb6w:System.Environment.Thin,System.IO.Caught=pathway-compat-base-0.0.1.0-BRBmFEfWQlkJP9xCDIxb6w:System.IO.Caught,System.IO.DropIn=pathway-compat-base-0.0.1.0-BRBmFEfWQlkJP9xCDIxb6w:System.IO.DropIn,System.IO.Error.Caught=pathway-compat-base-0.0.1.0-BRBmFEfWQlkJP9xCDIxb6w:System.IO.Error.Caught,System.IO.Error.DropIn=pathway-compat-base-0.0.1.0-BRBmFEfWQlkJP9xCDIxb6w:System.IO.Error.DropIn,System.IO.Error.Overlay=pathway-compat-base-0.0.1.0-BRBmFEfWQlkJP9xCDIxb6w:System.IO.Error.Overlay,System.IO.Error.Pathway=pathway-compat-base-0.0.1.0-BRBmFEfWQlkJP9xCDIxb6w:System.IO.Error.Pathway,System.IO.Error.Thin=pathway-compat-base-0.0.1.0-BRBmFEfWQlkJP9xCDIxb6w:System.IO.Error.Thin,System.IO.Overlay=pathway-compat-base-0.0.1.0-BRBmFEfWQlkJP9xCDIxb6w:System.IO.Overlay,System.IO.Pathway=pathway-compat-base-0.0.1.0-BRBmFEfWQlkJP9xCDIxb6w:System.IO.Pathway,System.IO.Thin=pathway-compat-base-0.0.1.0-BRBmFEfWQlkJP9xCDIxb6w:System.IO.Thin
120.62 s
[pathway-compat-base] unit pathway-compat-base-0.0.1.0-9hiQCnwyNrMJbzN0aYHqzB-doctests
120.62 s
[pathway-compat-base] include base-4.18.3.0
120.62 s
[pathway-compat-base] include doctest-0.24.2-7YxPr6lrdwiBMDK2pmizgF
120.62 s
[pathway-compat-base] include pathway-compat-base-0.0.1.0-BRBmFEfWQlkJP9xCDIxb6w
120.62 s
[pathway-compat-base] Ready component graph:
120.62 s
[pathway-compat-base] definite pathway-compat-base-0.0.1.0-BRBmFEfWQlkJP9xCDIxb6w
120.62 s
[pathway-compat-base] depends base-4.18.3.0
120.62 s
[pathway-compat-base] depends exceptions-0.10.7
120.62 s
[pathway-compat-base] depends megaparsec-9.7.0-9FWtFuoAKCoJPEfZ8OP0ob
120.62 s
[pathway-compat-base] depends pathway-0.0.1.0-31EObXlLuVk60eWeEQLXMY
120.62 s
[pathway-compat-base] depends variant-1.0.1-6hyP6D7a52554JhghneccZ
120.62 s
[pathway-compat-base] definite pathway-compat-base-0.0.1.0-9hiQCnwyNrMJbzN0aYHqzB-doctests
120.62 s
[pathway-compat-base] depends base-4.18.3.0
120.62 s
[pathway-compat-base] depends doctest-0.24.2-7YxPr6lrdwiBMDK2pmizgF
120.62 s
[pathway-compat-base] depends pathway-compat-base-0.0.1.0-BRBmFEfWQlkJP9xCDIxb6w
120.62 s
[pathway-compat-base] Using Cabal-3.10.3.0 compiled by ghc-9.6
120.62 s
[pathway-compat-base] Using compiler: ghc-9.6.7
120.62 s
[pathway-compat-base] Using install prefix:
120.62 s
[pathway-compat-base] /nix/store/immjks7z3cdng833dbs7k3bhslg3ix6w-pathway-compat-base-0.0.1.0
120.62 s
[pathway-compat-base] Executables installed in:
120.62 s
[pathway-compat-base] /nix/store/immjks7z3cdng833dbs7k3bhslg3ix6w-pathway-compat-base-0.0.1.0/bin
120.62 s
[pathway-compat-base] Libraries installed in:
120.62 s
[pathway-compat-base] /nix/store/immjks7z3cdng833dbs7k3bhslg3ix6w-pathway-compat-base-0.0.1.0/lib/ghc-9.6.7/lib/x86_64-linux-ghc-9.6.7/pathway-compat-base-0.0.1.0-BRBmFEfWQlkJP9xCDIxb6w
120.62 s
[pathway-compat-base] Dynamic Libraries installed in:
120.62 s
[pathway-compat-base] /nix/store/immjks7z3cdng833dbs7k3bhslg3ix6w-pathway-compat-base-0.0.1.0/lib/ghc-9.6.7/lib/x86_64-linux-ghc-9.6.7
120.62 s
[pathway-compat-base] Private executables installed in:
120.62 s
[pathway-compat-base] /nix/store/immjks7z3cdng833dbs7k3bhslg3ix6w-pathway-compat-base-0.0.1.0/libexec/x86_64-linux-ghc-9.6.7/pathway-compat-base-0.0.1.0
120.62 s
[pathway-compat-base] Data files installed in:
120.62 s
[pathway-compat-base] /nix/store/immjks7z3cdng833dbs7k3bhslg3ix6w-pathway-compat-base-0.0.1.0/share/x86_64-linux-ghc-9.6.7/pathway-compat-base-0.0.1.0
120.62 s
[pathway-compat-base] Documentation installed in:
120.62 s
[pathway-compat-base] /nix/store/crzf26y06x5l6vgfsc6nkfqqwfypfild-pathway-compat-base-0.0.1.0-doc/share/doc/pathway-compat-base-0.0.1.0
120.62 s
[pathway-compat-base] Configuration files installed in:
120.62 s
[pathway-compat-base] /nix/store/immjks7z3cdng833dbs7k3bhslg3ix6w-pathway-compat-base-0.0.1.0/etc
120.62 s
[pathway-compat-base] No alex found
120.62 s
[pathway-compat-base] Using ar found on system at:
120.62 s
[pathway-compat-base] /nix/store/iz5lckcsg66r223si2gck7csk2hihj0m-binutils-wrapper-2.44/bin/ar
120.62 s
[pathway-compat-base] No c2hs found
120.62 s
[pathway-compat-base] No cpphs found
120.62 s
[pathway-compat-base] Using doctest version 0.24.2 found on system at:
120.62 s
[pathway-compat-base] /nix/store/mky1glcba5jwjn0h7fa1mldfnh39g6l9-doctest-0.24.2/bin/doctest
120.62 s
[pathway-compat-base] Using gcc version 14.3.0 given by user at:
120.62 s
[pathway-compat-base] /nix/store/8v97ngkcpfzgghwnnr7fsz33p2x22gy9-gcc-wrapper-14.3.0/bin/gcc
120.62 s
[pathway-compat-base] Using ghc version 9.6.7 found on system at:
120.62 s
[pathway-compat-base] /nix/store/da9x1n5l146q0ai9wz8zfbx4zfwa9b02-ghc-9.6.7/bin/ghc
120.62 s
[pathway-compat-base] Using ghc-pkg version 9.6.7 found on system at:
120.62 s
[pathway-compat-base] /nix/store/da9x1n5l146q0ai9wz8zfbx4zfwa9b02-ghc-9.6.7/bin/ghc-pkg-9.6.7
120.62 s
[pathway-compat-base] No ghcjs found
120.62 s
[pathway-compat-base] No ghcjs-pkg found
120.62 s
[pathway-compat-base] No greencard found
120.62 s
[pathway-compat-base] Using haddock version 2.29.2 found on system at:
120.62 s
[pathway-compat-base] /nix/store/da9x1n5l146q0ai9wz8zfbx4zfwa9b02-ghc-9.6.7/bin/haddock-ghc-9.6.7
120.62 s
[pathway-compat-base] No happy found
120.62 s
[pathway-compat-base] Using haskell-suite found on system at: haskell-suite-dummy-location
120.62 s
[pathway-compat-base] Using haskell-suite-pkg found on system at: haskell-suite-pkg-dummy-location
120.62 s
[pathway-compat-base] No hmake found
120.62 s
[pathway-compat-base] Using hpc version 0.68 found on system at:
120.62 s
[pathway-compat-base] /nix/store/da9x1n5l146q0ai9wz8zfbx4zfwa9b02-ghc-9.6.7/bin/hpc-ghc-9.6.7
120.62 s
[pathway-compat-base] Using hsc2hs version 0.68.9 found on system at:
120.62 s
[pathway-compat-base] /nix/store/da9x1n5l146q0ai9wz8zfbx4zfwa9b02-ghc-9.6.7/bin/hsc2hs-ghc-9.6.7
120.62 s
[pathway-compat-base] Using hscolour version 1.25 found on system at:
120.62 s
[pathway-compat-base] /nix/store/7ffc07q75k5a6zk864jv9gpiphhwzjlh-hscolour-1.25/bin/HsColour
120.62 s
[pathway-compat-base] No jhc found
120.62 s
[pathway-compat-base] Using ld found on system at:
120.62 s
[pathway-compat-base] /nix/store/iz5lckcsg66r223si2gck7csk2hihj0m-binutils-wrapper-2.44/bin/ld.gold
120.62 s
[pathway-compat-base] No pkg-config found
120.62 s
[pathway-compat-base] Using runghc version 9.6.7 found on system at:
120.62 s
[pathway-compat-base] /nix/store/da9x1n5l146q0ai9wz8zfbx4zfwa9b02-ghc-9.6.7/bin/runghc-9.6.7
120.62 s
[pathway-compat-base] Using strip version 2.44 found on system at:
120.62 s
[pathway-compat-base] /nix/store/8v97ngkcpfzgghwnnr7fsz33p2x22gy9-gcc-wrapper-14.3.0/bin/strip
120.62 s
[pathway-compat-base] Using tar found on system at:
120.62 s
[pathway-compat-base] /nix/store/xl6pd2spjajwcpq09fnmnjv5psqmlmma-gnutar-1.35/bin/tar
120.62 s
[pathway-compat-base] No uhc found
120.76 s
[pathway-path] Source component graph:
120.76 s
[pathway-path] component lib
120.76 s
[pathway-path] component test:doctests dependency lib
120.76 s
[pathway-path] Configured component graph:
120.76 s
[pathway-path] component pathway-path-0.0.1.0-FXSdMAln6KE9xHCyQ2GwBN
120.76 s
[pathway-path] include base-4.18.3.0
120.76 s
[pathway-path] include filepath-1.4.301.0
120.76 s
[pathway-path] include path-0.9.6-IPEvNLiimbF2Cqv7oglQ26
120.76 s
[pathway-path] include pathway-0.0.1.0-31EObXlLuVk60eWeEQLXMY
120.76 s
[pathway-path] include pathway-internal-0.0.1.0-6pVrF111eN4BAqGigGNQse
120.76 s
[pathway-path] include yaya-0.6.2.3-7sqHSSXaJnw73nWfp3Ph4M
120.76 s
[pathway-path] include yaya-unsafe-0.4.1.4-GKzirUSXpFC6HxjkuccBOw
120.77 s
[pathway-path] component pathway-path-0.0.1.0-8oJGrVbvoifIPBkHaD9MWe-doctests
120.77 s
[pathway-path] include QuickCheck-2.15.0.1-8TOXA7GkEi42wTg0ODsItP
120.77 s
[pathway-path] include base-4.18.3.0
120.77 s
[pathway-path] include doctest-0.24.2-7YxPr6lrdwiBMDK2pmizgF
120.77 s
[pathway-path] include pathway-path-0.0.1.0-FXSdMAln6KE9xHCyQ2GwBN
120.77 s
[pathway-path] include pathway-quickcheck-0.0.1.0-3oURtdbGHQOF2R72KWRQV9
120.77 s
[pathway-path] Linked component graph:
120.77 s
[pathway-path] unit pathway-path-0.0.1.0-FXSdMAln6KE9xHCyQ2GwBN
120.77 s
[pathway-path] include base-4.18.3.0
120.77 s
[pathway-path] include filepath-1.4.301.0
120.77 s
[pathway-path] include path-0.9.6-IPEvNLiimbF2Cqv7oglQ26
120.77 s
[pathway-path] include pathway-0.0.1.0-31EObXlLuVk60eWeEQLXMY
120.77 s
[pathway-path] include pathway-internal-0.0.1.0-6pVrF111eN4BAqGigGNQse
120.77 s
[pathway-path] include yaya-0.6.2.3-7sqHSSXaJnw73nWfp3Ph4M
120.77 s
[pathway-path] include yaya-unsafe-0.4.1.4-GKzirUSXpFC6HxjkuccBOw
120.77 s
[pathway-path] Data.Path.Integration.Path=pathway-path-0.0.1.0-FXSdMAln6KE9xHCyQ2GwBN:Data.Path.Integration.Path
120.77 s
[pathway-path] unit pathway-path-0.0.1.0-8oJGrVbvoifIPBkHaD9MWe-doctests
120.77 s
[pathway-path] include QuickCheck-2.15.0.1-8TOXA7GkEi42wTg0ODsItP
120.77 s
[pathway-path] include base-4.18.3.0
120.77 s
[pathway-path] include doctest-0.24.2-7YxPr6lrdwiBMDK2pmizgF
120.77 s
[pathway-path] include pathway-path-0.0.1.0-FXSdMAln6KE9xHCyQ2GwBN
120.77 s
[pathway-path] include pathway-quickcheck-0.0.1.0-3oURtdbGHQOF2R72KWRQV9
120.77 s
[pathway-path] Ready component graph:
120.77 s
[pathway-path] definite pathway-path-0.0.1.0-FXSdMAln6KE9xHCyQ2GwBN
120.77 s
[pathway-path] depends base-4.18.3.0
120.77 s
[pathway-path] depends filepath-1.4.301.0
120.77 s
[pathway-path] depends path-0.9.6-IPEvNLiimbF2Cqv7oglQ26
120.77 s
[pathway-path] depends pathway-0.0.1.0-31EObXlLuVk60eWeEQLXMY
120.77 s
[pathway-path] depends pathway-internal-0.0.1.0-6pVrF111eN4BAqGigGNQse
120.77 s
[pathway-path] depends yaya-0.6.2.3-7sqHSSXaJnw73nWfp3Ph4M
120.77 s
[pathway-path] depends yaya-unsafe-0.4.1.4-GKzirUSXpFC6HxjkuccBOw
120.77 s
[pathway-path] definite pathway-path-0.0.1.0-8oJGrVbvoifIPBkHaD9MWe-doctests
120.77 s
[pathway-path] depends QuickCheck-2.15.0.1-8TOXA7GkEi42wTg0ODsItP
120.77 s
[pathway-path] depends base-4.18.3.0
120.77 s
[pathway-path] depends doctest-0.24.2-7YxPr6lrdwiBMDK2pmizgF
120.77 s
[pathway-path] depends pathway-path-0.0.1.0-FXSdMAln6KE9xHCyQ2GwBN
120.77 s
[pathway-path] depends pathway-quickcheck-0.0.1.0-3oURtdbGHQOF2R72KWRQV9
120.77 s
[pathway-path] Using Cabal-3.10.3.0 compiled by ghc-9.6
120.77 s
[pathway-path] Using compiler: ghc-9.6.7
120.77 s
[pathway-path] Using install prefix:
120.77 s
[pathway-path] /nix/store/nsbihvs0yf5psjvh6bq3ijpi4nci61l0-pathway-path-0.0.1.0
120.77 s
[pathway-path] Executables installed in:
120.77 s
[pathway-path] /nix/store/nsbihvs0yf5psjvh6bq3ijpi4nci61l0-pathway-path-0.0.1.0/bin
120.77 s
[pathway-path] Libraries installed in:
120.77 s
[pathway-path] /nix/store/nsbihvs0yf5psjvh6bq3ijpi4nci61l0-pathway-path-0.0.1.0/lib/ghc-9.6.7/lib/x86_64-linux-ghc-9.6.7/pathway-path-0.0.1.0-FXSdMAln6KE9xHCyQ2GwBN
120.77 s
[pathway-path] Dynamic Libraries installed in:
120.77 s
[pathway-path] /nix/store/nsbihvs0yf5psjvh6bq3ijpi4nci61l0-pathway-path-0.0.1.0/lib/ghc-9.6.7/lib/x86_64-linux-ghc-9.6.7
120.77 s
[pathway-path] Private executables installed in:
120.77 s
[pathway-path] /nix/store/nsbihvs0yf5psjvh6bq3ijpi4nci61l0-pathway-path-0.0.1.0/libexec/x86_64-linux-ghc-9.6.7/pathway-path-0.0.1.0
120.77 s
[pathway-path] Data files installed in:
120.77 s
[pathway-path] /nix/store/nsbihvs0yf5psjvh6bq3ijpi4nci61l0-pathway-path-0.0.1.0/share/x86_64-linux-ghc-9.6.7/pathway-path-0.0.1.0
120.77 s
[pathway-path] Documentation installed in:
120.77 s
[pathway-path] /nix/store/dr0s8ra5qf554rdixg2rfnzngv9v8j20-pathway-path-0.0.1.0-doc/share/doc/pathway-path-0.0.1.0
120.77 s
[pathway-path] Configuration files installed in:
120.77 s
[pathway-path] /nix/store/nsbihvs0yf5psjvh6bq3ijpi4nci61l0-pathway-path-0.0.1.0/etc
120.77 s
[pathway-path] No alex found
120.77 s
[pathway-path] Using ar found on system at:
120.77 s
[pathway-path] /nix/store/iz5lckcsg66r223si2gck7csk2hihj0m-binutils-wrapper-2.44/bin/ar
120.77 s
[pathway-path] No c2hs found
120.77 s
[pathway-path] No cpphs found
120.77 s
[pathway-path] Using doctest version 0.24.2 found on system at:
120.77 s
[pathway-path] /nix/store/mky1glcba5jwjn0h7fa1mldfnh39g6l9-doctest-0.24.2/bin/doctest
120.77 s
[pathway-path] Using gcc version 14.3.0 given by user at:
120.77 s
[pathway-path] /nix/store/8v97ngkcpfzgghwnnr7fsz33p2x22gy9-gcc-wrapper-14.3.0/bin/gcc
120.77 s
[pathway-path] Using ghc version 9.6.7 found on system at:
120.77 s
[pathway-path] /nix/store/da9x1n5l146q0ai9wz8zfbx4zfwa9b02-ghc-9.6.7/bin/ghc
120.77 s
[pathway-path] Using ghc-pkg version 9.6.7 found on system at:
120.77 s
[pathway-path] /nix/store/da9x1n5l146q0ai9wz8zfbx4zfwa9b02-ghc-9.6.7/bin/ghc-pkg-9.6.7
120.77 s
[pathway-path] No ghcjs found
120.77 s
[pathway-path] No ghcjs-pkg found
120.77 s
[pathway-path] No greencard found
120.77 s
[pathway-path] Using haddock version 2.29.2 found on system at:
120.77 s
[pathway-path] /nix/store/da9x1n5l146q0ai9wz8zfbx4zfwa9b02-ghc-9.6.7/bin/haddock-ghc-9.6.7
120.77 s
[pathway-path] No happy found
120.77 s
[pathway-path] Using haskell-suite found on system at: haskell-suite-dummy-location
120.77 s
[pathway-path] Using haskell-suite-pkg found on system at: haskell-suite-pkg-dummy-location
120.77 s
[pathway-path] No hmake found
120.77 s
[pathway-path] Using hpc version 0.68 found on system at:
120.77 s
[pathway-path] /nix/store/da9x1n5l146q0ai9wz8zfbx4zfwa9b02-ghc-9.6.7/bin/hpc-ghc-9.6.7
120.77 s
[pathway-path] Using hsc2hs version 0.68.9 found on system at:
120.77 s
[pathway-path] /nix/store/da9x1n5l146q0ai9wz8zfbx4zfwa9b02-ghc-9.6.7/bin/hsc2hs-ghc-9.6.7
120.77 s
[pathway-path] Using hscolour version 1.25 found on system at:
120.77 s
[pathway-path] /nix/store/7ffc07q75k5a6zk864jv9gpiphhwzjlh-hscolour-1.25/bin/HsColour
120.77 s
[pathway-path] No jhc found
120.77 s
[pathway-path] Using ld found on system at:
120.77 s
[pathway-path] /nix/store/iz5lckcsg66r223si2gck7csk2hihj0m-binutils-wrapper-2.44/bin/ld.gold
120.77 s
[pathway-path] No pkg-config found
120.77 s
[pathway-path] Using runghc version 9.6.7 found on system at:
120.77 s
[pathway-path] /nix/store/da9x1n5l146q0ai9wz8zfbx4zfwa9b02-ghc-9.6.7/bin/runghc-9.6.7
120.77 s
[pathway-path] Using strip version 2.44 found on system at:
120.77 s
[pathway-path] /nix/store/8v97ngkcpfzgghwnnr7fsz33p2x22gy9-gcc-wrapper-14.3.0/bin/strip
120.77 s
[pathway-path] Using tar found on system at:
120.77 s
[pathway-path] /nix/store/xl6pd2spjajwcpq09fnmnjv5psqmlmma-gnutar-1.35/bin/tar
120.77 s
[pathway-path] No uhc found
120.89 s
[pathway-compat-base] Phase: buildPhase
120.96 s
[pathway-compat-base] Preprocessing library for pathway-compat-base-0.0.1.0..
120.96 s
[pathway-compat-base] Building library for pathway-compat-base-0.0.1.0..
121.09 s
[pathway-path] Phase: buildPhase
121.10 s
[pathway-compat-base] [ 1 of 15] Compiling Common ( src/Common.hs, dist/build/Common.o, dist/build/Common.dyn_o )
121.16 s
[pathway-path] Preprocessing library for pathway-path-0.0.1.0..
121.17 s
[pathway-path] Building library for pathway-path-0.0.1.0..
121.23 s
[pathway-path] [1 of 1] Compiling Data.Path.Integration.Path ( src/Data/Path/Integration/Path.hs, dist/build/Data/Path/Integration/Path.o, dist/build/Data/Path/Integration/Path.dyn_o )
121.60 s
[pathway-compat-base] [ 2 of 15] Compiling System.Environment.Thin ( src/System/Environment/Thin.hs, dist/build/System/Environment/Thin.o, dist/build/System/Environment/Thin.dyn_o )
121.62 s
[pathway-path] [1 of 1] Compiling Data.Path.Integration.Path ( src/Data/Path/Integration/Path.hs, dist/build/Data/Path/Integration/Path.p_o )
121.66 s
[pathway-compat-base] [ 3 of 15] Compiling System.Environment.Pathway ( src/System/Environment/Pathway.hs, dist/build/System/Environment/Pathway.o, dist/build/System/Environment/Pathway.dyn_o )
121.68 s
[pathway-compat-base] [ 4 of 15] Compiling System.Environment.Overlay ( src/System/Environment/Overlay.hs, dist/build/System/Environment/Overlay.o, dist/build/System/Environment/Overlay.dyn_o )
121.70 s
[pathway-compat-base] [ 5 of 15] Compiling System.Environment.DropIn ( src/System/Environment/DropIn.hs, dist/build/System/Environment/DropIn.o, dist/build/System/Environment/DropIn.dyn_o )
121.72 s
[pathway-compat-base] [ 6 of 15] Compiling System.IO.Error.Caught ( src/System/IO/Error/Caught.hs, dist/build/System/IO/Error/Caught.o, dist/build/System/IO/Error/Caught.dyn_o )
121.72 s
[pathway-compat-base] [ 7 of 15] Compiling System.IO.Error.Thin ( src/System/IO/Error/Thin.hs, dist/build/System/IO/Error/Thin.o, dist/build/System/IO/Error/Thin.dyn_o )
121.72 s
[pathway-compat-base] [ 8 of 15] Compiling System.IO.Error.Pathway ( src/System/IO/Error/Pathway.hs, dist/build/System/IO/Error/Pathway.o, dist/build/System/IO/Error/Pathway.dyn_o )
121.72 s
[pathway-compat-base] [ 9 of 15] Compiling System.IO.Error.Overlay ( src/System/IO/Error/Overlay.hs, dist/build/System/IO/Error/Overlay.o, dist/build/System/IO/Error/Overlay.dyn_o )
121.72 s
[pathway-compat-base] [10 of 15] Compiling System.IO.Error.DropIn ( src/System/IO/Error/DropIn.hs, dist/build/System/IO/Error/DropIn.o, dist/build/System/IO/Error/DropIn.dyn_o )
121.72 s
[pathway-compat-base] [11 of 15] Compiling System.IO.Thin ( src/System/IO/Thin.hs, dist/build/System/IO/Thin.o, dist/build/System/IO/Thin.dyn_o )
121.72 s
[pathway-compat-base] [12 of 15] Compiling System.IO.Overlay ( src/System/IO/Overlay.hs, dist/build/System/IO/Overlay.o, dist/build/System/IO/Overlay.dyn_o )
121.75 s
[pathway-compat-base] [13 of 15] Compiling System.IO.DropIn ( src/System/IO/DropIn.hs, dist/build/System/IO/DropIn.o, dist/build/System/IO/DropIn.dyn_o )
121.77 s
[pathway-compat-base] [14 of 15] Compiling System.IO.Caught ( src/System/IO/Caught.hs, dist/build/System/IO/Caught.o, dist/build/System/IO/Caught.dyn_o )
121.77 s
[pathway-compat-base] [15 of 15] Compiling System.IO.Pathway ( src/System/IO/Pathway.hs, dist/build/System/IO/Pathway.o, dist/build/System/IO/Pathway.dyn_o )
122.05 s
[pathway-compat-base] [ 1 of 15] Compiling Common ( src/Common.hs, dist/build/Common.p_o )
122.57 s
[pathway-compat-base] [ 2 of 15] Compiling System.Environment.Thin ( src/System/Environment/Thin.hs, dist/build/System/Environment/Thin.p_o )
122.72 s
[pathway-compat-base] [ 3 of 15] Compiling System.Environment.Pathway ( src/System/Environment/Pathway.hs, dist/build/System/Environment/Pathway.p_o )
122.84 s
[pathway-compat-base] [ 4 of 15] Compiling System.Environment.Overlay ( src/System/Environment/Overlay.hs, dist/build/System/Environment/Overlay.p_o )
122.87 s
[pathway-compat-base] [ 5 of 15] Compiling System.Environment.DropIn ( src/System/Environment/DropIn.hs, dist/build/System/Environment/DropIn.p_o )
123.00 s
[pathway-compat-base] [ 6 of 15] Compiling System.IO.Error.Caught ( src/System/IO/Error/Caught.hs, dist/build/System/IO/Error/Caught.p_o )
123.00 s
[pathway-compat-base] [ 7 of 15] Compiling System.IO.Error.Thin ( src/System/IO/Error/Thin.hs, dist/build/System/IO/Error/Thin.p_o )
123.00 s
[pathway-compat-base] [ 8 of 15] Compiling System.IO.Error.Pathway ( src/System/IO/Error/Pathway.hs, dist/build/System/IO/Error/Pathway.p_o )
123.00 s
[pathway-compat-base] [ 9 of 15] Compiling System.IO.Error.Overlay ( src/System/IO/Error/Overlay.hs, dist/build/System/IO/Error/Overlay.p_o )
123.00 s
[pathway-compat-base] [10 of 15] Compiling System.IO.Error.DropIn ( src/System/IO/Error/DropIn.hs, dist/build/System/IO/Error/DropIn.p_o )
123.00 s
[pathway-compat-base] [11 of 15] Compiling System.IO.Thin ( src/System/IO/Thin.hs, dist/build/System/IO/Thin.p_o )
123.00 s
[pathway-compat-base] [12 of 15] Compiling System.IO.Overlay ( src/System/IO/Overlay.hs, dist/build/System/IO/Overlay.p_o )
123.00 s
[pathway-compat-base] [13 of 15] Compiling System.IO.DropIn ( src/System/IO/DropIn.hs, dist/build/System/IO/DropIn.p_o )
123.11 s
[pathway-compat-base] [14 of 15] Compiling System.IO.Caught ( src/System/IO/Caught.hs, dist/build/System/IO/Caught.p_o )
123.11 s
[pathway-compat-base] [15 of 15] Compiling System.IO.Pathway ( src/System/IO/Pathway.hs, dist/build/System/IO/Pathway.p_o )
123.69 s
[pathway-path] Preprocessing test suite 'doctests' for pathway-path-0.0.1.0..
123.69 s
[pathway-path] Building test suite 'doctests' for pathway-path-0.0.1.0..
123.77 s
[pathway-path] [1 of 2] Compiling Build_doctests ( dist/build/doctests/autogen/Build_doctests.hs, dist/build/doctests/doctests-tmp/Build_doctests.o )
124.00 s
[pathway-path] [2 of 2] Compiling Main ( tests/doctests.hs, dist/build/doctests/doctests-tmp/Main.o )
124.31 s
[pathway-path] [3 of 3] Linking dist/build/doctests/doctests
124.90 s
[pathway-compat-base] Preprocessing test suite 'doctests' for pathway-compat-base-0.0.1.0..
124.90 s
[pathway-compat-base] Building test suite 'doctests' for pathway-compat-base-0.0.1.0..
124.98 s
[pathway-compat-base] [1 of 2] Compiling Build_doctests ( dist/build/doctests/autogen/Build_doctests.hs, dist/build/doctests/doctests-tmp/Build_doctests.o )
125.23 s
[pathway-compat-base] [2 of 2] Compiling Main ( tests/doctests.hs, dist/build/doctests/doctests-tmp/Main.o )
125.52 s
[pathway-compat-base] [3 of 3] Linking dist/build/doctests/doctests
128.06 s
[pathway-path] Phase: checkPhase
128.12 s
[pathway-path] Running 1 test suites...
128.12 s
[pathway-path] Test suite doctests: RUNNING...
128.70 s
[pathway-path] Examples: 0 Tried: 0 Errors: 0 Failures: 0
128.75 s
[pathway-path] Test suite doctests: PASS
128.75 s
[pathway-path] Test suite logged to: dist/test/pathway-path-0.0.1.0-doctests.log
128.75 s
[pathway-path] 1 of 1 test suites (1 of 1 test cases) passed.
128.77 s
[pathway-path] Phase: haddockPhase
128.92 s
[pathway-path] Preprocessing library for pathway-path-0.0.1.0..
128.92 s
[pathway-path] Running Haddock on library for pathway-path-0.0.1.0..
128.93 s
[pathway-path] Warning: The documentation for the following packages are not installed. No
128.93 s
[pathway-path] links will be generated to these packages: path-0.9.6, path-0.9.6,
128.93 s
[pathway-path] vector-0.13.2.0
129.00 s
[pathway-path] Warning: --source-* options are ignored when --hyperlinked-source is enabled.
129.27 s
[pathway-compat-base] Phase: checkPhase
129.32 s
[pathway-compat-base] Running 1 test suites...
129.32 s
[pathway-compat-base] Test suite doctests: RUNNING...
129.41 s
[pathway-path] Warning: 'AmbiguousPath' is out of scope.
129.41 s
[pathway-path] If you qualify the identifier, haddock can try to link it anyway.
129.41 s
[pathway-path] 100% ( 1 / 1) in 'Data.Path.Integration.Path'
129.43 s
[pathway-path] Warning: Data.Path.Integration.Path: could not find link destinations for:
129.43 s
[pathway-path] - Path.Internal.Posix.Path
129.43 s
[pathway-path] - Path.Posix.Abs
129.43 s
[pathway-path] - Path.Posix.Dir
129.43 s
[pathway-path] - Path.Posix.File
129.43 s
[pathway-path] - Path.Posix.Rel
129.43 s
[pathway-path] - Path.Posix.SomeBase
129.70 s
[pathway-compat-base]
129.70 s
[pathway-compat-base] on the commandline: warning:
129.70 s
[pathway-compat-base] -XTemplateHaskell is not allowed in Safe Haskell; ignoring -XTemplateHaskell
129.70 s
[pathway-compat-base]
129.70 s
[pathway-compat-base] on the commandline: warning:
129.70 s
[pathway-compat-base] -XTemplateHaskell is not allowed in Safe Haskell; ignoring -XTemplateHaskell
129.70 s
[pathway-compat-base]
129.70 s
[pathway-compat-base] on the commandline: warning:
129.70 s
[pathway-compat-base] -XTemplateHaskell is not allowed in Safe Haskell; ignoring -XTemplateHaskell
129.70 s
[pathway-compat-base]
129.70 s
[pathway-compat-base] on the commandline: warning:
129.70 s
[pathway-compat-base] -XTemplateHaskell is not allowed in Safe Haskell; ignoring -XTemplateHaskell
129.72 s
[pathway-compat-base]
129.72 s
[pathway-compat-base] on the commandline: warning:
129.72 s
[pathway-compat-base] -XTemplateHaskell is not allowed in Safe Haskell; ignoring -XTemplateHaskell
129.72 s
[pathway-compat-base]
129.72 s
[pathway-compat-base] on the commandline: warning:
129.72 s
[pathway-compat-base] -XTemplateHaskell is not allowed in Safe Haskell; ignoring -XTemplateHaskell
129.73 s
[pathway-compat-base]
129.73 s
[pathway-compat-base] on the commandline: warning:
129.73 s
[pathway-compat-base] -XTemplateHaskell is not allowed in Safe Haskell; ignoring -XTemplateHaskell
129.73 s
[pathway-compat-base]
129.73 s
[pathway-compat-base] on the commandline: warning:
129.73 s
[pathway-compat-base] -XTemplateHaskell is not allowed in Safe Haskell; ignoring -XTemplateHaskell
129.73 s
[pathway-compat-base]
129.73 s
[pathway-compat-base] on the commandline: warning:
129.73 s
[pathway-compat-base] -XTemplateHaskell is not allowed in Safe Haskell; ignoring -XTemplateHaskell
129.73 s
[pathway-compat-base]
129.73 s
[pathway-compat-base] on the commandline: warning:
129.73 s
[pathway-compat-base] -XTemplateHaskell is not allowed in Safe Haskell; ignoring -XTemplateHaskell
129.73 s
[pathway-compat-base]
129.73 s
[pathway-compat-base] on the commandline: warning:
129.73 s
[pathway-compat-base] -XTemplateHaskell is not allowed in Safe Haskell; ignoring -XTemplateHaskell
129.73 s
[pathway-compat-base]
129.73 s
[pathway-compat-base] on the commandline: warning:
129.73 s
[pathway-compat-base] -XTemplateHaskell is not allowed in Safe Haskell; ignoring -XTemplateHaskell
129.73 s
[pathway-compat-base]
129.73 s
[pathway-compat-base] on the commandline: warning:
129.73 s
[pathway-compat-base] -XTemplateHaskell is not allowed in Safe Haskell; ignoring -XTemplateHaskell
129.73 s
[pathway-compat-base]
129.73 s
[pathway-compat-base] on the commandline: warning:
129.73 s
[pathway-compat-base] -XTemplateHaskell is not allowed in Safe Haskell; ignoring -XTemplateHaskell
129.75 s
[pathway-compat-base]
129.75 s
[pathway-compat-base] on the commandline: warning:
129.75 s
[pathway-compat-base] -XTemplateHaskell is not allowed in Safe Haskell; ignoring -XTemplateHaskell
129.75 s
[pathway-compat-base]
129.75 s
[pathway-compat-base] on the commandline: warning:
129.75 s
[pathway-compat-base] -XTemplateHaskell is not allowed in Safe Haskell; ignoring -XTemplateHaskell
129.75 s
[pathway-compat-base]
129.75 s
[pathway-compat-base] on the commandline: warning:
129.75 s
[pathway-compat-base] -XTemplateHaskell is not allowed in Safe Haskell; ignoring -XTemplateHaskell
129.75 s
[pathway-compat-base]
129.75 s
[pathway-compat-base] on the commandline: warning:
129.75 s
[pathway-compat-base] -XTemplateHaskell is not allowed in Safe Haskell; ignoring -XTemplateHaskell
129.75 s
[pathway-compat-base]
129.75 s
[pathway-compat-base] on the commandline: warning:
129.75 s
[pathway-compat-base] -XTemplateHaskell is not allowed in Safe Haskell; ignoring -XTemplateHaskell
129.75 s
[pathway-compat-base]
129.75 s
[pathway-compat-base] on the commandline: warning:
129.75 s
[pathway-compat-base] -XTemplateHaskell is not allowed in Safe Haskell; ignoring -XTemplateHaskell
129.75 s
[pathway-compat-base]
129.75 s
[pathway-compat-base] on the commandline: warning:
129.75 s
[pathway-compat-base] -XTemplateHaskell is not allowed in Safe Haskell; ignoring -XTemplateHaskell
129.75 s
[pathway-compat-base]
129.75 s
[pathway-compat-base] on the commandline: warning:
129.75 s
[pathway-compat-base] -XTemplateHaskell is not allowed in Safe Haskell; ignoring -XTemplateHaskell
129.75 s
[pathway-compat-base]
129.75 s
[pathway-compat-base] on the commandline: warning:
129.75 s
[pathway-compat-base] -XTemplateHaskell is not allowed in Safe Haskell; ignoring -XTemplateHaskell
130.27 s
[pathway-compat-base] Examples: 0 Tried: 0 Errors: 0 Failures: 0
130.34 s
[pathway-compat-base] Test suite doctests: PASS
130.34 s
[pathway-compat-base] Test suite logged to: dist/test/pathway-compat-base-0.0.1.0-doctests.log
130.34 s
[pathway-compat-base] 1 of 1 test suites (1 of 1 test cases) passed.
130.35 s
[pathway-compat-base] Phase: haddockPhase
130.50 s
[pathway-compat-base] Preprocessing library for pathway-compat-base-0.0.1.0..
130.50 s
[pathway-compat-base] Running Haddock on library for pathway-compat-base-0.0.1.0..
130.50 s
[pathway-compat-base] Warning: The documentation for the following packages are not installed. No
130.50 s
[pathway-compat-base] links will be generated to these packages: vector-0.13.2.0
130.56 s
[pathway-compat-base] Warning: --source-* options are ignored when --hyperlinked-source is enabled.
131.13 s
[pathway-compat-base] Warning: '</?>' is out of scope.
131.13 s
[pathway-compat-base] If you qualify the identifier, haddock can try to link it anyway.
131.13 s
[pathway-compat-base] Warning: '<$>' is out of scope.
131.13 s
[pathway-compat-base] If you qualify the identifier, haddock can try to link it anyway.
131.13 s
[pathway-compat-base] Warning: 'getCurrentDirectory' is out of scope.
131.13 s
[pathway-compat-base] If you qualify the identifier, haddock can try to link it anyway.
131.13 s
[pathway-compat-base] Warning: 'makeRelativeToCurrentDirectory' is out of scope.
131.13 s
[pathway-compat-base] If you qualify the identifier, haddock can try to link it anyway.
131.13 s
[pathway-compat-base] Warning: 'IOError' is out of scope.
131.13 s
[pathway-compat-base] If you qualify the identifier, haddock can try to link it anyway.
131.13 s
[pathway-compat-base] 14% ( 1 / 7) in 'Common'
131.13 s
[pathway-compat-base] Missing documentation for:
131.13 s
[pathway-compat-base] InternalFailure (src/Common.hs:69)
131.13 s
[pathway-compat-base] toPathRep (src/Common.hs:84)
131.13 s
[pathway-compat-base] fromPathRep (src/Common.hs:87)
131.14 s
[pathway-compat-base] handleAnchoredPath (src/Common.hs:93)
131.14 s
[pathway-compat-base] absFileFromPathRep (src/Common.hs:100)
131.14 s
[pathway-compat-base] fileFromPathRep (src/Common.hs:114)
131.15 s
[pathway-compat-base] Warning: '</?>' is out of scope.
131.15 s
[pathway-compat-base] If you qualify the identifier, haddock can try to link it anyway.
131.15 s
[pathway-compat-base] Warning: 'getCurrentDirectory' is out of scope.
131.15 s
[pathway-compat-base] If you qualify the identifier, haddock can try to link it anyway.
131.15 s
[pathway-compat-base] Warning: 'makeRelativeToCurrentDirectory' is out of scope.
131.15 s
[pathway-compat-base] If you qualify the identifier, haddock can try to link it anyway.
131.15 s
[pathway-compat-base] Warning: 'IOError' is out of scope.
131.15 s
[pathway-compat-base] If you qualify the identifier, haddock can try to link it anyway.
131.15 s
[pathway-compat-base] Warning: 'Anchored' is out of scope.
131.15 s
[pathway-compat-base] If you qualify the identifier, haddock can try to link it anyway.
131.15 s
[pathway-compat-base] 33% ( 1 / 3) in 'System.Environment.Thin'
131.15 s
[pathway-compat-base] Missing documentation for:
131.15 s
[pathway-compat-base] executablePath (src/System/Environment/Thin.hs:52)
131.15 s
[pathway-compat-base] getExecutablePath (src/System/Environment/Thin.hs:61)
131.16 s
[pathway-compat-base] 100% ( 11 / 11) in 'System.Environment.Pathway'
131.16 s
[pathway-compat-base] Warning: '</?>' is out of scope.
131.16 s
[pathway-compat-base] If you qualify the identifier, haddock can try to link it anyway.
131.16 s
[pathway-compat-base] Warning: 'getCurrentDirectory' is out of scope.
131.16 s
[pathway-compat-base] If you qualify the identifier, haddock can try to link it anyway.
131.16 s
[pathway-compat-base] Warning: 'makeRelativeToCurrentDirectory' is out of scope.
131.16 s
[pathway-compat-base] If you qualify the identifier, haddock can try to link it anyway.
131.16 s
[pathway-compat-base] Warning: 'IOError' is out of scope.
131.16 s
[pathway-compat-base] If you qualify the identifier, haddock can try to link it anyway.
131.16 s
[pathway-compat-base] 33% ( 1 / 3) in 'System.Environment.Overlay'
131.16 s
[pathway-compat-base] Missing documentation for:
131.16 s
[pathway-compat-base] executablePath (src/System/Environment/Overlay.hs:50)
131.16 s
[pathway-compat-base] getExecutablePath (src/System/Environment/Overlay.hs:54)
131.17 s
[pathway-compat-base] 100% ( 11 / 11) in 'System.Environment.DropIn'
131.18 s
[pathway-compat-base] 90% ( 10 / 11) in 'System.IO.Error.Caught'
131.18 s
[pathway-compat-base] Missing documentation for:
131.18 s
[pathway-compat-base] AlreadyInUseError (src/System/IO/Error/Caught.hs:103)
131.19 s
[pathway-compat-base] 0% ( 0 / 5) in 'System.IO.Error.Thin'
131.19 s
[pathway-compat-base] Missing documentation for:
131.19 s
[pathway-compat-base] Module header
131.19 s
[pathway-compat-base] mkIOError (src/System/IO/Error/Thin.hs:23)
131.19 s
[pathway-compat-base] annotateIOError (src/System/IO/Error/Thin.hs:31)
131.19 s
[pathway-compat-base] ioeGetFileName (src/System/IO/Error/Thin.hs:35)
131.19 s
[pathway-compat-base] ioeSetFileName (src/System/IO/Error/Thin.hs:41)
131.20 s
[pathway-compat-base] 82% ( 37 / 45) in 'System.IO.Error.Pathway'
131.20 s
[pathway-compat-base] Missing documentation for:
131.20 s
[pathway-compat-base] ioeGetErrorType
131.20 s
[pathway-compat-base] ioeGetErrorString
131.20 s
[pathway-compat-base] ioeGetLocation
131.20 s
[pathway-compat-base] ioeGetHandle
131.20 s
[pathway-compat-base] ioeSetErrorType
131.20 s
[pathway-compat-base] ioeSetErrorString
131.20 s
[pathway-compat-base] ioeSetLocation
131.20 s
[pathway-compat-base] ioeSetHandle
131.20 s
[pathway-compat-base] 0% ( 0 / 2) in 'System.IO.Error.Overlay'
131.20 s
[pathway-compat-base] Missing documentation for:
131.20 s
[pathway-compat-base] Module header
131.20 s
[pathway-compat-base] ioeGetFileName (src/System/IO/Error/Overlay.hs:20)
131.20 s
[pathway-compat-base] 76% ( 36 / 47) in 'System.IO.Error.DropIn'
131.20 s
[pathway-compat-base] Missing documentation for:
131.20 s
[pathway-compat-base] ioeGetErrorType
131.20 s
[pathway-compat-base] ioeGetErrorString
131.20 s
[pathway-compat-base] ioeGetLocation
131.20 s
[pathway-compat-base] ioeGetHandle
131.20 s
[pathway-compat-base] ioeSetErrorType
131.20 s
[pathway-compat-base] ioeSetErrorString
131.20 s
[pathway-compat-base] ioeSetLocation
131.20 s
[pathway-compat-base] ioeSetHandle
131.20 s
[pathway-compat-base] mkIOError (src/System/IO/Error/Thin.hs:23)
131.20 s
[pathway-compat-base] ioeSetFileName (src/System/IO/Error/Thin.hs:41)
131.20 s
[pathway-compat-base] annotateIOError (src/System/IO/Error/Thin.hs:31)
131.22 s
[pathway-compat-base] 0% ( 0 / 13) in 'System.IO.Thin'
131.22 s
[pathway-compat-base] Missing documentation for:
131.22 s
[pathway-compat-base] Module header
131.22 s
[pathway-compat-base] withFile (src/System/IO/Thin.hs:31)
131.22 s
[pathway-compat-base] openFile (src/System/IO/Thin.hs:34)
131.22 s
[pathway-compat-base] readFile (src/System/IO/Thin.hs:37)
131.22 s
[pathway-compat-base] readFile' (src/System/IO/Thin.hs:40)
131.22 s
[pathway-compat-base] writeFile (src/System/IO/Thin.hs:43)
131.22 s
[pathway-compat-base] appendFile (src/System/IO/Thin.hs:46)
131.22 s
[pathway-compat-base] withBinaryFile (src/System/IO/Thin.hs:49)
131.22 s
[pathway-compat-base] openBinaryFile (src/System/IO/Thin.hs:52)
131.22 s
[pathway-compat-base] openTempFile (src/System/IO/Thin.hs:55)
131.22 s
[pathway-compat-base] openBinaryTempFile (src/System/IO/Thin.hs:69)
131.22 s
[pathway-compat-base] openTempFileWithDefaultPermissions (src/System/IO/Thin.hs:84)
131.22 s
[pathway-compat-base] openBinaryTempFileWithDefaultPermissions (src/System/IO/Thin.hs:93)
131.22 s
[pathway-compat-base] 0% ( 0 / 5) in 'System.IO.Overlay'
131.22 s
[pathway-compat-base] Missing documentation for:
131.22 s
[pathway-compat-base] Module header
131.22 s
[pathway-compat-base] openTempFile (src/System/IO/Overlay.hs:22)
131.22 s
[pathway-compat-base] openBinaryTempFile (src/System/IO/Overlay.hs:26)
131.22 s
[pathway-compat-base] openTempFileWithDefaultPermissions (src/System/IO/Overlay.hs:32)
131.22 s
[pathway-compat-base] openBinaryTempFileWithDefaultPermissions (src/System/IO/Overlay.hs:37)
131.23 s
[pathway-compat-base] 80% ( 73 / 91) in 'System.IO.DropIn'
131.23 s
[pathway-compat-base] Missing documentation for:
131.23 s
[pathway-compat-base] HandlePosn
131.23 s
[pathway-compat-base] stdout
131.23 s
[pathway-compat-base] stdin
131.23 s
[pathway-compat-base] stderr
131.23 s
[pathway-compat-base] hPutBufNonBlocking
131.23 s
[pathway-compat-base] hIsOpen
131.23 s
[pathway-compat-base] hIsClosed
131.23 s
[pathway-compat-base] hIsReadable
131.23 s
[pathway-compat-base] hIsWritable
131.23 s
[pathway-compat-base] hIsSeekable
131.23 s
[pathway-compat-base] openFile (src/System/IO/Thin.hs:34)
131.23 s
[pathway-compat-base] readFile' (src/System/IO/Thin.hs:40)
131.23 s
[pathway-compat-base] writeFile (src/System/IO/Thin.hs:43)
131.23 s
[pathway-compat-base] withFile (src/System/IO/Thin.hs:31)
131.23 s
[pathway-compat-base] openBinaryFile (src/System/IO/Thin.hs:52)
131.23 s
[pathway-compat-base] withBinaryFile (src/System/IO/Thin.hs:49)
131.23 s
[pathway-compat-base] readFile (src/System/IO/Thin.hs:37)
131.23 s
[pathway-compat-base] appendFile (src/System/IO/Thin.hs:46)
131.25 s
[pathway-compat-base] 20% ( 1 / 5) in 'System.IO.Caught'
131.25 s
[pathway-compat-base] Missing documentation for:
131.25 s
[pathway-compat-base] Module header
131.25 s
[pathway-compat-base] OpenFileFailure (src/System/IO/Caught.hs:38)
131.25 s
[pathway-compat-base] openFile (src/System/IO/Caught.hs:48)
131.25 s
[pathway-compat-base] recoverOpenFileFailure (src/System/IO/Caught.hs:40)
131.26 s
[pathway-compat-base] 77% ( 73 / 94) in 'System.IO.Pathway'
131.26 s
[pathway-compat-base] Missing documentation for:
131.26 s
[pathway-compat-base] HandlePosn
131.26 s
[pathway-compat-base] stdout
131.26 s
[pathway-compat-base] stdin
131.26 s
[pathway-compat-base] stderr
131.26 s
[pathway-compat-base] hPutBufNonBlocking
131.26 s
[pathway-compat-base] hIsOpen
131.26 s
[pathway-compat-base] hIsClosed
131.26 s
[pathway-compat-base] hIsReadable
131.26 s
[pathway-compat-base] hIsWritable
131.26 s
[pathway-compat-base] hIsSeekable
131.26 s
[pathway-compat-base] readFile' (src/System/IO/Thin.hs:40)
131.26 s
[pathway-compat-base] writeFile (src/System/IO/Thin.hs:43)
131.26 s
[pathway-compat-base] withFile (src/System/IO/Thin.hs:31)
131.26 s
[pathway-compat-base] openBinaryFile (src/System/IO/Thin.hs:52)
131.26 s
[pathway-compat-base] withBinaryFile (src/System/IO/Thin.hs:49)
131.26 s
[pathway-compat-base] readFile (src/System/IO/Thin.hs:37)
131.26 s
[pathway-compat-base] appendFile (src/System/IO/Thin.hs:46)
131.26 s
[pathway-compat-base] openTempFile (src/System/IO/Thin.hs:55)
131.26 s
[pathway-compat-base] openBinaryTempFile (src/System/IO/Thin.hs:69)
131.26 s
[pathway-compat-base] openTempFileWithDefaultPermissions (src/System/IO/Thin.hs:84)
131.26 s
[pathway-compat-base] openBinaryTempFileWithDefaultPermissions (src/System/IO/Thin.hs:93)
133.45 s
[pathway-path] Documentation created: dist/doc/html/pathway-path/,
133.45 s
[pathway-path] dist/doc/html/pathway-path/pathway-path.txt
133.50 s
[pathway-path] Preprocessing test suite 'doctests' for pathway-path-0.0.1.0..
133.56 s
[pathway-path] Phase: installPhase
133.61 s
[pathway-path] Installing library in /nix/store/nsbihvs0yf5psjvh6bq3ijpi4nci61l0-pathway-path-0.0.1.0/lib/ghc-9.6.7/lib/x86_64-linux-ghc-9.6.7/pathway-path-0.0.1.0-FXSdMAln6KE9xHCyQ2GwBN
133.81 s
[pathway-path] Phase: fixupPhase
133.82 s
[pathway-path] shrinking RPATHs of ELF executables and libraries in /nix/store/nsbihvs0yf5psjvh6bq3ijpi4nci61l0-pathway-path-0.0.1.0
133.83 s
[pathway-path] shrinking /nix/store/nsbihvs0yf5psjvh6bq3ijpi4nci61l0-pathway-path-0.0.1.0/lib/ghc-9.6.7/lib/x86_64-linux-ghc-9.6.7/libHSpathway-path-0.0.1.0-FXSdMAln6KE9xHCyQ2GwBN-ghc9.6.7.so
133.85 s
[pathway-path] checking for references to /build/ in /nix/store/nsbihvs0yf5psjvh6bq3ijpi4nci61l0-pathway-path-0.0.1.0...
133.87 s
[pathway-path] patching script interpreter paths in /nix/store/nsbihvs0yf5psjvh6bq3ijpi4nci61l0-pathway-path-0.0.1.0
133.87 s
[pathway-path] stripping (with command strip and flags -S -p) in /nix/store/nsbihvs0yf5psjvh6bq3ijpi4nci61l0-pathway-path-0.0.1.0/lib
133.90 s
[pathway-path] shrinking RPATHs of ELF executables and libraries in /nix/store/dr0s8ra5qf554rdixg2rfnzngv9v8j20-pathway-path-0.0.1.0-doc
133.90 s
[pathway-path] checking for references to /build/ in /nix/store/dr0s8ra5qf554rdixg2rfnzngv9v8j20-pathway-path-0.0.1.0-doc...
133.91 s
[pathway-path] patching script interpreter paths in /nix/store/dr0s8ra5qf554rdixg2rfnzngv9v8j20-pathway-path-0.0.1.0-doc
134.01 s
[pathway-path:post-build] Uploading to cachix cache "sellout": /nix/store/dr0s8ra5qf554rdixg2rfnzngv9v8j20-pathway-path-0.0.1.0-doc /nix/store/nsbihvs0yf5psjvh6bq3ijpi4nci61l0-pathway-path-0.0.1.0
136.46 s
[pathway-path:post-build] Pushing 4 paths (211 are already present) using zstd to cache sellout ⏳
136.46 s
[pathway-path:post-build]
136.98 s
[pathway-path:post-build] Pushing /nix/store/8v97ngkcpfzgghwnnr7fsz33p2x22gy9-gcc-wrapper-14.3.0 (68.02 KiB)
136.98 s
[pathway-path:post-build] Pushing /nix/store/dr0s8ra5qf554rdixg2rfnzngv9v8j20-pathway-path-0.0.1.0-doc (263.38 KiB)
137.03 s
[pathway-path:post-build] Pushing /nix/store/6s5jp0cchd4jjq474xkfymj18l6i5x95-glibc-2.40-224-bin (2.72 MiB)
137.12 s
[pathway-path:post-build] Pushing /nix/store/nsbihvs0yf5psjvh6bq3ijpi4nci61l0-pathway-path-0.0.1.0 (217.41 KiB)
138.14 s
[pathway-path:post-build]
138.14 s
[pathway-path:post-build] All done.
138.16 s
[pathway-path:post-build] Uploading to the NixCI cache: /nix/store/dr0s8ra5qf554rdixg2rfnzngv9v8j20-pathway-path-0.0.1.0-doc /nix/store/nsbihvs0yf5psjvh6bq3ijpi4nci61l0-pathway-path-0.0.1.0
138.20 s
[pathway-path:post-build] warning: 'warn-short-path-literals' is deprecated, use 'lint-short-path-literals = ignore' instead
138.22 s
[pathway-path:post-build] copying 2 paths...
138.22 s
[pathway-path:post-build] copying path '/nix/store/dr0s8ra5qf554rdixg2rfnzngv9v8j20-pathway-path-0.0.1.0-doc' to 'https://cache.nix-ci.com'...
138.45 s
[pathway-path:post-build] copying path '/nix/store/nsbihvs0yf5psjvh6bq3ijpi4nci61l0-pathway-path-0.0.1.0' to 'https://cache.nix-ci.com'...
138.73 s
[pathway-path:post-build] warning: 'warn-short-path-literals' is deprecated, use 'lint-short-path-literals = ignore' instead
138.99 s
[pathway-path:post-build] copying 12 paths...
139.01 s
[pathway-path:post-build] copying path '/nix/store/0qr2jsicgc7rbfi8l9x043szzwskw8gc-semialign-1.3.1.drv' to 'https://cache.nix-ci.com'...
139.01 s
[pathway-path:post-build] copying path '/nix/store/jkh4j7sg4yyq1qlz3laxyh440hx1rmpi-witherable-0.5.drv' to 'https://cache.nix-ci.com'...
139.01 s
[pathway-path:post-build] copying path '/nix/store/7h6vb7z72k6dxrphyrzfwrl5c7nb57za-generically-0.1.1.drv' to 'https://cache.nix-ci.com'...
139.01 s
[pathway-path:post-build] copying path '/nix/store/x5s7n8x9mn1x5vjpjfc9ncriqjwv4hn5-character-ps-0.1.drv' to 'https://cache.nix-ci.com'...
139.01 s
[pathway-path:post-build] copying path '/nix/store/pa27hyz63bx77j8ag6z0y29yiv59jmq9-th-compat-0.1.6.drv' to 'https://cache.nix-ci.com'...
139.01 s
[pathway-path:post-build] copying path '/nix/store/jy7ivbw6clpp380n7r0khiy4w03qrxdx-dlist-1.0.drv' to 'https://cache.nix-ci.com'...
139.01 s
[pathway-path:post-build] copying path '/nix/store/ygnvnjbwbdifawivkk91iq632hxz3n1b-integer-conversion-0.1.1.drv' to 'https://cache.nix-ci.com'...
139.16 s
[pathway-path:post-build] copying path '/nix/store/y5idy5nmgk14w8h13pxvvkmkyali9b5c-text-iso8601-0.1.1.drv' to 'https://cache.nix-ci.com'...
139.17 s
[pathway-path:post-build] copying path '/nix/store/z87prj4za2i738f8nwcsm4c9di20k88l-network-uri-2.6.4.2.drv' to 'https://cache.nix-ci.com'...
139.31 s
[pathway-path:post-build] copying path '/nix/store/ij3c7ac3gfbifr7s3n9kd3b0p8b6blwq-aeson-2.2.3.0.drv' to 'https://cache.nix-ci.com'...
139.44 s
[pathway-path:post-build] copying path '/nix/store/fagnddh7jg7d9mbzd67xfcpnir8vrs0w-path-0.9.6.drv' to 'https://cache.nix-ci.com'...
139.59 s
[pathway-path:post-build] copying path '/nix/store/n51abigzrdcxmvhv96syrh1llssp1psp-pathway-path-0.0.1.0.drv' to 'https://cache.nix-ci.com'...
139.76 s
Uploaded pathway-path in 5.7s
139.76 s
Progress: 4 of 20 built (1 building), 184 of 184 downloaded from cache
139.76 s
Built pathway-path in 21.4s
139.76 s
[pathway-compat-base] Documentation created: dist/doc/html/pathway-compat-base/,
139.76 s
[pathway-compat-base] dist/doc/html/pathway-compat-base/pathway-compat-base.txt
139.76 s
[pathway-compat-base] Preprocessing test suite 'doctests' for pathway-compat-base-0.0.1.0..
139.76 s
[pathway-compat-base] Phase: installPhase
139.76 s
[pathway-compat-base] Installing library in /nix/store/immjks7z3cdng833dbs7k3bhslg3ix6w-pathway-compat-base-0.0.1.0/lib/ghc-9.6.7/lib/x86_64-linux-ghc-9.6.7/pathway-compat-base-0.0.1.0-BRBmFEfWQlkJP9xCDIxb6w
139.76 s
[pathway-compat-base] Phase: fixupPhase
139.76 s
[pathway-compat-base] shrinking RPATHs of ELF executables and libraries in /nix/store/immjks7z3cdng833dbs7k3bhslg3ix6w-pathway-compat-base-0.0.1.0
139.76 s
[pathway-compat-base] shrinking /nix/store/immjks7z3cdng833dbs7k3bhslg3ix6w-pathway-compat-base-0.0.1.0/lib/ghc-9.6.7/lib/x86_64-linux-ghc-9.6.7/libHSpathway-compat-base-0.0.1.0-BRBmFEfWQlkJP9xCDIxb6w-ghc9.6.7.so
139.76 s
[pathway-compat-base] checking for references to /build/ in /nix/store/immjks7z3cdng833dbs7k3bhslg3ix6w-pathway-compat-base-0.0.1.0...
139.76 s
[pathway-compat-base] patching script interpreter paths in /nix/store/immjks7z3cdng833dbs7k3bhslg3ix6w-pathway-compat-base-0.0.1.0
139.76 s
[pathway-compat-base] stripping (with command strip and flags -S -p) in /nix/store/immjks7z3cdng833dbs7k3bhslg3ix6w-pathway-compat-base-0.0.1.0/lib
139.76 s
[pathway-compat-base] shrinking RPATHs of ELF executables and libraries in /nix/store/crzf26y06x5l6vgfsc6nkfqqwfypfild-pathway-compat-base-0.0.1.0-doc
139.76 s
[pathway-compat-base] checking for references to /build/ in /nix/store/crzf26y06x5l6vgfsc6nkfqqwfypfild-pathway-compat-base-0.0.1.0-doc...
139.76 s
[pathway-compat-base] patching script interpreter paths in /nix/store/crzf26y06x5l6vgfsc6nkfqqwfypfild-pathway-compat-base-0.0.1.0-doc
139.84 s
[pathway-compat-base:post-build] Uploading to cachix cache "sellout": /nix/store/crzf26y06x5l6vgfsc6nkfqqwfypfild-pathway-compat-base-0.0.1.0-doc /nix/store/immjks7z3cdng833dbs7k3bhslg3ix6w-pathway-compat-base-0.0.1.0
140.28 s
[pathway-compat-base:post-build] Pushing 2 paths (190 are already present) using zstd to cache sellout ⏳
140.28 s
[pathway-compat-base:post-build]
140.75 s
[pathway-compat-base:post-build] Pushing /nix/store/crzf26y06x5l6vgfsc6nkfqqwfypfild-pathway-compat-base-0.0.1.0-doc (1.85 MiB)
140.83 s
[pathway-compat-base:post-build] Pushing /nix/store/immjks7z3cdng833dbs7k3bhslg3ix6w-pathway-compat-base-0.0.1.0 (1.99 MiB)
142.20 s
[pathway-compat-base:post-build]
142.20 s
[pathway-compat-base:post-build] All done.
142.22 s
[pathway-compat-base:post-build] Uploading to the NixCI cache: /nix/store/crzf26y06x5l6vgfsc6nkfqqwfypfild-pathway-compat-base-0.0.1.0-doc /nix/store/immjks7z3cdng833dbs7k3bhslg3ix6w-pathway-compat-base-0.0.1.0
142.26 s
[pathway-compat-base:post-build] warning: 'warn-short-path-literals' is deprecated, use 'lint-short-path-literals = ignore' instead
142.28 s
[pathway-compat-base:post-build] copying 6 paths...
142.28 s
[pathway-compat-base:post-build] copying path '/nix/store/gyranmvar972k78w8rlq1qc0gafhdv88-recursion-schemes-5.2.3-doc' to 'https://cache.nix-ci.com'...
142.65 s
[pathway-compat-base:post-build] copying path '/nix/store/cqx3hm92y0p26wpigvp299v3061yr121-recursion-schemes-5.2.3' to 'https://cache.nix-ci.com'...
142.65 s
[pathway-compat-base:post-build] copying path '/nix/store/pqp8hpmafbh9hw37z1xjrvmpp5d7aq62-variant-1.0.1-doc' to 'https://cache.nix-ci.com'...
143.34 s
[pathway-compat-base:post-build] copying path '/nix/store/crzf26y06x5l6vgfsc6nkfqqwfypfild-pathway-compat-base-0.0.1.0-doc' to 'https://cache.nix-ci.com'...
144.25 s
[pathway-compat-base:post-build] copying path '/nix/store/axj5100zq3mzhx1jrjd0hlvwlbp0q27h-variant-1.0.1' to 'https://cache.nix-ci.com'...
145.96 s
[pathway-compat-base:post-build] copying path '/nix/store/immjks7z3cdng833dbs7k3bhslg3ix6w-pathway-compat-base-0.0.1.0' to 'https://cache.nix-ci.com'...
146.42 s
[pathway-compat-base:post-build] warning: 'warn-short-path-literals' is deprecated, use 'lint-short-path-literals = ignore' instead
146.62 s
[pathway-compat-base:post-build] copying 3 paths...
146.62 s
[pathway-compat-base:post-build] copying path '/nix/store/pm93b0wfyk7djlbcmn05mlq09rh612nd-recursion-schemes-5.2.3.drv' to 'https://cache.nix-ci.com'...
146.77 s
[pathway-compat-base:post-build] copying path '/nix/store/c1widafhm2w27nzy0yjqnv4lw0l06ahx-variant-1.0.1.drv' to 'https://cache.nix-ci.com'...
146.89 s
[pathway-compat-base:post-build] copying path '/nix/store/8n94fqchg3sfvlkx3i3ry4vqg230s4p8-pathway-compat-base-0.0.1.0.drv' to 'https://cache.nix-ci.com'...
147.03 s
Uploaded pathway-compat-base in 7.2s
147.03 s
Progress: 5 of 19 built, 184 of 184 downloaded from cache
147.03 s
Built pathway-compat-base in 28.7s
147.08 s
Building /nix/store/ky3d4fbd2n1245lyrqqafbzks6pvj6yx-pathway-compat-filepath-0.0.1.0.drv
147.29 s
[pathway-compat-filepath] Phase: setupCompilerEnvironmentPhase
147.29 s
[pathway-compat-filepath] Build with /nix/store/da9x1n5l146q0ai9wz8zfbx4zfwa9b02-ghc-9.6.7.
147.53 s
[pathway-compat-filepath] Phase: unpackPhase
147.53 s
[pathway-compat-filepath] unpacking source archive /nix/store/723m6sjvk66iiqzpvcfdd74xi6id5zqq-zjizyqf4pafgh9rycgxd507dhvpisdy1-source/./compat/filepath
147.54 s
[pathway-compat-filepath] source root is filepath
147.55 s
[pathway-compat-filepath] Phase: patchPhase
147.56 s
[pathway-compat-filepath] Phase: compileBuildDriverPhase
147.56 s
[pathway-compat-filepath] setupCompileFlags: -package-db=/build/tmp.UPL5mMSZiG/setup-package.conf.d -threaded
147.60 s
[pathway-compat-filepath] [1 of 2] Compiling Main ( Setup.hs, /build/tmp.UPL5mMSZiG/Main.o )
147.64 s
[pathway-compat-filepath] [2 of 2] Linking Setup
148.72 s
[pathway-compat-filepath] Phase: updateAutotoolsGnuConfigScriptsPhase
148.73 s
[pathway-compat-filepath] Phase: configurePhase
148.74 s
[pathway-compat-filepath] configureFlags: --verbose --prefix=/nix/store/phlcj8ksn09xr2h64vqgfxmn7hpb9xgk-pathway-compat-filepath-0.0.1.0 --libdir=$prefix/lib/$compiler/lib --libsubdir=$abi/$libname --docdir=/nix/store/cchjkcffdkdfqbjkrmmp89a5gxnhp5as-pathway-compat-filepath-0.0.1.0-doc/share/doc/pathway-compat-filepath-0.0.1.0 --with-gcc=gcc --package-db=/build/tmp.UPL5mMSZiG/package.conf.d --ghc-option=-j16 --ghc-option=+RTS --ghc-option=-A64M --ghc-option=-RTS --enable-library-profiling --profiling-detail=exported-functions --disable-profiling --enable-shared --disable-coverage --enable-static --disable-executable-dynamic --enable-tests --disable-benchmarks --enable-library-vanilla --disable-library-for-ghci --enable-split-sections --enable-library-stripping --enable-executable-stripping --ghc-option=-haddock --ghc-options=-Werror --extra-lib-dirs=/nix/store/ffyzkisqs4vc4mg28bwwlyqjf8i9ph6b-ncurses-6.5/lib --extra-lib-dirs=/nix/store/n28qgdj8c1q41kf7n4y1jxa6ckp85m3c-libffi-3.5.2/lib --extra-lib-dirs=/nix/store/1b6h99dw7bk4wbn77kbalih42zbc67m1-elfutils-0.194/lib --extra-lib-dirs=/nix/store/hi0ar880110k6jsmmili7dh1gq3cg2a9-gmp-with-cxx-6.3.0/lib --extra-lib-dirs=/nix/store/g09cflpnp4g80q56sj9dng1qzv4v4ybc-numactl-2.0.18/lib --extra-lib-dirs=/nix/store/da9x1n5l146q0ai9wz8zfbx4zfwa9b02-ghc-9.6.7/lib
148.74 s
[pathway-compat-filepath] Using Parsec parser
148.74 s
[pathway-compat-filepath] Configuring pathway-compat-filepath-0.0.1.0...
149.08 s
[pathway-compat-filepath] Flags chosen: noisy-deprecations=True, verify-no-recursion=False
149.08 s
[pathway-compat-filepath] Dependency base >=4.14.0 && <4.15 || >=4.15.0 && <4.16 || >=4.16.0 && <4.17 ||
149.08 s
[pathway-compat-filepath] >=4.17.0 && <4.18 || >=4.18.0 && <4.19 || >=4.19.0 && <4.20 || >=4.20.0 &&
149.08 s
[pathway-compat-filepath] <4.21 || >=4.21.0 && <4.22 || >=4.22.0 && <4.23: using base-4.18.3.0
149.08 s
[pathway-compat-filepath] Dependency extra: using extra-1.8.1
149.08 s
[pathway-compat-filepath] Dependency filepath >=1.4.2 && <1.5 || >=1.5.0 && <1.6: using
149.08 s
[pathway-compat-filepath] filepath-1.4.301.0
149.08 s
[pathway-compat-filepath] Dependency megaparsec >=9.0.1 && <9.1 || >=9.2.1 && <9.3 || >=9.5.0 && <9.6 ||
149.08 s
[pathway-compat-filepath] >=9.7.0 && <9.8: using megaparsec-9.7.0
149.08 s
[pathway-compat-filepath] Dependency pathway >=0.0.1 && <0.1: using pathway-0.0.1.0
149.08 s
[pathway-compat-filepath] Dependency pathway-compat-base >=0.0.1 && <0.1: using
149.08 s
[pathway-compat-filepath] pathway-compat-base-0.0.1.0
149.08 s
[pathway-compat-filepath] Dependency pathway-internal >=0.0.1 && <0.1: using pathway-internal-0.0.1.0
149.08 s
[pathway-compat-filepath] Dependency base >=4.14.0 && <4.15 || >=4.15.0 && <4.16 || >=4.16.0 && <4.17 ||
149.08 s
[pathway-compat-filepath] >=4.17.0 && <4.18 || >=4.18.0 && <4.19 || >=4.19.0 && <4.20 || >=4.20.0 &&
149.08 s
[pathway-compat-filepath] <4.21 || >=4.21.0 && <4.22 || >=4.22.0 && <4.23: using base-4.18.3.0
149.08 s
[pathway-compat-filepath] Dependency doctest >=0.16.3 && <0.17 || >=0.18.1 && <0.19 || >=0.20.1 && <0.21
149.08 s
[pathway-compat-filepath] || >=0.21.1 && <0.22 || >=0.22.2 && <0.23 || >=0.24.2 && <0.25: using
149.08 s
[pathway-compat-filepath] doctest-0.24.2
149.08 s
[pathway-compat-filepath] Dependency pathway-compat-filepath: using pathway-compat-filepath-0.0.1.0
149.38 s
[pathway-compat-filepath] Source component graph:
149.41 s
[pathway-compat-filepath] component lib
149.41 s
[pathway-compat-filepath] component test:doctests dependency lib
149.41 s
[pathway-compat-filepath] Configured component graph:
149.41 s
[pathway-compat-filepath] component pathway-compat-filepath-0.0.1.0-L0VuJWewPKkKsQELfUFr0L
149.41 s
[pathway-compat-filepath] include base-4.18.3.0
149.41 s
[pathway-compat-filepath] include extra-1.8.1-mqL7YRifC8HhGrjpGYIL3
149.41 s
[pathway-compat-filepath] include filepath-1.4.301.0
149.41 s
[pathway-compat-filepath] include megaparsec-9.7.0-9FWtFuoAKCoJPEfZ8OP0ob
149.41 s
[pathway-compat-filepath] include pathway-0.0.1.0-31EObXlLuVk60eWeEQLXMY
149.41 s
[pathway-compat-filepath] include pathway-compat-base-0.0.1.0-BRBmFEfWQlkJP9xCDIxb6w
149.41 s
[pathway-compat-filepath] include pathway-internal-0.0.1.0-6pVrF111eN4BAqGigGNQse
149.41 s
[pathway-compat-filepath] component pathway-compat-filepath-0.0.1.0-7hV8D5x7Q712pKmJ0W1sv4-doctests
149.41 s
[pathway-compat-filepath] include base-4.18.3.0
149.41 s
[pathway-compat-filepath] include doctest-0.24.2-7YxPr6lrdwiBMDK2pmizgF
149.41 s
[pathway-compat-filepath] include pathway-compat-filepath-0.0.1.0-L0VuJWewPKkKsQELfUFr0L
149.41 s
[pathway-compat-filepath] Linked component graph:
149.41 s
[pathway-compat-filepath] unit pathway-compat-filepath-0.0.1.0-L0VuJWewPKkKsQELfUFr0L
149.41 s
[pathway-compat-filepath] include base-4.18.3.0
149.41 s
[pathway-compat-filepath] include extra-1.8.1-mqL7YRifC8HhGrjpGYIL3
149.41 s
[pathway-compat-filepath] include filepath-1.4.301.0
149.41 s
[pathway-compat-filepath] include megaparsec-9.7.0-9FWtFuoAKCoJPEfZ8OP0ob
149.41 s
[pathway-compat-filepath] include pathway-0.0.1.0-31EObXlLuVk60eWeEQLXMY
149.41 s
[pathway-compat-filepath] include pathway-compat-base-0.0.1.0-BRBmFEfWQlkJP9xCDIxb6w
149.41 s
[pathway-compat-filepath] include pathway-internal-0.0.1.0-6pVrF111eN4BAqGigGNQse
149.41 s
[pathway-compat-filepath] Common.FilePath=pathway-compat-filepath-0.0.1.0-L0VuJWewPKkKsQELfUFr0L:Common.FilePath,Common.OsPath=pathway-compat-filepath-0.0.1.0-L0VuJWewPKkKsQELfUFr0L:Common.OsPath,System.FilePath=pathway-compat-filepath-0.0.1.0-L0VuJWewPKkKsQELfUFr0L:System.FilePath,System.FilePath.Overlay=pathway-compat-filepath-0.0.1.0-L0VuJWewPKkKsQELfUFr0L:System.FilePath.Overlay,System.FilePath.Pathway=pathway-compat-filepath-0.0.1.0-L0VuJWewPKkKsQELfUFr0L:System.FilePath.Pathway,System.FilePath.Thin=pathway-compat-filepath-0.0.1.0-L0VuJWewPKkKsQELfUFr0L:System.FilePath.Thin,System.OsPath=pathway-compat-filepath-0.0.1.0-L0VuJWewPKkKsQELfUFr0L:System.OsPath,System.OsPath.Overlay=pathway-compat-filepath-0.0.1.0-L0VuJWewPKkKsQELfUFr0L:System.OsPath.Overlay,System.OsPath.Pathway=pathway-compat-filepath-0.0.1.0-L0VuJWewPKkKsQELfUFr0L:System.OsPath.Pathway,System.OsPath.Thin=pathway-compat-filepath-0.0.1.0-L0VuJWewPKkKsQELfUFr0L:System.OsPath.Thin
149.41 s
[pathway-compat-filepath] unit pathway-compat-filepath-0.0.1.0-7hV8D5x7Q712pKmJ0W1sv4-doctests
149.41 s
[pathway-compat-filepath] include base-4.18.3.0
149.41 s
[pathway-compat-filepath] include doctest-0.24.2-7YxPr6lrdwiBMDK2pmizgF
149.41 s
[pathway-compat-filepath] include pathway-compat-filepath-0.0.1.0-L0VuJWewPKkKsQELfUFr0L
149.41 s
[pathway-compat-filepath] Ready component graph:
149.41 s
[pathway-compat-filepath] definite pathway-compat-filepath-0.0.1.0-L0VuJWewPKkKsQELfUFr0L
149.41 s
[pathway-compat-filepath] depends base-4.18.3.0
149.41 s
[pathway-compat-filepath] depends extra-1.8.1-mqL7YRifC8HhGrjpGYIL3
149.41 s
[pathway-compat-filepath] depends filepath-1.4.301.0
149.41 s
[pathway-compat-filepath] depends megaparsec-9.7.0-9FWtFuoAKCoJPEfZ8OP0ob
149.41 s
[pathway-compat-filepath] depends pathway-0.0.1.0-31EObXlLuVk60eWeEQLXMY
149.41 s
[pathway-compat-filepath] depends pathway-compat-base-0.0.1.0-BRBmFEfWQlkJP9xCDIxb6w
149.41 s
[pathway-compat-filepath] depends pathway-internal-0.0.1.0-6pVrF111eN4BAqGigGNQse
149.41 s
[pathway-compat-filepath] definite pathway-compat-filepath-0.0.1.0-7hV8D5x7Q712pKmJ0W1sv4-doctests
149.41 s
[pathway-compat-filepath] depends base-4.18.3.0
149.41 s
[pathway-compat-filepath] depends doctest-0.24.2-7YxPr6lrdwiBMDK2pmizgF
149.41 s
[pathway-compat-filepath] depends pathway-compat-filepath-0.0.1.0-L0VuJWewPKkKsQELfUFr0L
149.41 s
[pathway-compat-filepath] Using Cabal-3.10.3.0 compiled by ghc-9.6
149.41 s
[pathway-compat-filepath] Using compiler: ghc-9.6.7
149.41 s
[pathway-compat-filepath] Using install prefix:
149.41 s
[pathway-compat-filepath] /nix/store/phlcj8ksn09xr2h64vqgfxmn7hpb9xgk-pathway-compat-filepath-0.0.1.0
149.41 s
[pathway-compat-filepath] Executables installed in:
149.41 s
[pathway-compat-filepath] /nix/store/phlcj8ksn09xr2h64vqgfxmn7hpb9xgk-pathway-compat-filepath-0.0.1.0/bin
149.41 s
[pathway-compat-filepath] Libraries installed in:
149.41 s
[pathway-compat-filepath] /nix/store/phlcj8ksn09xr2h64vqgfxmn7hpb9xgk-pathway-compat-filepath-0.0.1.0/lib/ghc-9.6.7/lib/x86_64-linux-ghc-9.6.7/pathway-compat-filepath-0.0.1.0-L0VuJWewPKkKsQELfUFr0L
149.41 s
[pathway-compat-filepath] Dynamic Libraries installed in:
149.41 s
[pathway-compat-filepath] /nix/store/phlcj8ksn09xr2h64vqgfxmn7hpb9xgk-pathway-compat-filepath-0.0.1.0/lib/ghc-9.6.7/lib/x86_64-linux-ghc-9.6.7
149.41 s
[pathway-compat-filepath] Private executables installed in:
149.41 s
[pathway-compat-filepath] /nix/store/phlcj8ksn09xr2h64vqgfxmn7hpb9xgk-pathway-compat-filepath-0.0.1.0/libexec/x86_64-linux-ghc-9.6.7/pathway-compat-filepath-0.0.1.0
149.41 s
[pathway-compat-filepath] Data files installed in:
149.41 s
[pathway-compat-filepath] /nix/store/phlcj8ksn09xr2h64vqgfxmn7hpb9xgk-pathway-compat-filepath-0.0.1.0/share/x86_64-linux-ghc-9.6.7/pathway-compat-filepath-0.0.1.0
149.41 s
[pathway-compat-filepath] Documentation installed in:
149.41 s
[pathway-compat-filepath] /nix/store/cchjkcffdkdfqbjkrmmp89a5gxnhp5as-pathway-compat-filepath-0.0.1.0-doc/share/doc/pathway-compat-filepath-0.0.1.0
149.41 s
[pathway-compat-filepath] Configuration files installed in:
149.41 s
[pathway-compat-filepath] /nix/store/phlcj8ksn09xr2h64vqgfxmn7hpb9xgk-pathway-compat-filepath-0.0.1.0/etc
149.41 s
[pathway-compat-filepath] No alex found
149.41 s
[pathway-compat-filepath] Using ar found on system at:
149.41 s
[pathway-compat-filepath] /nix/store/iz5lckcsg66r223si2gck7csk2hihj0m-binutils-wrapper-2.44/bin/ar
149.41 s
[pathway-compat-filepath] No c2hs found
149.41 s
[pathway-compat-filepath] No cpphs found
149.41 s
[pathway-compat-filepath] Using doctest version 0.24.2 found on system at:
149.41 s
[pathway-compat-filepath] /nix/store/mky1glcba5jwjn0h7fa1mldfnh39g6l9-doctest-0.24.2/bin/doctest
149.41 s
[pathway-compat-filepath] Using gcc version 14.3.0 given by user at:
149.41 s
[pathway-compat-filepath] /nix/store/8v97ngkcpfzgghwnnr7fsz33p2x22gy9-gcc-wrapper-14.3.0/bin/gcc
149.41 s
[pathway-compat-filepath] Using ghc version 9.6.7 found on system at:
149.41 s
[pathway-compat-filepath] /nix/store/da9x1n5l146q0ai9wz8zfbx4zfwa9b02-ghc-9.6.7/bin/ghc
149.41 s
[pathway-compat-filepath] Using ghc-pkg version 9.6.7 found on system at:
149.41 s
[pathway-compat-filepath] /nix/store/da9x1n5l146q0ai9wz8zfbx4zfwa9b02-ghc-9.6.7/bin/ghc-pkg-9.6.7
149.41 s
[pathway-compat-filepath] No ghcjs found
149.41 s
[pathway-compat-filepath] No ghcjs-pkg found
149.41 s
[pathway-compat-filepath] No greencard found
149.41 s
[pathway-compat-filepath] Using haddock version 2.29.2 found on system at:
149.41 s
[pathway-compat-filepath] /nix/store/da9x1n5l146q0ai9wz8zfbx4zfwa9b02-ghc-9.6.7/bin/haddock-ghc-9.6.7
149.41 s
[pathway-compat-filepath] No happy found
149.41 s
[pathway-compat-filepath] Using haskell-suite found on system at: haskell-suite-dummy-location
149.41 s
[pathway-compat-filepath] Using haskell-suite-pkg found on system at: haskell-suite-pkg-dummy-location
149.41 s
[pathway-compat-filepath] No hmake found
149.41 s
[pathway-compat-filepath] Using hpc version 0.68 found on system at:
149.41 s
[pathway-compat-filepath] /nix/store/da9x1n5l146q0ai9wz8zfbx4zfwa9b02-ghc-9.6.7/bin/hpc-ghc-9.6.7
149.41 s
[pathway-compat-filepath] Using hsc2hs version 0.68.9 found on system at:
149.41 s
[pathway-compat-filepath] /nix/store/da9x1n5l146q0ai9wz8zfbx4zfwa9b02-ghc-9.6.7/bin/hsc2hs-ghc-9.6.7
149.41 s
[pathway-compat-filepath] Using hscolour version 1.25 found on system at:
149.41 s
[pathway-compat-filepath] /nix/store/7ffc07q75k5a6zk864jv9gpiphhwzjlh-hscolour-1.25/bin/HsColour
149.41 s
[pathway-compat-filepath] No jhc found
149.41 s
[pathway-compat-filepath] Using ld found on system at:
149.41 s
[pathway-compat-filepath] /nix/store/iz5lckcsg66r223si2gck7csk2hihj0m-binutils-wrapper-2.44/bin/ld.gold
149.41 s
[pathway-compat-filepath] No pkg-config found
149.41 s
[pathway-compat-filepath] Using runghc version 9.6.7 found on system at:
149.41 s
[pathway-compat-filepath] /nix/store/da9x1n5l146q0ai9wz8zfbx4zfwa9b02-ghc-9.6.7/bin/runghc-9.6.7
149.41 s
[pathway-compat-filepath] Using strip version 2.44 found on system at:
149.41 s
[pathway-compat-filepath] /nix/store/8v97ngkcpfzgghwnnr7fsz33p2x22gy9-gcc-wrapper-14.3.0/bin/strip
149.41 s
[pathway-compat-filepath] Using tar found on system at:
149.41 s
[pathway-compat-filepath] /nix/store/xl6pd2spjajwcpq09fnmnjv5psqmlmma-gnutar-1.35/bin/tar
149.41 s
[pathway-compat-filepath] No uhc found
149.66 s
[pathway-compat-filepath] Phase: buildPhase
149.72 s
[pathway-compat-filepath] Preprocessing library for pathway-compat-filepath-0.0.1.0..
149.72 s
[pathway-compat-filepath] Building library for pathway-compat-filepath-0.0.1.0..
149.80 s
[pathway-compat-filepath] [ 1 of 10] Compiling Common.FilePath ( src/Common/FilePath.hs, dist/build/Common/FilePath.o, dist/build/Common/FilePath.dyn_o )
150.06 s
[pathway-compat-filepath] [ 2 of 10] Compiling Common.OsPath ( src/Common/OsPath.hs, dist/build/Common/OsPath.o, dist/build/Common/OsPath.dyn_o )
150.06 s
[pathway-compat-filepath]
150.06 s
[pathway-compat-filepath] src/Common/OsPath.hs:87:23: error : [ GHC-76037 ]
150.06 s
[pathway-compat-filepath] Not in scope: ‘O.unsafeEncodeUtf’
150.06 s
[pathway-compat-filepath] NB: the module ‘System.OsPath’ does not export ‘unsafeEncodeUtf’.
150.06 s
[pathway-compat-filepath] |
150.06 s
[pathway-compat-filepath] 87 | Format.parent = O.unsafeEncodeUtf "..",
150.06 s
[pathway-compat-filepath] | ^^^^^^^^^^^^^^^^^
150.06 s
[pathway-compat-filepath] [ 3 of 10] Compiling System.FilePath.Thin ( src/System/FilePath/Thin.hs, dist/build/System/FilePath/Thin.o, dist/build/System/FilePath/Thin.dyn_o )
150.21 s
[pathway-compat-filepath] [ 4 of 10] Compiling System.FilePath.Pathway ( src/System/FilePath/Pathway.hs, dist/build/System/FilePath/Pathway.o, dist/build/System/FilePath/Pathway.dyn_o )
150.23 s
[pathway-compat-filepath] [ 5 of 10] Compiling System.FilePath.Overlay ( src/System/FilePath/Overlay.hs, dist/build/System/FilePath/Overlay.o, dist/build/System/FilePath/Overlay.dyn_o )
150.26 s
[pathway-compat-filepath] [ 6 of 10] Compiling System.FilePath ( src/System/FilePath.hs, dist/build/System/FilePath.o, dist/build/System/FilePath.dyn_o )
150.37 s
Progress: 5 of 17 built (1 failed), 184 of 184 downloaded from cache
150.37 s
Failed to build pathway-compat-filepath after 3.2s
150.37 s
error: Cannot build '/nix/store/ky3d4fbd2n1245lyrqqafbzks6pvj6yx-pathway-compat-filepath-0.0.1.0.drv '.
150.37 s
Reason: builder failed with exit code 1 .
150.37 s
Output paths:
150.37 s
/nix/store/cchjkcffdkdfqbjkrmmp89a5gxnhp5as-pathway-compat-filepath-0.0.1.0-doc
150.37 s
/nix/store/phlcj8ksn09xr2h64vqgfxmn7hpb9xgk-pathway-compat-filepath-0.0.1.0
150.37 s
Last 151 log lines:
150.37 s
> Running phase: setupCompilerEnvironmentPhase
150.37 s
> Build with /nix/store/da9x1n5l146q0ai9wz8zfbx4zfwa9b02-ghc-9.6.7.
150.37 s
> Running phase: unpackPhase
150.37 s
> unpacking source archive /nix/store/723m6sjvk66iiqzpvcfdd74xi6id5zqq-zjizyqf4pafgh9rycgxd507dhvpisdy1-source/./compat/filepath
150.37 s
> source root is filepath
150.37 s
> Running phase: patchPhase
150.37 s
> Running phase: compileBuildDriverPhase
150.37 s
> setupCompileFlags: -package-db=/build/tmp.UPL5mMSZiG/setup-package.conf.d -threaded
150.37 s
> [1 of 2] Compiling Main ( Setup.hs, /build/tmp.UPL5mMSZiG/Main.o )
150.37 s
> [2 of 2] Linking Setup
150.37 s
> Running phase: updateAutotoolsGnuConfigScriptsPhase
150.37 s
> Running phase: configurePhase
150.37 s
> configureFlags: --verbose --prefix=/nix/store/phlcj8ksn09xr2h64vqgfxmn7hpb9xgk-pathway-compat-filepath-0.0.1.0 --libdir=$prefix/lib/$compiler/lib --libsubdir=$abi/$libname --docdir=/nix/store/cchjkcffdkdfqbjkrmmp89a5gxnhp5as-pathway-compat-filepath-0.0.1.0-doc/share/doc/pathway-compat-filepath-0.0.1.0 --with-gcc=gcc --package-db=/build/tmp.UPL5mMSZiG/package.conf.d --ghc-option=-j16 --ghc-option=+RTS --ghc-option=-A64M --ghc-option=-RTS --enable-library-profiling --profiling-detail=exported-functions --disable-profiling --enable-shared --disable-coverage --enable-static --disable-executable-dynamic --enable-tests --disable-benchmarks --enable-library-vanilla --disable-library-for-ghci --enable-split-sections --enable-library-stripping --enable-executable-stripping --ghc-option=-haddock --ghc-options=-Werror --extra-lib-dirs=/nix/store/ffyzkisqs4vc4mg28bwwlyqjf8i9ph6b-ncurses-6.5/lib --extra-lib-dirs=/nix/store/n28qgdj8c1q41kf7n4y1jxa6ckp85m3c-libffi-3.5.2/lib --extra-lib-dirs=/nix/store/1b6h99dw7bk4wbn77kbalih42zbc67m1-elfutils-0.194/lib --extra-lib-dirs=/nix/store/hi0ar880110k6jsmmili7dh1gq3cg2a9-gmp-with-cxx-6.3.0/lib --extra-lib-dirs=/nix/store/g09cflpnp4g80q56sj9dng1qzv4v4ybc-numactl-2.0.18/lib --extra-lib-dirs=/nix/store/da9x1n5l146q0ai9wz8zfbx4zfwa9b02-ghc-9.6.7/lib
150.37 s
> Using Parsec parser
150.37 s
> Configuring pathway-compat-filepath-0.0.1.0...
150.37 s
> Flags chosen: noisy-deprecations=True, verify-no-recursion=False
150.37 s
> Dependency base >=4.14.0 && <4.15 || >=4.15.0 && <4.16 || >=4.16.0 && <4.17 ||
150.37 s
> >=4.17.0 && <4.18 || >=4.18.0 && <4.19 || >=4.19.0 && <4.20 || >=4.20.0 &&
150.37 s
> <4.21 || >=4.21.0 && <4.22 || >=4.22.0 && <4.23: using base-4.18.3.0
150.37 s
> Dependency extra: using extra-1.8.1
150.37 s
> Dependency filepath >=1.4.2 && <1.5 || >=1.5.0 && <1.6: using
150.37 s
> filepath-1.4.301.0
150.37 s
> Dependency megaparsec >=9.0.1 && <9.1 || >=9.2.1 && <9.3 || >=9.5.0 && <9.6 ||
150.37 s
> >=9.7.0 && <9.8: using megaparsec-9.7.0
150.37 s
> Dependency pathway >=0.0.1 && <0.1: using pathway-0.0.1.0
150.37 s
> Dependency pathway-compat-base >=0.0.1 && <0.1: using
150.37 s
> pathway-compat-base-0.0.1.0
150.37 s
> Dependency pathway-internal >=0.0.1 && <0.1: using pathway-internal-0.0.1.0
150.37 s
> Dependency base >=4.14.0 && <4.15 || >=4.15.0 && <4.16 || >=4.16.0 && <4.17 ||
150.37 s
> >=4.17.0 && <4.18 || >=4.18.0 && <4.19 || >=4.19.0 && <4.20 || >=4.20.0 &&
150.37 s
> <4.21 || >=4.21.0 && <4.22 || >=4.22.0 && <4.23: using base-4.18.3.0
150.37 s
> Dependency doctest >=0.16.3 && <0.17 || >=0.18.1 && <0.19 || >=0.20.1 && <0.21
150.37 s
> || >=0.21.1 && <0.22 || >=0.22.2 && <0.23 || >=0.24.2 && <0.25: using
150.37 s
> doctest-0.24.2
150.37 s
> Dependency pathway-compat-filepath: using pathway-compat-filepath-0.0.1.0
150.37 s
> Source component graph:
150.37 s
> component lib
150.37 s
> component test:doctests dependency lib
150.37 s
> Configured component graph:
150.37 s
> component pathway-compat-filepath-0.0.1.0-L0VuJWewPKkKsQELfUFr0L
150.37 s
> include base-4.18.3.0
150.37 s
> include extra-1.8.1-mqL7YRifC8HhGrjpGYIL3
150.37 s
> include filepath-1.4.301.0
150.37 s
> include megaparsec-9.7.0-9FWtFuoAKCoJPEfZ8OP0ob
150.37 s
> include pathway-0.0.1.0-31EObXlLuVk60eWeEQLXMY
150.37 s
> include pathway-compat-base-0.0.1.0-BRBmFEfWQlkJP9xCDIxb6w
150.37 s
> include pathway-internal-0.0.1.0-6pVrF111eN4BAqGigGNQse
150.37 s
> component pathway-compat-filepath-0.0.1.0-7hV8D5x7Q712pKmJ0W1sv4-doctests
150.37 s
> include base-4.18.3.0
150.37 s
> include doctest-0.24.2-7YxPr6lrdwiBMDK2pmizgF
150.37 s
> include pathway-compat-filepath-0.0.1.0-L0VuJWewPKkKsQELfUFr0L
150.37 s
> Linked component graph:
150.37 s
> unit pathway-compat-filepath-0.0.1.0-L0VuJWewPKkKsQELfUFr0L
150.37 s
> include base-4.18.3.0
150.37 s
> include extra-1.8.1-mqL7YRifC8HhGrjpGYIL3
150.37 s
> include filepath-1.4.301.0
150.37 s
> include megaparsec-9.7.0-9FWtFuoAKCoJPEfZ8OP0ob
150.37 s
> include pathway-0.0.1.0-31EObXlLuVk60eWeEQLXMY
150.37 s
> include pathway-compat-base-0.0.1.0-BRBmFEfWQlkJP9xCDIxb6w
150.37 s
> include pathway-internal-0.0.1.0-6pVrF111eN4BAqGigGNQse
150.37 s
> Common.FilePath=pathway-compat-filepath-0.0.1.0-L0VuJWewPKkKsQELfUFr0L:Common.FilePath,Common.OsPath=pathway-compat-filepath-0.0.1.0-L0VuJWewPKkKsQELfUFr0L:Common.OsPath,System.FilePath=pathway-compat-filepath-0.0.1.0-L0VuJWewPKkKsQELfUFr0L:System.FilePath,System.FilePath.Overlay=pathway-compat-filepath-0.0.1.0-L0VuJWewPKkKsQELfUFr0L:System.FilePath.Overlay,System.FilePath.Pathway=pathway-compat-filepath-0.0.1.0-L0VuJWewPKkKsQELfUFr0L:System.FilePath.Pathway,System.FilePath.Thin=pathway-compat-filepath-0.0.1.0-L0VuJWewPKkKsQELfUFr0L:System.FilePath.Thin,System.OsPath=pathway-compat-filepath-0.0.1.0-L0VuJWewPKkKsQELfUFr0L:System.OsPath,System.OsPath.Overlay=pathway-compat-filepath-0.0.1.0-L0VuJWewPKkKsQELfUFr0L:System.OsPath.Overlay,System.OsPath.Pathway=pathway-compat-filepath-0.0.1.0-L0VuJWewPKkKsQELfUFr0L:System.OsPath.Pathway,System.OsPath.Thin=pathway-compat-filepath-0.0.1.0-L0VuJWewPKkKsQELfUFr0L:System.OsPath.Thin
150.37 s
> unit pathway-compat-filepath-0.0.1.0-7hV8D5x7Q712pKmJ0W1sv4-doctests
150.37 s
> include base-4.18.3.0
150.37 s
> include doctest-0.24.2-7YxPr6lrdwiBMDK2pmizgF
150.37 s
> include pathway-compat-filepath-0.0.1.0-L0VuJWewPKkKsQELfUFr0L
150.37 s
> Ready component graph:
150.37 s
> definite pathway-compat-filepath-0.0.1.0-L0VuJWewPKkKsQELfUFr0L
150.37 s
> depends base-4.18.3.0
150.37 s
> depends extra-1.8.1-mqL7YRifC8HhGrjpGYIL3
150.37 s
> depends filepath-1.4.301.0
150.37 s
> depends megaparsec-9.7.0-9FWtFuoAKCoJPEfZ8OP0ob
150.37 s
> depends pathway-0.0.1.0-31EObXlLuVk60eWeEQLXMY
150.37 s
> depends pathway-compat-base-0.0.1.0-BRBmFEfWQlkJP9xCDIxb6w
150.37 s
> depends pathway-internal-0.0.1.0-6pVrF111eN4BAqGigGNQse
150.37 s
> definite pathway-compat-filepath-0.0.1.0-7hV8D5x7Q712pKmJ0W1sv4-doctests
150.37 s
> depends base-4.18.3.0
150.37 s
> depends doctest-0.24.2-7YxPr6lrdwiBMDK2pmizgF
150.37 s
> depends pathway-compat-filepath-0.0.1.0-L0VuJWewPKkKsQELfUFr0L
150.37 s
> Using Cabal-3.10.3.0 compiled by ghc-9.6
150.37 s
> Using compiler: ghc-9.6.7
150.37 s
> Using install prefix:
150.37 s
> /nix/store/phlcj8ksn09xr2h64vqgfxmn7hpb9xgk-pathway-compat-filepath-0.0.1.0
150.37 s
> Executables installed in:
150.37 s
> /nix/store/phlcj8ksn09xr2h64vqgfxmn7hpb9xgk-pathway-compat-filepath-0.0.1.0/bin
150.37 s
> Libraries installed in:
150.37 s
> /nix/store/phlcj8ksn09xr2h64vqgfxmn7hpb9xgk-pathway-compat-filepath-0.0.1.0/lib/ghc-9.6.7/lib/x86_64-linux-ghc-9.6.7/pathway-compat-filepath-0.0.1.0-L0VuJWewPKkKsQELfUFr0L
150.37 s
> Dynamic Libraries installed in:
150.37 s
> /nix/store/phlcj8ksn09xr2h64vqgfxmn7hpb9xgk-pathway-compat-filepath-0.0.1.0/lib/ghc-9.6.7/lib/x86_64-linux-ghc-9.6.7
150.37 s
> Private executables installed in:
150.37 s
> /nix/store/phlcj8ksn09xr2h64vqgfxmn7hpb9xgk-pathway-compat-filepath-0.0.1.0/libexec/x86_64-linux-ghc-9.6.7/pathway-compat-filepath-0.0.1.0
150.37 s
> Data files installed in:
150.37 s
> /nix/store/phlcj8ksn09xr2h64vqgfxmn7hpb9xgk-pathway-compat-filepath-0.0.1.0/share/x86_64-linux-ghc-9.6.7/pathway-compat-filepath-0.0.1.0
150.37 s
> Documentation installed in:
150.37 s
> /nix/store/cchjkcffdkdfqbjkrmmp89a5gxnhp5as-pathway-compat-filepath-0.0.1.0-doc/share/doc/pathway-compat-filepath-0.0.1.0
150.37 s
> Configuration files installed in:
150.37 s
> /nix/store/phlcj8ksn09xr2h64vqgfxmn7hpb9xgk-pathway-compat-filepath-0.0.1.0/etc
150.37 s
> No alex found
150.37 s
> Using ar found on system at:
150.37 s
> /nix/store/iz5lckcsg66r223si2gck7csk2hihj0m-binutils-wrapper-2.44/bin/ar
150.37 s
> No c2hs found
150.37 s
> No cpphs found
150.37 s
> Using doctest version 0.24.2 found on system at:
150.37 s
> /nix/store/mky1glcba5jwjn0h7fa1mldfnh39g6l9-doctest-0.24.2/bin/doctest
150.37 s
> Using gcc version 14.3.0 given by user at:
150.37 s
> /nix/store/8v97ngkcpfzgghwnnr7fsz33p2x22gy9-gcc-wrapper-14.3.0/bin/gcc
150.37 s
> Using ghc version 9.6.7 found on system at:
150.37 s
> /nix/store/da9x1n5l146q0ai9wz8zfbx4zfwa9b02-ghc-9.6.7/bin/ghc
150.37 s
> Using ghc-pkg version 9.6.7 found on system at:
150.37 s
> /nix/store/da9x1n5l146q0ai9wz8zfbx4zfwa9b02-ghc-9.6.7/bin/ghc-pkg-9.6.7
150.37 s
> No ghcjs found
150.37 s
> No ghcjs-pkg found
150.37 s
> No greencard found
150.37 s
> Using haddock version 2.29.2 found on system at:
150.37 s
> /nix/store/da9x1n5l146q0ai9wz8zfbx4zfwa9b02-ghc-9.6.7/bin/haddock-ghc-9.6.7
150.37 s
> No happy found
150.37 s
> Using haskell-suite found on system at: haskell-suite-dummy-location
150.37 s
> Using haskell-suite-pkg found on system at: haskell-suite-pkg-dummy-location
150.37 s
> No hmake found
150.37 s
> Using hpc version 0.68 found on system at:
150.37 s
> /nix/store/da9x1n5l146q0ai9wz8zfbx4zfwa9b02-ghc-9.6.7/bin/hpc-ghc-9.6.7
150.37 s
> Using hsc2hs version 0.68.9 found on system at:
150.37 s
> /nix/store/da9x1n5l146q0ai9wz8zfbx4zfwa9b02-ghc-9.6.7/bin/hsc2hs-ghc-9.6.7
150.37 s
> Using hscolour version 1.25 found on system at:
150.37 s
> /nix/store/7ffc07q75k5a6zk864jv9gpiphhwzjlh-hscolour-1.25/bin/HsColour
150.37 s
> No jhc found
150.37 s
> Using ld found on system at:
150.37 s
> /nix/store/iz5lckcsg66r223si2gck7csk2hihj0m-binutils-wrapper-2.44/bin/ld.gold
150.37 s
> No pkg-config found
150.37 s
> Using runghc version 9.6.7 found on system at:
150.37 s
> /nix/store/da9x1n5l146q0ai9wz8zfbx4zfwa9b02-ghc-9.6.7/bin/runghc-9.6.7
150.37 s
> Using strip version 2.44 found on system at:
150.37 s
> /nix/store/8v97ngkcpfzgghwnnr7fsz33p2x22gy9-gcc-wrapper-14.3.0/bin/strip
150.37 s
> Using tar found on system at:
150.37 s
> /nix/store/xl6pd2spjajwcpq09fnmnjv5psqmlmma-gnutar-1.35/bin/tar
150.37 s
> No uhc found
150.37 s
> Running phase: buildPhase
150.37 s
> Preprocessing library for pathway-compat-filepath-0.0.1.0..
150.37 s
> Building library for pathway-compat-filepath-0.0.1.0..
150.37 s
> [ 1 of 10] Compiling Common.FilePath ( src/Common/FilePath.hs, dist/build/Common/FilePath.o, dist/build/Common/FilePath.dyn_o )
150.37 s
> [ 2 of 10] Compiling Common.OsPath ( src/Common/OsPath.hs, dist/build/Common/OsPath.o, dist/build/Common/OsPath.dyn_o )
150.37 s
>
150.37 s
> src/Common/OsPath.hs:87:23: error : [ GHC-76037 ]
150.37 s
> Not in scope: ‘O.unsafeEncodeUtf’
150.37 s
> NB: the module ‘System.OsPath’ does not export ‘unsafeEncodeUtf’.
150.37 s
> |
150.37 s
> 87 | Format.parent = O.unsafeEncodeUtf "..",
150.37 s
> | ^^^^^^^^^^^^^^^^^
150.37 s
> [ 3 of 10] Compiling System.FilePath.Thin ( src/System/FilePath/Thin.hs, dist/build/System/FilePath/Thin.o, dist/build/System/FilePath/Thin.dyn_o )
150.37 s
> [ 4 of 10] Compiling System.FilePath.Pathway ( src/System/FilePath/Pathway.hs, dist/build/System/FilePath/Pathway.o, dist/build/System/FilePath/Pathway.dyn_o )
150.37 s
> [ 5 of 10] Compiling System.FilePath.Overlay ( src/System/FilePath/Overlay.hs, dist/build/System/FilePath/Overlay.o, dist/build/System/FilePath/Overlay.dyn_o )
150.37 s
> [ 6 of 10] Compiling System.FilePath ( src/System/FilePath.hs, dist/build/System/FilePath.o, dist/build/System/FilePath.dyn_o )
150.37 s
For full logs, run:
150.37 s
nix log /nix/store/ky3d4fbd2n1245lyrqqafbzks6pvj6yx-pathway-compat-filepath-0.0.1.0.drv
150.37 s
error: Cannot build '/nix/store/ky3d4fbd2n1245lyrqqafbzks6pvj6yx-pathway-compat-filepath-0.0.1.0.drv '.
150.37 s
Reason: builder failed with exit code 1 .
150.37 s
Output paths:
150.37 s
/nix/store/cchjkcffdkdfqbjkrmmp89a5gxnhp5as-pathway-compat-filepath-0.0.1.0-doc
150.37 s
/nix/store/phlcj8ksn09xr2h64vqgfxmn7hpb9xgk-pathway-compat-filepath-0.0.1.0
150.37 s
Last 151 log lines:
150.37 s
> Running phase: setupCompilerEnvironmentPhase
150.37 s
> Build with /nix/store/da9x1n5l146q0ai9wz8zfbx4zfwa9b02-ghc-9.6.7.
150.37 s
> Running phase: unpackPhase
150.37 s
> unpacking source archive /nix/store/723m6sjvk66iiqzpvcfdd74xi6id5zqq-zjizyqf4pafgh9rycgxd507dhvpisdy1-source/./compat/filepath
150.37 s
> source root is filepath
150.37 s
> Running phase: patchPhase
150.37 s
> Running phase: compileBuildDriverPhase
150.37 s
> setupCompileFlags: -package-db=/build/tmp.UPL5mMSZiG/setup-package.conf.d -threaded
150.37 s
> [1 of 2] Compiling Main ( Setup.hs, /build/tmp.UPL5mMSZiG/Main.o )
150.37 s
> [2 of 2] Linking Setup
150.37 s
> Running phase: updateAutotoolsGnuConfigScriptsPhase
150.37 s
> Running phase: configurePhase
150.37 s
> configureFlags: --verbose --prefix=/nix/store/phlcj8ksn09xr2h64vqgfxmn7hpb9xgk-pathway-compat-filepath-0.0.1.0 --libdir=$prefix/lib/$compiler/lib --libsubdir=$abi/$libname --docdir=/nix/store/cchjkcffdkdfqbjkrmmp89a5gxnhp5as-pathway-compat-filepath-0.0.1.0-doc/share/doc/pathway-compat-filepath-0.0.1.0 --with-gcc=gcc --package-db=/build/tmp.UPL5mMSZiG/package.conf.d --ghc-option=-j16 --ghc-option=+RTS --ghc-option=-A64M --ghc-option=-RTS --enable-library-profiling --profiling-detail=exported-functions --disable-profiling --enable-shared --disable-coverage --enable-static --disable-executable-dynamic --enable-tests --disable-benchmarks --enable-library-vanilla --disable-library-for-ghci --enable-split-sections --enable-library-stripping --enable-executable-stripping --ghc-option=-haddock --ghc-options=-Werror --extra-lib-dirs=/nix/store/ffyzkisqs4vc4mg28bwwlyqjf8i9ph6b-ncurses-6.5/lib --extra-lib-dirs=/nix/store/n28qgdj8c1q41kf7n4y1jxa6ckp85m3c-libffi-3.5.2/lib --extra-lib-dirs=/nix/store/1b6h99dw7bk4wbn77kbalih42zbc67m1-elfutils-0.194/lib --extra-lib-dirs=/nix/store/hi0ar880110k6jsmmili7dh1gq3cg2a9-gmp-with-cxx-6.3.0/lib --extra-lib-dirs=/nix/store/g09cflpnp4g80q56sj9dng1qzv4v4ybc-numactl-2.0.18/lib --extra-lib-dirs=/nix/store/da9x1n5l146q0ai9wz8zfbx4zfwa9b02-ghc-9.6.7/lib
150.37 s
> Using Parsec parser
150.37 s
> Configuring pathway-compat-filepath-0.0.1.0...
150.37 s
> Flags chosen: noisy-deprecations=True, verify-no-recursion=False
150.37 s
> Dependency base >=4.14.0 && <4.15 || >=4.15.0 && <4.16 || >=4.16.0 && <4.17 ||
150.37 s
> >=4.17.0 && <4.18 || >=4.18.0 && <4.19 || >=4.19.0 && <4.20 || >=4.20.0 &&
150.37 s
> <4.21 || >=4.21.0 && <4.22 || >=4.22.0 && <4.23: using base-4.18.3.0
150.37 s
> Dependency extra: using extra-1.8.1
150.37 s
> Dependency filepath >=1.4.2 && <1.5 || >=1.5.0 && <1.6: using
150.37 s
> filepath-1.4.301.0
150.37 s
> Dependency megaparsec >=9.0.1 && <9.1 || >=9.2.1 && <9.3 || >=9.5.0 && <9.6 ||
150.37 s
> >=9.7.0 && <9.8: using megaparsec-9.7.0
150.37 s
> Dependency pathway >=0.0.1 && <0.1: using pathway-0.0.1.0
150.37 s
> Dependency pathway-compat-base >=0.0.1 && <0.1: using
150.37 s
> pathway-compat-base-0.0.1.0
150.37 s
> Dependency pathway-internal >=0.0.1 && <0.1: using pathway-internal-0.0.1.0
150.37 s
> Dependency base >=4.14.0 && <4.15 || >=4.15.0 && <4.16 || >=4.16.0 && <4.17 ||
150.37 s
> >=4.17.0 && <4.18 || >=4.18.0 && <4.19 || >=4.19.0 && <4.20 || >=4.20.0 &&
150.37 s
> <4.21 || >=4.21.0 && <4.22 || >=4.22.0 && <4.23: using base-4.18.3.0
150.37 s
> Dependency doctest >=0.16.3 && <0.17 || >=0.18.1 && <0.19 || >=0.20.1 && <0.21
150.37 s
> || >=0.21.1 && <0.22 || >=0.22.2 && <0.23 || >=0.24.2 && <0.25: using
150.37 s
> doctest-0.24.2
150.37 s
> Dependency pathway-compat-filepath: using pathway-compat-filepath-0.0.1.0
150.37 s
> Source component graph:
150.37 s
> component lib
150.37 s
> component test:doctests dependency lib
150.37 s
> Configured component graph:
150.37 s
> component pathway-compat-filepath-0.0.1.0-L0VuJWewPKkKsQELfUFr0L
150.37 s
> include base-4.18.3.0
150.37 s
> include extra-1.8.1-mqL7YRifC8HhGrjpGYIL3
150.37 s
> include filepath-1.4.301.0
150.37 s
> include megaparsec-9.7.0-9FWtFuoAKCoJPEfZ8OP0ob
150.37 s
> include pathway-0.0.1.0-31EObXlLuVk60eWeEQLXMY
150.37 s
> include pathway-compat-base-0.0.1.0-BRBmFEfWQlkJP9xCDIxb6w
150.37 s
> include pathway-internal-0.0.1.0-6pVrF111eN4BAqGigGNQse
150.37 s
> component pathway-compat-filepath-0.0.1.0-7hV8D5x7Q712pKmJ0W1sv4-doctests
150.37 s
> include base-4.18.3.0
150.37 s
> include doctest-0.24.2-7YxPr6lrdwiBMDK2pmizgF
150.37 s
> include pathway-compat-filepath-0.0.1.0-L0VuJWewPKkKsQELfUFr0L
150.37 s
> Linked component graph:
150.37 s
> unit pathway-compat-filepath-0.0.1.0-L0VuJWewPKkKsQELfUFr0L
150.37 s
> include base-4.18.3.0
150.37 s
> include extra-1.8.1-mqL7YRifC8HhGrjpGYIL3
150.37 s
> include filepath-1.4.301.0
150.37 s
> include megaparsec-9.7.0-9FWtFuoAKCoJPEfZ8OP0ob
150.37 s
> include pathway-0.0.1.0-31EObXlLuVk60eWeEQLXMY
150.37 s
> include pathway-compat-base-0.0.1.0-BRBmFEfWQlkJP9xCDIxb6w
150.37 s
> include pathway-internal-0.0.1.0-6pVrF111eN4BAqGigGNQse
150.37 s
> Common.FilePath=pathway-compat-filepath-0.0.1.0-L0VuJWewPKkKsQELfUFr0L:Common.FilePath,Common.OsPath=pathway-compat-filepath-0.0.1.0-L0VuJWewPKkKsQELfUFr0L:Common.OsPath,System.FilePath=pathway-compat-filepath-0.0.1.0-L0VuJWewPKkKsQELfUFr0L:System.FilePath,System.FilePath.Overlay=pathway-compat-filepath-0.0.1.0-L0VuJWewPKkKsQELfUFr0L:System.FilePath.Overlay,System.FilePath.Pathway=pathway-compat-filepath-0.0.1.0-L0VuJWewPKkKsQELfUFr0L:System.FilePath.Pathway,System.FilePath.Thin=pathway-compat-filepath-0.0.1.0-L0VuJWewPKkKsQELfUFr0L:System.FilePath.Thin,System.OsPath=pathway-compat-filepath-0.0.1.0-L0VuJWewPKkKsQELfUFr0L:System.OsPath,System.OsPath.Overlay=pathway-compat-filepath-0.0.1.0-L0VuJWewPKkKsQELfUFr0L:System.OsPath.Overlay,System.OsPath.Pathway=pathway-compat-filepath-0.0.1.0-L0VuJWewPKkKsQELfUFr0L:System.OsPath.Pathway,System.OsPath.Thin=pathway-compat-filepath-0.0.1.0-L0VuJWewPKkKsQELfUFr0L:System.OsPath.Thin
150.37 s
> unit pathway-compat-filepath-0.0.1.0-7hV8D5x7Q712pKmJ0W1sv4-doctests
150.37 s
> include base-4.18.3.0
150.37 s
> include doctest-0.24.2-7YxPr6lrdwiBMDK2pmizgF
150.37 s
> include pathway-compat-filepath-0.0.1.0-L0VuJWewPKkKsQELfUFr0L
150.37 s
> Ready component graph:
150.37 s
> definite pathway-compat-filepath-0.0.1.0-L0VuJWewPKkKsQELfUFr0L
150.37 s
> depends base-4.18.3.0
150.37 s
> depends extra-1.8.1-mqL7YRifC8HhGrjpGYIL3
150.37 s
> depends filepath-1.4.301.0
150.37 s
> depends megaparsec-9.7.0-9FWtFuoAKCoJPEfZ8OP0ob
150.37 s
> depends pathway-0.0.1.0-31EObXlLuVk60eWeEQLXMY
150.37 s
> depends pathway-compat-base-0.0.1.0-BRBmFEfWQlkJP9xCDIxb6w
150.37 s
> depends pathway-internal-0.0.1.0-6pVrF111eN4BAqGigGNQse
150.37 s
> definite pathway-compat-filepath-0.0.1.0-7hV8D5x7Q712pKmJ0W1sv4-doctests
150.37 s
> depends base-4.18.3.0
150.37 s
> depends doctest-0.24.2-7YxPr6lrdwiBMDK2pmizgF
150.37 s
> depends pathway-compat-filepath-0.0.1.0-L0VuJWewPKkKsQELfUFr0L
150.37 s
> Using Cabal-3.10.3.0 compiled by ghc-9.6
150.37 s
> Using compiler: ghc-9.6.7
150.37 s
> Using install prefix:
150.37 s
> /nix/store/phlcj8ksn09xr2h64vqgfxmn7hpb9xgk-pathway-compat-filepath-0.0.1.0
150.37 s
> Executables installed in:
150.37 s
> /nix/store/phlcj8ksn09xr2h64vqgfxmn7hpb9xgk-pathway-compat-filepath-0.0.1.0/bin
150.37 s
> Libraries installed in:
150.37 s
> /nix/store/phlcj8ksn09xr2h64vqgfxmn7hpb9xgk-pathway-compat-filepath-0.0.1.0/lib/ghc-9.6.7/lib/x86_64-linux-ghc-9.6.7/pathway-compat-filepath-0.0.1.0-L0VuJWewPKkKsQELfUFr0L
150.37 s
> Dynamic Libraries installed in:
150.37 s
> /nix/store/phlcj8ksn09xr2h64vqgfxmn7hpb9xgk-pathway-compat-filepath-0.0.1.0/lib/ghc-9.6.7/lib/x86_64-linux-ghc-9.6.7
150.37 s
> Private executables installed in:
150.37 s
> /nix/store/phlcj8ksn09xr2h64vqgfxmn7hpb9xgk-pathway-compat-filepath-0.0.1.0/libexec/x86_64-linux-ghc-9.6.7/pathway-compat-filepath-0.0.1.0
150.37 s
> Data files installed in:
150.37 s
> /nix/store/phlcj8ksn09xr2h64vqgfxmn7hpb9xgk-pathway-compat-filepath-0.0.1.0/share/x86_64-linux-ghc-9.6.7/pathway-compat-filepath-0.0.1.0
150.37 s
> Documentation installed in:
150.37 s
> /nix/store/cchjkcffdkdfqbjkrmmp89a5gxnhp5as-pathway-compat-filepath-0.0.1.0-doc/share/doc/pathway-compat-filepath-0.0.1.0
150.37 s
> Configuration files installed in:
150.37 s
> /nix/store/phlcj8ksn09xr2h64vqgfxmn7hpb9xgk-pathway-compat-filepath-0.0.1.0/etc
150.37 s
> No alex found
150.37 s
> Using ar found on system at:
150.37 s
> /nix/store/iz5lckcsg66r223si2gck7csk2hihj0m-binutils-wrapper-2.44/bin/ar
150.37 s
> No c2hs found
150.37 s
> No cpphs found
150.37 s
> Using doctest version 0.24.2 found on system at:
150.37 s
> /nix/store/mky1glcba5jwjn0h7fa1mldfnh39g6l9-doctest-0.24.2/bin/doctest
150.37 s
> Using gcc version 14.3.0 given by user at:
150.37 s
> /nix/store/8v97ngkcpfzgghwnnr7fsz33p2x22gy9-gcc-wrapper-14.3.0/bin/gcc
150.37 s
> Using ghc version 9.6.7 found on system at:
150.37 s
> /nix/store/da9x1n5l146q0ai9wz8zfbx4zfwa9b02-ghc-9.6.7/bin/ghc
150.37 s
> Using ghc-pkg version 9.6.7 found on system at:
150.37 s
> /nix/store/da9x1n5l146q0ai9wz8zfbx4zfwa9b02-ghc-9.6.7/bin/ghc-pkg-9.6.7
150.37 s
> No ghcjs found
150.37 s
> No ghcjs-pkg found
150.37 s
> No greencard found
150.37 s
> Using haddock version 2.29.2 found on system at:
150.37 s
> /nix/store/da9x1n5l146q0ai9wz8zfbx4zfwa9b02-ghc-9.6.7/bin/haddock-ghc-9.6.7
150.37 s
> No happy found
150.37 s
> Using haskell-suite found on system at: haskell-suite-dummy-location
150.37 s
> Using haskell-suite-pkg found on system at: haskell-suite-pkg-dummy-location
150.37 s
> No hmake found
150.37 s
> Using hpc version 0.68 found on system at:
150.37 s
> /nix/store/da9x1n5l146q0ai9wz8zfbx4zfwa9b02-ghc-9.6.7/bin/hpc-ghc-9.6.7
150.37 s
> Using hsc2hs version 0.68.9 found on system at:
150.37 s
> /nix/store/da9x1n5l146q0ai9wz8zfbx4zfwa9b02-ghc-9.6.7/bin/hsc2hs-ghc-9.6.7
150.37 s
> Using hscolour version 1.25 found on system at:
150.37 s
> /nix/store/7ffc07q75k5a6zk864jv9gpiphhwzjlh-hscolour-1.25/bin/HsColour
150.37 s
> No jhc found
150.37 s
> Using ld found on system at:
150.37 s
> /nix/store/iz5lckcsg66r223si2gck7csk2hihj0m-binutils-wrapper-2.44/bin/ld.gold
150.37 s
> No pkg-config found
150.37 s
> Using runghc version 9.6.7 found on system at:
150.37 s
> /nix/store/da9x1n5l146q0ai9wz8zfbx4zfwa9b02-ghc-9.6.7/bin/runghc-9.6.7
150.37 s
> Using strip version 2.44 found on system at:
150.37 s
> /nix/store/8v97ngkcpfzgghwnnr7fsz33p2x22gy9-gcc-wrapper-14.3.0/bin/strip
150.37 s
> Using tar found on system at:
150.37 s
> /nix/store/xl6pd2spjajwcpq09fnmnjv5psqmlmma-gnutar-1.35/bin/tar
150.37 s
> No uhc found
150.37 s
> Running phase: buildPhase
150.37 s
> Preprocessing library for pathway-compat-filepath-0.0.1.0..
150.37 s
> Building library for pathway-compat-filepath-0.0.1.0..
150.37 s
> [ 1 of 10] Compiling Common.FilePath ( src/Common/FilePath.hs, dist/build/Common/FilePath.o, dist/build/Common/FilePath.dyn_o )
150.37 s
> [ 2 of 10] Compiling Common.OsPath ( src/Common/OsPath.hs, dist/build/Common/OsPath.o, dist/build/Common/OsPath.dyn_o )
150.37 s
>
150.37 s
> src/Common/OsPath.hs:87:23: error : [ GHC-76037 ]
150.37 s
> Not in scope: ‘O.unsafeEncodeUtf’
150.37 s
> NB: the module ‘System.OsPath’ does not export ‘unsafeEncodeUtf’.
150.37 s
> |
150.37 s
> 87 | Format.parent = O.unsafeEncodeUtf "..",
150.37 s
> | ^^^^^^^^^^^^^^^^^
150.37 s
> [ 3 of 10] Compiling System.FilePath.Thin ( src/System/FilePath/Thin.hs, dist/build/System/FilePath/Thin.o, dist/build/System/FilePath/Thin.dyn_o )
150.37 s
> [ 4 of 10] Compiling System.FilePath.Pathway ( src/System/FilePath/Pathway.hs, dist/build/System/FilePath/Pathway.o, dist/build/System/FilePath/Pathway.dyn_o )
150.37 s
> [ 5 of 10] Compiling System.FilePath.Overlay ( src/System/FilePath/Overlay.hs, dist/build/System/FilePath/Overlay.o, dist/build/System/FilePath/Overlay.dyn_o )
150.37 s
> [ 6 of 10] Compiling System.FilePath ( src/System/FilePath.hs, dist/build/System/FilePath.o, dist/build/System/FilePath.dyn_o )
150.37 s
For full logs, run:
150.37 s
nix log /nix/store/ky3d4fbd2n1245lyrqqafbzks6pvj6yx-pathway-compat-filepath-0.0.1.0.drv
150.37 s
error: Cannot build '/nix/store/3vbjn9jkkyz37dm9smjix8hw63j2gl7x-ghc-9.6.7-with-packages.drv '.
150.37 s
Reason: 1 dependency failed .
150.37 s
Output paths:
150.37 s
/nix/store/xxg3mpyav890r1sycx59jdqbsz1qzyhz-ghc-9.6.7-with-packages
150.37 s
error: Cannot build '/nix/store/j6s9kmsbhwxgrfrrxpyp9v3r6nqhrsik-pathway-compat-directory-0.0.1.0.drv '.
150.37 s
Reason: 1 dependency failed .
150.37 s
Output paths:
150.37 s
/nix/store/7vlsb5s1xzm3gj9pazkkmql6ngg629dj-pathway-compat-directory-0.0.1.0-doc
150.37 s
/nix/store/sp4nd7ma4mv1dqdh34yp9mv0rap7azjd-pathway-compat-directory-0.0.1.0
150.37 s
error: Cannot build '/nix/store/f4vx65smf5yrza4igjs21knayx1x52rn-pathway-compat-file-io-0.0.1.0.drv '.
150.37 s
Reason: 1 dependency failed .
150.37 s
Output paths:
150.37 s
/nix/store/v9vlsg022s8lvbifqf6vljd2mwra2qa9-pathway-compat-file-io-0.0.1.0
150.37 s
/nix/store/zvp84zym5a3j9j3x09rp2qd21n1pldd4-pathway-compat-file-io-0.0.1.0-doc
150.37 s
error: Cannot build '/nix/store/vrph1jdgm748dbnysajhnrc6qspm56y1-pathway-compat-temporary-0.0.1.0.drv '.
150.37 s
Reason: 1 dependency failed .
150.37 s
Output paths:
150.37 s
/nix/store/bdf8bvzmn7v5ngfacmff1jaycx38gy6b-pathway-compat-temporary-0.0.1.0
150.37 s
/nix/store/smrv1q41bva08jsakmay0ylxv1r41lzr-pathway-compat-temporary-0.0.1.0-doc
150.37 s
error: Cannot build '/nix/store/vq06xbq6yy1rvcz3fvh9vkabamj36ysx-pathway-system-0.0.1.0.drv '.
150.37 s
Reason: 1 dependency failed .
150.37 s
Output paths:
150.37 s
/nix/store/9303w25nmidczm0k7h2pdic85jff690x-pathway-system-0.0.1.0
150.37 s
/nix/store/visz5vm0yjss8s2ph7bx6jg1aawk3w91-pathway-system-0.0.1.0-doc
150.37 s
error: Build failed due to failed dependency
150.37 s
error: Cannot build '/nix/store/kpsrp0ddpy4x0yhhxf5hgjnaqb2l1aqb-all-packages.drv '.
150.37 s
Reason: 1 dependency failed .
150.37 s
Output paths:
150.37 s
/nix/store/sz9kjyi6l0ygk3xi0qis5yvysq51klz6-all-packages
150.38 s
Build failed due to failed dependency
150.41 s
Build failed.