1. 0.69 s $ /nix/store/9ypz3flqsrl5xl495mm8h645gadjsxi1-coreutils-9.11/bin/timeout --kill-after=15s 7200s /nix/store/23zk8sgzamrbmj1fday15szf7f2279s8-nix-2.34.7/bin/nix --extra-experimental-features nix-command --extra-experimental-features flakes --log-format internal-json build --no-link --print-out-paths git+https://github.com/sellout/pathway?ref=more-system&rev=315332dbcaa9f1016fc658995abc767abdaec679&shallow=1#packages.x86_64-linux.ghc967_all --print-build-logs
  2. 0.70 s warning: ignoring untrusted flake configuration setting 'allow-import-from-derivation'.
  3. 0.70 s Pass '--accept-flake-config' to trust it
  4. 0.70 s warning: ignoring untrusted flake configuration setting 'extra-experimental-features'.
  5. 0.70 s Pass '--accept-flake-config' to trust it
  6. 0.70 s warning: ignoring untrusted flake configuration setting 'extra-substituters'.
  7. 0.70 s Pass '--accept-flake-config' to trust it
  8. 0.70 s warning: ignoring untrusted flake configuration setting 'extra-trusted-public-keys'.
  9. 0.70 s Pass '--accept-flake-config' to trust it
  10. 0.70 s warning: ignoring untrusted flake configuration setting 'sandbox'.
  11. 0.70 s Pass '--accept-flake-config' to trust it
  12. 0.70 s warning: ignoring untrusted flake configuration setting 'use-registries'.
  13. 0.70 s Pass '--accept-flake-config' to trust it
  14. 1.25 s
  15. 1.77 s Building /nix/store/ky3d4fbd2n1245lyrqqafbzks6pvj6yx-pathway-compat-filepath-0.0.1.0.drv
  16. 2.00 s [pathway-compat-filepath] Phase: setupCompilerEnvironmentPhase
  17. 2.01 s [pathway-compat-filepath] Build with /nix/store/da9x1n5l146q0ai9wz8zfbx4zfwa9b02-ghc-9.6.7.
  18. 2.26 s [pathway-compat-filepath] Phase: unpackPhase
  19. 2.26 s [pathway-compat-filepath] unpacking source archive /nix/store/723m6sjvk66iiqzpvcfdd74xi6id5zqq-zjizyqf4pafgh9rycgxd507dhvpisdy1-source/./compat/filepath
  20. 2.26 s [pathway-compat-filepath] source root is filepath
  21. 2.27 s [pathway-compat-filepath] Phase: patchPhase
  22. 2.28 s [pathway-compat-filepath] Phase: compileBuildDriverPhase
  23. 2.28 s [pathway-compat-filepath] setupCompileFlags: -package-db=/build/tmp.kHIc8suGvt/setup-package.conf.d -threaded
  24. 2.33 s [pathway-compat-filepath] [1 of 2] Compiling Main ( Setup.hs, /build/tmp.kHIc8suGvt/Main.o )
  25. 2.37 s [pathway-compat-filepath] [2 of 2] Linking Setup
  26. 3.47 s [pathway-compat-filepath] Phase: updateAutotoolsGnuConfigScriptsPhase
  27. 3.48 s [pathway-compat-filepath] Phase: configurePhase
  28. 3.49 s [pathway-compat-filepath] configureFlags: --verbose --prefix=/nix/store/phlcj8ksn09xr2h64vqgfxmn7hpb9xgk-pathway-compat-filepath-0.0.1.0 --libdir=$prefix/lib/$compiler/lib --libsubdir=$abi/$libname --docdir=/nix/store/cchjkcffdkdfqbjkrmmp89a5gxnhp5as-pathway-compat-filepath-0.0.1.0-doc/share/doc/pathway-compat-filepath-0.0.1.0 --with-gcc=gcc --package-db=/build/tmp.kHIc8suGvt/package.conf.d --ghc-option=-j16 --ghc-option=+RTS --ghc-option=-A64M --ghc-option=-RTS --enable-library-profiling --profiling-detail=exported-functions --disable-profiling --enable-shared --disable-coverage --enable-static --disable-executable-dynamic --enable-tests --disable-benchmarks --enable-library-vanilla --disable-library-for-ghci --enable-split-sections --enable-library-stripping --enable-executable-stripping --ghc-option=-haddock --ghc-options=-Werror --extra-lib-dirs=/nix/store/ffyzkisqs4vc4mg28bwwlyqjf8i9ph6b-ncurses-6.5/lib --extra-lib-dirs=/nix/store/n28qgdj8c1q41kf7n4y1jxa6ckp85m3c-libffi-3.5.2/lib --extra-lib-dirs=/nix/store/1b6h99dw7bk4wbn77kbalih42zbc67m1-elfutils-0.194/lib --extra-lib-dirs=/nix/store/hi0ar880110k6jsmmili7dh1gq3cg2a9-gmp-with-cxx-6.3.0/lib --extra-lib-dirs=/nix/store/g09cflpnp4g80q56sj9dng1qzv4v4ybc-numactl-2.0.18/lib --extra-lib-dirs=/nix/store/da9x1n5l146q0ai9wz8zfbx4zfwa9b02-ghc-9.6.7/lib
  29. 3.50 s [pathway-compat-filepath] Using Parsec parser
  30. 3.50 s [pathway-compat-filepath] Configuring pathway-compat-filepath-0.0.1.0...
  31. 3.81 s [pathway-compat-filepath] Flags chosen: noisy-deprecations=True, verify-no-recursion=False
  32. 3.81 s [pathway-compat-filepath] Dependency base >=4.14.0 && <4.15 || >=4.15.0 && <4.16 || >=4.16.0 && <4.17 ||
  33. 3.81 s [pathway-compat-filepath] >=4.17.0 && <4.18 || >=4.18.0 && <4.19 || >=4.19.0 && <4.20 || >=4.20.0 &&
  34. 3.81 s [pathway-compat-filepath] <4.21 || >=4.21.0 && <4.22 || >=4.22.0 && <4.23: using base-4.18.3.0
  35. 3.81 s [pathway-compat-filepath] Dependency extra: using extra-1.8.1
  36. 3.81 s [pathway-compat-filepath] Dependency filepath >=1.4.2 && <1.5 || >=1.5.0 && <1.6: using
  37. 3.81 s [pathway-compat-filepath] filepath-1.4.301.0
  38. 3.81 s [pathway-compat-filepath] Dependency megaparsec >=9.0.1 && <9.1 || >=9.2.1 && <9.3 || >=9.5.0 && <9.6 ||
  39. 3.81 s [pathway-compat-filepath] >=9.7.0 && <9.8: using megaparsec-9.7.0
  40. 3.81 s [pathway-compat-filepath] Dependency pathway >=0.0.1 && <0.1: using pathway-0.0.1.0
  41. 3.81 s [pathway-compat-filepath] Dependency pathway-compat-base >=0.0.1 && <0.1: using
  42. 3.81 s [pathway-compat-filepath] pathway-compat-base-0.0.1.0
  43. 3.81 s [pathway-compat-filepath] Dependency pathway-internal >=0.0.1 && <0.1: using pathway-internal-0.0.1.0
  44. 3.81 s [pathway-compat-filepath] Dependency base >=4.14.0 && <4.15 || >=4.15.0 && <4.16 || >=4.16.0 && <4.17 ||
  45. 3.81 s [pathway-compat-filepath] >=4.17.0 && <4.18 || >=4.18.0 && <4.19 || >=4.19.0 && <4.20 || >=4.20.0 &&
  46. 3.81 s [pathway-compat-filepath] <4.21 || >=4.21.0 && <4.22 || >=4.22.0 && <4.23: using base-4.18.3.0
  47. 3.81 s [pathway-compat-filepath] Dependency doctest >=0.16.3 && <0.17 || >=0.18.1 && <0.19 || >=0.20.1 && <0.21
  48. 3.81 s [pathway-compat-filepath] || >=0.21.1 && <0.22 || >=0.22.2 && <0.23 || >=0.24.2 && <0.25: using
  49. 3.81 s [pathway-compat-filepath] doctest-0.24.2
  50. 3.81 s [pathway-compat-filepath] Dependency pathway-compat-filepath: using pathway-compat-filepath-0.0.1.0
  51. 4.11 s [pathway-compat-filepath] Source component graph:
  52. 4.11 s [pathway-compat-filepath] component lib
  53. 4.11 s [pathway-compat-filepath] component test:doctests dependency lib
  54. 4.11 s [pathway-compat-filepath] Configured component graph:
  55. 4.11 s [pathway-compat-filepath] component pathway-compat-filepath-0.0.1.0-L0VuJWewPKkKsQELfUFr0L
  56. 4.11 s [pathway-compat-filepath] include base-4.18.3.0
  57. 4.11 s [pathway-compat-filepath] include extra-1.8.1-mqL7YRifC8HhGrjpGYIL3
  58. 4.11 s [pathway-compat-filepath] include filepath-1.4.301.0
  59. 4.12 s [pathway-compat-filepath] include megaparsec-9.7.0-9FWtFuoAKCoJPEfZ8OP0ob
  60. 4.12 s [pathway-compat-filepath] include pathway-0.0.1.0-31EObXlLuVk60eWeEQLXMY
  61. 4.12 s [pathway-compat-filepath] include pathway-compat-base-0.0.1.0-BRBmFEfWQlkJP9xCDIxb6w
  62. 4.12 s [pathway-compat-filepath] include pathway-internal-0.0.1.0-6pVrF111eN4BAqGigGNQse
  63. 4.12 s [pathway-compat-filepath] component pathway-compat-filepath-0.0.1.0-7hV8D5x7Q712pKmJ0W1sv4-doctests
  64. 4.12 s [pathway-compat-filepath] include base-4.18.3.0
  65. 4.12 s [pathway-compat-filepath] include doctest-0.24.2-7YxPr6lrdwiBMDK2pmizgF
  66. 4.12 s [pathway-compat-filepath] include pathway-compat-filepath-0.0.1.0-L0VuJWewPKkKsQELfUFr0L
  67. 4.12 s [pathway-compat-filepath] Linked component graph:
  68. 4.12 s [pathway-compat-filepath] unit pathway-compat-filepath-0.0.1.0-L0VuJWewPKkKsQELfUFr0L
  69. 4.12 s [pathway-compat-filepath] include base-4.18.3.0
  70. 4.12 s [pathway-compat-filepath] include extra-1.8.1-mqL7YRifC8HhGrjpGYIL3
  71. 4.12 s [pathway-compat-filepath] include filepath-1.4.301.0
  72. 4.12 s [pathway-compat-filepath] include megaparsec-9.7.0-9FWtFuoAKCoJPEfZ8OP0ob
  73. 4.12 s [pathway-compat-filepath] include pathway-0.0.1.0-31EObXlLuVk60eWeEQLXMY
  74. 4.12 s [pathway-compat-filepath] include pathway-compat-base-0.0.1.0-BRBmFEfWQlkJP9xCDIxb6w
  75. 4.12 s [pathway-compat-filepath] include pathway-internal-0.0.1.0-6pVrF111eN4BAqGigGNQse
  76. 4.12 s [pathway-compat-filepath] Common.FilePath=pathway-compat-filepath-0.0.1.0-L0VuJWewPKkKsQELfUFr0L:Common.FilePath,Common.OsPath=pathway-compat-filepath-0.0.1.0-L0VuJWewPKkKsQELfUFr0L:Common.OsPath,System.FilePath=pathway-compat-filepath-0.0.1.0-L0VuJWewPKkKsQELfUFr0L:System.FilePath,System.FilePath.Overlay=pathway-compat-filepath-0.0.1.0-L0VuJWewPKkKsQELfUFr0L:System.FilePath.Overlay,System.FilePath.Pathway=pathway-compat-filepath-0.0.1.0-L0VuJWewPKkKsQELfUFr0L:System.FilePath.Pathway,System.FilePath.Thin=pathway-compat-filepath-0.0.1.0-L0VuJWewPKkKsQELfUFr0L:System.FilePath.Thin,System.OsPath=pathway-compat-filepath-0.0.1.0-L0VuJWewPKkKsQELfUFr0L:System.OsPath,System.OsPath.Overlay=pathway-compat-filepath-0.0.1.0-L0VuJWewPKkKsQELfUFr0L:System.OsPath.Overlay,System.OsPath.Pathway=pathway-compat-filepath-0.0.1.0-L0VuJWewPKkKsQELfUFr0L:System.OsPath.Pathway,System.OsPath.Thin=pathway-compat-filepath-0.0.1.0-L0VuJWewPKkKsQELfUFr0L:System.OsPath.Thin
  77. 4.12 s [pathway-compat-filepath] unit pathway-compat-filepath-0.0.1.0-7hV8D5x7Q712pKmJ0W1sv4-doctests
  78. 4.12 s [pathway-compat-filepath] include base-4.18.3.0
  79. 4.12 s [pathway-compat-filepath] include doctest-0.24.2-7YxPr6lrdwiBMDK2pmizgF
  80. 4.12 s [pathway-compat-filepath] include pathway-compat-filepath-0.0.1.0-L0VuJWewPKkKsQELfUFr0L
  81. 4.12 s [pathway-compat-filepath] Ready component graph:
  82. 4.12 s [pathway-compat-filepath] definite pathway-compat-filepath-0.0.1.0-L0VuJWewPKkKsQELfUFr0L
  83. 4.12 s [pathway-compat-filepath] depends base-4.18.3.0
  84. 4.12 s [pathway-compat-filepath] depends extra-1.8.1-mqL7YRifC8HhGrjpGYIL3
  85. 4.12 s [pathway-compat-filepath] depends filepath-1.4.301.0
  86. 4.12 s [pathway-compat-filepath] depends megaparsec-9.7.0-9FWtFuoAKCoJPEfZ8OP0ob
  87. 4.12 s [pathway-compat-filepath] depends pathway-0.0.1.0-31EObXlLuVk60eWeEQLXMY
  88. 4.12 s [pathway-compat-filepath] depends pathway-compat-base-0.0.1.0-BRBmFEfWQlkJP9xCDIxb6w
  89. 4.12 s [pathway-compat-filepath] depends pathway-internal-0.0.1.0-6pVrF111eN4BAqGigGNQse
  90. 4.12 s [pathway-compat-filepath] definite pathway-compat-filepath-0.0.1.0-7hV8D5x7Q712pKmJ0W1sv4-doctests
  91. 4.12 s [pathway-compat-filepath] depends base-4.18.3.0
  92. 4.12 s [pathway-compat-filepath] depends doctest-0.24.2-7YxPr6lrdwiBMDK2pmizgF
  93. 4.12 s [pathway-compat-filepath] depends pathway-compat-filepath-0.0.1.0-L0VuJWewPKkKsQELfUFr0L
  94. 4.12 s [pathway-compat-filepath] Using Cabal-3.10.3.0 compiled by ghc-9.6
  95. 4.12 s [pathway-compat-filepath] Using compiler: ghc-9.6.7
  96. 4.12 s [pathway-compat-filepath] Using install prefix:
  97. 4.12 s [pathway-compat-filepath] /nix/store/phlcj8ksn09xr2h64vqgfxmn7hpb9xgk-pathway-compat-filepath-0.0.1.0
  98. 4.12 s [pathway-compat-filepath] Executables installed in:
  99. 4.12 s [pathway-compat-filepath] /nix/store/phlcj8ksn09xr2h64vqgfxmn7hpb9xgk-pathway-compat-filepath-0.0.1.0/bin
  100. 4.12 s [pathway-compat-filepath] Libraries installed in:
  101. 4.12 s [pathway-compat-filepath] /nix/store/phlcj8ksn09xr2h64vqgfxmn7hpb9xgk-pathway-compat-filepath-0.0.1.0/lib/ghc-9.6.7/lib/x86_64-linux-ghc-9.6.7/pathway-compat-filepath-0.0.1.0-L0VuJWewPKkKsQELfUFr0L
  102. 4.12 s [pathway-compat-filepath] Dynamic Libraries installed in:
  103. 4.12 s [pathway-compat-filepath] /nix/store/phlcj8ksn09xr2h64vqgfxmn7hpb9xgk-pathway-compat-filepath-0.0.1.0/lib/ghc-9.6.7/lib/x86_64-linux-ghc-9.6.7
  104. 4.12 s [pathway-compat-filepath] Private executables installed in:
  105. 4.12 s [pathway-compat-filepath] /nix/store/phlcj8ksn09xr2h64vqgfxmn7hpb9xgk-pathway-compat-filepath-0.0.1.0/libexec/x86_64-linux-ghc-9.6.7/pathway-compat-filepath-0.0.1.0
  106. 4.12 s [pathway-compat-filepath] Data files installed in:
  107. 4.12 s [pathway-compat-filepath] /nix/store/phlcj8ksn09xr2h64vqgfxmn7hpb9xgk-pathway-compat-filepath-0.0.1.0/share/x86_64-linux-ghc-9.6.7/pathway-compat-filepath-0.0.1.0
  108. 4.12 s [pathway-compat-filepath] Documentation installed in:
  109. 4.12 s [pathway-compat-filepath] /nix/store/cchjkcffdkdfqbjkrmmp89a5gxnhp5as-pathway-compat-filepath-0.0.1.0-doc/share/doc/pathway-compat-filepath-0.0.1.0
  110. 4.12 s [pathway-compat-filepath] Configuration files installed in:
  111. 4.12 s [pathway-compat-filepath] /nix/store/phlcj8ksn09xr2h64vqgfxmn7hpb9xgk-pathway-compat-filepath-0.0.1.0/etc
  112. 4.12 s [pathway-compat-filepath] No alex found
  113. 4.12 s [pathway-compat-filepath] Using ar found on system at:
  114. 4.12 s [pathway-compat-filepath] /nix/store/iz5lckcsg66r223si2gck7csk2hihj0m-binutils-wrapper-2.44/bin/ar
  115. 4.12 s [pathway-compat-filepath] No c2hs found
  116. 4.12 s [pathway-compat-filepath] No cpphs found
  117. 4.12 s [pathway-compat-filepath] Using doctest version 0.24.2 found on system at:
  118. 4.12 s [pathway-compat-filepath] /nix/store/mky1glcba5jwjn0h7fa1mldfnh39g6l9-doctest-0.24.2/bin/doctest
  119. 4.12 s [pathway-compat-filepath] Using gcc version 14.3.0 given by user at:
  120. 4.12 s [pathway-compat-filepath] /nix/store/8v97ngkcpfzgghwnnr7fsz33p2x22gy9-gcc-wrapper-14.3.0/bin/gcc
  121. 4.12 s [pathway-compat-filepath] Using ghc version 9.6.7 found on system at:
  122. 4.12 s [pathway-compat-filepath] /nix/store/da9x1n5l146q0ai9wz8zfbx4zfwa9b02-ghc-9.6.7/bin/ghc
  123. 4.12 s [pathway-compat-filepath] Using ghc-pkg version 9.6.7 found on system at:
  124. 4.12 s [pathway-compat-filepath] /nix/store/da9x1n5l146q0ai9wz8zfbx4zfwa9b02-ghc-9.6.7/bin/ghc-pkg-9.6.7
  125. 4.12 s [pathway-compat-filepath] No ghcjs found
  126. 4.12 s [pathway-compat-filepath] No ghcjs-pkg found
  127. 4.12 s [pathway-compat-filepath] No greencard found
  128. 4.12 s [pathway-compat-filepath] Using haddock version 2.29.2 found on system at:
  129. 4.12 s [pathway-compat-filepath] /nix/store/da9x1n5l146q0ai9wz8zfbx4zfwa9b02-ghc-9.6.7/bin/haddock-ghc-9.6.7
  130. 4.12 s [pathway-compat-filepath] No happy found
  131. 4.12 s [pathway-compat-filepath] Using haskell-suite found on system at: haskell-suite-dummy-location
  132. 4.12 s [pathway-compat-filepath] Using haskell-suite-pkg found on system at: haskell-suite-pkg-dummy-location
  133. 4.12 s [pathway-compat-filepath] No hmake found
  134. 4.12 s [pathway-compat-filepath] Using hpc version 0.68 found on system at:
  135. 4.12 s [pathway-compat-filepath] /nix/store/da9x1n5l146q0ai9wz8zfbx4zfwa9b02-ghc-9.6.7/bin/hpc-ghc-9.6.7
  136. 4.12 s [pathway-compat-filepath] Using hsc2hs version 0.68.9 found on system at:
  137. 4.12 s [pathway-compat-filepath] /nix/store/da9x1n5l146q0ai9wz8zfbx4zfwa9b02-ghc-9.6.7/bin/hsc2hs-ghc-9.6.7
  138. 4.12 s [pathway-compat-filepath] Using hscolour version 1.25 found on system at:
  139. 4.12 s [pathway-compat-filepath] /nix/store/7ffc07q75k5a6zk864jv9gpiphhwzjlh-hscolour-1.25/bin/HsColour
  140. 4.12 s [pathway-compat-filepath] No jhc found
  141. 4.12 s [pathway-compat-filepath] Using ld found on system at:
  142. 4.12 s [pathway-compat-filepath] /nix/store/iz5lckcsg66r223si2gck7csk2hihj0m-binutils-wrapper-2.44/bin/ld.gold
  143. 4.12 s [pathway-compat-filepath] No pkg-config found
  144. 4.12 s [pathway-compat-filepath] Using runghc version 9.6.7 found on system at:
  145. 4.12 s [pathway-compat-filepath] /nix/store/da9x1n5l146q0ai9wz8zfbx4zfwa9b02-ghc-9.6.7/bin/runghc-9.6.7
  146. 4.12 s [pathway-compat-filepath] Using strip version 2.44 found on system at:
  147. 4.12 s [pathway-compat-filepath] /nix/store/8v97ngkcpfzgghwnnr7fsz33p2x22gy9-gcc-wrapper-14.3.0/bin/strip
  148. 4.12 s [pathway-compat-filepath] Using tar found on system at:
  149. 4.12 s [pathway-compat-filepath] /nix/store/xl6pd2spjajwcpq09fnmnjv5psqmlmma-gnutar-1.35/bin/tar
  150. 4.12 s [pathway-compat-filepath] No uhc found
  151. 4.39 s [pathway-compat-filepath] Phase: buildPhase
  152. 4.45 s [pathway-compat-filepath] Preprocessing library for pathway-compat-filepath-0.0.1.0..
  153. 4.45 s [pathway-compat-filepath] Building library for pathway-compat-filepath-0.0.1.0..
  154. 4.53 s [pathway-compat-filepath] [ 1 of 10] Compiling Common.FilePath ( src/Common/FilePath.hs, dist/build/Common/FilePath.o, dist/build/Common/FilePath.dyn_o )
  155. 4.79 s [pathway-compat-filepath] [ 2 of 10] Compiling Common.OsPath ( src/Common/OsPath.hs, dist/build/Common/OsPath.o, dist/build/Common/OsPath.dyn_o )
  156. 4.79 s [pathway-compat-filepath]
  157. 4.80 s [pathway-compat-filepath] src/Common/OsPath.hs:87:23: error: [GHC-76037]
  158. 4.80 s [pathway-compat-filepath] Not in scope: ‘O.unsafeEncodeUtf’
  159. 4.80 s [pathway-compat-filepath] NB: the module ‘System.OsPath’ does not export ‘unsafeEncodeUtf’.
  160. 4.80 s [pathway-compat-filepath] |
  161. 4.80 s [pathway-compat-filepath] 87 | Format.parent = O.unsafeEncodeUtf "..",
  162. 4.80 s [pathway-compat-filepath] | ^^^^^^^^^^^^^^^^^
  163. 4.80 s [pathway-compat-filepath] [ 3 of 10] Compiling System.FilePath.Thin ( src/System/FilePath/Thin.hs, dist/build/System/FilePath/Thin.o, dist/build/System/FilePath/Thin.dyn_o )
  164. 4.94 s [pathway-compat-filepath] [ 4 of 10] Compiling System.FilePath.Pathway ( src/System/FilePath/Pathway.hs, dist/build/System/FilePath/Pathway.o, dist/build/System/FilePath/Pathway.dyn_o )
  165. 4.96 s [pathway-compat-filepath] [ 5 of 10] Compiling System.FilePath.Overlay ( src/System/FilePath/Overlay.hs, dist/build/System/FilePath/Overlay.o, dist/build/System/FilePath/Overlay.dyn_o )
  166. 4.98 s [pathway-compat-filepath] [ 6 of 10] Compiling System.FilePath ( src/System/FilePath.hs, dist/build/System/FilePath.o, dist/build/System/FilePath.dyn_o )
  167. 5.09 s Progress: 0 of 12 built (1 failed)
  168. 5.09 s Failed to build pathway-compat-filepath after 3.3s
  169. 5.09 s error: Cannot build '/nix/store/ky3d4fbd2n1245lyrqqafbzks6pvj6yx-pathway-compat-filepath-0.0.1.0.drv'.
  170. 5.09 s Reason: builder failed with exit code 1.
  171. 5.09 s Output paths:
  172. 5.09 s /nix/store/cchjkcffdkdfqbjkrmmp89a5gxnhp5as-pathway-compat-filepath-0.0.1.0-doc
  173. 5.09 s /nix/store/phlcj8ksn09xr2h64vqgfxmn7hpb9xgk-pathway-compat-filepath-0.0.1.0
  174. 5.09 s Last 151 log lines:
  175. 5.09 s > Running phase: setupCompilerEnvironmentPhase
  176. 5.09 s > Build with /nix/store/da9x1n5l146q0ai9wz8zfbx4zfwa9b02-ghc-9.6.7.
  177. 5.09 s > Running phase: unpackPhase
  178. 5.09 s > unpacking source archive /nix/store/723m6sjvk66iiqzpvcfdd74xi6id5zqq-zjizyqf4pafgh9rycgxd507dhvpisdy1-source/./compat/filepath
  179. 5.09 s > source root is filepath
  180. 5.09 s > Running phase: patchPhase
  181. 5.09 s > Running phase: compileBuildDriverPhase
  182. 5.09 s > setupCompileFlags: -package-db=/build/tmp.kHIc8suGvt/setup-package.conf.d -threaded
  183. 5.09 s > [1 of 2] Compiling Main ( Setup.hs, /build/tmp.kHIc8suGvt/Main.o )
  184. 5.09 s > [2 of 2] Linking Setup
  185. 5.09 s > Running phase: updateAutotoolsGnuConfigScriptsPhase
  186. 5.09 s > Running phase: configurePhase
  187. 5.09 s > configureFlags: --verbose --prefix=/nix/store/phlcj8ksn09xr2h64vqgfxmn7hpb9xgk-pathway-compat-filepath-0.0.1.0 --libdir=$prefix/lib/$compiler/lib --libsubdir=$abi/$libname --docdir=/nix/store/cchjkcffdkdfqbjkrmmp89a5gxnhp5as-pathway-compat-filepath-0.0.1.0-doc/share/doc/pathway-compat-filepath-0.0.1.0 --with-gcc=gcc --package-db=/build/tmp.kHIc8suGvt/package.conf.d --ghc-option=-j16 --ghc-option=+RTS --ghc-option=-A64M --ghc-option=-RTS --enable-library-profiling --profiling-detail=exported-functions --disable-profiling --enable-shared --disable-coverage --enable-static --disable-executable-dynamic --enable-tests --disable-benchmarks --enable-library-vanilla --disable-library-for-ghci --enable-split-sections --enable-library-stripping --enable-executable-stripping --ghc-option=-haddock --ghc-options=-Werror --extra-lib-dirs=/nix/store/ffyzkisqs4vc4mg28bwwlyqjf8i9ph6b-ncurses-6.5/lib --extra-lib-dirs=/nix/store/n28qgdj8c1q41kf7n4y1jxa6ckp85m3c-libffi-3.5.2/lib --extra-lib-dirs=/nix/store/1b6h99dw7bk4wbn77kbalih42zbc67m1-elfutils-0.194/lib --extra-lib-dirs=/nix/store/hi0ar880110k6jsmmili7dh1gq3cg2a9-gmp-with-cxx-6.3.0/lib --extra-lib-dirs=/nix/store/g09cflpnp4g80q56sj9dng1qzv4v4ybc-numactl-2.0.18/lib --extra-lib-dirs=/nix/store/da9x1n5l146q0ai9wz8zfbx4zfwa9b02-ghc-9.6.7/lib
  188. 5.09 s > Using Parsec parser
  189. 5.09 s > Configuring pathway-compat-filepath-0.0.1.0...
  190. 5.09 s > Flags chosen: noisy-deprecations=True, verify-no-recursion=False
  191. 5.09 s > Dependency base >=4.14.0 && <4.15 || >=4.15.0 && <4.16 || >=4.16.0 && <4.17 ||
  192. 5.09 s > >=4.17.0 && <4.18 || >=4.18.0 && <4.19 || >=4.19.0 && <4.20 || >=4.20.0 &&
  193. 5.09 s > <4.21 || >=4.21.0 && <4.22 || >=4.22.0 && <4.23: using base-4.18.3.0
  194. 5.09 s > Dependency extra: using extra-1.8.1
  195. 5.09 s > Dependency filepath >=1.4.2 && <1.5 || >=1.5.0 && <1.6: using
  196. 5.09 s > filepath-1.4.301.0
  197. 5.09 s > Dependency megaparsec >=9.0.1 && <9.1 || >=9.2.1 && <9.3 || >=9.5.0 && <9.6 ||
  198. 5.09 s > >=9.7.0 && <9.8: using megaparsec-9.7.0
  199. 5.09 s > Dependency pathway >=0.0.1 && <0.1: using pathway-0.0.1.0
  200. 5.09 s > Dependency pathway-compat-base >=0.0.1 && <0.1: using
  201. 5.09 s > pathway-compat-base-0.0.1.0
  202. 5.09 s > Dependency pathway-internal >=0.0.1 && <0.1: using pathway-internal-0.0.1.0
  203. 5.09 s > Dependency base >=4.14.0 && <4.15 || >=4.15.0 && <4.16 || >=4.16.0 && <4.17 ||
  204. 5.09 s > >=4.17.0 && <4.18 || >=4.18.0 && <4.19 || >=4.19.0 && <4.20 || >=4.20.0 &&
  205. 5.09 s > <4.21 || >=4.21.0 && <4.22 || >=4.22.0 && <4.23: using base-4.18.3.0
  206. 5.09 s > Dependency doctest >=0.16.3 && <0.17 || >=0.18.1 && <0.19 || >=0.20.1 && <0.21
  207. 5.09 s > || >=0.21.1 && <0.22 || >=0.22.2 && <0.23 || >=0.24.2 && <0.25: using
  208. 5.09 s > doctest-0.24.2
  209. 5.09 s > Dependency pathway-compat-filepath: using pathway-compat-filepath-0.0.1.0
  210. 5.09 s > Source component graph:
  211. 5.09 s > component lib
  212. 5.09 s > component test:doctests dependency lib
  213. 5.09 s > Configured component graph:
  214. 5.09 s > component pathway-compat-filepath-0.0.1.0-L0VuJWewPKkKsQELfUFr0L
  215. 5.09 s > include base-4.18.3.0
  216. 5.09 s > include extra-1.8.1-mqL7YRifC8HhGrjpGYIL3
  217. 5.09 s > include filepath-1.4.301.0
  218. 5.09 s > include megaparsec-9.7.0-9FWtFuoAKCoJPEfZ8OP0ob
  219. 5.09 s > include pathway-0.0.1.0-31EObXlLuVk60eWeEQLXMY
  220. 5.09 s > include pathway-compat-base-0.0.1.0-BRBmFEfWQlkJP9xCDIxb6w
  221. 5.09 s > include pathway-internal-0.0.1.0-6pVrF111eN4BAqGigGNQse
  222. 5.09 s > component pathway-compat-filepath-0.0.1.0-7hV8D5x7Q712pKmJ0W1sv4-doctests
  223. 5.09 s > include base-4.18.3.0
  224. 5.09 s > include doctest-0.24.2-7YxPr6lrdwiBMDK2pmizgF
  225. 5.09 s > include pathway-compat-filepath-0.0.1.0-L0VuJWewPKkKsQELfUFr0L
  226. 5.09 s > Linked component graph:
  227. 5.09 s > unit pathway-compat-filepath-0.0.1.0-L0VuJWewPKkKsQELfUFr0L
  228. 5.09 s > include base-4.18.3.0
  229. 5.09 s > include extra-1.8.1-mqL7YRifC8HhGrjpGYIL3
  230. 5.09 s > include filepath-1.4.301.0
  231. 5.09 s > include megaparsec-9.7.0-9FWtFuoAKCoJPEfZ8OP0ob
  232. 5.09 s > include pathway-0.0.1.0-31EObXlLuVk60eWeEQLXMY
  233. 5.09 s > include pathway-compat-base-0.0.1.0-BRBmFEfWQlkJP9xCDIxb6w
  234. 5.09 s > include pathway-internal-0.0.1.0-6pVrF111eN4BAqGigGNQse
  235. 5.09 s > Common.FilePath=pathway-compat-filepath-0.0.1.0-L0VuJWewPKkKsQELfUFr0L:Common.FilePath,Common.OsPath=pathway-compat-filepath-0.0.1.0-L0VuJWewPKkKsQELfUFr0L:Common.OsPath,System.FilePath=pathway-compat-filepath-0.0.1.0-L0VuJWewPKkKsQELfUFr0L:System.FilePath,System.FilePath.Overlay=pathway-compat-filepath-0.0.1.0-L0VuJWewPKkKsQELfUFr0L:System.FilePath.Overlay,System.FilePath.Pathway=pathway-compat-filepath-0.0.1.0-L0VuJWewPKkKsQELfUFr0L:System.FilePath.Pathway,System.FilePath.Thin=pathway-compat-filepath-0.0.1.0-L0VuJWewPKkKsQELfUFr0L:System.FilePath.Thin,System.OsPath=pathway-compat-filepath-0.0.1.0-L0VuJWewPKkKsQELfUFr0L:System.OsPath,System.OsPath.Overlay=pathway-compat-filepath-0.0.1.0-L0VuJWewPKkKsQELfUFr0L:System.OsPath.Overlay,System.OsPath.Pathway=pathway-compat-filepath-0.0.1.0-L0VuJWewPKkKsQELfUFr0L:System.OsPath.Pathway,System.OsPath.Thin=pathway-compat-filepath-0.0.1.0-L0VuJWewPKkKsQELfUFr0L:System.OsPath.Thin
  236. 5.09 s > unit pathway-compat-filepath-0.0.1.0-7hV8D5x7Q712pKmJ0W1sv4-doctests
  237. 5.09 s > include base-4.18.3.0
  238. 5.09 s > include doctest-0.24.2-7YxPr6lrdwiBMDK2pmizgF
  239. 5.09 s > include pathway-compat-filepath-0.0.1.0-L0VuJWewPKkKsQELfUFr0L
  240. 5.09 s > Ready component graph:
  241. 5.09 s > definite pathway-compat-filepath-0.0.1.0-L0VuJWewPKkKsQELfUFr0L
  242. 5.09 s > depends base-4.18.3.0
  243. 5.09 s > depends extra-1.8.1-mqL7YRifC8HhGrjpGYIL3
  244. 5.09 s > depends filepath-1.4.301.0
  245. 5.09 s > depends megaparsec-9.7.0-9FWtFuoAKCoJPEfZ8OP0ob
  246. 5.09 s > depends pathway-0.0.1.0-31EObXlLuVk60eWeEQLXMY
  247. 5.09 s > depends pathway-compat-base-0.0.1.0-BRBmFEfWQlkJP9xCDIxb6w
  248. 5.09 s > depends pathway-internal-0.0.1.0-6pVrF111eN4BAqGigGNQse
  249. 5.09 s > definite pathway-compat-filepath-0.0.1.0-7hV8D5x7Q712pKmJ0W1sv4-doctests
  250. 5.09 s > depends base-4.18.3.0
  251. 5.09 s > depends doctest-0.24.2-7YxPr6lrdwiBMDK2pmizgF
  252. 5.09 s > depends pathway-compat-filepath-0.0.1.0-L0VuJWewPKkKsQELfUFr0L
  253. 5.09 s > Using Cabal-3.10.3.0 compiled by ghc-9.6
  254. 5.09 s > Using compiler: ghc-9.6.7
  255. 5.09 s > Using install prefix:
  256. 5.09 s > /nix/store/phlcj8ksn09xr2h64vqgfxmn7hpb9xgk-pathway-compat-filepath-0.0.1.0
  257. 5.09 s > Executables installed in:
  258. 5.09 s > /nix/store/phlcj8ksn09xr2h64vqgfxmn7hpb9xgk-pathway-compat-filepath-0.0.1.0/bin
  259. 5.09 s > Libraries installed in:
  260. 5.09 s > /nix/store/phlcj8ksn09xr2h64vqgfxmn7hpb9xgk-pathway-compat-filepath-0.0.1.0/lib/ghc-9.6.7/lib/x86_64-linux-ghc-9.6.7/pathway-compat-filepath-0.0.1.0-L0VuJWewPKkKsQELfUFr0L
  261. 5.09 s > Dynamic Libraries installed in:
  262. 5.09 s > /nix/store/phlcj8ksn09xr2h64vqgfxmn7hpb9xgk-pathway-compat-filepath-0.0.1.0/lib/ghc-9.6.7/lib/x86_64-linux-ghc-9.6.7
  263. 5.09 s > Private executables installed in:
  264. 5.09 s > /nix/store/phlcj8ksn09xr2h64vqgfxmn7hpb9xgk-pathway-compat-filepath-0.0.1.0/libexec/x86_64-linux-ghc-9.6.7/pathway-compat-filepath-0.0.1.0
  265. 5.09 s > Data files installed in:
  266. 5.09 s > /nix/store/phlcj8ksn09xr2h64vqgfxmn7hpb9xgk-pathway-compat-filepath-0.0.1.0/share/x86_64-linux-ghc-9.6.7/pathway-compat-filepath-0.0.1.0
  267. 5.09 s > Documentation installed in:
  268. 5.09 s > /nix/store/cchjkcffdkdfqbjkrmmp89a5gxnhp5as-pathway-compat-filepath-0.0.1.0-doc/share/doc/pathway-compat-filepath-0.0.1.0
  269. 5.09 s > Configuration files installed in:
  270. 5.09 s > /nix/store/phlcj8ksn09xr2h64vqgfxmn7hpb9xgk-pathway-compat-filepath-0.0.1.0/etc
  271. 5.09 s > No alex found
  272. 5.09 s > Using ar found on system at:
  273. 5.09 s > /nix/store/iz5lckcsg66r223si2gck7csk2hihj0m-binutils-wrapper-2.44/bin/ar
  274. 5.09 s > No c2hs found
  275. 5.09 s > No cpphs found
  276. 5.09 s > Using doctest version 0.24.2 found on system at:
  277. 5.09 s > /nix/store/mky1glcba5jwjn0h7fa1mldfnh39g6l9-doctest-0.24.2/bin/doctest
  278. 5.09 s > Using gcc version 14.3.0 given by user at:
  279. 5.09 s > /nix/store/8v97ngkcpfzgghwnnr7fsz33p2x22gy9-gcc-wrapper-14.3.0/bin/gcc
  280. 5.09 s > Using ghc version 9.6.7 found on system at:
  281. 5.09 s > /nix/store/da9x1n5l146q0ai9wz8zfbx4zfwa9b02-ghc-9.6.7/bin/ghc
  282. 5.09 s > Using ghc-pkg version 9.6.7 found on system at:
  283. 5.09 s > /nix/store/da9x1n5l146q0ai9wz8zfbx4zfwa9b02-ghc-9.6.7/bin/ghc-pkg-9.6.7
  284. 5.09 s > No ghcjs found
  285. 5.09 s > No ghcjs-pkg found
  286. 5.09 s > No greencard found
  287. 5.09 s > Using haddock version 2.29.2 found on system at:
  288. 5.09 s > /nix/store/da9x1n5l146q0ai9wz8zfbx4zfwa9b02-ghc-9.6.7/bin/haddock-ghc-9.6.7
  289. 5.09 s > No happy found
  290. 5.09 s > Using haskell-suite found on system at: haskell-suite-dummy-location
  291. 5.09 s > Using haskell-suite-pkg found on system at: haskell-suite-pkg-dummy-location
  292. 5.09 s > No hmake found
  293. 5.09 s > Using hpc version 0.68 found on system at:
  294. 5.09 s > /nix/store/da9x1n5l146q0ai9wz8zfbx4zfwa9b02-ghc-9.6.7/bin/hpc-ghc-9.6.7
  295. 5.09 s > Using hsc2hs version 0.68.9 found on system at:
  296. 5.09 s > /nix/store/da9x1n5l146q0ai9wz8zfbx4zfwa9b02-ghc-9.6.7/bin/hsc2hs-ghc-9.6.7
  297. 5.09 s > Using hscolour version 1.25 found on system at:
  298. 5.09 s > /nix/store/7ffc07q75k5a6zk864jv9gpiphhwzjlh-hscolour-1.25/bin/HsColour
  299. 5.09 s > No jhc found
  300. 5.09 s > Using ld found on system at:
  301. 5.09 s > /nix/store/iz5lckcsg66r223si2gck7csk2hihj0m-binutils-wrapper-2.44/bin/ld.gold
  302. 5.09 s > No pkg-config found
  303. 5.09 s > Using runghc version 9.6.7 found on system at:
  304. 5.09 s > /nix/store/da9x1n5l146q0ai9wz8zfbx4zfwa9b02-ghc-9.6.7/bin/runghc-9.6.7
  305. 5.09 s > Using strip version 2.44 found on system at:
  306. 5.09 s > /nix/store/8v97ngkcpfzgghwnnr7fsz33p2x22gy9-gcc-wrapper-14.3.0/bin/strip
  307. 5.09 s > Using tar found on system at:
  308. 5.09 s > /nix/store/xl6pd2spjajwcpq09fnmnjv5psqmlmma-gnutar-1.35/bin/tar
  309. 5.09 s > No uhc found
  310. 5.09 s > Running phase: buildPhase
  311. 5.09 s > Preprocessing library for pathway-compat-filepath-0.0.1.0..
  312. 5.09 s > Building library for pathway-compat-filepath-0.0.1.0..
  313. 5.09 s > [ 1 of 10] Compiling Common.FilePath ( src/Common/FilePath.hs, dist/build/Common/FilePath.o, dist/build/Common/FilePath.dyn_o )
  314. 5.09 s > [ 2 of 10] Compiling Common.OsPath ( src/Common/OsPath.hs, dist/build/Common/OsPath.o, dist/build/Common/OsPath.dyn_o )
  315. 5.09 s >
  316. 5.09 s > src/Common/OsPath.hs:87:23: error: [GHC-76037]
  317. 5.09 s > Not in scope: ‘O.unsafeEncodeUtf’
  318. 5.09 s > NB: the module ‘System.OsPath’ does not export ‘unsafeEncodeUtf’.
  319. 5.09 s > |
  320. 5.09 s > 87 | Format.parent = O.unsafeEncodeUtf "..",
  321. 5.09 s > | ^^^^^^^^^^^^^^^^^
  322. 5.09 s > [ 3 of 10] Compiling System.FilePath.Thin ( src/System/FilePath/Thin.hs, dist/build/System/FilePath/Thin.o, dist/build/System/FilePath/Thin.dyn_o )
  323. 5.09 s > [ 4 of 10] Compiling System.FilePath.Pathway ( src/System/FilePath/Pathway.hs, dist/build/System/FilePath/Pathway.o, dist/build/System/FilePath/Pathway.dyn_o )
  324. 5.09 s > [ 5 of 10] Compiling System.FilePath.Overlay ( src/System/FilePath/Overlay.hs, dist/build/System/FilePath/Overlay.o, dist/build/System/FilePath/Overlay.dyn_o )
  325. 5.09 s > [ 6 of 10] Compiling System.FilePath ( src/System/FilePath.hs, dist/build/System/FilePath.o, dist/build/System/FilePath.dyn_o )
  326. 5.09 s For full logs, run:
  327. 5.09 s nix log /nix/store/ky3d4fbd2n1245lyrqqafbzks6pvj6yx-pathway-compat-filepath-0.0.1.0.drv
  328. 5.10 s error: Cannot build '/nix/store/ky3d4fbd2n1245lyrqqafbzks6pvj6yx-pathway-compat-filepath-0.0.1.0.drv'.
  329. 5.10 s Reason: builder failed with exit code 1.
  330. 5.10 s Output paths:
  331. 5.10 s /nix/store/cchjkcffdkdfqbjkrmmp89a5gxnhp5as-pathway-compat-filepath-0.0.1.0-doc
  332. 5.10 s /nix/store/phlcj8ksn09xr2h64vqgfxmn7hpb9xgk-pathway-compat-filepath-0.0.1.0
  333. 5.10 s Last 151 log lines:
  334. 5.10 s > Running phase: setupCompilerEnvironmentPhase
  335. 5.10 s > Build with /nix/store/da9x1n5l146q0ai9wz8zfbx4zfwa9b02-ghc-9.6.7.
  336. 5.10 s > Running phase: unpackPhase
  337. 5.10 s > unpacking source archive /nix/store/723m6sjvk66iiqzpvcfdd74xi6id5zqq-zjizyqf4pafgh9rycgxd507dhvpisdy1-source/./compat/filepath
  338. 5.10 s > source root is filepath
  339. 5.10 s > Running phase: patchPhase
  340. 5.10 s > Running phase: compileBuildDriverPhase
  341. 5.10 s > setupCompileFlags: -package-db=/build/tmp.kHIc8suGvt/setup-package.conf.d -threaded
  342. 5.10 s > [1 of 2] Compiling Main ( Setup.hs, /build/tmp.kHIc8suGvt/Main.o )
  343. 5.10 s > [2 of 2] Linking Setup
  344. 5.10 s > Running phase: updateAutotoolsGnuConfigScriptsPhase
  345. 5.10 s > Running phase: configurePhase
  346. 5.10 s > configureFlags: --verbose --prefix=/nix/store/phlcj8ksn09xr2h64vqgfxmn7hpb9xgk-pathway-compat-filepath-0.0.1.0 --libdir=$prefix/lib/$compiler/lib --libsubdir=$abi/$libname --docdir=/nix/store/cchjkcffdkdfqbjkrmmp89a5gxnhp5as-pathway-compat-filepath-0.0.1.0-doc/share/doc/pathway-compat-filepath-0.0.1.0 --with-gcc=gcc --package-db=/build/tmp.kHIc8suGvt/package.conf.d --ghc-option=-j16 --ghc-option=+RTS --ghc-option=-A64M --ghc-option=-RTS --enable-library-profiling --profiling-detail=exported-functions --disable-profiling --enable-shared --disable-coverage --enable-static --disable-executable-dynamic --enable-tests --disable-benchmarks --enable-library-vanilla --disable-library-for-ghci --enable-split-sections --enable-library-stripping --enable-executable-stripping --ghc-option=-haddock --ghc-options=-Werror --extra-lib-dirs=/nix/store/ffyzkisqs4vc4mg28bwwlyqjf8i9ph6b-ncurses-6.5/lib --extra-lib-dirs=/nix/store/n28qgdj8c1q41kf7n4y1jxa6ckp85m3c-libffi-3.5.2/lib --extra-lib-dirs=/nix/store/1b6h99dw7bk4wbn77kbalih42zbc67m1-elfutils-0.194/lib --extra-lib-dirs=/nix/store/hi0ar880110k6jsmmili7dh1gq3cg2a9-gmp-with-cxx-6.3.0/lib --extra-lib-dirs=/nix/store/g09cflpnp4g80q56sj9dng1qzv4v4ybc-numactl-2.0.18/lib --extra-lib-dirs=/nix/store/da9x1n5l146q0ai9wz8zfbx4zfwa9b02-ghc-9.6.7/lib
  347. 5.10 s > Using Parsec parser
  348. 5.10 s > Configuring pathway-compat-filepath-0.0.1.0...
  349. 5.10 s > Flags chosen: noisy-deprecations=True, verify-no-recursion=False
  350. 5.10 s > Dependency base >=4.14.0 && <4.15 || >=4.15.0 && <4.16 || >=4.16.0 && <4.17 ||
  351. 5.10 s > >=4.17.0 && <4.18 || >=4.18.0 && <4.19 || >=4.19.0 && <4.20 || >=4.20.0 &&
  352. 5.10 s > <4.21 || >=4.21.0 && <4.22 || >=4.22.0 && <4.23: using base-4.18.3.0
  353. 5.10 s > Dependency extra: using extra-1.8.1
  354. 5.10 s > Dependency filepath >=1.4.2 && <1.5 || >=1.5.0 && <1.6: using
  355. 5.10 s > filepath-1.4.301.0
  356. 5.10 s > Dependency megaparsec >=9.0.1 && <9.1 || >=9.2.1 && <9.3 || >=9.5.0 && <9.6 ||
  357. 5.10 s > >=9.7.0 && <9.8: using megaparsec-9.7.0
  358. 5.10 s > Dependency pathway >=0.0.1 && <0.1: using pathway-0.0.1.0
  359. 5.10 s > Dependency pathway-compat-base >=0.0.1 && <0.1: using
  360. 5.10 s > pathway-compat-base-0.0.1.0
  361. 5.10 s > Dependency pathway-internal >=0.0.1 && <0.1: using pathway-internal-0.0.1.0
  362. 5.10 s > Dependency base >=4.14.0 && <4.15 || >=4.15.0 && <4.16 || >=4.16.0 && <4.17 ||
  363. 5.10 s > >=4.17.0 && <4.18 || >=4.18.0 && <4.19 || >=4.19.0 && <4.20 || >=4.20.0 &&
  364. 5.10 s > <4.21 || >=4.21.0 && <4.22 || >=4.22.0 && <4.23: using base-4.18.3.0
  365. 5.10 s > Dependency doctest >=0.16.3 && <0.17 || >=0.18.1 && <0.19 || >=0.20.1 && <0.21
  366. 5.10 s > || >=0.21.1 && <0.22 || >=0.22.2 && <0.23 || >=0.24.2 && <0.25: using
  367. 5.10 s > doctest-0.24.2
  368. 5.10 s > Dependency pathway-compat-filepath: using pathway-compat-filepath-0.0.1.0
  369. 5.10 s > Source component graph:
  370. 5.10 s > component lib
  371. 5.10 s > component test:doctests dependency lib
  372. 5.10 s > Configured component graph:
  373. 5.10 s > component pathway-compat-filepath-0.0.1.0-L0VuJWewPKkKsQELfUFr0L
  374. 5.10 s > include base-4.18.3.0
  375. 5.10 s > include extra-1.8.1-mqL7YRifC8HhGrjpGYIL3
  376. 5.10 s > include filepath-1.4.301.0
  377. 5.10 s > include megaparsec-9.7.0-9FWtFuoAKCoJPEfZ8OP0ob
  378. 5.10 s > include pathway-0.0.1.0-31EObXlLuVk60eWeEQLXMY
  379. 5.10 s > include pathway-compat-base-0.0.1.0-BRBmFEfWQlkJP9xCDIxb6w
  380. 5.10 s > include pathway-internal-0.0.1.0-6pVrF111eN4BAqGigGNQse
  381. 5.10 s > component pathway-compat-filepath-0.0.1.0-7hV8D5x7Q712pKmJ0W1sv4-doctests
  382. 5.10 s > include base-4.18.3.0
  383. 5.10 s > include doctest-0.24.2-7YxPr6lrdwiBMDK2pmizgF
  384. 5.10 s > include pathway-compat-filepath-0.0.1.0-L0VuJWewPKkKsQELfUFr0L
  385. 5.10 s > Linked component graph:
  386. 5.10 s > unit pathway-compat-filepath-0.0.1.0-L0VuJWewPKkKsQELfUFr0L
  387. 5.10 s > include base-4.18.3.0
  388. 5.10 s > include extra-1.8.1-mqL7YRifC8HhGrjpGYIL3
  389. 5.10 s > include filepath-1.4.301.0
  390. 5.10 s > include megaparsec-9.7.0-9FWtFuoAKCoJPEfZ8OP0ob
  391. 5.10 s > include pathway-0.0.1.0-31EObXlLuVk60eWeEQLXMY
  392. 5.10 s > include pathway-compat-base-0.0.1.0-BRBmFEfWQlkJP9xCDIxb6w
  393. 5.10 s > include pathway-internal-0.0.1.0-6pVrF111eN4BAqGigGNQse
  394. 5.10 s > Common.FilePath=pathway-compat-filepath-0.0.1.0-L0VuJWewPKkKsQELfUFr0L:Common.FilePath,Common.OsPath=pathway-compat-filepath-0.0.1.0-L0VuJWewPKkKsQELfUFr0L:Common.OsPath,System.FilePath=pathway-compat-filepath-0.0.1.0-L0VuJWewPKkKsQELfUFr0L:System.FilePath,System.FilePath.Overlay=pathway-compat-filepath-0.0.1.0-L0VuJWewPKkKsQELfUFr0L:System.FilePath.Overlay,System.FilePath.Pathway=pathway-compat-filepath-0.0.1.0-L0VuJWewPKkKsQELfUFr0L:System.FilePath.Pathway,System.FilePath.Thin=pathway-compat-filepath-0.0.1.0-L0VuJWewPKkKsQELfUFr0L:System.FilePath.Thin,System.OsPath=pathway-compat-filepath-0.0.1.0-L0VuJWewPKkKsQELfUFr0L:System.OsPath,System.OsPath.Overlay=pathway-compat-filepath-0.0.1.0-L0VuJWewPKkKsQELfUFr0L:System.OsPath.Overlay,System.OsPath.Pathway=pathway-compat-filepath-0.0.1.0-L0VuJWewPKkKsQELfUFr0L:System.OsPath.Pathway,System.OsPath.Thin=pathway-compat-filepath-0.0.1.0-L0VuJWewPKkKsQELfUFr0L:System.OsPath.Thin
  395. 5.10 s > unit pathway-compat-filepath-0.0.1.0-7hV8D5x7Q712pKmJ0W1sv4-doctests
  396. 5.10 s > include base-4.18.3.0
  397. 5.10 s > include doctest-0.24.2-7YxPr6lrdwiBMDK2pmizgF
  398. 5.10 s > include pathway-compat-filepath-0.0.1.0-L0VuJWewPKkKsQELfUFr0L
  399. 5.10 s > Ready component graph:
  400. 5.10 s > definite pathway-compat-filepath-0.0.1.0-L0VuJWewPKkKsQELfUFr0L
  401. 5.10 s > depends base-4.18.3.0
  402. 5.10 s > depends extra-1.8.1-mqL7YRifC8HhGrjpGYIL3
  403. 5.10 s > depends filepath-1.4.301.0
  404. 5.10 s > depends megaparsec-9.7.0-9FWtFuoAKCoJPEfZ8OP0ob
  405. 5.10 s > depends pathway-0.0.1.0-31EObXlLuVk60eWeEQLXMY
  406. 5.10 s > depends pathway-compat-base-0.0.1.0-BRBmFEfWQlkJP9xCDIxb6w
  407. 5.10 s > depends pathway-internal-0.0.1.0-6pVrF111eN4BAqGigGNQse
  408. 5.10 s > definite pathway-compat-filepath-0.0.1.0-7hV8D5x7Q712pKmJ0W1sv4-doctests
  409. 5.10 s > depends base-4.18.3.0
  410. 5.10 s > depends doctest-0.24.2-7YxPr6lrdwiBMDK2pmizgF
  411. 5.10 s > depends pathway-compat-filepath-0.0.1.0-L0VuJWewPKkKsQELfUFr0L
  412. 5.10 s > Using Cabal-3.10.3.0 compiled by ghc-9.6
  413. 5.10 s > Using compiler: ghc-9.6.7
  414. 5.10 s > Using install prefix:
  415. 5.10 s > /nix/store/phlcj8ksn09xr2h64vqgfxmn7hpb9xgk-pathway-compat-filepath-0.0.1.0
  416. 5.10 s > Executables installed in:
  417. 5.10 s > /nix/store/phlcj8ksn09xr2h64vqgfxmn7hpb9xgk-pathway-compat-filepath-0.0.1.0/bin
  418. 5.10 s > Libraries installed in:
  419. 5.10 s > /nix/store/phlcj8ksn09xr2h64vqgfxmn7hpb9xgk-pathway-compat-filepath-0.0.1.0/lib/ghc-9.6.7/lib/x86_64-linux-ghc-9.6.7/pathway-compat-filepath-0.0.1.0-L0VuJWewPKkKsQELfUFr0L
  420. 5.10 s > Dynamic Libraries installed in:
  421. 5.10 s > /nix/store/phlcj8ksn09xr2h64vqgfxmn7hpb9xgk-pathway-compat-filepath-0.0.1.0/lib/ghc-9.6.7/lib/x86_64-linux-ghc-9.6.7
  422. 5.10 s > Private executables installed in:
  423. 5.10 s > /nix/store/phlcj8ksn09xr2h64vqgfxmn7hpb9xgk-pathway-compat-filepath-0.0.1.0/libexec/x86_64-linux-ghc-9.6.7/pathway-compat-filepath-0.0.1.0
  424. 5.10 s > Data files installed in:
  425. 5.10 s > /nix/store/phlcj8ksn09xr2h64vqgfxmn7hpb9xgk-pathway-compat-filepath-0.0.1.0/share/x86_64-linux-ghc-9.6.7/pathway-compat-filepath-0.0.1.0
  426. 5.10 s > Documentation installed in:
  427. 5.10 s > /nix/store/cchjkcffdkdfqbjkrmmp89a5gxnhp5as-pathway-compat-filepath-0.0.1.0-doc/share/doc/pathway-compat-filepath-0.0.1.0
  428. 5.10 s > Configuration files installed in:
  429. 5.10 s > /nix/store/phlcj8ksn09xr2h64vqgfxmn7hpb9xgk-pathway-compat-filepath-0.0.1.0/etc
  430. 5.10 s > No alex found
  431. 5.10 s > Using ar found on system at:
  432. 5.10 s > /nix/store/iz5lckcsg66r223si2gck7csk2hihj0m-binutils-wrapper-2.44/bin/ar
  433. 5.10 s > No c2hs found
  434. 5.10 s > No cpphs found
  435. 5.10 s > Using doctest version 0.24.2 found on system at:
  436. 5.10 s > /nix/store/mky1glcba5jwjn0h7fa1mldfnh39g6l9-doctest-0.24.2/bin/doctest
  437. 5.10 s > Using gcc version 14.3.0 given by user at:
  438. 5.10 s > /nix/store/8v97ngkcpfzgghwnnr7fsz33p2x22gy9-gcc-wrapper-14.3.0/bin/gcc
  439. 5.10 s > Using ghc version 9.6.7 found on system at:
  440. 5.10 s > /nix/store/da9x1n5l146q0ai9wz8zfbx4zfwa9b02-ghc-9.6.7/bin/ghc
  441. 5.10 s > Using ghc-pkg version 9.6.7 found on system at:
  442. 5.10 s > /nix/store/da9x1n5l146q0ai9wz8zfbx4zfwa9b02-ghc-9.6.7/bin/ghc-pkg-9.6.7
  443. 5.10 s > No ghcjs found
  444. 5.10 s > No ghcjs-pkg found
  445. 5.10 s > No greencard found
  446. 5.10 s > Using haddock version 2.29.2 found on system at:
  447. 5.10 s > /nix/store/da9x1n5l146q0ai9wz8zfbx4zfwa9b02-ghc-9.6.7/bin/haddock-ghc-9.6.7
  448. 5.10 s > No happy found
  449. 5.10 s > Using haskell-suite found on system at: haskell-suite-dummy-location
  450. 5.10 s > Using haskell-suite-pkg found on system at: haskell-suite-pkg-dummy-location
  451. 5.10 s > No hmake found
  452. 5.10 s > Using hpc version 0.68 found on system at:
  453. 5.10 s > /nix/store/da9x1n5l146q0ai9wz8zfbx4zfwa9b02-ghc-9.6.7/bin/hpc-ghc-9.6.7
  454. 5.10 s > Using hsc2hs version 0.68.9 found on system at:
  455. 5.10 s > /nix/store/da9x1n5l146q0ai9wz8zfbx4zfwa9b02-ghc-9.6.7/bin/hsc2hs-ghc-9.6.7
  456. 5.10 s > Using hscolour version 1.25 found on system at:
  457. 5.10 s > /nix/store/7ffc07q75k5a6zk864jv9gpiphhwzjlh-hscolour-1.25/bin/HsColour
  458. 5.10 s > No jhc found
  459. 5.10 s > Using ld found on system at:
  460. 5.10 s > /nix/store/iz5lckcsg66r223si2gck7csk2hihj0m-binutils-wrapper-2.44/bin/ld.gold
  461. 5.10 s > No pkg-config found
  462. 5.10 s > Using runghc version 9.6.7 found on system at:
  463. 5.10 s > /nix/store/da9x1n5l146q0ai9wz8zfbx4zfwa9b02-ghc-9.6.7/bin/runghc-9.6.7
  464. 5.10 s > Using strip version 2.44 found on system at:
  465. 5.10 s > /nix/store/8v97ngkcpfzgghwnnr7fsz33p2x22gy9-gcc-wrapper-14.3.0/bin/strip
  466. 5.10 s > Using tar found on system at:
  467. 5.10 s > /nix/store/xl6pd2spjajwcpq09fnmnjv5psqmlmma-gnutar-1.35/bin/tar
  468. 5.10 s > No uhc found
  469. 5.10 s > Running phase: buildPhase
  470. 5.10 s > Preprocessing library for pathway-compat-filepath-0.0.1.0..
  471. 5.10 s > Building library for pathway-compat-filepath-0.0.1.0..
  472. 5.10 s > [ 1 of 10] Compiling Common.FilePath ( src/Common/FilePath.hs, dist/build/Common/FilePath.o, dist/build/Common/FilePath.dyn_o )
  473. 5.10 s > [ 2 of 10] Compiling Common.OsPath ( src/Common/OsPath.hs, dist/build/Common/OsPath.o, dist/build/Common/OsPath.dyn_o )
  474. 5.10 s >
  475. 5.10 s > src/Common/OsPath.hs:87:23: error: [GHC-76037]
  476. 5.10 s > Not in scope: ‘O.unsafeEncodeUtf’
  477. 5.10 s > NB: the module ‘System.OsPath’ does not export ‘unsafeEncodeUtf’.
  478. 5.10 s > |
  479. 5.10 s > 87 | Format.parent = O.unsafeEncodeUtf "..",
  480. 5.10 s > | ^^^^^^^^^^^^^^^^^
  481. 5.10 s > [ 3 of 10] Compiling System.FilePath.Thin ( src/System/FilePath/Thin.hs, dist/build/System/FilePath/Thin.o, dist/build/System/FilePath/Thin.dyn_o )
  482. 5.10 s > [ 4 of 10] Compiling System.FilePath.Pathway ( src/System/FilePath/Pathway.hs, dist/build/System/FilePath/Pathway.o, dist/build/System/FilePath/Pathway.dyn_o )
  483. 5.10 s > [ 5 of 10] Compiling System.FilePath.Overlay ( src/System/FilePath/Overlay.hs, dist/build/System/FilePath/Overlay.o, dist/build/System/FilePath/Overlay.dyn_o )
  484. 5.10 s > [ 6 of 10] Compiling System.FilePath ( src/System/FilePath.hs, dist/build/System/FilePath.o, dist/build/System/FilePath.dyn_o )
  485. 5.10 s For full logs, run:
  486. 5.10 s nix log /nix/store/ky3d4fbd2n1245lyrqqafbzks6pvj6yx-pathway-compat-filepath-0.0.1.0.drv
  487. 5.10 s error: Cannot build '/nix/store/3vbjn9jkkyz37dm9smjix8hw63j2gl7x-ghc-9.6.7-with-packages.drv'.
  488. 5.10 s Reason: 1 dependency failed.
  489. 5.10 s Output paths:
  490. 5.10 s /nix/store/xxg3mpyav890r1sycx59jdqbsz1qzyhz-ghc-9.6.7-with-packages
  491. 5.10 s error: Cannot build '/nix/store/j6s9kmsbhwxgrfrrxpyp9v3r6nqhrsik-pathway-compat-directory-0.0.1.0.drv'.
  492. 5.10 s Reason: 1 dependency failed.
  493. 5.10 s Output paths:
  494. 5.10 s /nix/store/7vlsb5s1xzm3gj9pazkkmql6ngg629dj-pathway-compat-directory-0.0.1.0-doc
  495. 5.10 s /nix/store/sp4nd7ma4mv1dqdh34yp9mv0rap7azjd-pathway-compat-directory-0.0.1.0
  496. 5.10 s error: Cannot build '/nix/store/f4vx65smf5yrza4igjs21knayx1x52rn-pathway-compat-file-io-0.0.1.0.drv'.
  497. 5.10 s Reason: 1 dependency failed.
  498. 5.10 s Output paths:
  499. 5.10 s /nix/store/v9vlsg022s8lvbifqf6vljd2mwra2qa9-pathway-compat-file-io-0.0.1.0
  500. 5.10 s /nix/store/zvp84zym5a3j9j3x09rp2qd21n1pldd4-pathway-compat-file-io-0.0.1.0-doc
  501. 5.10 s error: Cannot build '/nix/store/vrph1jdgm748dbnysajhnrc6qspm56y1-pathway-compat-temporary-0.0.1.0.drv'.
  502. 5.10 s Reason: 1 dependency failed.
  503. 5.10 s Output paths:
  504. 5.10 s /nix/store/bdf8bvzmn7v5ngfacmff1jaycx38gy6b-pathway-compat-temporary-0.0.1.0
  505. 5.10 s /nix/store/smrv1q41bva08jsakmay0ylxv1r41lzr-pathway-compat-temporary-0.0.1.0-doc
  506. 5.10 s error: Cannot build '/nix/store/vq06xbq6yy1rvcz3fvh9vkabamj36ysx-pathway-system-0.0.1.0.drv'.
  507. 5.10 s Reason: 1 dependency failed.
  508. 5.10 s Output paths:
  509. 5.10 s /nix/store/9303w25nmidczm0k7h2pdic85jff690x-pathway-system-0.0.1.0
  510. 5.10 s /nix/store/visz5vm0yjss8s2ph7bx6jg1aawk3w91-pathway-system-0.0.1.0-doc
  511. 5.10 s error: Build failed due to failed dependency
  512. 5.10 s error: Cannot build '/nix/store/kpsrp0ddpy4x0yhhxf5hgjnaqb2l1aqb-all-packages.drv'.
  513. 5.10 s Reason: 1 dependency failed.
  514. 5.10 s Output paths:
  515. 5.10 s /nix/store/sz9kjyi6l0ygk3xi0qis5yvysq51klz6-all-packages
  516. 5.10 s Build failed due to failed dependency
  517. 5.14 s Build failed.