1. 0.98 s $ /nix/store/9ypz3flqsrl5xl495mm8h645gadjsxi1-coreutils-9.11/bin/timeout --kill-after=15s 7200s /nix/store/23zk8sgzamrbmj1fday15szf7f2279s8-nix-2.34.7/bin/nix --extra-experimental-features nix-command --extra-experimental-features flakes --log-format internal-json build --no-link --print-out-paths git+https://github.com/sellout/pathway?ref=more-system&rev=bf654313bb47699f313cdd00e42ee12d835b5bed&shallow=1#packages.x86_64-linux.ghc967_all --print-build-logs
  2. 1.86 s warning: ignoring untrusted flake configuration setting 'allow-import-from-derivation'.
  3. 1.86 s Pass '--accept-flake-config' to trust it
  4. 1.86 s warning: ignoring untrusted flake configuration setting 'extra-experimental-features'.
  5. 1.86 s Pass '--accept-flake-config' to trust it
  6. 1.86 s warning: ignoring untrusted flake configuration setting 'extra-substituters'.
  7. 1.86 s Pass '--accept-flake-config' to trust it
  8. 1.86 s warning: ignoring untrusted flake configuration setting 'extra-trusted-public-keys'.
  9. 1.86 s Pass '--accept-flake-config' to trust it
  10. 1.86 s warning: ignoring untrusted flake configuration setting 'sandbox'.
  11. 1.86 s Pass '--accept-flake-config' to trust it
  12. 1.86 s warning: ignoring untrusted flake configuration setting 'use-registries'.
  13. 1.86 s Pass '--accept-flake-config' to trust it
  14. 1.86 s error (ignored): SQLite database '/var/cache/nix-ci-worker/eval-cache-v6/ce64b74b4de8d8ae91f7291e66459c5ea87d9e2f54a2343866e5476db495272f.sqlite' is busy
  15. 1.86 s
  16. 2.32 s Building /nix/store/0xfx9r31aw74hs5sjbw3nqlrrvg2y7r8-pathway-compat-filepath-0.0.1.0.drv
  17. 2.52 s [pathway-compat-filepath] Phase: setupCompilerEnvironmentPhase
  18. 2.52 s [pathway-compat-filepath] Build with /nix/store/2djpcnj8a25viv1y24h3mziy1gsy3fc6-ghc-9.6.7.
  19. 2.85 s [pathway-compat-filepath] Phase: unpackPhase
  20. 2.85 s [pathway-compat-filepath] unpacking source archive /nix/store/56v5999xvkp18l2ygdvahppqdv4hrlnl-filepath
  21. 2.86 s [pathway-compat-filepath] source root is filepath
  22. 2.87 s [pathway-compat-filepath] Phase: patchPhase
  23. 2.88 s [pathway-compat-filepath] Phase: compileBuildDriverPhase
  24. 2.89 s [pathway-compat-filepath] setupCompileFlags: -package-db=/build/tmp.Uf5lJVh2Of/setup-package.conf.d -threaded
  25. 2.94 s [pathway-compat-filepath] [1 of 2] Compiling Main ( Setup.hs, /build/tmp.Uf5lJVh2Of/Main.o )
  26. 2.99 s [pathway-compat-filepath] [2 of 2] Linking Setup
  27. 5.04 s [pathway-compat-filepath] Phase: updateAutotoolsGnuConfigScriptsPhase
  28. 5.06 s [pathway-compat-filepath] Phase: configurePhase
  29. 5.06 s [pathway-compat-filepath] configureFlags: --verbose --prefix=/nix/store/0igg77m8f8gygqh7ywrf5yrrz3q05mcp-pathway-compat-filepath-0.0.1.0 --libdir=$prefix/lib/$compiler/lib --libsubdir=$abi/$libname --docdir=/nix/store/h9ipqzh965180gvqq9glid6sh6h06105-pathway-compat-filepath-0.0.1.0-doc/share/doc/pathway-compat-filepath-0.0.1.0 --with-gcc=gcc --package-db=/build/tmp.Uf5lJVh2Of/package.conf.d --ghc-option=-j16 --ghc-option=+RTS --ghc-option=-A64M --ghc-option=-RTS --enable-library-profiling --profiling-detail=exported-functions --disable-profiling --enable-shared --disable-coverage --enable-static --disable-executable-dynamic --enable-tests --disable-benchmarks --enable-library-vanilla --disable-library-for-ghci --enable-split-sections --enable-library-stripping --enable-executable-stripping --ghc-option=-haddock --ghc-options=-Werror --extra-lib-dirs=/nix/store/pndhkk0l649lm1sj0mxk7cbwq26qd1ra-ncurses-6.6/lib --extra-lib-dirs=/nix/store/0djlg4g0b81w94k3vcaqsxsc2hh4kism-libffi-3.5.2/lib --extra-lib-dirs=/nix/store/md4paia7riiggyrj8p24c7a6vf8w7jz8-elfutils-0.194/lib --extra-lib-dirs=/nix/store/39vv2pf64gd8li48a4hpbhw2crzd8z5p-gmp-with-cxx-6.3.0/lib --extra-lib-dirs=/nix/store/7wwvald8lapkrsr72qanlw8blyn55ifx-numactl-2.0.18/lib --extra-lib-dirs=/nix/store/2djpcnj8a25viv1y24h3mziy1gsy3fc6-ghc-9.6.7/lib
  30. 5.07 s [pathway-compat-filepath] Using Parsec parser
  31. 5.07 s [pathway-compat-filepath] Configuring pathway-compat-filepath-0.0.1.0...
  32. 5.44 s [pathway-compat-filepath] Flags chosen: noisy-deprecations=True, verify-no-recursion=False
  33. 5.44 s [pathway-compat-filepath] Dependency base >=4.14.0 && <4.15 || >=4.15.0 && <4.16 || >=4.16.0 && <4.17 ||
  34. 5.44 s [pathway-compat-filepath] >=4.17.0 && <4.18 || >=4.18.0 && <4.19 || >=4.19.0 && <4.20 || >=4.20.0 &&
  35. 5.44 s [pathway-compat-filepath] <4.21 || >=4.21.0 && <4.22 || >=4.22.0 && <4.23: using base-4.18.3.0
  36. 5.44 s [pathway-compat-filepath] Dependency extra: using extra-1.8.1
  37. 5.44 s [pathway-compat-filepath] Dependency filepath >=1.4.2 && <1.5 || >=1.5.0 && <1.6: using
  38. 5.44 s [pathway-compat-filepath] filepath-1.4.301.0
  39. 5.44 s [pathway-compat-filepath] Dependency megaparsec >=9.0.1 && <9.1 || >=9.2.1 && <9.3 || >=9.5.0 && <9.6 ||
  40. 5.44 s [pathway-compat-filepath] >=9.7.0 && <9.8: using megaparsec-9.7.0
  41. 5.44 s [pathway-compat-filepath] Dependency os-string: using os-string-2.0.10
  42. 5.44 s [pathway-compat-filepath] Dependency pathway >=0.0.1 && <0.1: using pathway-0.0.1.0
  43. 5.44 s [pathway-compat-filepath] Dependency pathway-compat-base >=0.0.1 && <0.1: using
  44. 5.44 s [pathway-compat-filepath] pathway-compat-base-0.0.1.0
  45. 5.44 s [pathway-compat-filepath] Dependency pathway-internal >=0.0.1 && <0.1: using pathway-internal-0.0.1.0
  46. 5.44 s [pathway-compat-filepath] Dependency base >=4.14.0 && <4.15 || >=4.15.0 && <4.16 || >=4.16.0 && <4.17 ||
  47. 5.44 s [pathway-compat-filepath] >=4.17.0 && <4.18 || >=4.18.0 && <4.19 || >=4.19.0 && <4.20 || >=4.20.0 &&
  48. 5.44 s [pathway-compat-filepath] <4.21 || >=4.21.0 && <4.22 || >=4.22.0 && <4.23: using base-4.18.3.0
  49. 5.44 s [pathway-compat-filepath] Dependency doctest >=0.16.3 && <0.17 || >=0.18.1 && <0.19 || >=0.20.1 && <0.21
  50. 5.44 s [pathway-compat-filepath] || >=0.21.1 && <0.22 || >=0.22.2 && <0.23 || >=0.24.2 && <0.25: using
  51. 5.44 s [pathway-compat-filepath] doctest-0.24.3
  52. 5.44 s [pathway-compat-filepath] Dependency pathway-compat-filepath: using pathway-compat-filepath-0.0.1.0
  53. 5.95 s [pathway-compat-filepath] Source component graph:
  54. 5.95 s [pathway-compat-filepath] component lib
  55. 5.95 s [pathway-compat-filepath] component test:doctests dependency lib
  56. 5.95 s [pathway-compat-filepath] Configured component graph:
  57. 5.95 s [pathway-compat-filepath] component pathway-compat-filepath-0.0.1.0-Ck51GFznMiC2cxIfBMz4NH
  58. 5.95 s [pathway-compat-filepath] include base-4.18.3.0
  59. 5.95 s [pathway-compat-filepath] include extra-1.8.1-FU1frm3XcM88A49dBkmtgI
  60. 5.95 s [pathway-compat-filepath] include filepath-1.4.301.0
  61. 5.95 s [pathway-compat-filepath] include megaparsec-9.7.0-EpAk7LLR2KBGAKafJPbXz1
  62. 5.95 s [pathway-compat-filepath] include os-string-2.0.10-19KGKnZaj8J2ODUMyNXxJr
  63. 5.95 s [pathway-compat-filepath] include pathway-0.0.1.0-5VJXWbvreBAfybP2NROr3
  64. 5.95 s [pathway-compat-filepath] include pathway-compat-base-0.0.1.0-E02izPYkwmmGdAPlQBKjbP
  65. 5.95 s [pathway-compat-filepath] include pathway-internal-0.0.1.0-1xeSc3z2VhRIotiMz9hdL1
  66. 5.95 s [pathway-compat-filepath] component pathway-compat-filepath-0.0.1.0-Bh4LT0cz7im2Vo1hGnl75g-doctests
  67. 5.95 s [pathway-compat-filepath] include base-4.18.3.0
  68. 5.95 s [pathway-compat-filepath] include doctest-0.24.3-ACQNy8u8jPjC50l4I3tyiL
  69. 5.95 s [pathway-compat-filepath] include pathway-compat-filepath-0.0.1.0-Ck51GFznMiC2cxIfBMz4NH
  70. 5.95 s [pathway-compat-filepath] Linked component graph:
  71. 5.95 s [pathway-compat-filepath] unit pathway-compat-filepath-0.0.1.0-Ck51GFznMiC2cxIfBMz4NH
  72. 5.95 s [pathway-compat-filepath] include base-4.18.3.0
  73. 5.95 s [pathway-compat-filepath] include extra-1.8.1-FU1frm3XcM88A49dBkmtgI
  74. 5.95 s [pathway-compat-filepath] include filepath-1.4.301.0
  75. 5.95 s [pathway-compat-filepath] include megaparsec-9.7.0-EpAk7LLR2KBGAKafJPbXz1
  76. 5.95 s [pathway-compat-filepath] include os-string-2.0.10-19KGKnZaj8J2ODUMyNXxJr
  77. 5.95 s [pathway-compat-filepath] include pathway-0.0.1.0-5VJXWbvreBAfybP2NROr3
  78. 5.95 s [pathway-compat-filepath] include pathway-compat-base-0.0.1.0-E02izPYkwmmGdAPlQBKjbP
  79. 5.95 s [pathway-compat-filepath] include pathway-internal-0.0.1.0-1xeSc3z2VhRIotiMz9hdL1
  80. 5.95 s [pathway-compat-filepath] Common.FilePath=pathway-compat-filepath-0.0.1.0-Ck51GFznMiC2cxIfBMz4NH:Common.FilePath,Common.OsPath=pathway-compat-filepath-0.0.1.0-Ck51GFznMiC2cxIfBMz4NH:Common.OsPath,System.FilePath=pathway-compat-filepath-0.0.1.0-Ck51GFznMiC2cxIfBMz4NH:System.FilePath,System.FilePath.Overlay=pathway-compat-filepath-0.0.1.0-Ck51GFznMiC2cxIfBMz4NH:System.FilePath.Overlay,System.FilePath.Pathway=pathway-compat-filepath-0.0.1.0-Ck51GFznMiC2cxIfBMz4NH:System.FilePath.Pathway,System.FilePath.Thin=pathway-compat-filepath-0.0.1.0-Ck51GFznMiC2cxIfBMz4NH:System.FilePath.Thin,System.OsPath=pathway-compat-filepath-0.0.1.0-Ck51GFznMiC2cxIfBMz4NH:System.OsPath,System.OsPath.Overlay=pathway-compat-filepath-0.0.1.0-Ck51GFznMiC2cxIfBMz4NH:System.OsPath.Overlay,System.OsPath.Pathway=pathway-compat-filepath-0.0.1.0-Ck51GFznMiC2cxIfBMz4NH:System.OsPath.Pathway,System.OsPath.Thin=pathway-compat-filepath-0.0.1.0-Ck51GFznMiC2cxIfBMz4NH:System.OsPath.Thin
  81. 5.95 s [pathway-compat-filepath] unit pathway-compat-filepath-0.0.1.0-Bh4LT0cz7im2Vo1hGnl75g-doctests
  82. 5.95 s [pathway-compat-filepath] include base-4.18.3.0
  83. 5.95 s [pathway-compat-filepath] include doctest-0.24.3-ACQNy8u8jPjC50l4I3tyiL
  84. 5.95 s [pathway-compat-filepath] include pathway-compat-filepath-0.0.1.0-Ck51GFznMiC2cxIfBMz4NH
  85. 5.95 s [pathway-compat-filepath] Ready component graph:
  86. 5.95 s [pathway-compat-filepath] definite pathway-compat-filepath-0.0.1.0-Ck51GFznMiC2cxIfBMz4NH
  87. 5.95 s [pathway-compat-filepath] depends base-4.18.3.0
  88. 5.95 s [pathway-compat-filepath] depends extra-1.8.1-FU1frm3XcM88A49dBkmtgI
  89. 5.95 s [pathway-compat-filepath] depends filepath-1.4.301.0
  90. 5.95 s [pathway-compat-filepath] depends megaparsec-9.7.0-EpAk7LLR2KBGAKafJPbXz1
  91. 5.95 s [pathway-compat-filepath] depends os-string-2.0.10-19KGKnZaj8J2ODUMyNXxJr
  92. 5.95 s [pathway-compat-filepath] depends pathway-0.0.1.0-5VJXWbvreBAfybP2NROr3
  93. 5.95 s [pathway-compat-filepath] depends pathway-compat-base-0.0.1.0-E02izPYkwmmGdAPlQBKjbP
  94. 5.95 s [pathway-compat-filepath] depends pathway-internal-0.0.1.0-1xeSc3z2VhRIotiMz9hdL1
  95. 5.95 s [pathway-compat-filepath] definite pathway-compat-filepath-0.0.1.0-Bh4LT0cz7im2Vo1hGnl75g-doctests
  96. 5.95 s [pathway-compat-filepath] depends base-4.18.3.0
  97. 5.95 s [pathway-compat-filepath] depends doctest-0.24.3-ACQNy8u8jPjC50l4I3tyiL
  98. 5.95 s [pathway-compat-filepath] depends pathway-compat-filepath-0.0.1.0-Ck51GFznMiC2cxIfBMz4NH
  99. 5.95 s [pathway-compat-filepath] Using Cabal-3.10.3.0 compiled by ghc-9.6
  100. 5.95 s [pathway-compat-filepath] Using compiler: ghc-9.6.7
  101. 5.95 s [pathway-compat-filepath] Using install prefix:
  102. 5.95 s [pathway-compat-filepath] /nix/store/0igg77m8f8gygqh7ywrf5yrrz3q05mcp-pathway-compat-filepath-0.0.1.0
  103. 5.95 s [pathway-compat-filepath] Executables installed in:
  104. 5.95 s [pathway-compat-filepath] /nix/store/0igg77m8f8gygqh7ywrf5yrrz3q05mcp-pathway-compat-filepath-0.0.1.0/bin
  105. 5.95 s [pathway-compat-filepath] Libraries installed in:
  106. 5.95 s [pathway-compat-filepath] /nix/store/0igg77m8f8gygqh7ywrf5yrrz3q05mcp-pathway-compat-filepath-0.0.1.0/lib/ghc-9.6.7/lib/x86_64-linux-ghc-9.6.7/pathway-compat-filepath-0.0.1.0-Ck51GFznMiC2cxIfBMz4NH
  107. 5.95 s [pathway-compat-filepath] Dynamic Libraries installed in:
  108. 5.95 s [pathway-compat-filepath] /nix/store/0igg77m8f8gygqh7ywrf5yrrz3q05mcp-pathway-compat-filepath-0.0.1.0/lib/ghc-9.6.7/lib/x86_64-linux-ghc-9.6.7
  109. 5.95 s [pathway-compat-filepath] Private executables installed in:
  110. 5.95 s [pathway-compat-filepath] /nix/store/0igg77m8f8gygqh7ywrf5yrrz3q05mcp-pathway-compat-filepath-0.0.1.0/libexec/x86_64-linux-ghc-9.6.7/pathway-compat-filepath-0.0.1.0
  111. 5.95 s [pathway-compat-filepath] Data files installed in:
  112. 5.95 s [pathway-compat-filepath] /nix/store/0igg77m8f8gygqh7ywrf5yrrz3q05mcp-pathway-compat-filepath-0.0.1.0/share/x86_64-linux-ghc-9.6.7/pathway-compat-filepath-0.0.1.0
  113. 5.95 s [pathway-compat-filepath] Documentation installed in:
  114. 5.95 s [pathway-compat-filepath] /nix/store/h9ipqzh965180gvqq9glid6sh6h06105-pathway-compat-filepath-0.0.1.0-doc/share/doc/pathway-compat-filepath-0.0.1.0
  115. 5.95 s [pathway-compat-filepath] Configuration files installed in:
  116. 5.95 s [pathway-compat-filepath] /nix/store/0igg77m8f8gygqh7ywrf5yrrz3q05mcp-pathway-compat-filepath-0.0.1.0/etc
  117. 5.95 s [pathway-compat-filepath] No alex found
  118. 5.95 s [pathway-compat-filepath] Using ar found on system at:
  119. 5.95 s [pathway-compat-filepath] /nix/store/zjraf40s86y3iwhp626b934r5y6ldkbb-binutils-wrapper-2.46/bin/ar
  120. 5.95 s [pathway-compat-filepath] No c2hs found
  121. 5.95 s [pathway-compat-filepath] No cpphs found
  122. 5.95 s [pathway-compat-filepath] Using doctest version 0.24.3 found on system at:
  123. 5.95 s [pathway-compat-filepath] /nix/store/s48k56ayjjxwdbz9y7d8mnqwlcjfi1a8-doctest-0.24.3/bin/doctest
  124. 5.95 s [pathway-compat-filepath] Using gcc version 15.2.0 given by user at:
  125. 5.95 s [pathway-compat-filepath] /nix/store/29qjlshvklnyr67nhpprzgb9igmsfsjj-gcc-wrapper-15.2.0/bin/gcc
  126. 5.95 s [pathway-compat-filepath] Using ghc version 9.6.7 found on system at:
  127. 5.95 s [pathway-compat-filepath] /nix/store/2djpcnj8a25viv1y24h3mziy1gsy3fc6-ghc-9.6.7/bin/ghc
  128. 5.95 s [pathway-compat-filepath] Using ghc-pkg version 9.6.7 found on system at:
  129. 5.95 s [pathway-compat-filepath] /nix/store/2djpcnj8a25viv1y24h3mziy1gsy3fc6-ghc-9.6.7/bin/ghc-pkg-9.6.7
  130. 5.95 s [pathway-compat-filepath] No ghcjs found
  131. 5.95 s [pathway-compat-filepath] No ghcjs-pkg found
  132. 5.95 s [pathway-compat-filepath] No greencard found
  133. 5.95 s [pathway-compat-filepath] Using haddock version 2.29.2 found on system at:
  134. 5.95 s [pathway-compat-filepath] /nix/store/2djpcnj8a25viv1y24h3mziy1gsy3fc6-ghc-9.6.7/bin/haddock-ghc-9.6.7
  135. 5.95 s [pathway-compat-filepath] No happy found
  136. 5.95 s [pathway-compat-filepath] Using haskell-suite found on system at: haskell-suite-dummy-location
  137. 5.95 s [pathway-compat-filepath] Using haskell-suite-pkg found on system at: haskell-suite-pkg-dummy-location
  138. 5.95 s [pathway-compat-filepath] No hmake found
  139. 5.95 s [pathway-compat-filepath] Using hpc version 0.68 found on system at:
  140. 5.95 s [pathway-compat-filepath] /nix/store/2djpcnj8a25viv1y24h3mziy1gsy3fc6-ghc-9.6.7/bin/hpc-ghc-9.6.7
  141. 5.95 s [pathway-compat-filepath] Using hsc2hs version 0.68.9 found on system at:
  142. 5.95 s [pathway-compat-filepath] /nix/store/2djpcnj8a25viv1y24h3mziy1gsy3fc6-ghc-9.6.7/bin/hsc2hs-ghc-9.6.7
  143. 5.95 s [pathway-compat-filepath] Using hscolour version 1.25 found on system at:
  144. 5.95 s [pathway-compat-filepath] /nix/store/2x19jxh5g98bv0s06mdj71c1hmxi54yl-hscolour-1.25/bin/HsColour
  145. 5.95 s [pathway-compat-filepath] No jhc found
  146. 5.95 s [pathway-compat-filepath] Using ld found on system at:
  147. 5.95 s [pathway-compat-filepath] /nix/store/zjraf40s86y3iwhp626b934r5y6ldkbb-binutils-wrapper-2.46/bin/ld.gold
  148. 5.95 s [pathway-compat-filepath] No pkg-config found
  149. 5.95 s [pathway-compat-filepath] Using runghc version 9.6.7 found on system at:
  150. 5.95 s [pathway-compat-filepath] /nix/store/2djpcnj8a25viv1y24h3mziy1gsy3fc6-ghc-9.6.7/bin/runghc-9.6.7
  151. 5.95 s [pathway-compat-filepath] Using strip version 2.46 found on system at:
  152. 5.95 s [pathway-compat-filepath] /nix/store/29qjlshvklnyr67nhpprzgb9igmsfsjj-gcc-wrapper-15.2.0/bin/strip
  153. 5.95 s [pathway-compat-filepath] Using tar found on system at:
  154. 5.95 s [pathway-compat-filepath] /nix/store/z5mq2sam4484prf3kv6v6vjw1m0i7j24-gnutar-1.35/bin/tar
  155. 5.95 s [pathway-compat-filepath] No uhc found
  156. 6.33 s [pathway-compat-filepath] Phase: buildPhase
  157. 6.40 s [pathway-compat-filepath] Preprocessing library for pathway-compat-filepath-0.0.1.0..
  158. 8.04 s [pathway-compat-filepath] Building library for pathway-compat-filepath-0.0.1.0..
  159. 8.04 s [pathway-compat-filepath] [ 1 of 10] Compiling Common.FilePath ( src/Common/FilePath.hs, dist/build/Common/FilePath.o, dist/build/Common/FilePath.dyn_o )
  160. 8.04 s [pathway-compat-filepath] [ 2 of 10] Compiling Common.OsPath ( src/Common/OsPath.hs, dist/build/Common/OsPath.o, dist/build/Common/OsPath.dyn_o )
  161. 8.04 s [pathway-compat-filepath]
  162. 8.04 s [pathway-compat-filepath] src/Common/OsPath.hs:90:23: error: [GHC-83865]
  163. 8.04 s [pathway-compat-filepath] • Couldn't match type ‘OSS.OsString’ with ‘OsString’
  164. 8.04 s [pathway-compat-filepath] Expected: OsPath
  165. 8.04 s [pathway-compat-filepath] Actual: OSS.OsString
  166. 8.04 s [pathway-compat-filepath] NB: ‘OsString’
  167. 8.04 s [pathway-compat-filepath] is defined in ‘System.OsString.Internal.Types.Hidden’
  168. 8.04 s [pathway-compat-filepath] in package ‘filepath-1.4.301.0’
  169. 8.04 s [pathway-compat-filepath] ‘OSS.OsString’
  170. 8.04 s [pathway-compat-filepath] is defined in ‘System.OsString.Internal.Types’
  171. 8.04 s [pathway-compat-filepath] in package ‘os-string-2.0.10’
  172. 8.04 s [pathway-compat-filepath] • In the ‘parent’ field of a record
  173. 8.04 s [pathway-compat-filepath] In the expression:
  174. 8.04 s [pathway-compat-filepath] Format
  175. 8.04 s [pathway-compat-filepath] {Format.root = O.pack . pure $ O.pathSeparator,
  176. 8.04 s [pathway-compat-filepath] Format.current = mempty, Format.parent = OSS.unsafeEncodeUtf "..",
  177. 8.04 s [pathway-compat-filepath] Format.separator = O.pack . pure $ O.pathSeparator,
  178. 8.04 s [pathway-compat-filepath] Format.substitutions = mempty}
  179. 8.04 s [pathway-compat-filepath] In an equation for ‘localFormat’:
  180. 8.04 s [pathway-compat-filepath] localFormat
  181. 8.04 s [pathway-compat-filepath] = Format
  182. 8.04 s [pathway-compat-filepath] {Format.root = O.pack . pure $ O.pathSeparator,
  183. 8.04 s [pathway-compat-filepath] Format.current = mempty, Format.parent = OSS.unsafeEncodeUtf "..",
  184. 8.04 s [pathway-compat-filepath] Format.separator = O.pack . pure $ O.pathSeparator,
  185. 8.04 s [pathway-compat-filepath] Format.substitutions = mempty}
  186. 8.04 s [pathway-compat-filepath] |
  187. 8.04 s [pathway-compat-filepath] 90 | Format.parent = OSS.unsafeEncodeUtf "..",
  188. 8.04 s [pathway-compat-filepath] | ^^^^^^^^^^^^^^^^^^^^^^^^
  189. 8.04 s [pathway-compat-filepath] [ 3 of 10] Compiling System.FilePath.Thin ( src/System/FilePath/Thin.hs, dist/build/System/FilePath/Thin.o, dist/build/System/FilePath/Thin.dyn_o )
  190. 8.04 s [pathway-compat-filepath] [ 4 of 10] Compiling System.FilePath.Pathway ( src/System/FilePath/Pathway.hs, dist/build/System/FilePath/Pathway.o, dist/build/System/FilePath/Pathway.dyn_o )
  191. 8.04 s [pathway-compat-filepath] [ 5 of 10] Compiling System.FilePath.Overlay ( src/System/FilePath/Overlay.hs, dist/build/System/FilePath/Overlay.o, dist/build/System/FilePath/Overlay.dyn_o )
  192. 8.04 s [pathway-compat-filepath] [ 6 of 10] Compiling System.FilePath ( src/System/FilePath.hs, dist/build/System/FilePath.o, dist/build/System/FilePath.dyn_o )
  193. 8.04 s Progress: 0 of 12 built (1 failed)
  194. 8.04 s Failed to build pathway-compat-filepath after 5.7s
  195. 8.04 s error: Cannot build '/nix/store/0xfx9r31aw74hs5sjbw3nqlrrvg2y7r8-pathway-compat-filepath-0.0.1.0.drv'.
  196. 8.04 s Reason: builder failed with exit code 1.
  197. 8.04 s Output paths:
  198. 8.04 s /nix/store/0igg77m8f8gygqh7ywrf5yrrz3q05mcp-pathway-compat-filepath-0.0.1.0
  199. 8.04 s /nix/store/h9ipqzh965180gvqq9glid6sh6h06105-pathway-compat-filepath-0.0.1.0-doc
  200. 8.04 s Last 176 log lines:
  201. 8.04 s > Running phase: setupCompilerEnvironmentPhase
  202. 8.04 s > Build with /nix/store/2djpcnj8a25viv1y24h3mziy1gsy3fc6-ghc-9.6.7.
  203. 8.04 s > Running phase: unpackPhase
  204. 8.04 s > unpacking source archive /nix/store/56v5999xvkp18l2ygdvahppqdv4hrlnl-filepath
  205. 8.04 s > source root is filepath
  206. 8.04 s > Running phase: patchPhase
  207. 8.04 s > Running phase: compileBuildDriverPhase
  208. 8.04 s > setupCompileFlags: -package-db=/build/tmp.Uf5lJVh2Of/setup-package.conf.d -threaded
  209. 8.04 s > [1 of 2] Compiling Main ( Setup.hs, /build/tmp.Uf5lJVh2Of/Main.o )
  210. 8.04 s > [2 of 2] Linking Setup
  211. 8.04 s > Running phase: updateAutotoolsGnuConfigScriptsPhase
  212. 8.04 s > Running phase: configurePhase
  213. 8.04 s > configureFlags: --verbose --prefix=/nix/store/0igg77m8f8gygqh7ywrf5yrrz3q05mcp-pathway-compat-filepath-0.0.1.0 --libdir=$prefix/lib/$compiler/lib --libsubdir=$abi/$libname --docdir=/nix/store/h9ipqzh965180gvqq9glid6sh6h06105-pathway-compat-filepath-0.0.1.0-doc/share/doc/pathway-compat-filepath-0.0.1.0 --with-gcc=gcc --package-db=/build/tmp.Uf5lJVh2Of/package.conf.d --ghc-option=-j16 --ghc-option=+RTS --ghc-option=-A64M --ghc-option=-RTS --enable-library-profiling --profiling-detail=exported-functions --disable-profiling --enable-shared --disable-coverage --enable-static --disable-executable-dynamic --enable-tests --disable-benchmarks --enable-library-vanilla --disable-library-for-ghci --enable-split-sections --enable-library-stripping --enable-executable-stripping --ghc-option=-haddock --ghc-options=-Werror --extra-lib-dirs=/nix/store/pndhkk0l649lm1sj0mxk7cbwq26qd1ra-ncurses-6.6/lib --extra-lib-dirs=/nix/store/0djlg4g0b81w94k3vcaqsxsc2hh4kism-libffi-3.5.2/lib --extra-lib-dirs=/nix/store/md4paia7riiggyrj8p24c7a6vf8w7jz8-elfutils-0.194/lib --extra-lib-dirs=/nix/store/39vv2pf64gd8li48a4hpbhw2crzd8z5p-gmp-with-cxx-6.3.0/lib --extra-lib-dirs=/nix/store/7wwvald8lapkrsr72qanlw8blyn55ifx-numactl-2.0.18/lib --extra-lib-dirs=/nix/store/2djpcnj8a25viv1y24h3mziy1gsy3fc6-ghc-9.6.7/lib
  214. 8.04 s > Using Parsec parser
  215. 8.04 s > Configuring pathway-compat-filepath-0.0.1.0...
  216. 8.04 s > Flags chosen: noisy-deprecations=True, verify-no-recursion=False
  217. 8.04 s > Dependency base >=4.14.0 && <4.15 || >=4.15.0 && <4.16 || >=4.16.0 && <4.17 ||
  218. 8.04 s > >=4.17.0 && <4.18 || >=4.18.0 && <4.19 || >=4.19.0 && <4.20 || >=4.20.0 &&
  219. 8.04 s > <4.21 || >=4.21.0 && <4.22 || >=4.22.0 && <4.23: using base-4.18.3.0
  220. 8.04 s > Dependency extra: using extra-1.8.1
  221. 8.04 s > Dependency filepath >=1.4.2 && <1.5 || >=1.5.0 && <1.6: using
  222. 8.04 s > filepath-1.4.301.0
  223. 8.04 s > Dependency megaparsec >=9.0.1 && <9.1 || >=9.2.1 && <9.3 || >=9.5.0 && <9.6 ||
  224. 8.04 s > >=9.7.0 && <9.8: using megaparsec-9.7.0
  225. 8.04 s > Dependency os-string: using os-string-2.0.10
  226. 8.04 s > Dependency pathway >=0.0.1 && <0.1: using pathway-0.0.1.0
  227. 8.04 s > Dependency pathway-compat-base >=0.0.1 && <0.1: using
  228. 8.04 s > pathway-compat-base-0.0.1.0
  229. 8.04 s > Dependency pathway-internal >=0.0.1 && <0.1: using pathway-internal-0.0.1.0
  230. 8.04 s > Dependency base >=4.14.0 && <4.15 || >=4.15.0 && <4.16 || >=4.16.0 && <4.17 ||
  231. 8.04 s > >=4.17.0 && <4.18 || >=4.18.0 && <4.19 || >=4.19.0 && <4.20 || >=4.20.0 &&
  232. 8.04 s > <4.21 || >=4.21.0 && <4.22 || >=4.22.0 && <4.23: using base-4.18.3.0
  233. 8.04 s > Dependency doctest >=0.16.3 && <0.17 || >=0.18.1 && <0.19 || >=0.20.1 && <0.21
  234. 8.04 s > || >=0.21.1 && <0.22 || >=0.22.2 && <0.23 || >=0.24.2 && <0.25: using
  235. 8.04 s > doctest-0.24.3
  236. 8.04 s > Dependency pathway-compat-filepath: using pathway-compat-filepath-0.0.1.0
  237. 8.04 s > Source component graph:
  238. 8.04 s > component lib
  239. 8.04 s > component test:doctests dependency lib
  240. 8.04 s > Configured component graph:
  241. 8.04 s > component pathway-compat-filepath-0.0.1.0-Ck51GFznMiC2cxIfBMz4NH
  242. 8.04 s > include base-4.18.3.0
  243. 8.04 s > include extra-1.8.1-FU1frm3XcM88A49dBkmtgI
  244. 8.04 s > include filepath-1.4.301.0
  245. 8.04 s > include megaparsec-9.7.0-EpAk7LLR2KBGAKafJPbXz1
  246. 8.04 s > include os-string-2.0.10-19KGKnZaj8J2ODUMyNXxJr
  247. 8.04 s > include pathway-0.0.1.0-5VJXWbvreBAfybP2NROr3
  248. 8.04 s > include pathway-compat-base-0.0.1.0-E02izPYkwmmGdAPlQBKjbP
  249. 8.04 s > include pathway-internal-0.0.1.0-1xeSc3z2VhRIotiMz9hdL1
  250. 8.04 s > component pathway-compat-filepath-0.0.1.0-Bh4LT0cz7im2Vo1hGnl75g-doctests
  251. 8.04 s > include base-4.18.3.0
  252. 8.04 s > include doctest-0.24.3-ACQNy8u8jPjC50l4I3tyiL
  253. 8.04 s > include pathway-compat-filepath-0.0.1.0-Ck51GFznMiC2cxIfBMz4NH
  254. 8.04 s > Linked component graph:
  255. 8.04 s > unit pathway-compat-filepath-0.0.1.0-Ck51GFznMiC2cxIfBMz4NH
  256. 8.04 s > include base-4.18.3.0
  257. 8.04 s > include extra-1.8.1-FU1frm3XcM88A49dBkmtgI
  258. 8.04 s > include filepath-1.4.301.0
  259. 8.04 s > include megaparsec-9.7.0-EpAk7LLR2KBGAKafJPbXz1
  260. 8.04 s > include os-string-2.0.10-19KGKnZaj8J2ODUMyNXxJr
  261. 8.04 s > include pathway-0.0.1.0-5VJXWbvreBAfybP2NROr3
  262. 8.04 s > include pathway-compat-base-0.0.1.0-E02izPYkwmmGdAPlQBKjbP
  263. 8.04 s > include pathway-internal-0.0.1.0-1xeSc3z2VhRIotiMz9hdL1
  264. 8.04 s > Common.FilePath=pathway-compat-filepath-0.0.1.0-Ck51GFznMiC2cxIfBMz4NH:Common.FilePath,Common.OsPath=pathway-compat-filepath-0.0.1.0-Ck51GFznMiC2cxIfBMz4NH:Common.OsPath,System.FilePath=pathway-compat-filepath-0.0.1.0-Ck51GFznMiC2cxIfBMz4NH:System.FilePath,System.FilePath.Overlay=pathway-compat-filepath-0.0.1.0-Ck51GFznMiC2cxIfBMz4NH:System.FilePath.Overlay,System.FilePath.Pathway=pathway-compat-filepath-0.0.1.0-Ck51GFznMiC2cxIfBMz4NH:System.FilePath.Pathway,System.FilePath.Thin=pathway-compat-filepath-0.0.1.0-Ck51GFznMiC2cxIfBMz4NH:System.FilePath.Thin,System.OsPath=pathway-compat-filepath-0.0.1.0-Ck51GFznMiC2cxIfBMz4NH:System.OsPath,System.OsPath.Overlay=pathway-compat-filepath-0.0.1.0-Ck51GFznMiC2cxIfBMz4NH:System.OsPath.Overlay,System.OsPath.Pathway=pathway-compat-filepath-0.0.1.0-Ck51GFznMiC2cxIfBMz4NH:System.OsPath.Pathway,System.OsPath.Thin=pathway-compat-filepath-0.0.1.0-Ck51GFznMiC2cxIfBMz4NH:System.OsPath.Thin
  265. 8.04 s > unit pathway-compat-filepath-0.0.1.0-Bh4LT0cz7im2Vo1hGnl75g-doctests
  266. 8.04 s > include base-4.18.3.0
  267. 8.04 s > include doctest-0.24.3-ACQNy8u8jPjC50l4I3tyiL
  268. 8.04 s > include pathway-compat-filepath-0.0.1.0-Ck51GFznMiC2cxIfBMz4NH
  269. 8.04 s > Ready component graph:
  270. 8.04 s > definite pathway-compat-filepath-0.0.1.0-Ck51GFznMiC2cxIfBMz4NH
  271. 8.04 s > depends base-4.18.3.0
  272. 8.04 s > depends extra-1.8.1-FU1frm3XcM88A49dBkmtgI
  273. 8.04 s > depends filepath-1.4.301.0
  274. 8.04 s > depends megaparsec-9.7.0-EpAk7LLR2KBGAKafJPbXz1
  275. 8.04 s > depends os-string-2.0.10-19KGKnZaj8J2ODUMyNXxJr
  276. 8.04 s > depends pathway-0.0.1.0-5VJXWbvreBAfybP2NROr3
  277. 8.04 s > depends pathway-compat-base-0.0.1.0-E02izPYkwmmGdAPlQBKjbP
  278. 8.04 s > depends pathway-internal-0.0.1.0-1xeSc3z2VhRIotiMz9hdL1
  279. 8.04 s > definite pathway-compat-filepath-0.0.1.0-Bh4LT0cz7im2Vo1hGnl75g-doctests
  280. 8.04 s > depends base-4.18.3.0
  281. 8.04 s > depends doctest-0.24.3-ACQNy8u8jPjC50l4I3tyiL
  282. 8.04 s > depends pathway-compat-filepath-0.0.1.0-Ck51GFznMiC2cxIfBMz4NH
  283. 8.04 s > Using Cabal-3.10.3.0 compiled by ghc-9.6
  284. 8.04 s > Using compiler: ghc-9.6.7
  285. 8.04 s > Using install prefix:
  286. 8.04 s > /nix/store/0igg77m8f8gygqh7ywrf5yrrz3q05mcp-pathway-compat-filepath-0.0.1.0
  287. 8.04 s > Executables installed in:
  288. 8.04 s > /nix/store/0igg77m8f8gygqh7ywrf5yrrz3q05mcp-pathway-compat-filepath-0.0.1.0/bin
  289. 8.04 s > Libraries installed in:
  290. 8.04 s > /nix/store/0igg77m8f8gygqh7ywrf5yrrz3q05mcp-pathway-compat-filepath-0.0.1.0/lib/ghc-9.6.7/lib/x86_64-linux-ghc-9.6.7/pathway-compat-filepath-0.0.1.0-Ck51GFznMiC2cxIfBMz4NH
  291. 8.04 s > Dynamic Libraries installed in:
  292. 8.04 s > /nix/store/0igg77m8f8gygqh7ywrf5yrrz3q05mcp-pathway-compat-filepath-0.0.1.0/lib/ghc-9.6.7/lib/x86_64-linux-ghc-9.6.7
  293. 8.04 s > Private executables installed in:
  294. 8.04 s > /nix/store/0igg77m8f8gygqh7ywrf5yrrz3q05mcp-pathway-compat-filepath-0.0.1.0/libexec/x86_64-linux-ghc-9.6.7/pathway-compat-filepath-0.0.1.0
  295. 8.04 s > Data files installed in:
  296. 8.04 s > /nix/store/0igg77m8f8gygqh7ywrf5yrrz3q05mcp-pathway-compat-filepath-0.0.1.0/share/x86_64-linux-ghc-9.6.7/pathway-compat-filepath-0.0.1.0
  297. 8.04 s > Documentation installed in:
  298. 8.04 s > /nix/store/h9ipqzh965180gvqq9glid6sh6h06105-pathway-compat-filepath-0.0.1.0-doc/share/doc/pathway-compat-filepath-0.0.1.0
  299. 8.04 s > Configuration files installed in:
  300. 8.04 s > /nix/store/0igg77m8f8gygqh7ywrf5yrrz3q05mcp-pathway-compat-filepath-0.0.1.0/etc
  301. 8.04 s > No alex found
  302. 8.04 s > Using ar found on system at:
  303. 8.04 s > /nix/store/zjraf40s86y3iwhp626b934r5y6ldkbb-binutils-wrapper-2.46/bin/ar
  304. 8.04 s > No c2hs found
  305. 8.04 s > No cpphs found
  306. 8.04 s > Using doctest version 0.24.3 found on system at:
  307. 8.04 s > /nix/store/s48k56ayjjxwdbz9y7d8mnqwlcjfi1a8-doctest-0.24.3/bin/doctest
  308. 8.04 s > Using gcc version 15.2.0 given by user at:
  309. 8.04 s > /nix/store/29qjlshvklnyr67nhpprzgb9igmsfsjj-gcc-wrapper-15.2.0/bin/gcc
  310. 8.04 s > Using ghc version 9.6.7 found on system at:
  311. 8.04 s > /nix/store/2djpcnj8a25viv1y24h3mziy1gsy3fc6-ghc-9.6.7/bin/ghc
  312. 8.04 s > Using ghc-pkg version 9.6.7 found on system at:
  313. 8.04 s > /nix/store/2djpcnj8a25viv1y24h3mziy1gsy3fc6-ghc-9.6.7/bin/ghc-pkg-9.6.7
  314. 8.04 s > No ghcjs found
  315. 8.04 s > No ghcjs-pkg found
  316. 8.04 s > No greencard found
  317. 8.04 s > Using haddock version 2.29.2 found on system at:
  318. 8.04 s > /nix/store/2djpcnj8a25viv1y24h3mziy1gsy3fc6-ghc-9.6.7/bin/haddock-ghc-9.6.7
  319. 8.04 s > No happy found
  320. 8.04 s > Using haskell-suite found on system at: haskell-suite-dummy-location
  321. 8.04 s > Using haskell-suite-pkg found on system at: haskell-suite-pkg-dummy-location
  322. 8.04 s > No hmake found
  323. 8.04 s > Using hpc version 0.68 found on system at:
  324. 8.04 s > /nix/store/2djpcnj8a25viv1y24h3mziy1gsy3fc6-ghc-9.6.7/bin/hpc-ghc-9.6.7
  325. 8.04 s > Using hsc2hs version 0.68.9 found on system at:
  326. 8.04 s > /nix/store/2djpcnj8a25viv1y24h3mziy1gsy3fc6-ghc-9.6.7/bin/hsc2hs-ghc-9.6.7
  327. 8.04 s > Using hscolour version 1.25 found on system at:
  328. 8.04 s > /nix/store/2x19jxh5g98bv0s06mdj71c1hmxi54yl-hscolour-1.25/bin/HsColour
  329. 8.04 s > No jhc found
  330. 8.04 s > Using ld found on system at:
  331. 8.04 s > /nix/store/zjraf40s86y3iwhp626b934r5y6ldkbb-binutils-wrapper-2.46/bin/ld.gold
  332. 8.04 s > No pkg-config found
  333. 8.04 s > Using runghc version 9.6.7 found on system at:
  334. 8.04 s > /nix/store/2djpcnj8a25viv1y24h3mziy1gsy3fc6-ghc-9.6.7/bin/runghc-9.6.7
  335. 8.04 s > Using strip version 2.46 found on system at:
  336. 8.04 s > /nix/store/29qjlshvklnyr67nhpprzgb9igmsfsjj-gcc-wrapper-15.2.0/bin/strip
  337. 8.04 s > Using tar found on system at:
  338. 8.04 s > /nix/store/z5mq2sam4484prf3kv6v6vjw1m0i7j24-gnutar-1.35/bin/tar
  339. 8.04 s > No uhc found
  340. 8.04 s > Running phase: buildPhase
  341. 8.04 s > Preprocessing library for pathway-compat-filepath-0.0.1.0..
  342. 8.04 s > Building library for pathway-compat-filepath-0.0.1.0..
  343. 8.04 s > [ 1 of 10] Compiling Common.FilePath ( src/Common/FilePath.hs, dist/build/Common/FilePath.o, dist/build/Common/FilePath.dyn_o )
  344. 8.04 s > [ 2 of 10] Compiling Common.OsPath ( src/Common/OsPath.hs, dist/build/Common/OsPath.o, dist/build/Common/OsPath.dyn_o )
  345. 8.04 s >
  346. 8.04 s > src/Common/OsPath.hs:90:23: error: [GHC-83865]
  347. 8.04 s > • Couldn't match type ‘OSS.OsString’ with ‘OsString’
  348. 8.04 s > Expected: OsPath
  349. 8.04 s > Actual: OSS.OsString
  350. 8.04 s > NB: ‘OsString’
  351. 8.04 s > is defined in ‘System.OsString.Internal.Types.Hidden’
  352. 8.04 s > in package ‘filepath-1.4.301.0’
  353. 8.04 s > ‘OSS.OsString’
  354. 8.04 s > is defined in ‘System.OsString.Internal.Types’
  355. 8.04 s > in package ‘os-string-2.0.10’
  356. 8.04 s > • In the ‘parent’ field of a record
  357. 8.04 s > In the expression:
  358. 8.04 s > Format
  359. 8.04 s > {Format.root = O.pack . pure $ O.pathSeparator,
  360. 8.04 s > Format.current = mempty, Format.parent = OSS.unsafeEncodeUtf "..",
  361. 8.04 s > Format.separator = O.pack . pure $ O.pathSeparator,
  362. 8.04 s > Format.substitutions = mempty}
  363. 8.04 s > In an equation for ‘localFormat’:
  364. 8.04 s > localFormat
  365. 8.04 s > = Format
  366. 8.04 s > {Format.root = O.pack . pure $ O.pathSeparator,
  367. 8.04 s > Format.current = mempty, Format.parent = OSS.unsafeEncodeUtf "..",
  368. 8.04 s > Format.separator = O.pack . pure $ O.pathSeparator,
  369. 8.04 s > Format.substitutions = mempty}
  370. 8.04 s > |
  371. 8.04 s > 90 | Format.parent = OSS.unsafeEncodeUtf "..",
  372. 8.04 s > | ^^^^^^^^^^^^^^^^^^^^^^^^
  373. 8.04 s > [ 3 of 10] Compiling System.FilePath.Thin ( src/System/FilePath/Thin.hs, dist/build/System/FilePath/Thin.o, dist/build/System/FilePath/Thin.dyn_o )
  374. 8.04 s > [ 4 of 10] Compiling System.FilePath.Pathway ( src/System/FilePath/Pathway.hs, dist/build/System/FilePath/Pathway.o, dist/build/System/FilePath/Pathway.dyn_o )
  375. 8.04 s > [ 5 of 10] Compiling System.FilePath.Overlay ( src/System/FilePath/Overlay.hs, dist/build/System/FilePath/Overlay.o, dist/build/System/FilePath/Overlay.dyn_o )
  376. 8.04 s > [ 6 of 10] Compiling System.FilePath ( src/System/FilePath.hs, dist/build/System/FilePath.o, dist/build/System/FilePath.dyn_o )
  377. 8.04 s For full logs, run:
  378. 8.04 s nix log /nix/store/0xfx9r31aw74hs5sjbw3nqlrrvg2y7r8-pathway-compat-filepath-0.0.1.0.drv
  379. 8.04 s error: Cannot build '/nix/store/0xfx9r31aw74hs5sjbw3nqlrrvg2y7r8-pathway-compat-filepath-0.0.1.0.drv'.
  380. 8.04 s Reason: builder failed with exit code 1.
  381. 8.04 s Output paths:
  382. 8.04 s /nix/store/0igg77m8f8gygqh7ywrf5yrrz3q05mcp-pathway-compat-filepath-0.0.1.0
  383. 8.04 s /nix/store/h9ipqzh965180gvqq9glid6sh6h06105-pathway-compat-filepath-0.0.1.0-doc
  384. 8.04 s Last 176 log lines:
  385. 8.04 s > Running phase: setupCompilerEnvironmentPhase
  386. 8.04 s > Build with /nix/store/2djpcnj8a25viv1y24h3mziy1gsy3fc6-ghc-9.6.7.
  387. 8.04 s > Running phase: unpackPhase
  388. 8.04 s > unpacking source archive /nix/store/56v5999xvkp18l2ygdvahppqdv4hrlnl-filepath
  389. 8.04 s > source root is filepath
  390. 8.04 s > Running phase: patchPhase
  391. 8.04 s > Running phase: compileBuildDriverPhase
  392. 8.04 s > setupCompileFlags: -package-db=/build/tmp.Uf5lJVh2Of/setup-package.conf.d -threaded
  393. 8.04 s > [1 of 2] Compiling Main ( Setup.hs, /build/tmp.Uf5lJVh2Of/Main.o )
  394. 8.04 s > [2 of 2] Linking Setup
  395. 8.04 s > Running phase: updateAutotoolsGnuConfigScriptsPhase
  396. 8.04 s > Running phase: configurePhase
  397. 8.04 s > configureFlags: --verbose --prefix=/nix/store/0igg77m8f8gygqh7ywrf5yrrz3q05mcp-pathway-compat-filepath-0.0.1.0 --libdir=$prefix/lib/$compiler/lib --libsubdir=$abi/$libname --docdir=/nix/store/h9ipqzh965180gvqq9glid6sh6h06105-pathway-compat-filepath-0.0.1.0-doc/share/doc/pathway-compat-filepath-0.0.1.0 --with-gcc=gcc --package-db=/build/tmp.Uf5lJVh2Of/package.conf.d --ghc-option=-j16 --ghc-option=+RTS --ghc-option=-A64M --ghc-option=-RTS --enable-library-profiling --profiling-detail=exported-functions --disable-profiling --enable-shared --disable-coverage --enable-static --disable-executable-dynamic --enable-tests --disable-benchmarks --enable-library-vanilla --disable-library-for-ghci --enable-split-sections --enable-library-stripping --enable-executable-stripping --ghc-option=-haddock --ghc-options=-Werror --extra-lib-dirs=/nix/store/pndhkk0l649lm1sj0mxk7cbwq26qd1ra-ncurses-6.6/lib --extra-lib-dirs=/nix/store/0djlg4g0b81w94k3vcaqsxsc2hh4kism-libffi-3.5.2/lib --extra-lib-dirs=/nix/store/md4paia7riiggyrj8p24c7a6vf8w7jz8-elfutils-0.194/lib --extra-lib-dirs=/nix/store/39vv2pf64gd8li48a4hpbhw2crzd8z5p-gmp-with-cxx-6.3.0/lib --extra-lib-dirs=/nix/store/7wwvald8lapkrsr72qanlw8blyn55ifx-numactl-2.0.18/lib --extra-lib-dirs=/nix/store/2djpcnj8a25viv1y24h3mziy1gsy3fc6-ghc-9.6.7/lib
  398. 8.04 s > Using Parsec parser
  399. 8.04 s > Configuring pathway-compat-filepath-0.0.1.0...
  400. 8.04 s > Flags chosen: noisy-deprecations=True, verify-no-recursion=False
  401. 8.04 s > Dependency base >=4.14.0 && <4.15 || >=4.15.0 && <4.16 || >=4.16.0 && <4.17 ||
  402. 8.04 s > >=4.17.0 && <4.18 || >=4.18.0 && <4.19 || >=4.19.0 && <4.20 || >=4.20.0 &&
  403. 8.04 s > <4.21 || >=4.21.0 && <4.22 || >=4.22.0 && <4.23: using base-4.18.3.0
  404. 8.04 s > Dependency extra: using extra-1.8.1
  405. 8.04 s > Dependency filepath >=1.4.2 && <1.5 || >=1.5.0 && <1.6: using
  406. 8.04 s > filepath-1.4.301.0
  407. 8.04 s > Dependency megaparsec >=9.0.1 && <9.1 || >=9.2.1 && <9.3 || >=9.5.0 && <9.6 ||
  408. 8.04 s > >=9.7.0 && <9.8: using megaparsec-9.7.0
  409. 8.04 s > Dependency os-string: using os-string-2.0.10
  410. 8.04 s > Dependency pathway >=0.0.1 && <0.1: using pathway-0.0.1.0
  411. 8.04 s > Dependency pathway-compat-base >=0.0.1 && <0.1: using
  412. 8.04 s > pathway-compat-base-0.0.1.0
  413. 8.04 s > Dependency pathway-internal >=0.0.1 && <0.1: using pathway-internal-0.0.1.0
  414. 8.04 s > Dependency base >=4.14.0 && <4.15 || >=4.15.0 && <4.16 || >=4.16.0 && <4.17 ||
  415. 8.04 s > >=4.17.0 && <4.18 || >=4.18.0 && <4.19 || >=4.19.0 && <4.20 || >=4.20.0 &&
  416. 8.04 s > <4.21 || >=4.21.0 && <4.22 || >=4.22.0 && <4.23: using base-4.18.3.0
  417. 8.04 s > Dependency doctest >=0.16.3 && <0.17 || >=0.18.1 && <0.19 || >=0.20.1 && <0.21
  418. 8.04 s > || >=0.21.1 && <0.22 || >=0.22.2 && <0.23 || >=0.24.2 && <0.25: using
  419. 8.04 s > doctest-0.24.3
  420. 8.04 s > Dependency pathway-compat-filepath: using pathway-compat-filepath-0.0.1.0
  421. 8.04 s > Source component graph:
  422. 8.04 s > component lib
  423. 8.04 s > component test:doctests dependency lib
  424. 8.04 s > Configured component graph:
  425. 8.04 s > component pathway-compat-filepath-0.0.1.0-Ck51GFznMiC2cxIfBMz4NH
  426. 8.04 s > include base-4.18.3.0
  427. 8.04 s > include extra-1.8.1-FU1frm3XcM88A49dBkmtgI
  428. 8.04 s > include filepath-1.4.301.0
  429. 8.04 s > include megaparsec-9.7.0-EpAk7LLR2KBGAKafJPbXz1
  430. 8.04 s > include os-string-2.0.10-19KGKnZaj8J2ODUMyNXxJr
  431. 8.04 s > include pathway-0.0.1.0-5VJXWbvreBAfybP2NROr3
  432. 8.04 s > include pathway-compat-base-0.0.1.0-E02izPYkwmmGdAPlQBKjbP
  433. 8.04 s > include pathway-internal-0.0.1.0-1xeSc3z2VhRIotiMz9hdL1
  434. 8.04 s > component pathway-compat-filepath-0.0.1.0-Bh4LT0cz7im2Vo1hGnl75g-doctests
  435. 8.04 s > include base-4.18.3.0
  436. 8.04 s > include doctest-0.24.3-ACQNy8u8jPjC50l4I3tyiL
  437. 8.04 s > include pathway-compat-filepath-0.0.1.0-Ck51GFznMiC2cxIfBMz4NH
  438. 8.04 s > Linked component graph:
  439. 8.04 s > unit pathway-compat-filepath-0.0.1.0-Ck51GFznMiC2cxIfBMz4NH
  440. 8.04 s > include base-4.18.3.0
  441. 8.04 s > include extra-1.8.1-FU1frm3XcM88A49dBkmtgI
  442. 8.04 s > include filepath-1.4.301.0
  443. 8.04 s > include megaparsec-9.7.0-EpAk7LLR2KBGAKafJPbXz1
  444. 8.04 s > include os-string-2.0.10-19KGKnZaj8J2ODUMyNXxJr
  445. 8.04 s > include pathway-0.0.1.0-5VJXWbvreBAfybP2NROr3
  446. 8.04 s > include pathway-compat-base-0.0.1.0-E02izPYkwmmGdAPlQBKjbP
  447. 8.04 s > include pathway-internal-0.0.1.0-1xeSc3z2VhRIotiMz9hdL1
  448. 8.04 s > Common.FilePath=pathway-compat-filepath-0.0.1.0-Ck51GFznMiC2cxIfBMz4NH:Common.FilePath,Common.OsPath=pathway-compat-filepath-0.0.1.0-Ck51GFznMiC2cxIfBMz4NH:Common.OsPath,System.FilePath=pathway-compat-filepath-0.0.1.0-Ck51GFznMiC2cxIfBMz4NH:System.FilePath,System.FilePath.Overlay=pathway-compat-filepath-0.0.1.0-Ck51GFznMiC2cxIfBMz4NH:System.FilePath.Overlay,System.FilePath.Pathway=pathway-compat-filepath-0.0.1.0-Ck51GFznMiC2cxIfBMz4NH:System.FilePath.Pathway,System.FilePath.Thin=pathway-compat-filepath-0.0.1.0-Ck51GFznMiC2cxIfBMz4NH:System.FilePath.Thin,System.OsPath=pathway-compat-filepath-0.0.1.0-Ck51GFznMiC2cxIfBMz4NH:System.OsPath,System.OsPath.Overlay=pathway-compat-filepath-0.0.1.0-Ck51GFznMiC2cxIfBMz4NH:System.OsPath.Overlay,System.OsPath.Pathway=pathway-compat-filepath-0.0.1.0-Ck51GFznMiC2cxIfBMz4NH:System.OsPath.Pathway,System.OsPath.Thin=pathway-compat-filepath-0.0.1.0-Ck51GFznMiC2cxIfBMz4NH:System.OsPath.Thin
  449. 8.04 s > unit pathway-compat-filepath-0.0.1.0-Bh4LT0cz7im2Vo1hGnl75g-doctests
  450. 8.04 s > include base-4.18.3.0
  451. 8.04 s > include doctest-0.24.3-ACQNy8u8jPjC50l4I3tyiL
  452. 8.04 s > include pathway-compat-filepath-0.0.1.0-Ck51GFznMiC2cxIfBMz4NH
  453. 8.04 s > Ready component graph:
  454. 8.04 s > definite pathway-compat-filepath-0.0.1.0-Ck51GFznMiC2cxIfBMz4NH
  455. 8.04 s > depends base-4.18.3.0
  456. 8.04 s > depends extra-1.8.1-FU1frm3XcM88A49dBkmtgI
  457. 8.04 s > depends filepath-1.4.301.0
  458. 8.04 s > depends megaparsec-9.7.0-EpAk7LLR2KBGAKafJPbXz1
  459. 8.04 s > depends os-string-2.0.10-19KGKnZaj8J2ODUMyNXxJr
  460. 8.04 s > depends pathway-0.0.1.0-5VJXWbvreBAfybP2NROr3
  461. 8.04 s > depends pathway-compat-base-0.0.1.0-E02izPYkwmmGdAPlQBKjbP
  462. 8.04 s > depends pathway-internal-0.0.1.0-1xeSc3z2VhRIotiMz9hdL1
  463. 8.04 s > definite pathway-compat-filepath-0.0.1.0-Bh4LT0cz7im2Vo1hGnl75g-doctests
  464. 8.04 s > depends base-4.18.3.0
  465. 8.04 s > depends doctest-0.24.3-ACQNy8u8jPjC50l4I3tyiL
  466. 8.04 s > depends pathway-compat-filepath-0.0.1.0-Ck51GFznMiC2cxIfBMz4NH
  467. 8.04 s > Using Cabal-3.10.3.0 compiled by ghc-9.6
  468. 8.04 s > Using compiler: ghc-9.6.7
  469. 8.04 s > Using install prefix:
  470. 8.04 s > /nix/store/0igg77m8f8gygqh7ywrf5yrrz3q05mcp-pathway-compat-filepath-0.0.1.0
  471. 8.04 s > Executables installed in:
  472. 8.04 s > /nix/store/0igg77m8f8gygqh7ywrf5yrrz3q05mcp-pathway-compat-filepath-0.0.1.0/bin
  473. 8.04 s > Libraries installed in:
  474. 8.04 s > /nix/store/0igg77m8f8gygqh7ywrf5yrrz3q05mcp-pathway-compat-filepath-0.0.1.0/lib/ghc-9.6.7/lib/x86_64-linux-ghc-9.6.7/pathway-compat-filepath-0.0.1.0-Ck51GFznMiC2cxIfBMz4NH
  475. 8.04 s > Dynamic Libraries installed in:
  476. 8.04 s > /nix/store/0igg77m8f8gygqh7ywrf5yrrz3q05mcp-pathway-compat-filepath-0.0.1.0/lib/ghc-9.6.7/lib/x86_64-linux-ghc-9.6.7
  477. 8.04 s > Private executables installed in:
  478. 8.04 s > /nix/store/0igg77m8f8gygqh7ywrf5yrrz3q05mcp-pathway-compat-filepath-0.0.1.0/libexec/x86_64-linux-ghc-9.6.7/pathway-compat-filepath-0.0.1.0
  479. 8.04 s > Data files installed in:
  480. 8.04 s > /nix/store/0igg77m8f8gygqh7ywrf5yrrz3q05mcp-pathway-compat-filepath-0.0.1.0/share/x86_64-linux-ghc-9.6.7/pathway-compat-filepath-0.0.1.0
  481. 8.04 s > Documentation installed in:
  482. 8.04 s > /nix/store/h9ipqzh965180gvqq9glid6sh6h06105-pathway-compat-filepath-0.0.1.0-doc/share/doc/pathway-compat-filepath-0.0.1.0
  483. 8.04 s > Configuration files installed in:
  484. 8.04 s > /nix/store/0igg77m8f8gygqh7ywrf5yrrz3q05mcp-pathway-compat-filepath-0.0.1.0/etc
  485. 8.04 s > No alex found
  486. 8.04 s > Using ar found on system at:
  487. 8.04 s > /nix/store/zjraf40s86y3iwhp626b934r5y6ldkbb-binutils-wrapper-2.46/bin/ar
  488. 8.04 s > No c2hs found
  489. 8.04 s > No cpphs found
  490. 8.04 s > Using doctest version 0.24.3 found on system at:
  491. 8.04 s > /nix/store/s48k56ayjjxwdbz9y7d8mnqwlcjfi1a8-doctest-0.24.3/bin/doctest
  492. 8.04 s > Using gcc version 15.2.0 given by user at:
  493. 8.04 s > /nix/store/29qjlshvklnyr67nhpprzgb9igmsfsjj-gcc-wrapper-15.2.0/bin/gcc
  494. 8.04 s > Using ghc version 9.6.7 found on system at:
  495. 8.04 s > /nix/store/2djpcnj8a25viv1y24h3mziy1gsy3fc6-ghc-9.6.7/bin/ghc
  496. 8.04 s > Using ghc-pkg version 9.6.7 found on system at:
  497. 8.04 s > /nix/store/2djpcnj8a25viv1y24h3mziy1gsy3fc6-ghc-9.6.7/bin/ghc-pkg-9.6.7
  498. 8.04 s > No ghcjs found
  499. 8.04 s > No ghcjs-pkg found
  500. 8.04 s > No greencard found
  501. 8.04 s > Using haddock version 2.29.2 found on system at:
  502. 8.04 s > /nix/store/2djpcnj8a25viv1y24h3mziy1gsy3fc6-ghc-9.6.7/bin/haddock-ghc-9.6.7
  503. 8.04 s > No happy found
  504. 8.04 s > Using haskell-suite found on system at: haskell-suite-dummy-location
  505. 8.04 s > Using haskell-suite-pkg found on system at: haskell-suite-pkg-dummy-location
  506. 8.04 s > No hmake found
  507. 8.04 s > Using hpc version 0.68 found on system at:
  508. 8.04 s > /nix/store/2djpcnj8a25viv1y24h3mziy1gsy3fc6-ghc-9.6.7/bin/hpc-ghc-9.6.7
  509. 8.04 s > Using hsc2hs version 0.68.9 found on system at:
  510. 8.04 s > /nix/store/2djpcnj8a25viv1y24h3mziy1gsy3fc6-ghc-9.6.7/bin/hsc2hs-ghc-9.6.7
  511. 8.04 s > Using hscolour version 1.25 found on system at:
  512. 8.04 s > /nix/store/2x19jxh5g98bv0s06mdj71c1hmxi54yl-hscolour-1.25/bin/HsColour
  513. 8.04 s > No jhc found
  514. 8.04 s > Using ld found on system at:
  515. 8.04 s > /nix/store/zjraf40s86y3iwhp626b934r5y6ldkbb-binutils-wrapper-2.46/bin/ld.gold
  516. 8.04 s > No pkg-config found
  517. 8.04 s > Using runghc version 9.6.7 found on system at:
  518. 8.04 s > /nix/store/2djpcnj8a25viv1y24h3mziy1gsy3fc6-ghc-9.6.7/bin/runghc-9.6.7
  519. 8.04 s > Using strip version 2.46 found on system at:
  520. 8.04 s > /nix/store/29qjlshvklnyr67nhpprzgb9igmsfsjj-gcc-wrapper-15.2.0/bin/strip
  521. 8.04 s > Using tar found on system at:
  522. 8.04 s > /nix/store/z5mq2sam4484prf3kv6v6vjw1m0i7j24-gnutar-1.35/bin/tar
  523. 8.04 s > No uhc found
  524. 8.04 s > Running phase: buildPhase
  525. 8.04 s > Preprocessing library for pathway-compat-filepath-0.0.1.0..
  526. 8.04 s > Building library for pathway-compat-filepath-0.0.1.0..
  527. 8.04 s > [ 1 of 10] Compiling Common.FilePath ( src/Common/FilePath.hs, dist/build/Common/FilePath.o, dist/build/Common/FilePath.dyn_o )
  528. 8.04 s > [ 2 of 10] Compiling Common.OsPath ( src/Common/OsPath.hs, dist/build/Common/OsPath.o, dist/build/Common/OsPath.dyn_o )
  529. 8.04 s >
  530. 8.04 s > src/Common/OsPath.hs:90:23: error: [GHC-83865]
  531. 8.04 s > • Couldn't match type ‘OSS.OsString’ with ‘OsString’
  532. 8.04 s > Expected: OsPath
  533. 8.04 s > Actual: OSS.OsString
  534. 8.04 s > NB: ‘OsString’
  535. 8.04 s > is defined in ‘System.OsString.Internal.Types.Hidden’
  536. 8.04 s > in package ‘filepath-1.4.301.0’
  537. 8.04 s > ‘OSS.OsString’
  538. 8.04 s > is defined in ‘System.OsString.Internal.Types’
  539. 8.04 s > in package ‘os-string-2.0.10’
  540. 8.04 s > • In the ‘parent’ field of a record
  541. 8.04 s > In the expression:
  542. 8.04 s > Format
  543. 8.04 s > {Format.root = O.pack . pure $ O.pathSeparator,
  544. 8.04 s > Format.current = mempty, Format.parent = OSS.unsafeEncodeUtf "..",
  545. 8.04 s > Format.separator = O.pack . pure $ O.pathSeparator,
  546. 8.04 s > Format.substitutions = mempty}
  547. 8.04 s > In an equation for ‘localFormat’:
  548. 8.04 s > localFormat
  549. 8.04 s > = Format
  550. 8.04 s > {Format.root = O.pack . pure $ O.pathSeparator,
  551. 8.04 s > Format.current = mempty, Format.parent = OSS.unsafeEncodeUtf "..",
  552. 8.04 s > Format.separator = O.pack . pure $ O.pathSeparator,
  553. 8.04 s > Format.substitutions = mempty}
  554. 8.04 s > |
  555. 8.04 s > 90 | Format.parent = OSS.unsafeEncodeUtf "..",
  556. 8.04 s > | ^^^^^^^^^^^^^^^^^^^^^^^^
  557. 8.04 s > [ 3 of 10] Compiling System.FilePath.Thin ( src/System/FilePath/Thin.hs, dist/build/System/FilePath/Thin.o, dist/build/System/FilePath/Thin.dyn_o )
  558. 8.04 s > [ 4 of 10] Compiling System.FilePath.Pathway ( src/System/FilePath/Pathway.hs, dist/build/System/FilePath/Pathway.o, dist/build/System/FilePath/Pathway.dyn_o )
  559. 8.04 s > [ 5 of 10] Compiling System.FilePath.Overlay ( src/System/FilePath/Overlay.hs, dist/build/System/FilePath/Overlay.o, dist/build/System/FilePath/Overlay.dyn_o )
  560. 8.04 s > [ 6 of 10] Compiling System.FilePath ( src/System/FilePath.hs, dist/build/System/FilePath.o, dist/build/System/FilePath.dyn_o )
  561. 8.04 s For full logs, run:
  562. 8.04 s nix log /nix/store/0xfx9r31aw74hs5sjbw3nqlrrvg2y7r8-pathway-compat-filepath-0.0.1.0.drv
  563. 8.04 s error: Cannot build '/nix/store/71b14xy4wzcm037bxmlbg6i3w2h0s1fz-ghc-9.6.7-with-packages.drv'.
  564. 8.04 s Reason: 1 dependency failed.
  565. 8.04 s Output paths:
  566. 8.04 s /nix/store/jhh1rv4hb7mxz7igxfavjiwi3fmqdhr4-ghc-9.6.7-with-packages
  567. 8.04 s error: Cannot build '/nix/store/qxncbg1di4hjb5zqdb9f1gy8xjrprh5s-pathway-compat-directory-0.0.1.0.drv'.
  568. 8.04 s Reason: 1 dependency failed.
  569. 8.04 s Output paths:
  570. 8.04 s /nix/store/i7m2drlr7v0x2fxggqqgd55pz7gs5fgh-pathway-compat-directory-0.0.1.0
  571. 8.04 s /nix/store/ncplkscdjaxivdd29516xdj1qdqipqd4-pathway-compat-directory-0.0.1.0-doc
  572. 8.04 s error: Cannot build '/nix/store/rhq1glrhz4npf6sdg8x56v34xyk1v6xr-pathway-compat-file-io-0.0.1.0.drv'.
  573. 8.04 s Reason: 1 dependency failed.
  574. 8.04 s Output paths:
  575. 8.04 s /nix/store/dcl1g80506zngd1b0fc83l3kd4pn37pd-pathway-compat-file-io-0.0.1.0
  576. 8.04 s /nix/store/p09awv2yah32fd68gjx7la6zrvdipjm8-pathway-compat-file-io-0.0.1.0-doc
  577. 8.04 s error: Cannot build '/nix/store/c430j3jkyff0isy6y8zgjmqrzxagfl7j-pathway-compat-temporary-0.0.1.0.drv'.
  578. 8.04 s Reason: 1 dependency failed.
  579. 8.04 s Output paths:
  580. 8.04 s /nix/store/2yvp81sa5xwik58a51zsawqcgivrpbaf-pathway-compat-temporary-0.0.1.0
  581. 8.04 s /nix/store/4fj0nglrfjmwafh96wbmi1y4pj14h8z2-pathway-compat-temporary-0.0.1.0-doc
  582. 8.04 s error: Cannot build '/nix/store/8vn4w4whsg96imc6nnvkpb1x1cdrxn3a-pathway-system-0.0.1.0.drv'.
  583. 8.04 s Reason: 1 dependency failed.
  584. 8.04 s Output paths:
  585. 8.04 s /nix/store/3bq8q3g9lqsgna0f3pcncqilkiyhrra6-pathway-system-0.0.1.0-doc
  586. 8.04 s /nix/store/v8hrvv875m3n5sqvibj8ffw1cvws4y0a-pathway-system-0.0.1.0
  587. 8.04 s error: Build failed due to failed dependency
  588. 8.04 s error: Cannot build '/nix/store/qg47f934x32d5kxxwpin0w03ij810y32-all-packages.drv'.
  589. 8.04 s Reason: 1 dependency failed.
  590. 8.04 s Output paths:
  591. 8.04 s /nix/store/3pwkmh01p09qp3k06bbdak7z37jsgnv8-all-packages
  592. 8.04 s Build failed due to failed dependency
  593. 8.04 s Build failed.