build packages.x86_64-linux.ghc967_all
0.00 s
$ /nix/store/61685rbaxmpigwi3z23i33sv3jyfl70q-coreutils-9.11/bin/timeout --kill-after=15s 7200s /nix/store/wknkybkzrc16r11vk5vrykh4wmw7a353-nix-2.34.8/bin/nix --extra-experimental-features nix-command --extra-experimental-features flakes --log-format internal-json build --no-link --print-out-paths git+https://github.com/sellout/require-package-imports?ref=renovate%2Fubuntu-26.x&rev=2f36d73488b2cfa949a2ae1913d501a8fdb6a770&shallow=1#packages.x86_64-linux.ghc967_all --print-build-logs
0.09 s
warning: ignoring untrusted flake configuration setting 'allow-import-from-derivation'.
0.09 s
Pass '--accept-flake-config' to trust it
0.09 s
warning: ignoring untrusted flake configuration setting 'extra-experimental-features'.
0.09 s
Pass '--accept-flake-config' to trust it
0.09 s
warning: ignoring untrusted flake configuration setting 'extra-substituters'.
0.09 s
Pass '--accept-flake-config' to trust it
0.09 s
warning: ignoring untrusted flake configuration setting 'extra-trusted-public-keys'.
0.09 s
Pass '--accept-flake-config' to trust it
0.09 s
warning: ignoring untrusted flake configuration setting 'sandbox'.
0.09 s
Pass '--accept-flake-config' to trust it
0.09 s
warning: ignoring untrusted flake configuration setting 'use-registries'.
0.09 s
Pass '--accept-flake-config' to trust it
0.34 s
error (ignored): SQLite database '/var/cache/nix-ci-worker/eval-cache-v6/d3bdbd635b5af1c7e7ad33027d5467917a229f4c4dc97ccce2776f231194cd12.sqlite ' is busy
0.39 s
'system' has been renamed to/replaced by 'stdenv.hostPlatform.system'
1.10 s
1.42 s
Building /nix/store/h5sqcmmpnkpj2f2vgv67x418nkdf8jhw-require-package-imports-0.0.1.0.drv
1.50 s
[require-package-imports] Phase: setupCompilerEnvironmentPhase
1.50 s
[require-package-imports] Build with /nix/store/57awwm6z1vqyrdx8wa52i9dhiw09xkiw-ghc-9.6.7.
1.63 s
[require-package-imports] Phase: unpackPhase
1.63 s
[require-package-imports] unpacking source archive /nix/store/77xqabkfgr4snb1h4wff7w18h064ckbg-hlwfqmp2wib0p5f3pa61ari7ib0pz7px-source/./core
1.64 s
[require-package-imports] source root is core
1.65 s
[require-package-imports] Phase: patchPhase
1.66 s
[require-package-imports] Phase: compileBuildDriverPhase
1.66 s
[require-package-imports] setupCompileFlags: -package-db=/build/tmp.L5RsOKReMG/setup-package.conf.d -threaded
1.72 s
[require-package-imports] [1 of 2] Compiling Main ( Setup.hs, /build/tmp.L5RsOKReMG/Main.o )
1.76 s
[require-package-imports] [2 of 2] Linking Setup
2.77 s
[require-package-imports] Phase: updateAutotoolsGnuConfigScriptsPhase
2.78 s
[require-package-imports] Phase: configurePhase
2.78 s
[require-package-imports] configureFlags: --verbose --prefix=/nix/store/89rgggxqf87r24bz4lv97x0r21hjfbsm-require-package-imports-0.0.1.0 --libdir=$prefix/lib/$compiler/lib --libsubdir=$abi/$libname --docdir=/nix/store/frhy0da5lfq2jw4j23sa102rr77l7ixv-require-package-imports-0.0.1.0-doc/share/doc/require-package-imports-0.0.1.0 --with-gcc=gcc --package-db=/build/tmp.L5RsOKReMG/package.conf.d --ghc-option=-j16 --ghc-option=+RTS --ghc-option=-A64M --ghc-option=-RTS --enable-library-profiling --profiling-detail=exported-functions --disable-profiling --enable-shared --disable-coverage --enable-static --disable-executable-dynamic --enable-tests --disable-benchmarks --enable-library-vanilla --disable-library-for-ghci --enable-split-sections --enable-library-stripping --enable-executable-stripping --ghc-option=-haddock --ghc-options=-Werror --extra-lib-dirs=/nix/store/kpi3v5fl8hlgy5lagjvn6ayq78mla49k-ncurses-6.5/lib --extra-lib-dirs=/nix/store/c86nvwib4x4w4lkd3qw2aw40a354b6yd-libffi-3.5.2/lib --extra-lib-dirs=/nix/store/v6v4r40nfy7inyr36yckidhi6ngh0k6p-elfutils-0.194/lib --extra-lib-dirs=/nix/store/z658zzyxfc8106bjl5svssvsjvk513yj-gmp-with-cxx-6.3.0/lib --extra-lib-dirs=/nix/store/n8f6dc226f3z0yz8b7yh2ksi5gx70mha-numactl-2.0.18/lib --extra-lib-dirs=/nix/store/57awwm6z1vqyrdx8wa52i9dhiw09xkiw-ghc-9.6.7/lib
2.79 s
[require-package-imports] Using Parsec parser
2.79 s
[require-package-imports] Configuring require-package-imports-0.0.1.0...
3.09 s
[require-package-imports] Flags chosen: noisy-deprecations=True, verify-no-recursion=False
3.09 s
[require-package-imports] Dependency base >=4.8.2 && <4.9 || >=4.9.0 && <4.10 || >=4.10.0 && <4.11 ||
3.09 s
[require-package-imports] >=4.11.0 && <4.12 || >=4.12.0 && <4.13 || >=4.13.0 && <4.14 || >=4.14.0 &&
3.09 s
[require-package-imports] <4.15 || >=4.15.0 && <4.16 || >=4.16.0 && <4.17 || >=4.17.0 && <4.18 ||
3.09 s
[require-package-imports] >=4.18.0 && <4.19 || >=4.19.0 && <4.20 || >=4.20.0 && <4.21 || >=4.21.0 &&
3.09 s
[require-package-imports] <4.22 || >=4.22.0 && <4.23: using base-4.18.3.0
3.09 s
[require-package-imports] Dependency ghc >=7.2.1 && <9.16: using ghc-9.6.7
3.09 s
[require-package-imports] Dependency ghc-boot-th >=8.0.1 && <9.16: using ghc-boot-th-9.6.7
3.09 s
[require-package-imports] Dependency ghc-compat-plugin >=0.1.0 && <0.2: using ghc-compat-plugin-0.1.0.1
3.09 s
[require-package-imports] Dependency base >=4.8.2 && <4.9 || >=4.9.0 && <4.10 || >=4.10.0 && <4.11 ||
3.09 s
[require-package-imports] >=4.11.0 && <4.12 || >=4.12.0 && <4.13 || >=4.13.0 && <4.14 || >=4.14.0 &&
3.09 s
[require-package-imports] <4.15 || >=4.15.0 && <4.16 || >=4.16.0 && <4.17 || >=4.17.0 && <4.18 ||
3.09 s
[require-package-imports] >=4.18.0 && <4.19 || >=4.19.0 && <4.20 || >=4.20.0 && <4.21 || >=4.21.0 &&
3.09 s
[require-package-imports] <4.22 || >=4.22.0 && <4.23: using base-4.18.3.0
3.09 s
[require-package-imports] Dependency doctest: using doctest-0.24.2
3.09 s
[require-package-imports] Dependency ghc-compat-plugin >=0.1.0 && <0.2: using ghc-compat-plugin-0.1.0.1
3.09 s
[require-package-imports] Dependency require-package-imports: using require-package-imports-0.0.1.0
3.36 s
[require-package-imports] Source component graph:
3.36 s
[require-package-imports] component lib
3.36 s
[require-package-imports] component test:doctests dependency lib
3.36 s
[require-package-imports] Configured component graph:
3.36 s
[require-package-imports] component require-package-imports-0.0.1.0-6c5oBGtoLFS1O4623edh3k
3.36 s
[require-package-imports] include base-4.18.3.0
3.36 s
[require-package-imports] include ghc-9.6.7
3.36 s
[require-package-imports] include ghc-boot-th-9.6.7
3.36 s
[require-package-imports] include ghc-compat-plugin-0.1.0.1-6wKNTt5WLLQByK2Br4PYfC
3.36 s
[require-package-imports] component require-package-imports-0.0.1.0-4Bh5Fo1I7iR2a0QaNrVO6O-doctests
3.36 s
[require-package-imports] include base-4.18.3.0
3.36 s
[require-package-imports] include doctest-0.24.2-7YxPr6lrdwiBMDK2pmizgF
3.36 s
[require-package-imports] include ghc-compat-plugin-0.1.0.1-6wKNTt5WLLQByK2Br4PYfC
3.36 s
[require-package-imports] include require-package-imports-0.0.1.0-6c5oBGtoLFS1O4623edh3k
3.36 s
[require-package-imports] Linked component graph:
3.36 s
[require-package-imports] unit require-package-imports-0.0.1.0-6c5oBGtoLFS1O4623edh3k
3.36 s
[require-package-imports] include base-4.18.3.0
3.36 s
[require-package-imports] include ghc-9.6.7
3.36 s
[require-package-imports] include ghc-boot-th-9.6.7
3.36 s
[require-package-imports] include ghc-compat-plugin-0.1.0.1-6wKNTt5WLLQByK2Br4PYfC
3.36 s
[require-package-imports] RequirePackageImports=require-package-imports-0.0.1.0-6c5oBGtoLFS1O4623edh3k:RequirePackageImports
3.36 s
[require-package-imports] unit require-package-imports-0.0.1.0-4Bh5Fo1I7iR2a0QaNrVO6O-doctests
3.36 s
[require-package-imports] include base-4.18.3.0
3.36 s
[require-package-imports] include doctest-0.24.2-7YxPr6lrdwiBMDK2pmizgF
3.36 s
[require-package-imports] include ghc-compat-plugin-0.1.0.1-6wKNTt5WLLQByK2Br4PYfC
3.36 s
[require-package-imports] include require-package-imports-0.0.1.0-6c5oBGtoLFS1O4623edh3k
3.36 s
[require-package-imports] Ready component graph:
3.36 s
[require-package-imports] definite require-package-imports-0.0.1.0-6c5oBGtoLFS1O4623edh3k
3.36 s
[require-package-imports] depends base-4.18.3.0
3.36 s
[require-package-imports] depends ghc-9.6.7
3.36 s
[require-package-imports] depends ghc-boot-th-9.6.7
3.36 s
[require-package-imports] depends ghc-compat-plugin-0.1.0.1-6wKNTt5WLLQByK2Br4PYfC
3.36 s
[require-package-imports] definite require-package-imports-0.0.1.0-4Bh5Fo1I7iR2a0QaNrVO6O-doctests
3.36 s
[require-package-imports] depends base-4.18.3.0
3.36 s
[require-package-imports] depends doctest-0.24.2-7YxPr6lrdwiBMDK2pmizgF
3.36 s
[require-package-imports] depends ghc-compat-plugin-0.1.0.1-6wKNTt5WLLQByK2Br4PYfC
3.36 s
[require-package-imports] depends require-package-imports-0.0.1.0-6c5oBGtoLFS1O4623edh3k
3.36 s
[require-package-imports] Using Cabal-3.10.3.0 compiled by ghc-9.6
3.36 s
[require-package-imports] Using compiler: ghc-9.6.7
3.36 s
[require-package-imports] Using install prefix:
3.36 s
[require-package-imports] /nix/store/89rgggxqf87r24bz4lv97x0r21hjfbsm-require-package-imports-0.0.1.0
3.36 s
[require-package-imports] Executables installed in:
3.36 s
[require-package-imports] /nix/store/89rgggxqf87r24bz4lv97x0r21hjfbsm-require-package-imports-0.0.1.0/bin
3.36 s
[require-package-imports] Libraries installed in:
3.36 s
[require-package-imports] /nix/store/89rgggxqf87r24bz4lv97x0r21hjfbsm-require-package-imports-0.0.1.0/lib/ghc-9.6.7/lib/x86_64-linux-ghc-9.6.7/require-package-imports-0.0.1.0-6c5oBGtoLFS1O4623edh3k
3.36 s
[require-package-imports] Dynamic Libraries installed in:
3.36 s
[require-package-imports] /nix/store/89rgggxqf87r24bz4lv97x0r21hjfbsm-require-package-imports-0.0.1.0/lib/ghc-9.6.7/lib/x86_64-linux-ghc-9.6.7
3.36 s
[require-package-imports] Private executables installed in:
3.36 s
[require-package-imports] /nix/store/89rgggxqf87r24bz4lv97x0r21hjfbsm-require-package-imports-0.0.1.0/libexec/x86_64-linux-ghc-9.6.7/require-package-imports-0.0.1.0
3.36 s
[require-package-imports] Data files installed in:
3.36 s
[require-package-imports] /nix/store/89rgggxqf87r24bz4lv97x0r21hjfbsm-require-package-imports-0.0.1.0/share/x86_64-linux-ghc-9.6.7/require-package-imports-0.0.1.0
3.36 s
[require-package-imports] Documentation installed in:
3.36 s
[require-package-imports] /nix/store/frhy0da5lfq2jw4j23sa102rr77l7ixv-require-package-imports-0.0.1.0-doc/share/doc/require-package-imports-0.0.1.0
3.36 s
[require-package-imports] Configuration files installed in:
3.36 s
[require-package-imports] /nix/store/89rgggxqf87r24bz4lv97x0r21hjfbsm-require-package-imports-0.0.1.0/etc
3.36 s
[require-package-imports] No alex found
3.36 s
[require-package-imports] Using ar found on system at:
3.36 s
[require-package-imports] /nix/store/4dh4138m8gbp56kh63j2pwgsfhf5l8v7-binutils-wrapper-2.44/bin/ar
3.36 s
[require-package-imports] No c2hs found
3.36 s
[require-package-imports] No cpphs found
3.36 s
[require-package-imports] Using doctest version 0.24.2 found on system at:
3.36 s
[require-package-imports] /nix/store/zlv1cwdvafilcwmibmzyc1mzi7hyf5c5-doctest-0.24.2/bin/doctest
3.36 s
[require-package-imports] Using gcc version 14.3.0 given by user at:
3.36 s
[require-package-imports] /nix/store/myvv172x2am72534zgn9wx0qp5amq6a8-gcc-wrapper-14.3.0/bin/gcc
3.36 s
[require-package-imports] Using ghc version 9.6.7 found on system at:
3.36 s
[require-package-imports] /nix/store/57awwm6z1vqyrdx8wa52i9dhiw09xkiw-ghc-9.6.7/bin/ghc
3.36 s
[require-package-imports] Using ghc-pkg version 9.6.7 found on system at:
3.36 s
[require-package-imports] /nix/store/57awwm6z1vqyrdx8wa52i9dhiw09xkiw-ghc-9.6.7/bin/ghc-pkg-9.6.7
3.36 s
[require-package-imports] No ghcjs found
3.36 s
[require-package-imports] No ghcjs-pkg found
3.36 s
[require-package-imports] No greencard found
3.36 s
[require-package-imports] Using haddock version 2.29.2 found on system at:
3.36 s
[require-package-imports] /nix/store/57awwm6z1vqyrdx8wa52i9dhiw09xkiw-ghc-9.6.7/bin/haddock-ghc-9.6.7
3.36 s
[require-package-imports] No happy found
3.36 s
[require-package-imports] Using haskell-suite found on system at: haskell-suite-dummy-location
3.36 s
[require-package-imports] Using haskell-suite-pkg found on system at: haskell-suite-pkg-dummy-location
3.36 s
[require-package-imports] No hmake found
3.36 s
[require-package-imports] Using hpc version 0.68 found on system at:
3.36 s
[require-package-imports] /nix/store/57awwm6z1vqyrdx8wa52i9dhiw09xkiw-ghc-9.6.7/bin/hpc-ghc-9.6.7
3.36 s
[require-package-imports] Using hsc2hs version 0.68.9 found on system at:
3.36 s
[require-package-imports] /nix/store/57awwm6z1vqyrdx8wa52i9dhiw09xkiw-ghc-9.6.7/bin/hsc2hs-ghc-9.6.7
3.36 s
[require-package-imports] Using hscolour version 1.25 found on system at:
3.36 s
[require-package-imports] /nix/store/ggvvgxsqy3gwrzfkchn306i0was12fc8-hscolour-1.25/bin/HsColour
3.36 s
[require-package-imports] No jhc found
3.36 s
[require-package-imports] Using ld found on system at:
3.36 s
[require-package-imports] /nix/store/4dh4138m8gbp56kh63j2pwgsfhf5l8v7-binutils-wrapper-2.44/bin/ld.gold
3.36 s
[require-package-imports] No pkg-config found
3.36 s
[require-package-imports] Using runghc version 9.6.7 found on system at:
3.36 s
[require-package-imports] /nix/store/57awwm6z1vqyrdx8wa52i9dhiw09xkiw-ghc-9.6.7/bin/runghc-9.6.7
3.36 s
[require-package-imports] Using strip version 2.44 found on system at:
3.36 s
[require-package-imports] /nix/store/myvv172x2am72534zgn9wx0qp5amq6a8-gcc-wrapper-14.3.0/bin/strip
3.36 s
[require-package-imports] Using tar found on system at:
3.36 s
[require-package-imports] /nix/store/l5ibq1yp8m7jibzgqbmpc46hkcnvv8fq-gnutar-1.35/bin/tar
3.36 s
[require-package-imports] No uhc found
3.49 s
[require-package-imports] Phase: buildPhase
3.54 s
[require-package-imports] Preprocessing library for require-package-imports-0.0.1.0..
3.54 s
[require-package-imports] Building library for require-package-imports-0.0.1.0..
3.64 s
[require-package-imports] [1 of 1] Compiling RequirePackageImports ( src/RequirePackageImports.hs, dist/build/RequirePackageImports.o, dist/build/RequirePackageImports.dyn_o )
3.80 s
[require-package-imports]
3.85 s
[require-package-imports] src/RequirePackageImports.hs:48:34: error : [ GHC-76037 ]
3.85 s
[require-package-imports] Not in scope: ‘Annotation.getHasLoc’
3.85 s
[require-package-imports] NB: the module ‘GHC.Parser.Annotation’ does not export ‘getHasLoc’.
3.85 s
[require-package-imports] Suggested fix:
3.85 s
[require-package-imports] Perhaps use one of these:
3.85 s
[require-package-imports] ‘Annotation.getLocA’ (imported from GHC.Parser.Annotation),
3.85 s
[require-package-imports] ‘Annotation.reLoc’ (imported from GHC.Parser.Annotation)
3.85 s
[require-package-imports] |
3.85 s
[require-package-imports] 48 | { Error.errMsgSpan = Annotation.getHasLoc imp,
3.85 s
[require-package-imports] | ^^^^^^^^^^^^^^^^^^^^
3.85 s
[require-package-imports]
3.89 s
[require-package-imports] src/RequirePackageImports.hs:52:52: error : [ GHC-76037 ]
3.89 s
[require-package-imports] Not in scope: ‘Error.defaultOpts’
3.89 s
[require-package-imports] NB: the module ‘GHC.Types.Error’ does not export ‘defaultOpts’.
3.89 s
[require-package-imports] |
3.89 s
[require-package-imports] 52 | . Error.UnknownDiagnostic (const Error.defaultOpts )
3.89 s
[require-package-imports] | ^^^^^^^^^^^^^^^^^
3.89 s
[require-package-imports]
3.89 s
[require-package-imports] src/RequirePackageImports.hs:64:15: error :
3.89 s
[require-package-imports] Constructor ‘Error.MsgEnvelope’ does not have field ‘errMsgReason’
3.89 s
[require-package-imports] |
3.89 s
[require-package-imports] 64 | Error.errMsgReason = Error.ResolvedDiagnosticReason reason
3.89 s
[require-package-imports] | ^^^^^^^^^^^^^^^^^^
3.89 s
[require-package-imports]
3.95 s
[require-package-imports] src/RequirePackageImports.hs:64:36: error : [ GHC-76037 ]
3.95 s
[require-package-imports] Not in scope: data constructor ‘Error.ResolvedDiagnosticReason’
3.95 s
[require-package-imports] NB: the module ‘GHC.Types.Error’ does not export ‘ResolvedDiagnosticReason’.
3.95 s
[require-package-imports] Suggested fix:
3.95 s
[require-package-imports] Perhaps use variable ‘Error.diagnosticReason’ (imported from GHC.Types.Error)
3.95 s
[require-package-imports] |
3.95 s
[require-package-imports] 64 | Error.errMsgReason = Error.ResolvedDiagnosticReason reason
3.95 s
[require-package-imports] | ^^^^^^^^^^^^^^^^^^^^^^^^^^^^^^
4.05 s
Progress: 0 of 4 built (1 failed)
4.05 s
Failed to build require-package-imports after 2.6s
4.05 s
error: Cannot build '/nix/store/h5sqcmmpnkpj2f2vgv67x418nkdf8jhw-require-package-imports-0.0.1.0.drv '.
4.05 s
Reason: builder failed with exit code 1 .
4.05 s
Output paths:
4.05 s
/nix/store/89rgggxqf87r24bz4lv97x0r21hjfbsm-require-package-imports-0.0.1.0
4.05 s
/nix/store/frhy0da5lfq2jw4j23sa102rr77l7ixv-require-package-imports-0.0.1.0-doc
4.05 s
Last 163 log lines:
4.05 s
> Running phase: setupCompilerEnvironmentPhase
4.05 s
> Build with /nix/store/57awwm6z1vqyrdx8wa52i9dhiw09xkiw-ghc-9.6.7.
4.05 s
> Running phase: unpackPhase
4.05 s
> unpacking source archive /nix/store/77xqabkfgr4snb1h4wff7w18h064ckbg-hlwfqmp2wib0p5f3pa61ari7ib0pz7px-source/./core
4.05 s
> source root is core
4.05 s
> Running phase: patchPhase
4.05 s
> Running phase: compileBuildDriverPhase
4.05 s
> setupCompileFlags: -package-db=/build/tmp.L5RsOKReMG/setup-package.conf.d -threaded
4.05 s
> [1 of 2] Compiling Main ( Setup.hs, /build/tmp.L5RsOKReMG/Main.o )
4.05 s
> [2 of 2] Linking Setup
4.05 s
> Running phase: updateAutotoolsGnuConfigScriptsPhase
4.05 s
> Running phase: configurePhase
4.05 s
> configureFlags: --verbose --prefix=/nix/store/89rgggxqf87r24bz4lv97x0r21hjfbsm-require-package-imports-0.0.1.0 --libdir=$prefix/lib/$compiler/lib --libsubdir=$abi/$libname --docdir=/nix/store/frhy0da5lfq2jw4j23sa102rr77l7ixv-require-package-imports-0.0.1.0-doc/share/doc/require-package-imports-0.0.1.0 --with-gcc=gcc --package-db=/build/tmp.L5RsOKReMG/package.conf.d --ghc-option=-j16 --ghc-option=+RTS --ghc-option=-A64M --ghc-option=-RTS --enable-library-profiling --profiling-detail=exported-functions --disable-profiling --enable-shared --disable-coverage --enable-static --disable-executable-dynamic --enable-tests --disable-benchmarks --enable-library-vanilla --disable-library-for-ghci --enable-split-sections --enable-library-stripping --enable-executable-stripping --ghc-option=-haddock --ghc-options=-Werror --extra-lib-dirs=/nix/store/kpi3v5fl8hlgy5lagjvn6ayq78mla49k-ncurses-6.5/lib --extra-lib-dirs=/nix/store/c86nvwib4x4w4lkd3qw2aw40a354b6yd-libffi-3.5.2/lib --extra-lib-dirs=/nix/store/v6v4r40nfy7inyr36yckidhi6ngh0k6p-elfutils-0.194/lib --extra-lib-dirs=/nix/store/z658zzyxfc8106bjl5svssvsjvk513yj-gmp-with-cxx-6.3.0/lib --extra-lib-dirs=/nix/store/n8f6dc226f3z0yz8b7yh2ksi5gx70mha-numactl-2.0.18/lib --extra-lib-dirs=/nix/store/57awwm6z1vqyrdx8wa52i9dhiw09xkiw-ghc-9.6.7/lib
4.05 s
> Using Parsec parser
4.05 s
> Configuring require-package-imports-0.0.1.0...
4.05 s
> Flags chosen: noisy-deprecations=True, verify-no-recursion=False
4.05 s
> Dependency base >=4.8.2 && <4.9 || >=4.9.0 && <4.10 || >=4.10.0 && <4.11 ||
4.05 s
> >=4.11.0 && <4.12 || >=4.12.0 && <4.13 || >=4.13.0 && <4.14 || >=4.14.0 &&
4.05 s
> <4.15 || >=4.15.0 && <4.16 || >=4.16.0 && <4.17 || >=4.17.0 && <4.18 ||
4.05 s
> >=4.18.0 && <4.19 || >=4.19.0 && <4.20 || >=4.20.0 && <4.21 || >=4.21.0 &&
4.05 s
> <4.22 || >=4.22.0 && <4.23: using base-4.18.3.0
4.05 s
> Dependency ghc >=7.2.1 && <9.16: using ghc-9.6.7
4.05 s
> Dependency ghc-boot-th >=8.0.1 && <9.16: using ghc-boot-th-9.6.7
4.05 s
> Dependency ghc-compat-plugin >=0.1.0 && <0.2: using ghc-compat-plugin-0.1.0.1
4.05 s
> Dependency base >=4.8.2 && <4.9 || >=4.9.0 && <4.10 || >=4.10.0 && <4.11 ||
4.05 s
> >=4.11.0 && <4.12 || >=4.12.0 && <4.13 || >=4.13.0 && <4.14 || >=4.14.0 &&
4.05 s
> <4.15 || >=4.15.0 && <4.16 || >=4.16.0 && <4.17 || >=4.17.0 && <4.18 ||
4.05 s
> >=4.18.0 && <4.19 || >=4.19.0 && <4.20 || >=4.20.0 && <4.21 || >=4.21.0 &&
4.05 s
> <4.22 || >=4.22.0 && <4.23: using base-4.18.3.0
4.05 s
> Dependency doctest: using doctest-0.24.2
4.05 s
> Dependency ghc-compat-plugin >=0.1.0 && <0.2: using ghc-compat-plugin-0.1.0.1
4.05 s
> Dependency require-package-imports: using require-package-imports-0.0.1.0
4.05 s
> Source component graph:
4.05 s
> component lib
4.05 s
> component test:doctests dependency lib
4.05 s
> Configured component graph:
4.05 s
> component require-package-imports-0.0.1.0-6c5oBGtoLFS1O4623edh3k
4.05 s
> include base-4.18.3.0
4.05 s
> include ghc-9.6.7
4.05 s
> include ghc-boot-th-9.6.7
4.05 s
> include ghc-compat-plugin-0.1.0.1-6wKNTt5WLLQByK2Br4PYfC
4.05 s
> component require-package-imports-0.0.1.0-4Bh5Fo1I7iR2a0QaNrVO6O-doctests
4.05 s
> include base-4.18.3.0
4.05 s
> include doctest-0.24.2-7YxPr6lrdwiBMDK2pmizgF
4.05 s
> include ghc-compat-plugin-0.1.0.1-6wKNTt5WLLQByK2Br4PYfC
4.05 s
> include require-package-imports-0.0.1.0-6c5oBGtoLFS1O4623edh3k
4.05 s
> Linked component graph:
4.05 s
> unit require-package-imports-0.0.1.0-6c5oBGtoLFS1O4623edh3k
4.05 s
> include base-4.18.3.0
4.05 s
> include ghc-9.6.7
4.05 s
> include ghc-boot-th-9.6.7
4.05 s
> include ghc-compat-plugin-0.1.0.1-6wKNTt5WLLQByK2Br4PYfC
4.05 s
> RequirePackageImports=require-package-imports-0.0.1.0-6c5oBGtoLFS1O4623edh3k:RequirePackageImports
4.05 s
> unit require-package-imports-0.0.1.0-4Bh5Fo1I7iR2a0QaNrVO6O-doctests
4.05 s
> include base-4.18.3.0
4.05 s
> include doctest-0.24.2-7YxPr6lrdwiBMDK2pmizgF
4.05 s
> include ghc-compat-plugin-0.1.0.1-6wKNTt5WLLQByK2Br4PYfC
4.05 s
> include require-package-imports-0.0.1.0-6c5oBGtoLFS1O4623edh3k
4.05 s
> Ready component graph:
4.05 s
> definite require-package-imports-0.0.1.0-6c5oBGtoLFS1O4623edh3k
4.05 s
> depends base-4.18.3.0
4.05 s
> depends ghc-9.6.7
4.05 s
> depends ghc-boot-th-9.6.7
4.05 s
> depends ghc-compat-plugin-0.1.0.1-6wKNTt5WLLQByK2Br4PYfC
4.05 s
> definite require-package-imports-0.0.1.0-4Bh5Fo1I7iR2a0QaNrVO6O-doctests
4.05 s
> depends base-4.18.3.0
4.05 s
> depends doctest-0.24.2-7YxPr6lrdwiBMDK2pmizgF
4.05 s
> depends ghc-compat-plugin-0.1.0.1-6wKNTt5WLLQByK2Br4PYfC
4.05 s
> depends require-package-imports-0.0.1.0-6c5oBGtoLFS1O4623edh3k
4.05 s
> Using Cabal-3.10.3.0 compiled by ghc-9.6
4.05 s
> Using compiler: ghc-9.6.7
4.05 s
> Using install prefix:
4.05 s
> /nix/store/89rgggxqf87r24bz4lv97x0r21hjfbsm-require-package-imports-0.0.1.0
4.05 s
> Executables installed in:
4.05 s
> /nix/store/89rgggxqf87r24bz4lv97x0r21hjfbsm-require-package-imports-0.0.1.0/bin
4.05 s
> Libraries installed in:
4.05 s
> /nix/store/89rgggxqf87r24bz4lv97x0r21hjfbsm-require-package-imports-0.0.1.0/lib/ghc-9.6.7/lib/x86_64-linux-ghc-9.6.7/require-package-imports-0.0.1.0-6c5oBGtoLFS1O4623edh3k
4.05 s
> Dynamic Libraries installed in:
4.05 s
> /nix/store/89rgggxqf87r24bz4lv97x0r21hjfbsm-require-package-imports-0.0.1.0/lib/ghc-9.6.7/lib/x86_64-linux-ghc-9.6.7
4.05 s
> Private executables installed in:
4.05 s
> /nix/store/89rgggxqf87r24bz4lv97x0r21hjfbsm-require-package-imports-0.0.1.0/libexec/x86_64-linux-ghc-9.6.7/require-package-imports-0.0.1.0
4.05 s
> Data files installed in:
4.05 s
> /nix/store/89rgggxqf87r24bz4lv97x0r21hjfbsm-require-package-imports-0.0.1.0/share/x86_64-linux-ghc-9.6.7/require-package-imports-0.0.1.0
4.05 s
> Documentation installed in:
4.05 s
> /nix/store/frhy0da5lfq2jw4j23sa102rr77l7ixv-require-package-imports-0.0.1.0-doc/share/doc/require-package-imports-0.0.1.0
4.05 s
> Configuration files installed in:
4.05 s
> /nix/store/89rgggxqf87r24bz4lv97x0r21hjfbsm-require-package-imports-0.0.1.0/etc
4.05 s
> No alex found
4.05 s
> Using ar found on system at:
4.05 s
> /nix/store/4dh4138m8gbp56kh63j2pwgsfhf5l8v7-binutils-wrapper-2.44/bin/ar
4.05 s
> No c2hs found
4.05 s
> No cpphs found
4.05 s
> Using doctest version 0.24.2 found on system at:
4.05 s
> /nix/store/zlv1cwdvafilcwmibmzyc1mzi7hyf5c5-doctest-0.24.2/bin/doctest
4.05 s
> Using gcc version 14.3.0 given by user at:
4.05 s
> /nix/store/myvv172x2am72534zgn9wx0qp5amq6a8-gcc-wrapper-14.3.0/bin/gcc
4.05 s
> Using ghc version 9.6.7 found on system at:
4.05 s
> /nix/store/57awwm6z1vqyrdx8wa52i9dhiw09xkiw-ghc-9.6.7/bin/ghc
4.05 s
> Using ghc-pkg version 9.6.7 found on system at:
4.05 s
> /nix/store/57awwm6z1vqyrdx8wa52i9dhiw09xkiw-ghc-9.6.7/bin/ghc-pkg-9.6.7
4.05 s
> No ghcjs found
4.05 s
> No ghcjs-pkg found
4.05 s
> No greencard found
4.05 s
> Using haddock version 2.29.2 found on system at:
4.05 s
> /nix/store/57awwm6z1vqyrdx8wa52i9dhiw09xkiw-ghc-9.6.7/bin/haddock-ghc-9.6.7
4.05 s
> No happy found
4.05 s
> Using haskell-suite found on system at: haskell-suite-dummy-location
4.05 s
> Using haskell-suite-pkg found on system at: haskell-suite-pkg-dummy-location
4.05 s
> No hmake found
4.05 s
> Using hpc version 0.68 found on system at:
4.05 s
> /nix/store/57awwm6z1vqyrdx8wa52i9dhiw09xkiw-ghc-9.6.7/bin/hpc-ghc-9.6.7
4.05 s
> Using hsc2hs version 0.68.9 found on system at:
4.05 s
> /nix/store/57awwm6z1vqyrdx8wa52i9dhiw09xkiw-ghc-9.6.7/bin/hsc2hs-ghc-9.6.7
4.05 s
> Using hscolour version 1.25 found on system at:
4.05 s
> /nix/store/ggvvgxsqy3gwrzfkchn306i0was12fc8-hscolour-1.25/bin/HsColour
4.05 s
> No jhc found
4.05 s
> Using ld found on system at:
4.05 s
> /nix/store/4dh4138m8gbp56kh63j2pwgsfhf5l8v7-binutils-wrapper-2.44/bin/ld.gold
4.05 s
> No pkg-config found
4.05 s
> Using runghc version 9.6.7 found on system at:
4.05 s
> /nix/store/57awwm6z1vqyrdx8wa52i9dhiw09xkiw-ghc-9.6.7/bin/runghc-9.6.7
4.05 s
> Using strip version 2.44 found on system at:
4.05 s
> /nix/store/myvv172x2am72534zgn9wx0qp5amq6a8-gcc-wrapper-14.3.0/bin/strip
4.05 s
> Using tar found on system at:
4.05 s
> /nix/store/l5ibq1yp8m7jibzgqbmpc46hkcnvv8fq-gnutar-1.35/bin/tar
4.05 s
> No uhc found
4.05 s
> Running phase: buildPhase
4.05 s
> Preprocessing library for require-package-imports-0.0.1.0..
4.05 s
> Building library for require-package-imports-0.0.1.0..
4.05 s
> [1 of 1] Compiling RequirePackageImports ( src/RequirePackageImports.hs, dist/build/RequirePackageImports.o, dist/build/RequirePackageImports.dyn_o )
4.05 s
>
4.05 s
> src/RequirePackageImports.hs:48:34: error : [ GHC-76037 ]
4.05 s
> Not in scope: ‘Annotation.getHasLoc’
4.05 s
> NB: the module ‘GHC.Parser.Annotation’ does not export ‘getHasLoc’.
4.05 s
> Suggested fix:
4.05 s
> Perhaps use one of these:
4.05 s
> ‘Annotation.getLocA’ (imported from GHC.Parser.Annotation),
4.05 s
> ‘Annotation.reLoc’ (imported from GHC.Parser.Annotation)
4.05 s
> |
4.05 s
> 48 | { Error.errMsgSpan = Annotation.getHasLoc imp,
4.05 s
> | ^^^^^^^^^^^^^^^^^^^^
4.05 s
>
4.05 s
> src/RequirePackageImports.hs:52:52: error : [ GHC-76037 ]
4.05 s
> Not in scope: ‘Error.defaultOpts’
4.05 s
> NB: the module ‘GHC.Types.Error’ does not export ‘defaultOpts’.
4.05 s
> |
4.05 s
> 52 | . Error.UnknownDiagnostic (const Error.defaultOpts )
4.05 s
> | ^^^^^^^^^^^^^^^^^
4.05 s
>
4.05 s
> src/RequirePackageImports.hs:64:15: error :
4.05 s
> Constructor ‘Error.MsgEnvelope’ does not have field ‘errMsgReason’
4.05 s
> |
4.05 s
> 64 | Error.errMsgReason = Error.ResolvedDiagnosticReason reason
4.05 s
> | ^^^^^^^^^^^^^^^^^^
4.05 s
>
4.05 s
> src/RequirePackageImports.hs:64:36: error : [ GHC-76037 ]
4.05 s
> Not in scope: data constructor ‘Error.ResolvedDiagnosticReason’
4.05 s
> NB: the module ‘GHC.Types.Error’ does not export ‘ResolvedDiagnosticReason’.
4.05 s
> Suggested fix:
4.05 s
> Perhaps use variable ‘Error.diagnosticReason’ (imported from GHC.Types.Error)
4.05 s
> |
4.05 s
> 64 | Error.errMsgReason = Error.ResolvedDiagnosticReason reason
4.05 s
> | ^^^^^^^^^^^^^^^^^^^^^^^^^^^^^^
4.05 s
For full logs, run:
4.05 s
nix log /nix/store/h5sqcmmpnkpj2f2vgv67x418nkdf8jhw-require-package-imports-0.0.1.0.drv
4.05 s
error: Cannot build '/nix/store/3l06q8bbrf8pzkzsg7wxg01d893cbjrw-ghc-9.6.7-with-packages.drv '.
4.05 s
Reason: 1 dependency failed .
4.05 s
Output paths:
4.05 s
/nix/store/fa1p3knnybh9vvw50a2gp79vva25824b-ghc-9.6.7-with-packages
4.05 s
Cannot build ' /nix/store/qk16ndlsk1csqn2x9dwg6zmms7wn45xz-all-packages.drv '.
4.05 s
Reason: 1 dependency failed .
4.05 s
Output paths:
4.05 s
/nix/store/zh6ab00rmmra1na3p17cs2hhjfdv63sc-all-packages
4.09 s
Build failed.