build packages.x86_64-linux.ghc967_all
0.00 s
$ /nix/store/61685rbaxmpigwi3z23i33sv3jyfl70q-coreutils-9.11/bin/timeout --kill-after=15s 7200s /nix/store/wknkybkzrc16r11vk5vrykh4wmw7a353-nix-2.34.8/bin/nix --extra-experimental-features nix-command --extra-experimental-features flakes --log-format internal-json build --no-link --print-out-paths git+https://github.com/sellout/require-package-imports?ref=renovate%2Fubuntu-26.x&rev=e47c412baef4e966c2f250e9d10d381291ec7c69&shallow=1#packages.x86_64-linux.ghc967_all --print-build-logs
0.14 s
warning: ignoring untrusted flake configuration setting 'allow-import-from-derivation'.
0.14 s
Pass '--accept-flake-config' to trust it
0.14 s
warning: ignoring untrusted flake configuration setting 'extra-experimental-features'.
0.14 s
Pass '--accept-flake-config' to trust it
0.15 s
warning: ignoring untrusted flake configuration setting 'extra-substituters'.
0.15 s
Pass '--accept-flake-config' to trust it
0.15 s
warning: ignoring untrusted flake configuration setting 'extra-trusted-public-keys'.
0.15 s
Pass '--accept-flake-config' to trust it
0.15 s
warning: ignoring untrusted flake configuration setting 'sandbox'.
0.15 s
Pass '--accept-flake-config' to trust it
0.15 s
warning: ignoring untrusted flake configuration setting 'use-registries'.
0.15 s
Pass '--accept-flake-config' to trust it
0.15 s
error (ignored): SQLite database '/var/cache/nix-ci-worker/eval-cache-v6/4223af2c88755fd902da70224246e78bd252ce744743a3e52e222827486113d7.sqlite ' is busy
0.62 s
'system' has been renamed to/replaced by 'stdenv.hostPlatform.system'
1.67 s
1.70 s
Building /nix/store/c4jqnqnmp4f4alzna43hw3r5wswd6017-cabal2nix-require-package-imports.drv
1.78 s
[cabal2nix-require-package-imports:post-build] Uploading to cachix cache "sellout": /nix/store/q3xgmhbyz60hrjrz5f059fl1765my929-cabal2nix-require-package-imports
2.22 s
[cabal2nix-require-package-imports:post-build] Nothing to push - all store paths are already on Cachix.
2.38 s
[cabal2nix-require-package-imports:post-build] Uploading to the NixCI cache: /nix/store/q3xgmhbyz60hrjrz5f059fl1765my929-cabal2nix-require-package-imports
2.44 s
[cabal2nix-require-package-imports:post-build] warning: 'warn-short-path-literals' is deprecated, use 'lint-short-path-literals = ignore' instead
2.64 s
[cabal2nix-require-package-imports:post-build] copying 0 paths...
2.70 s
[cabal2nix-require-package-imports:post-build] warning: 'warn-short-path-literals' is deprecated, use 'lint-short-path-literals = ignore' instead
2.87 s
[cabal2nix-require-package-imports:post-build] copying 0 paths...
2.90 s
Uploaded cabal2nix-require-package-imports in 1.1s
2.90 s
Progress: 1 of 2 built
2.90 s
Built cabal2nix-require-package-imports in 1.1s
2.90 s
Progress: 2 of 2 built
3.36 s
3.39 s
Building /nix/store/rinxp95wnlz5gjsp85z1yhcs9wz1z320-cabal2nix-ghc-compat-plugin.drv
3.47 s
[cabal2nix-ghc-compat-plugin:post-build] Uploading to cachix cache "sellout": /nix/store/5vjpdp80n7ql4aji77vpzc7blg23nfi2-cabal2nix-ghc-compat-plugin
3.89 s
[cabal2nix-ghc-compat-plugin:post-build] Nothing to push - all store paths are already on Cachix.
3.93 s
[cabal2nix-ghc-compat-plugin:post-build] Uploading to the NixCI cache: /nix/store/5vjpdp80n7ql4aji77vpzc7blg23nfi2-cabal2nix-ghc-compat-plugin
3.98 s
[cabal2nix-ghc-compat-plugin:post-build] warning: 'warn-short-path-literals' is deprecated, use 'lint-short-path-literals = ignore' instead
4.10 s
[cabal2nix-ghc-compat-plugin:post-build] copying 0 paths...
4.16 s
[cabal2nix-ghc-compat-plugin:post-build] warning: 'warn-short-path-literals' is deprecated, use 'lint-short-path-literals = ignore' instead
4.38 s
[cabal2nix-ghc-compat-plugin:post-build] copying 0 paths...
4.55 s
Uploaded cabal2nix-ghc-compat-plugin in 1.0s
4.55 s
Progress: 1 of 2 built
4.55 s
Built cabal2nix-ghc-compat-plugin in 1.1s
4.55 s
Progress: 2 of 2 built
5.21 s
5.22 s
Downloading cached ghc-9.6.7-doc from https://cache.nix-ci.com
5.22 s
Downloading cached hscolour from https://cache.nix-ci.com
5.30 s
Downloaded cached hscolour (2.5 MiB) in 81ms
5.30 s
Progress: 0 of 10 built, 1 of 21 downloaded from cache (1 downloading)
7.70 s
Downloaded cached ghc-9.6.7-doc (658.5 MiB) in 2.4s
7.70 s
Progress: 0 of 9 built, 2 of 21 downloaded from cache
7.70 s
Downloading cached cabal-doctest-1.0.12-doc from https://cache.nix-ci.com
7.70 s
Downloading cached ghc from https://cache.nix-ci.com
7.70 s
Downloading cached code-page-0.2.1-doc from https://cache.nix-ci.com
7.70 s
Downloading cached ghc-compat-plugin-0.1.0.1-doc from https://cache.nix-ci.com
7.70 s
Downloading cached ghc-paths-0.1.0.12-doc from https://cache.nix-ci.com
7.70 s
Downloading cached splitmix-0.1.3.1-doc from https://cache.nix-ci.com
7.70 s
Downloading cached syb-0.7.2.4-doc from https://cache.nix-ci.com
7.76 s
Downloaded cached syb-0.7.2.4-doc (1.2 MiB) in 59ms
7.76 s
Progress: 0 of 8 built, 3 of 21 downloaded from cache (6 downloading)
7.77 s
Downloaded cached code-page-0.2.1-doc (276 KiB) in 62ms
7.77 s
Progress: 0 of 8 built, 4 of 21 downloaded from cache (5 downloading)
7.82 s
Downloaded cached cabal-doctest-1.0.12-doc (357 KiB) in 112ms
7.82 s
Progress: 0 of 8 built, 5 of 21 downloaded from cache (4 downloading)
7.85 s
Downloaded cached ghc-compat-plugin-0.1.0.1-doc (544 KiB) in 146ms
7.85 s
Progress: 0 of 8 built, 6 of 21 downloaded from cache (3 downloading)
7.90 s
Downloaded cached ghc-paths-0.1.0.12-doc (121 KiB) in 194ms
7.90 s
Progress: 0 of 8 built, 7 of 21 downloaded from cache (2 downloading)
7.90 s
Downloaded cached splitmix-0.1.3.1-doc (552 KiB) in 198ms
7.90 s
Progress: 0 of 8 built, 8 of 21 downloaded from cache (1 downloading)
7.90 s
Downloading cached random-1.2.1.3-doc from https://cache.nix-ci.com
8.00 s
Downloaded cached random-1.2.1.3-doc (2.5 MiB) in 95ms
8.00 s
Progress: 0 of 8 built, 9 of 21 downloaded from cache (1 downloading)
8.00 s
Downloading cached temporary-1.3-doc from https://cache.nix-ci.com
8.09 s
Downloaded cached temporary-1.3-doc (237 KiB) in 96ms
8.09 s
Progress: 0 of 8 built, 10 of 21 downloaded from cache (1 downloading)
8.09 s
Downloading cached doctest-0.24.2-doc from https://cache.nix-ci.com
8.19 s
Downloaded cached doctest-0.24.2-doc (1.6 MiB) in 97ms
8.19 s
Progress: 0 of 8 built, 11 of 21 downloaded from cache (1 downloading)
15.96 s
Downloaded cached ghc (1.7 GiB) in 8.2s
15.96 s
Progress: 0 of 8 built, 12 of 21 downloaded from cache
15.97 s
Downloading cached cabal-doctest from https://cache.nix-ci.com
15.97 s
Downloading cached code-page from https://cache.nix-ci.com
15.97 s
Downloading cached ghc-compat-plugin from https://cache.nix-ci.com
15.97 s
Downloading cached ghc-paths from https://cache.nix-ci.com
15.97 s
Downloading cached splitmix from https://cache.nix-ci.com
15.97 s
Downloading cached syb from https://cache.nix-ci.com
16.02 s
Downloaded cached splitmix (894 KiB) in 53ms
16.02 s
Progress: 0 of 7 built, 13 of 21 downloaded from cache (5 downloading)
16.02 s
Downloading cached random from https://cache.nix-ci.com
16.02 s
Downloaded cached ghc-paths (101 KiB) in 57ms
16.02 s
Progress: 0 of 7 built, 14 of 21 downloaded from cache (5 downloading)
16.03 s
Downloaded cached code-page (366 KiB) in 60ms
16.03 s
Progress: 0 of 7 built, 15 of 21 downloaded from cache (4 downloading)
16.11 s
Downloaded cached ghc-compat-plugin (1.3 MiB) in 149ms
16.12 s
Progress: 0 of 7 built, 16 of 21 downloaded from cache (3 downloading)
16.12 s
Downloaded cached cabal-doctest (768 KiB) in 153ms
16.12 s
Progress: 0 of 6 built, 17 of 21 downloaded from cache (2 downloading)
16.15 s
Downloaded cached syb (2.8 MiB) in 181ms
16.15 s
Progress: 0 of 5 built, 18 of 21 downloaded from cache (1 downloading)
16.17 s
Downloaded cached random (8.9 MiB) in 147ms
16.17 s
Progress: 0 of 5 built, 19 of 21 downloaded from cache
16.17 s
Downloading cached temporary from https://cache.nix-ci.com
16.49 s
Downloaded cached temporary (305 KiB) in 319ms
16.49 s
Progress: 0 of 5 built, 20 of 21 downloaded from cache
16.49 s
Downloading cached doctest from https://cache.nix-ci.com
17.00 s
Downloaded cached doctest (66.3 MiB) in 508ms
17.00 s
Progress: 0 of 5 built, 21 of 21 downloaded from cache
17.18 s
Building /nix/store/1sm2qvnabig3zi3xyg21kh6ddn9hm2k8-require-package-imports-0.0.1.0.drv
17.28 s
[require-package-imports] Phase: setupCompilerEnvironmentPhase
17.28 s
[require-package-imports] Build with /nix/store/57awwm6z1vqyrdx8wa52i9dhiw09xkiw-ghc-9.6.7.
17.43 s
[require-package-imports] Phase: unpackPhase
17.43 s
[require-package-imports] unpacking source archive /nix/store/q37acxd26agyg667547zl2i1lysw4rrf-zs1ipfmkhjv63yx12warxxr1n2krz2ry-source/./core
17.44 s
[require-package-imports] source root is core
17.44 s
[require-package-imports] Phase: patchPhase
17.45 s
[require-package-imports] Phase: compileBuildDriverPhase
17.45 s
[require-package-imports] setupCompileFlags: -package-db=/build/tmp.gY52NHmYuO/setup-package.conf.d -threaded
17.52 s
[require-package-imports] [1 of 2] Compiling Main ( Setup.hs, /build/tmp.gY52NHmYuO/Main.o )
17.58 s
[require-package-imports] [2 of 2] Linking Setup
18.78 s
[require-package-imports] Phase: updateAutotoolsGnuConfigScriptsPhase
18.79 s
[require-package-imports] Phase: configurePhase
18.79 s
[require-package-imports] configureFlags: --verbose --prefix=/nix/store/kc4x275zfimy8a4k3hnjm5z91fb3z8kg-require-package-imports-0.0.1.0 --libdir=$prefix/lib/$compiler/lib --libsubdir=$abi/$libname --docdir=/nix/store/iwzk6a7y3frjj53z8rr970vq6agmkvbs-require-package-imports-0.0.1.0-doc/share/doc/require-package-imports-0.0.1.0 --with-gcc=gcc --package-db=/build/tmp.gY52NHmYuO/package.conf.d --ghc-option=-j16 --ghc-option=+RTS --ghc-option=-A64M --ghc-option=-RTS --enable-library-profiling --profiling-detail=exported-functions --disable-profiling --enable-shared --disable-coverage --enable-static --disable-executable-dynamic --enable-tests --disable-benchmarks --enable-library-vanilla --disable-library-for-ghci --enable-split-sections --enable-library-stripping --enable-executable-stripping --ghc-option=-haddock --ghc-options=-Werror --extra-lib-dirs=/nix/store/kpi3v5fl8hlgy5lagjvn6ayq78mla49k-ncurses-6.5/lib --extra-lib-dirs=/nix/store/c86nvwib4x4w4lkd3qw2aw40a354b6yd-libffi-3.5.2/lib --extra-lib-dirs=/nix/store/v6v4r40nfy7inyr36yckidhi6ngh0k6p-elfutils-0.194/lib --extra-lib-dirs=/nix/store/z658zzyxfc8106bjl5svssvsjvk513yj-gmp-with-cxx-6.3.0/lib --extra-lib-dirs=/nix/store/n8f6dc226f3z0yz8b7yh2ksi5gx70mha-numactl-2.0.18/lib --extra-lib-dirs=/nix/store/57awwm6z1vqyrdx8wa52i9dhiw09xkiw-ghc-9.6.7/lib
18.80 s
[require-package-imports] Using Parsec parser
18.80 s
[require-package-imports] Configuring require-package-imports-0.0.1.0...
19.13 s
[require-package-imports] Flags chosen: noisy-deprecations=True, verify-no-recursion=False
19.13 s
[require-package-imports] Dependency base >=4.8.2 && <4.9 || >=4.9.0 && <4.10 || >=4.10.0 && <4.11 ||
19.13 s
[require-package-imports] >=4.11.0 && <4.12 || >=4.12.0 && <4.13 || >=4.13.0 && <4.14 || >=4.14.0 &&
19.13 s
[require-package-imports] <4.15 || >=4.15.0 && <4.16 || >=4.16.0 && <4.17 || >=4.17.0 && <4.18 ||
19.13 s
[require-package-imports] >=4.18.0 && <4.19 || >=4.19.0 && <4.20 || >=4.20.0 && <4.21 || >=4.21.0 &&
19.13 s
[require-package-imports] <4.22 || >=4.22.0 && <4.23: using base-4.18.3.0
19.13 s
[require-package-imports] Dependency ghc >=7.2.1 && <9.16: using ghc-9.6.7
19.13 s
[require-package-imports] Dependency ghc-boot-th >=8.0.1 && <9.16: using ghc-boot-th-9.6.7
19.13 s
[require-package-imports] Dependency ghc-compat-plugin >=0.1.0 && <0.2: using ghc-compat-plugin-0.1.0.1
19.13 s
[require-package-imports] Dependency base >=4.8.2 && <4.9 || >=4.9.0 && <4.10 || >=4.10.0 && <4.11 ||
19.13 s
[require-package-imports] >=4.11.0 && <4.12 || >=4.12.0 && <4.13 || >=4.13.0 && <4.14 || >=4.14.0 &&
19.13 s
[require-package-imports] <4.15 || >=4.15.0 && <4.16 || >=4.16.0 && <4.17 || >=4.17.0 && <4.18 ||
19.13 s
[require-package-imports] >=4.18.0 && <4.19 || >=4.19.0 && <4.20 || >=4.20.0 && <4.21 || >=4.21.0 &&
19.13 s
[require-package-imports] <4.22 || >=4.22.0 && <4.23: using base-4.18.3.0
19.13 s
[require-package-imports] Dependency doctest: using doctest-0.24.2
19.13 s
[require-package-imports] Dependency ghc-compat-plugin >=0.1.0 && <0.2: using ghc-compat-plugin-0.1.0.1
19.13 s
[require-package-imports] Dependency require-package-imports: using require-package-imports-0.0.1.0
19.43 s
[require-package-imports] Source component graph:
19.43 s
[require-package-imports] component lib
19.43 s
[require-package-imports] component test:doctests dependency lib
19.43 s
[require-package-imports] Configured component graph:
19.43 s
[require-package-imports] component require-package-imports-0.0.1.0-6c5oBGtoLFS1O4623edh3k
19.43 s
[require-package-imports] include base-4.18.3.0
19.43 s
[require-package-imports] include ghc-9.6.7
19.43 s
[require-package-imports] include ghc-boot-th-9.6.7
19.43 s
[require-package-imports] include ghc-compat-plugin-0.1.0.1-6wKNTt5WLLQByK2Br4PYfC
19.43 s
[require-package-imports] component require-package-imports-0.0.1.0-4Bh5Fo1I7iR2a0QaNrVO6O-doctests
19.43 s
[require-package-imports] include base-4.18.3.0
19.43 s
[require-package-imports] include doctest-0.24.2-7YxPr6lrdwiBMDK2pmizgF
19.43 s
[require-package-imports] include ghc-compat-plugin-0.1.0.1-6wKNTt5WLLQByK2Br4PYfC
19.43 s
[require-package-imports] include require-package-imports-0.0.1.0-6c5oBGtoLFS1O4623edh3k
19.43 s
[require-package-imports] Linked component graph:
19.43 s
[require-package-imports] unit require-package-imports-0.0.1.0-6c5oBGtoLFS1O4623edh3k
19.43 s
[require-package-imports] include base-4.18.3.0
19.43 s
[require-package-imports] include ghc-9.6.7
19.43 s
[require-package-imports] include ghc-boot-th-9.6.7
19.43 s
[require-package-imports] include ghc-compat-plugin-0.1.0.1-6wKNTt5WLLQByK2Br4PYfC
19.43 s
[require-package-imports] RequirePackageImports=require-package-imports-0.0.1.0-6c5oBGtoLFS1O4623edh3k:RequirePackageImports
19.43 s
[require-package-imports] unit require-package-imports-0.0.1.0-4Bh5Fo1I7iR2a0QaNrVO6O-doctests
19.43 s
[require-package-imports] include base-4.18.3.0
19.43 s
[require-package-imports] include doctest-0.24.2-7YxPr6lrdwiBMDK2pmizgF
19.43 s
[require-package-imports] include ghc-compat-plugin-0.1.0.1-6wKNTt5WLLQByK2Br4PYfC
19.43 s
[require-package-imports] include require-package-imports-0.0.1.0-6c5oBGtoLFS1O4623edh3k
19.43 s
[require-package-imports] Ready component graph:
19.43 s
[require-package-imports] definite require-package-imports-0.0.1.0-6c5oBGtoLFS1O4623edh3k
19.43 s
[require-package-imports] depends base-4.18.3.0
19.43 s
[require-package-imports] depends ghc-9.6.7
19.43 s
[require-package-imports] depends ghc-boot-th-9.6.7
19.43 s
[require-package-imports] depends ghc-compat-plugin-0.1.0.1-6wKNTt5WLLQByK2Br4PYfC
19.43 s
[require-package-imports] definite require-package-imports-0.0.1.0-4Bh5Fo1I7iR2a0QaNrVO6O-doctests
19.43 s
[require-package-imports] depends base-4.18.3.0
19.43 s
[require-package-imports] depends doctest-0.24.2-7YxPr6lrdwiBMDK2pmizgF
19.43 s
[require-package-imports] depends ghc-compat-plugin-0.1.0.1-6wKNTt5WLLQByK2Br4PYfC
19.43 s
[require-package-imports] depends require-package-imports-0.0.1.0-6c5oBGtoLFS1O4623edh3k
19.43 s
[require-package-imports] Using Cabal-3.10.3.0 compiled by ghc-9.6
19.43 s
[require-package-imports] Using compiler: ghc-9.6.7
19.43 s
[require-package-imports] Using install prefix:
19.43 s
[require-package-imports] /nix/store/kc4x275zfimy8a4k3hnjm5z91fb3z8kg-require-package-imports-0.0.1.0
19.43 s
[require-package-imports] Executables installed in:
19.43 s
[require-package-imports] /nix/store/kc4x275zfimy8a4k3hnjm5z91fb3z8kg-require-package-imports-0.0.1.0/bin
19.43 s
[require-package-imports] Libraries installed in:
19.43 s
[require-package-imports] /nix/store/kc4x275zfimy8a4k3hnjm5z91fb3z8kg-require-package-imports-0.0.1.0/lib/ghc-9.6.7/lib/x86_64-linux-ghc-9.6.7/require-package-imports-0.0.1.0-6c5oBGtoLFS1O4623edh3k
19.43 s
[require-package-imports] Dynamic Libraries installed in:
19.43 s
[require-package-imports] /nix/store/kc4x275zfimy8a4k3hnjm5z91fb3z8kg-require-package-imports-0.0.1.0/lib/ghc-9.6.7/lib/x86_64-linux-ghc-9.6.7
19.43 s
[require-package-imports] Private executables installed in:
19.43 s
[require-package-imports] /nix/store/kc4x275zfimy8a4k3hnjm5z91fb3z8kg-require-package-imports-0.0.1.0/libexec/x86_64-linux-ghc-9.6.7/require-package-imports-0.0.1.0
19.43 s
[require-package-imports] Data files installed in:
19.43 s
[require-package-imports] /nix/store/kc4x275zfimy8a4k3hnjm5z91fb3z8kg-require-package-imports-0.0.1.0/share/x86_64-linux-ghc-9.6.7/require-package-imports-0.0.1.0
19.43 s
[require-package-imports] Documentation installed in:
19.43 s
[require-package-imports] /nix/store/iwzk6a7y3frjj53z8rr970vq6agmkvbs-require-package-imports-0.0.1.0-doc/share/doc/require-package-imports-0.0.1.0
19.43 s
[require-package-imports] Configuration files installed in:
19.43 s
[require-package-imports] /nix/store/kc4x275zfimy8a4k3hnjm5z91fb3z8kg-require-package-imports-0.0.1.0/etc
19.43 s
[require-package-imports] No alex found
19.43 s
[require-package-imports] Using ar found on system at:
19.43 s
[require-package-imports] /nix/store/4dh4138m8gbp56kh63j2pwgsfhf5l8v7-binutils-wrapper-2.44/bin/ar
19.43 s
[require-package-imports] No c2hs found
19.43 s
[require-package-imports] No cpphs found
19.43 s
[require-package-imports] Using doctest version 0.24.2 found on system at:
19.44 s
[require-package-imports] /nix/store/zlv1cwdvafilcwmibmzyc1mzi7hyf5c5-doctest-0.24.2/bin/doctest
19.44 s
[require-package-imports] Using gcc version 14.3.0 given by user at:
19.44 s
[require-package-imports] /nix/store/myvv172x2am72534zgn9wx0qp5amq6a8-gcc-wrapper-14.3.0/bin/gcc
19.44 s
[require-package-imports] Using ghc version 9.6.7 found on system at:
19.44 s
[require-package-imports] /nix/store/57awwm6z1vqyrdx8wa52i9dhiw09xkiw-ghc-9.6.7/bin/ghc
19.44 s
[require-package-imports] Using ghc-pkg version 9.6.7 found on system at:
19.44 s
[require-package-imports] /nix/store/57awwm6z1vqyrdx8wa52i9dhiw09xkiw-ghc-9.6.7/bin/ghc-pkg-9.6.7
19.44 s
[require-package-imports] No ghcjs found
19.44 s
[require-package-imports] No ghcjs-pkg found
19.44 s
[require-package-imports] No greencard found
19.44 s
[require-package-imports] Using haddock version 2.29.2 found on system at:
19.44 s
[require-package-imports] /nix/store/57awwm6z1vqyrdx8wa52i9dhiw09xkiw-ghc-9.6.7/bin/haddock-ghc-9.6.7
19.44 s
[require-package-imports] No happy found
19.44 s
[require-package-imports] Using haskell-suite found on system at: haskell-suite-dummy-location
19.44 s
[require-package-imports] Using haskell-suite-pkg found on system at: haskell-suite-pkg-dummy-location
19.44 s
[require-package-imports] No hmake found
19.44 s
[require-package-imports] Using hpc version 0.68 found on system at:
19.44 s
[require-package-imports] /nix/store/57awwm6z1vqyrdx8wa52i9dhiw09xkiw-ghc-9.6.7/bin/hpc-ghc-9.6.7
19.44 s
[require-package-imports] Using hsc2hs version 0.68.9 found on system at:
19.44 s
[require-package-imports] /nix/store/57awwm6z1vqyrdx8wa52i9dhiw09xkiw-ghc-9.6.7/bin/hsc2hs-ghc-9.6.7
19.44 s
[require-package-imports] Using hscolour version 1.25 found on system at:
19.44 s
[require-package-imports] /nix/store/ggvvgxsqy3gwrzfkchn306i0was12fc8-hscolour-1.25/bin/HsColour
19.44 s
[require-package-imports] No jhc found
19.44 s
[require-package-imports] Using ld found on system at:
19.44 s
[require-package-imports] /nix/store/4dh4138m8gbp56kh63j2pwgsfhf5l8v7-binutils-wrapper-2.44/bin/ld.gold
19.44 s
[require-package-imports] No pkg-config found
19.44 s
[require-package-imports] Using runghc version 9.6.7 found on system at:
19.44 s
[require-package-imports] /nix/store/57awwm6z1vqyrdx8wa52i9dhiw09xkiw-ghc-9.6.7/bin/runghc-9.6.7
19.44 s
[require-package-imports] Using strip version 2.44 found on system at:
19.44 s
[require-package-imports] /nix/store/myvv172x2am72534zgn9wx0qp5amq6a8-gcc-wrapper-14.3.0/bin/strip
19.44 s
[require-package-imports] Using tar found on system at:
19.44 s
[require-package-imports] /nix/store/l5ibq1yp8m7jibzgqbmpc46hkcnvv8fq-gnutar-1.35/bin/tar
19.44 s
[require-package-imports] No uhc found
19.57 s
[require-package-imports] Phase: buildPhase
19.63 s
[require-package-imports] Preprocessing library for require-package-imports-0.0.1.0..
19.63 s
[require-package-imports] Building library for require-package-imports-0.0.1.0..
19.74 s
[require-package-imports] [1 of 1] Compiling RequirePackageImports ( src/RequirePackageImports.hs, dist/build/RequirePackageImports.o, dist/build/RequirePackageImports.dyn_o )
19.95 s
[require-package-imports]
20.01 s
[require-package-imports] src/RequirePackageImports.hs:48:34: error : [ GHC-76037 ]
20.01 s
[require-package-imports] Not in scope: ‘Annotation.getHasLoc’
20.01 s
[require-package-imports] NB: the module ‘GHC.Parser.Annotation’ does not export ‘getHasLoc’.
20.01 s
[require-package-imports] Suggested fix:
20.01 s
[require-package-imports] Perhaps use one of these:
20.01 s
[require-package-imports] ‘Annotation.getLocA’ (imported from GHC.Parser.Annotation),
20.01 s
[require-package-imports] ‘Annotation.reLoc’ (imported from GHC.Parser.Annotation)
20.01 s
[require-package-imports] |
20.01 s
[require-package-imports] 48 | { Error.errMsgSpan = Annotation.getHasLoc imp,
20.01 s
[require-package-imports] | ^^^^^^^^^^^^^^^^^^^^
20.01 s
[require-package-imports]
20.06 s
[require-package-imports] src/RequirePackageImports.hs:52:52: error : [ GHC-76037 ]
20.06 s
[require-package-imports] Not in scope: ‘Error.defaultOpts’
20.06 s
[require-package-imports] NB: the module ‘GHC.Types.Error’ does not export ‘defaultOpts’.
20.06 s
[require-package-imports] |
20.06 s
[require-package-imports] 52 | . Error.UnknownDiagnostic (const Error.defaultOpts )
20.06 s
[require-package-imports] | ^^^^^^^^^^^^^^^^^
20.06 s
[require-package-imports]
20.06 s
[require-package-imports] src/RequirePackageImports.hs:64:15: error :
20.06 s
[require-package-imports] Constructor ‘Error.MsgEnvelope’ does not have field ‘errMsgReason’
20.06 s
[require-package-imports] |
20.06 s
[require-package-imports] 64 | Error.errMsgReason = Error.ResolvedDiagnosticReason reason
20.06 s
[require-package-imports] | ^^^^^^^^^^^^^^^^^^
20.06 s
[require-package-imports]
20.12 s
[require-package-imports] src/RequirePackageImports.hs:64:36: error : [ GHC-76037 ]
20.12 s
[require-package-imports] Not in scope: data constructor ‘Error.ResolvedDiagnosticReason’
20.12 s
[require-package-imports] NB: the module ‘GHC.Types.Error’ does not export ‘ResolvedDiagnosticReason’.
20.12 s
[require-package-imports] Suggested fix:
20.12 s
[require-package-imports] Perhaps use variable ‘Error.diagnosticReason’ (imported from GHC.Types.Error)
20.12 s
[require-package-imports] |
20.12 s
[require-package-imports] 64 | Error.errMsgReason = Error.ResolvedDiagnosticReason reason
20.12 s
[require-package-imports] | ^^^^^^^^^^^^^^^^^^^^^^^^^^^^^^
20.24 s
Progress: 0 of 4 built (1 failed), 21 of 21 downloaded from cache
20.24 s
Failed to build require-package-imports after 3.0s
20.25 s
error: Cannot build '/nix/store/1sm2qvnabig3zi3xyg21kh6ddn9hm2k8-require-package-imports-0.0.1.0.drv '.
20.25 s
Reason: builder failed with exit code 1 .
20.25 s
Output paths:
20.25 s
/nix/store/iwzk6a7y3frjj53z8rr970vq6agmkvbs-require-package-imports-0.0.1.0-doc
20.25 s
/nix/store/kc4x275zfimy8a4k3hnjm5z91fb3z8kg-require-package-imports-0.0.1.0
20.25 s
Last 163 log lines:
20.25 s
> Running phase: setupCompilerEnvironmentPhase
20.25 s
> Build with /nix/store/57awwm6z1vqyrdx8wa52i9dhiw09xkiw-ghc-9.6.7.
20.25 s
> Running phase: unpackPhase
20.25 s
> unpacking source archive /nix/store/q37acxd26agyg667547zl2i1lysw4rrf-zs1ipfmkhjv63yx12warxxr1n2krz2ry-source/./core
20.25 s
> source root is core
20.25 s
> Running phase: patchPhase
20.25 s
> Running phase: compileBuildDriverPhase
20.25 s
> setupCompileFlags: -package-db=/build/tmp.gY52NHmYuO/setup-package.conf.d -threaded
20.25 s
> [1 of 2] Compiling Main ( Setup.hs, /build/tmp.gY52NHmYuO/Main.o )
20.25 s
> [2 of 2] Linking Setup
20.25 s
> Running phase: updateAutotoolsGnuConfigScriptsPhase
20.25 s
> Running phase: configurePhase
20.25 s
> configureFlags: --verbose --prefix=/nix/store/kc4x275zfimy8a4k3hnjm5z91fb3z8kg-require-package-imports-0.0.1.0 --libdir=$prefix/lib/$compiler/lib --libsubdir=$abi/$libname --docdir=/nix/store/iwzk6a7y3frjj53z8rr970vq6agmkvbs-require-package-imports-0.0.1.0-doc/share/doc/require-package-imports-0.0.1.0 --with-gcc=gcc --package-db=/build/tmp.gY52NHmYuO/package.conf.d --ghc-option=-j16 --ghc-option=+RTS --ghc-option=-A64M --ghc-option=-RTS --enable-library-profiling --profiling-detail=exported-functions --disable-profiling --enable-shared --disable-coverage --enable-static --disable-executable-dynamic --enable-tests --disable-benchmarks --enable-library-vanilla --disable-library-for-ghci --enable-split-sections --enable-library-stripping --enable-executable-stripping --ghc-option=-haddock --ghc-options=-Werror --extra-lib-dirs=/nix/store/kpi3v5fl8hlgy5lagjvn6ayq78mla49k-ncurses-6.5/lib --extra-lib-dirs=/nix/store/c86nvwib4x4w4lkd3qw2aw40a354b6yd-libffi-3.5.2/lib --extra-lib-dirs=/nix/store/v6v4r40nfy7inyr36yckidhi6ngh0k6p-elfutils-0.194/lib --extra-lib-dirs=/nix/store/z658zzyxfc8106bjl5svssvsjvk513yj-gmp-with-cxx-6.3.0/lib --extra-lib-dirs=/nix/store/n8f6dc226f3z0yz8b7yh2ksi5gx70mha-numactl-2.0.18/lib --extra-lib-dirs=/nix/store/57awwm6z1vqyrdx8wa52i9dhiw09xkiw-ghc-9.6.7/lib
20.25 s
> Using Parsec parser
20.25 s
> Configuring require-package-imports-0.0.1.0...
20.25 s
> Flags chosen: noisy-deprecations=True, verify-no-recursion=False
20.25 s
> Dependency base >=4.8.2 && <4.9 || >=4.9.0 && <4.10 || >=4.10.0 && <4.11 ||
20.25 s
> >=4.11.0 && <4.12 || >=4.12.0 && <4.13 || >=4.13.0 && <4.14 || >=4.14.0 &&
20.25 s
> <4.15 || >=4.15.0 && <4.16 || >=4.16.0 && <4.17 || >=4.17.0 && <4.18 ||
20.25 s
> >=4.18.0 && <4.19 || >=4.19.0 && <4.20 || >=4.20.0 && <4.21 || >=4.21.0 &&
20.25 s
> <4.22 || >=4.22.0 && <4.23: using base-4.18.3.0
20.25 s
> Dependency ghc >=7.2.1 && <9.16: using ghc-9.6.7
20.25 s
> Dependency ghc-boot-th >=8.0.1 && <9.16: using ghc-boot-th-9.6.7
20.25 s
> Dependency ghc-compat-plugin >=0.1.0 && <0.2: using ghc-compat-plugin-0.1.0.1
20.25 s
> Dependency base >=4.8.2 && <4.9 || >=4.9.0 && <4.10 || >=4.10.0 && <4.11 ||
20.25 s
> >=4.11.0 && <4.12 || >=4.12.0 && <4.13 || >=4.13.0 && <4.14 || >=4.14.0 &&
20.25 s
> <4.15 || >=4.15.0 && <4.16 || >=4.16.0 && <4.17 || >=4.17.0 && <4.18 ||
20.25 s
> >=4.18.0 && <4.19 || >=4.19.0 && <4.20 || >=4.20.0 && <4.21 || >=4.21.0 &&
20.25 s
> <4.22 || >=4.22.0 && <4.23: using base-4.18.3.0
20.25 s
> Dependency doctest: using doctest-0.24.2
20.25 s
> Dependency ghc-compat-plugin >=0.1.0 && <0.2: using ghc-compat-plugin-0.1.0.1
20.25 s
> Dependency require-package-imports: using require-package-imports-0.0.1.0
20.25 s
> Source component graph:
20.25 s
> component lib
20.25 s
> component test:doctests dependency lib
20.25 s
> Configured component graph:
20.25 s
> component require-package-imports-0.0.1.0-6c5oBGtoLFS1O4623edh3k
20.25 s
> include base-4.18.3.0
20.25 s
> include ghc-9.6.7
20.25 s
> include ghc-boot-th-9.6.7
20.25 s
> include ghc-compat-plugin-0.1.0.1-6wKNTt5WLLQByK2Br4PYfC
20.25 s
> component require-package-imports-0.0.1.0-4Bh5Fo1I7iR2a0QaNrVO6O-doctests
20.25 s
> include base-4.18.3.0
20.25 s
> include doctest-0.24.2-7YxPr6lrdwiBMDK2pmizgF
20.25 s
> include ghc-compat-plugin-0.1.0.1-6wKNTt5WLLQByK2Br4PYfC
20.25 s
> include require-package-imports-0.0.1.0-6c5oBGtoLFS1O4623edh3k
20.25 s
> Linked component graph:
20.25 s
> unit require-package-imports-0.0.1.0-6c5oBGtoLFS1O4623edh3k
20.25 s
> include base-4.18.3.0
20.25 s
> include ghc-9.6.7
20.25 s
> include ghc-boot-th-9.6.7
20.25 s
> include ghc-compat-plugin-0.1.0.1-6wKNTt5WLLQByK2Br4PYfC
20.25 s
> RequirePackageImports=require-package-imports-0.0.1.0-6c5oBGtoLFS1O4623edh3k:RequirePackageImports
20.25 s
> unit require-package-imports-0.0.1.0-4Bh5Fo1I7iR2a0QaNrVO6O-doctests
20.25 s
> include base-4.18.3.0
20.25 s
> include doctest-0.24.2-7YxPr6lrdwiBMDK2pmizgF
20.25 s
> include ghc-compat-plugin-0.1.0.1-6wKNTt5WLLQByK2Br4PYfC
20.25 s
> include require-package-imports-0.0.1.0-6c5oBGtoLFS1O4623edh3k
20.25 s
> Ready component graph:
20.25 s
> definite require-package-imports-0.0.1.0-6c5oBGtoLFS1O4623edh3k
20.25 s
> depends base-4.18.3.0
20.25 s
> depends ghc-9.6.7
20.25 s
> depends ghc-boot-th-9.6.7
20.25 s
> depends ghc-compat-plugin-0.1.0.1-6wKNTt5WLLQByK2Br4PYfC
20.25 s
> definite require-package-imports-0.0.1.0-4Bh5Fo1I7iR2a0QaNrVO6O-doctests
20.25 s
> depends base-4.18.3.0
20.25 s
> depends doctest-0.24.2-7YxPr6lrdwiBMDK2pmizgF
20.25 s
> depends ghc-compat-plugin-0.1.0.1-6wKNTt5WLLQByK2Br4PYfC
20.25 s
> depends require-package-imports-0.0.1.0-6c5oBGtoLFS1O4623edh3k
20.25 s
> Using Cabal-3.10.3.0 compiled by ghc-9.6
20.25 s
> Using compiler: ghc-9.6.7
20.25 s
> Using install prefix:
20.25 s
> /nix/store/kc4x275zfimy8a4k3hnjm5z91fb3z8kg-require-package-imports-0.0.1.0
20.25 s
> Executables installed in:
20.25 s
> /nix/store/kc4x275zfimy8a4k3hnjm5z91fb3z8kg-require-package-imports-0.0.1.0/bin
20.25 s
> Libraries installed in:
20.25 s
> /nix/store/kc4x275zfimy8a4k3hnjm5z91fb3z8kg-require-package-imports-0.0.1.0/lib/ghc-9.6.7/lib/x86_64-linux-ghc-9.6.7/require-package-imports-0.0.1.0-6c5oBGtoLFS1O4623edh3k
20.25 s
> Dynamic Libraries installed in:
20.25 s
> /nix/store/kc4x275zfimy8a4k3hnjm5z91fb3z8kg-require-package-imports-0.0.1.0/lib/ghc-9.6.7/lib/x86_64-linux-ghc-9.6.7
20.25 s
> Private executables installed in:
20.25 s
> /nix/store/kc4x275zfimy8a4k3hnjm5z91fb3z8kg-require-package-imports-0.0.1.0/libexec/x86_64-linux-ghc-9.6.7/require-package-imports-0.0.1.0
20.25 s
> Data files installed in:
20.25 s
> /nix/store/kc4x275zfimy8a4k3hnjm5z91fb3z8kg-require-package-imports-0.0.1.0/share/x86_64-linux-ghc-9.6.7/require-package-imports-0.0.1.0
20.25 s
> Documentation installed in:
20.25 s
> /nix/store/iwzk6a7y3frjj53z8rr970vq6agmkvbs-require-package-imports-0.0.1.0-doc/share/doc/require-package-imports-0.0.1.0
20.25 s
> Configuration files installed in:
20.25 s
> /nix/store/kc4x275zfimy8a4k3hnjm5z91fb3z8kg-require-package-imports-0.0.1.0/etc
20.25 s
> No alex found
20.25 s
> Using ar found on system at:
20.25 s
> /nix/store/4dh4138m8gbp56kh63j2pwgsfhf5l8v7-binutils-wrapper-2.44/bin/ar
20.25 s
> No c2hs found
20.25 s
> No cpphs found
20.25 s
> Using doctest version 0.24.2 found on system at:
20.25 s
> /nix/store/zlv1cwdvafilcwmibmzyc1mzi7hyf5c5-doctest-0.24.2/bin/doctest
20.25 s
> Using gcc version 14.3.0 given by user at:
20.25 s
> /nix/store/myvv172x2am72534zgn9wx0qp5amq6a8-gcc-wrapper-14.3.0/bin/gcc
20.25 s
> Using ghc version 9.6.7 found on system at:
20.25 s
> /nix/store/57awwm6z1vqyrdx8wa52i9dhiw09xkiw-ghc-9.6.7/bin/ghc
20.25 s
> Using ghc-pkg version 9.6.7 found on system at:
20.25 s
> /nix/store/57awwm6z1vqyrdx8wa52i9dhiw09xkiw-ghc-9.6.7/bin/ghc-pkg-9.6.7
20.25 s
> No ghcjs found
20.25 s
> No ghcjs-pkg found
20.25 s
> No greencard found
20.25 s
> Using haddock version 2.29.2 found on system at:
20.25 s
> /nix/store/57awwm6z1vqyrdx8wa52i9dhiw09xkiw-ghc-9.6.7/bin/haddock-ghc-9.6.7
20.25 s
> No happy found
20.25 s
> Using haskell-suite found on system at: haskell-suite-dummy-location
20.25 s
> Using haskell-suite-pkg found on system at: haskell-suite-pkg-dummy-location
20.25 s
> No hmake found
20.25 s
> Using hpc version 0.68 found on system at:
20.25 s
> /nix/store/57awwm6z1vqyrdx8wa52i9dhiw09xkiw-ghc-9.6.7/bin/hpc-ghc-9.6.7
20.25 s
> Using hsc2hs version 0.68.9 found on system at:
20.25 s
> /nix/store/57awwm6z1vqyrdx8wa52i9dhiw09xkiw-ghc-9.6.7/bin/hsc2hs-ghc-9.6.7
20.25 s
> Using hscolour version 1.25 found on system at:
20.25 s
> /nix/store/ggvvgxsqy3gwrzfkchn306i0was12fc8-hscolour-1.25/bin/HsColour
20.25 s
> No jhc found
20.25 s
> Using ld found on system at:
20.25 s
> /nix/store/4dh4138m8gbp56kh63j2pwgsfhf5l8v7-binutils-wrapper-2.44/bin/ld.gold
20.25 s
> No pkg-config found
20.25 s
> Using runghc version 9.6.7 found on system at:
20.25 s
> /nix/store/57awwm6z1vqyrdx8wa52i9dhiw09xkiw-ghc-9.6.7/bin/runghc-9.6.7
20.25 s
> Using strip version 2.44 found on system at:
20.25 s
> /nix/store/myvv172x2am72534zgn9wx0qp5amq6a8-gcc-wrapper-14.3.0/bin/strip
20.25 s
> Using tar found on system at:
20.25 s
> /nix/store/l5ibq1yp8m7jibzgqbmpc46hkcnvv8fq-gnutar-1.35/bin/tar
20.25 s
> No uhc found
20.25 s
> Running phase: buildPhase
20.25 s
> Preprocessing library for require-package-imports-0.0.1.0..
20.25 s
> Building library for require-package-imports-0.0.1.0..
20.25 s
> [1 of 1] Compiling RequirePackageImports ( src/RequirePackageImports.hs, dist/build/RequirePackageImports.o, dist/build/RequirePackageImports.dyn_o )
20.25 s
>
20.25 s
> src/RequirePackageImports.hs:48:34: error : [ GHC-76037 ]
20.25 s
> Not in scope: ‘Annotation.getHasLoc’
20.25 s
> NB: the module ‘GHC.Parser.Annotation’ does not export ‘getHasLoc’.
20.25 s
> Suggested fix:
20.25 s
> Perhaps use one of these:
20.25 s
> ‘Annotation.getLocA’ (imported from GHC.Parser.Annotation),
20.25 s
> ‘Annotation.reLoc’ (imported from GHC.Parser.Annotation)
20.25 s
> |
20.25 s
> 48 | { Error.errMsgSpan = Annotation.getHasLoc imp,
20.25 s
> | ^^^^^^^^^^^^^^^^^^^^
20.25 s
>
20.25 s
> src/RequirePackageImports.hs:52:52: error : [ GHC-76037 ]
20.25 s
> Not in scope: ‘Error.defaultOpts’
20.25 s
> NB: the module ‘GHC.Types.Error’ does not export ‘defaultOpts’.
20.25 s
> |
20.25 s
> 52 | . Error.UnknownDiagnostic (const Error.defaultOpts )
20.25 s
> | ^^^^^^^^^^^^^^^^^
20.25 s
>
20.25 s
> src/RequirePackageImports.hs:64:15: error :
20.25 s
> Constructor ‘Error.MsgEnvelope’ does not have field ‘errMsgReason’
20.25 s
> |
20.25 s
> 64 | Error.errMsgReason = Error.ResolvedDiagnosticReason reason
20.25 s
> | ^^^^^^^^^^^^^^^^^^
20.25 s
>
20.25 s
> src/RequirePackageImports.hs:64:36: error : [ GHC-76037 ]
20.25 s
> Not in scope: data constructor ‘Error.ResolvedDiagnosticReason’
20.25 s
> NB: the module ‘GHC.Types.Error’ does not export ‘ResolvedDiagnosticReason’.
20.25 s
> Suggested fix:
20.25 s
> Perhaps use variable ‘Error.diagnosticReason’ (imported from GHC.Types.Error)
20.25 s
> |
20.25 s
> 64 | Error.errMsgReason = Error.ResolvedDiagnosticReason reason
20.25 s
> | ^^^^^^^^^^^^^^^^^^^^^^^^^^^^^^
20.25 s
For full logs, run:
20.25 s
nix log /nix/store/1sm2qvnabig3zi3xyg21kh6ddn9hm2k8-require-package-imports-0.0.1.0.drv
20.25 s
error: Cannot build '/nix/store/qzxqvjv5yizj0ixwnwnx34dbn3bir81f-ghc-9.6.7-with-packages.drv '.
20.25 s
Reason: 1 dependency failed .
20.25 s
Output paths:
20.25 s
/nix/store/74h41ycb34plc38ddxkvn0c2rm1rfiw1-ghc-9.6.7-with-packages
20.25 s
Cannot build ' /nix/store/4rcazmkm7kg269xg3yasv9l8x7wgmv7y-all-packages.drv '.
20.25 s
Reason: 1 dependency failed .
20.25 s
Output paths:
20.25 s
/nix/store/zb75dc9ya0fng78y3hahcl9kk7ngz206-all-packages
20.31 s
Build failed.