1. 0.01 s $ /nix/store/61685rbaxmpigwi3z23i33sv3jyfl70q-coreutils-9.11/bin/timeout --kill-after=15s 7200s /nix/store/wknkybkzrc16r11vk5vrykh4wmw7a353-nix-2.34.8/bin/nix --extra-experimental-features nix-command --extra-experimental-features flakes --log-format internal-json build --no-link --print-out-paths git+https://github.com/sellout/xdg-base-directory?ref=renovate%2Fubuntu-26.x&rev=f846e15c919b40c2194fa7dd7da5a34c74a89887&shallow=1#packages.x86_64-linux.ghc8107_xdg-base-directory-internal --print-build-logs
  2. 0.67 s warning: ignoring untrusted flake configuration setting 'extra-experimental-features'.
  3. 0.67 s Pass '--accept-flake-config' to trust it
  4. 0.67 s warning: ignoring untrusted flake configuration setting 'extra-substituters'.
  5. 0.67 s Pass '--accept-flake-config' to trust it
  6. 0.67 s warning: ignoring untrusted flake configuration setting 'extra-trusted-public-keys'.
  7. 0.67 s Pass '--accept-flake-config' to trust it
  8. 0.67 s warning: ignoring untrusted flake configuration setting 'sandbox'.
  9. 0.67 s Pass '--accept-flake-config' to trust it
  10. 0.67 s warning: ignoring untrusted flake configuration setting 'use-registries'.
  11. 0.67 s Pass '--accept-flake-config' to trust it
  12. 0.68 s error (ignored): SQLite database '/var/cache/nix-ci-worker/eval-cache-v6/a2e528fbd8f31bce30432f112980882482e0524db6ae2ba5aeeaa58b2b9ce4da.sqlite' is busy
  13. 4.22 s
  14. 5.71 s Building /nix/store/jsplhgywrncpdlrzdbq0h19b1rvhbi4n-xdg-base-directory-internal-0.0.1.0.drv
  15. 6.10 s [xdg-base-directory-internal] Phase: setupCompilerEnvironmentPhase
  16. 6.11 s [xdg-base-directory-internal] Build with /nix/store/0vh9kdrb21vxnn95z2xdal211cfvk0sb-ghc-8.10.7.
  17. 6.89 s [xdg-base-directory-internal] Phase: unpackPhase
  18. 6.90 s [xdg-base-directory-internal] unpacking source archive /nix/store/rchkdcbbia484ynzyiqgfc9m3wdm8pjx-5gla8zzrp17kd7s257qx06hp6d5z9s5z-source/./internal
  19. 6.92 s [xdg-base-directory-internal] source root is internal
  20. 6.95 s [xdg-base-directory-internal] Phase: patchPhase
  21. 6.98 s [xdg-base-directory-internal] Phase: compileBuildDriverPhase
  22. 6.98 s [xdg-base-directory-internal] setupCompileFlags: -package-db=/build/tmp.m3H28mWRw7/setup-package.conf.d -threaded
  23. 7.22 s [xdg-base-directory-internal] [1 of 1] Compiling Main ( Setup.hs, /build/tmp.m3H28mWRw7/Main.o )
  24. 7.42 s [xdg-base-directory-internal] Linking Setup ...
  25. 10.29 s [xdg-base-directory-internal] Phase: updateAutotoolsGnuConfigScriptsPhase
  26. 10.32 s [xdg-base-directory-internal] Phase: configurePhase
  27. 10.33 s [xdg-base-directory-internal] configureFlags: --verbose --prefix=/nix/store/46gkrbwnb03iyf5yg925hfk5nwsscsad-xdg-base-directory-internal-0.0.1.0 --libdir=$prefix/lib/$compiler --libsubdir=$abi/$libname --docdir=/nix/store/nl287b66dq5zsplk84wfgn9m9jz0ad16-xdg-base-directory-internal-0.0.1.0-doc/share/doc/xdg-base-directory-internal-0.0.1.0 --with-gcc=gcc --package-db=/build/tmp.m3H28mWRw7/package.conf.d --ghc-option=-j16 --ghc-option=+RTS --ghc-option=-A64M --ghc-option=-RTS --enable-library-profiling --profiling-detail=exported-functions --disable-profiling --enable-shared --disable-coverage --enable-static --disable-executable-dynamic --enable-tests --disable-benchmarks --enable-library-vanilla --disable-library-for-ghci --enable-split-sections --enable-library-stripping --enable-executable-stripping --ghc-options=-Werror --extra-lib-dirs=/nix/store/vfmnmqsnfiiqmphy7ffh2zqynsxfck1q-ncurses-6.5/lib --extra-lib-dirs=/nix/store/z2yynpqq1x1lb9xvnjd5r51b3vl9xmfh-libffi-3.3/lib --extra-lib-dirs=/nix/store/kxhsmlrscry4pvbpwkbbbxsksmzg0gp0-gmp-with-cxx-6.3.0/lib --extra-lib-dirs=/nix/store/0vh9kdrb21vxnn95z2xdal211cfvk0sb-ghc-8.10.7/lib
  28. 11.47 s [xdg-base-directory-internal] Using Parsec parser
  29. 11.47 s [xdg-base-directory-internal] Configuring xdg-base-directory-internal-0.0.1.0...
  30. 11.47 s [xdg-base-directory-internal] Flags chosen: noisy-deprecations=True
  31. 11.47 s [xdg-base-directory-internal] Dependency base >=4.8.2 && <4.9 || >=4.9.1 && <4.10 || >=4.10.1 && <4.11 ||
  32. 11.47 s [xdg-base-directory-internal] >=4.11.0 && <4.12 || >=4.12.0 && <4.13 || >=4.13.0 && <4.14 || >=4.14.0 &&
  33. 11.47 s [xdg-base-directory-internal] <4.15 || >=4.15.0 && <4.16 || >=4.16.0 && <4.17 || >=4.17.0 && <4.18 ||
  34. 11.47 s [xdg-base-directory-internal] >=4.18.0 && <4.19 || >=4.19.0 && <4.20 || >=4.20.0 && <4.21: using
  35. 11.47 s [xdg-base-directory-internal] base-4.14.3.0
  36. 11.47 s [xdg-base-directory-internal] Dependency directory -any: using directory-1.3.6.0
  37. 11.47 s [xdg-base-directory-internal] Dependency filepath -any: using filepath-1.4.2.1
  38. 11.47 s [xdg-base-directory-internal] Dependency pathway -any: using pathway-0.1.0.0
  39. 11.47 s [xdg-base-directory-internal] Dependency pathway-internal -any: using pathway-internal-0.1.0.0
  40. 11.47 s [xdg-base-directory-internal] Dependency strict -any: using strict-0.5.1
  41. 11.47 s [xdg-base-directory-internal] Dependency yaya -any: using yaya-0.6.2.3
  42. 11.47 s [xdg-base-directory-internal] Dependency base >=4.8.2 && <4.9 || >=4.9.1 && <4.10 || >=4.10.1 && <4.11 ||
  43. 11.47 s [xdg-base-directory-internal] >=4.11.0 && <4.12 || >=4.12.0 && <4.13 || >=4.13.0 && <4.14 || >=4.14.0 &&
  44. 11.47 s [xdg-base-directory-internal] <4.15 || >=4.15.0 && <4.16 || >=4.16.0 && <4.17 || >=4.17.0 && <4.18 ||
  45. 11.47 s [xdg-base-directory-internal] >=4.18.0 && <4.19 || >=4.19.0 && <4.20 || >=4.20.0 && <4.21: using
  46. 11.47 s [xdg-base-directory-internal] base-4.14.3.0
  47. 11.47 s [xdg-base-directory-internal] Dependency doctest >=0.16.0 && <0.17 || >=0.17.0 && <0.18 || >=0.18.0 && <0.19
  48. 11.47 s [xdg-base-directory-internal] || >=0.19.0 && <0.20 || >=0.20.0 && <0.21 || >=0.21.0 && <0.22 || >=0.22.0 &&
  49. 11.47 s [xdg-base-directory-internal] <0.23: using doctest-0.22.6
  50. 11.47 s [xdg-base-directory-internal] Dependency xdg-base-directory-internal -any: using
  51. 11.47 s [xdg-base-directory-internal] xdg-base-directory-internal-0.0.1.0
  52. 12.04 s [xdg-base-directory-internal] Source component graph:
  53. 12.04 s [xdg-base-directory-internal] component lib
  54. 12.04 s [xdg-base-directory-internal] component test:doctests dependency lib
  55. 12.04 s [xdg-base-directory-internal] Configured component graph:
  56. 12.04 s [xdg-base-directory-internal] component xdg-base-directory-internal-0.0.1.0-F4r8Pto1OAmI2wHVX14V5C
  57. 12.04 s [xdg-base-directory-internal] include base-4.14.3.0
  58. 12.04 s [xdg-base-directory-internal] include directory-1.3.6.0
  59. 12.04 s [xdg-base-directory-internal] include filepath-1.4.2.1
  60. 12.04 s [xdg-base-directory-internal] include pathway-0.1.0.0-ApYfFviduZq6K4pLVWuemU
  61. 12.04 s [xdg-base-directory-internal] include pathway-internal-0.1.0.0-1UEYu7yfooTK8S0MyXdeip
  62. 12.04 s [xdg-base-directory-internal] include strict-0.5.1-6mZjzgNbkwE50Y6JPhFw9J
  63. 12.04 s [xdg-base-directory-internal] include yaya-0.6.2.3-35aVjaET2ZTKiqggVH8SnZ
  64. 12.04 s [xdg-base-directory-internal] component xdg-base-directory-internal-0.0.1.0-MMc9FnnqmeKQaQmYP6HzM-doctests
  65. 12.04 s [xdg-base-directory-internal] include base-4.14.3.0
  66. 12.04 s [xdg-base-directory-internal] include doctest-0.22.6-67dcUYdlzxgByoqlGIcK6b
  67. 12.04 s [xdg-base-directory-internal] include xdg-base-directory-internal-0.0.1.0-F4r8Pto1OAmI2wHVX14V5C
  68. 12.04 s [xdg-base-directory-internal] Linked component graph:
  69. 12.04 s [xdg-base-directory-internal] unit xdg-base-directory-internal-0.0.1.0-F4r8Pto1OAmI2wHVX14V5C
  70. 12.04 s [xdg-base-directory-internal] include base-4.14.3.0
  71. 12.04 s [xdg-base-directory-internal] include directory-1.3.6.0
  72. 12.04 s [xdg-base-directory-internal] include filepath-1.4.2.1
  73. 12.04 s [xdg-base-directory-internal] include pathway-0.1.0.0-ApYfFviduZq6K4pLVWuemU
  74. 12.04 s [xdg-base-directory-internal] include pathway-internal-0.1.0.0-1UEYu7yfooTK8S0MyXdeip
  75. 12.04 s [xdg-base-directory-internal] include strict-0.5.1-6mZjzgNbkwE50Y6JPhFw9J
  76. 12.04 s [xdg-base-directory-internal] include yaya-0.6.2.3-35aVjaET2ZTKiqggVH8SnZ
  77. 12.04 s [xdg-base-directory-internal] Data.Path.Patch=xdg-base-directory-internal-0.0.1.0-F4r8Pto1OAmI2wHVX14V5C:Data.Path.Patch,XDG.BaseDirectory.Internal.System=xdg-base-directory-internal-0.0.1.0-F4r8Pto1OAmI2wHVX14V5C:XDG.BaseDirectory.Internal.System
  78. 12.04 s [xdg-base-directory-internal] unit xdg-base-directory-internal-0.0.1.0-MMc9FnnqmeKQaQmYP6HzM-doctests
  79. 12.04 s [xdg-base-directory-internal] include base-4.14.3.0
  80. 12.04 s [xdg-base-directory-internal] include doctest-0.22.6-67dcUYdlzxgByoqlGIcK6b
  81. 12.04 s [xdg-base-directory-internal] include xdg-base-directory-internal-0.0.1.0-F4r8Pto1OAmI2wHVX14V5C
  82. 12.04 s [xdg-base-directory-internal] Ready component graph:
  83. 12.04 s [xdg-base-directory-internal] definite xdg-base-directory-internal-0.0.1.0-F4r8Pto1OAmI2wHVX14V5C
  84. 12.04 s [xdg-base-directory-internal] depends base-4.14.3.0
  85. 12.05 s [xdg-base-directory-internal] depends directory-1.3.6.0
  86. 12.05 s [xdg-base-directory-internal] depends filepath-1.4.2.1
  87. 12.05 s [xdg-base-directory-internal] depends pathway-0.1.0.0-ApYfFviduZq6K4pLVWuemU
  88. 12.05 s [xdg-base-directory-internal] depends pathway-internal-0.1.0.0-1UEYu7yfooTK8S0MyXdeip
  89. 12.05 s [xdg-base-directory-internal] depends strict-0.5.1-6mZjzgNbkwE50Y6JPhFw9J
  90. 12.05 s [xdg-base-directory-internal] depends yaya-0.6.2.3-35aVjaET2ZTKiqggVH8SnZ
  91. 12.05 s [xdg-base-directory-internal] definite xdg-base-directory-internal-0.0.1.0-MMc9FnnqmeKQaQmYP6HzM-doctests
  92. 12.05 s [xdg-base-directory-internal] depends base-4.14.3.0
  93. 12.05 s [xdg-base-directory-internal] depends doctest-0.22.6-67dcUYdlzxgByoqlGIcK6b
  94. 12.05 s [xdg-base-directory-internal] depends xdg-base-directory-internal-0.0.1.0-F4r8Pto1OAmI2wHVX14V5C
  95. 12.05 s [xdg-base-directory-internal] Using Cabal-3.2.1.0 compiled by ghc-8.10
  96. 12.05 s [xdg-base-directory-internal] Using compiler: ghc-8.10.7
  97. 12.05 s [xdg-base-directory-internal] Using install prefix:
  98. 12.05 s [xdg-base-directory-internal] /nix/store/46gkrbwnb03iyf5yg925hfk5nwsscsad-xdg-base-directory-internal-0.0.1.0
  99. 12.05 s [xdg-base-directory-internal] Executables installed in:
  100. 12.05 s [xdg-base-directory-internal] /nix/store/46gkrbwnb03iyf5yg925hfk5nwsscsad-xdg-base-directory-internal-0.0.1.0/bin
  101. 12.05 s [xdg-base-directory-internal] Libraries installed in:
  102. 12.05 s [xdg-base-directory-internal] /nix/store/46gkrbwnb03iyf5yg925hfk5nwsscsad-xdg-base-directory-internal-0.0.1.0/lib/ghc-8.10.7/x86_64-linux-ghc-8.10.7/xdg-base-directory-internal-0.0.1.0-F4r8Pto1OAmI2wHVX14V5C
  103. 12.05 s [xdg-base-directory-internal] Dynamic Libraries installed in:
  104. 12.05 s [xdg-base-directory-internal] /nix/store/46gkrbwnb03iyf5yg925hfk5nwsscsad-xdg-base-directory-internal-0.0.1.0/lib/ghc-8.10.7/x86_64-linux-ghc-8.10.7
  105. 12.05 s [xdg-base-directory-internal] Private executables installed in:
  106. 12.05 s [xdg-base-directory-internal] /nix/store/46gkrbwnb03iyf5yg925hfk5nwsscsad-xdg-base-directory-internal-0.0.1.0/libexec/x86_64-linux-ghc-8.10.7/xdg-base-directory-internal-0.0.1.0
  107. 12.05 s [xdg-base-directory-internal] Data files installed in:
  108. 12.05 s [xdg-base-directory-internal] /nix/store/46gkrbwnb03iyf5yg925hfk5nwsscsad-xdg-base-directory-internal-0.0.1.0/share/x86_64-linux-ghc-8.10.7/xdg-base-directory-internal-0.0.1.0
  109. 12.05 s [xdg-base-directory-internal] Documentation installed in:
  110. 12.05 s [xdg-base-directory-internal] /nix/store/nl287b66dq5zsplk84wfgn9m9jz0ad16-xdg-base-directory-internal-0.0.1.0-doc/share/doc/xdg-base-directory-internal-0.0.1.0
  111. 12.05 s [xdg-base-directory-internal] Configuration files installed in:
  112. 12.05 s [xdg-base-directory-internal] /nix/store/46gkrbwnb03iyf5yg925hfk5nwsscsad-xdg-base-directory-internal-0.0.1.0/etc
  113. 12.05 s [xdg-base-directory-internal] No alex found
  114. 12.05 s [xdg-base-directory-internal] Using ar found on system at:
  115. 12.05 s [xdg-base-directory-internal] /nix/store/hhfm5fkvb1alg1np5a69m2qlcjqhr062-binutils-wrapper-2.44/bin/ar
  116. 12.05 s [xdg-base-directory-internal] No c2hs found
  117. 12.05 s [xdg-base-directory-internal] No cpphs found
  118. 12.05 s [xdg-base-directory-internal] Using doctest version 0.22.6 found on system at:
  119. 12.05 s [xdg-base-directory-internal] /nix/store/fplihjp338lzayp9gsblwh7kghka5037-doctest-0.22.6/bin/doctest
  120. 12.05 s [xdg-base-directory-internal] Using gcc version 14.2.1 given by user at:
  121. 12.05 s [xdg-base-directory-internal] /nix/store/0fsnicvfpf55nkza12cjnad0w84d6ba7-gcc-wrapper-14.2.1.20250322/bin/gcc
  122. 12.05 s [xdg-base-directory-internal] Using ghc version 8.10.7 found on system at:
  123. 12.05 s [xdg-base-directory-internal] /nix/store/0vh9kdrb21vxnn95z2xdal211cfvk0sb-ghc-8.10.7/bin/ghc
  124. 12.05 s [xdg-base-directory-internal] Using ghc-pkg version 8.10.7 found on system at:
  125. 12.05 s [xdg-base-directory-internal] /nix/store/0vh9kdrb21vxnn95z2xdal211cfvk0sb-ghc-8.10.7/bin/ghc-pkg
  126. 12.05 s [xdg-base-directory-internal] No ghcjs found
  127. 12.05 s [xdg-base-directory-internal] No ghcjs-pkg found
  128. 12.05 s [xdg-base-directory-internal] No greencard found
  129. 12.05 s [xdg-base-directory-internal] Using haddock version 2.24.2 found on system at:
  130. 12.05 s [xdg-base-directory-internal] /nix/store/0vh9kdrb21vxnn95z2xdal211cfvk0sb-ghc-8.10.7/bin/haddock
  131. 12.05 s [xdg-base-directory-internal] No happy found
  132. 12.05 s [xdg-base-directory-internal] Using haskell-suite found on system at: haskell-suite-dummy-location
  133. 12.05 s [xdg-base-directory-internal] Using haskell-suite-pkg found on system at: haskell-suite-pkg-dummy-location
  134. 12.05 s [xdg-base-directory-internal] No hmake found
  135. 12.05 s [xdg-base-directory-internal] Using hpc version 0.68 found on system at:
  136. 12.05 s [xdg-base-directory-internal] /nix/store/0vh9kdrb21vxnn95z2xdal211cfvk0sb-ghc-8.10.7/bin/hpc
  137. 12.05 s [xdg-base-directory-internal] Using hsc2hs version 0.68.7 found on system at:
  138. 12.05 s [xdg-base-directory-internal] /nix/store/0vh9kdrb21vxnn95z2xdal211cfvk0sb-ghc-8.10.7/bin/hsc2hs
  139. 12.05 s [xdg-base-directory-internal] Using hscolour version 1.25 found on system at:
  140. 12.05 s [xdg-base-directory-internal] /nix/store/dkxv7l2h9aks2fb1xmvar5xy9r7pyqby-hscolour-1.25/bin/HsColour
  141. 12.05 s [xdg-base-directory-internal] No jhc found
  142. 12.05 s [xdg-base-directory-internal] Using ld found on system at:
  143. 12.05 s [xdg-base-directory-internal] /nix/store/hhfm5fkvb1alg1np5a69m2qlcjqhr062-binutils-wrapper-2.44/bin/ld.gold
  144. 12.05 s [xdg-base-directory-internal] No pkg-config found
  145. 12.05 s [xdg-base-directory-internal] Using runghc version 8.10.7 found on system at:
  146. 12.05 s [xdg-base-directory-internal] /nix/store/0vh9kdrb21vxnn95z2xdal211cfvk0sb-ghc-8.10.7/bin/runghc
  147. 12.05 s [xdg-base-directory-internal] Using strip version 2.44 found on system at:
  148. 12.05 s [xdg-base-directory-internal] /nix/store/0fsnicvfpf55nkza12cjnad0w84d6ba7-gcc-wrapper-14.2.1.20250322/bin/strip
  149. 12.05 s [xdg-base-directory-internal] Using tar found on system at:
  150. 12.05 s [xdg-base-directory-internal] /nix/store/wrxvqj822kz8746608lgns7h8mkpn79f-gnutar-1.35/bin/tar
  151. 12.05 s [xdg-base-directory-internal] No uhc found
  152. 12.07 s [xdg-base-directory-internal] Phase: buildPhase
  153. 12.22 s [xdg-base-directory-internal] Preprocessing library for xdg-base-directory-internal-0.0.1.0..
  154. 12.23 s [xdg-base-directory-internal] Building library for xdg-base-directory-internal-0.0.1.0..
  155. 12.50 s [xdg-base-directory-internal] [1 of 2] Compiling XDG.BaseDirectory.Internal.System ( src/XDG/BaseDirectory/Internal/System.hs, dist/build/XDG/BaseDirectory/Internal/System.o, dist/build/XDG/BaseDirectory/Internal/System.dyn_o )
  156. 12.69 s [xdg-base-directory-internal]
  157. 12.69 s [xdg-base-directory-internal] <no location info>: error: [-Wsafe, -Werror=safe]
  158. 12.69 s [xdg-base-directory-internal] ‘XDG.BaseDirectory.Internal.System’ has been inferred as safe!
  159. 12.69 s [xdg-base-directory-internal]
  160. 12.70 s [xdg-base-directory-internal] <no location info>: error: [-Wunused-packages, -Werror=unused-packages]
  161. 12.70 s [xdg-base-directory-internal] The following packages were specified via -package or -package-id flags,
  162. 12.70 s [xdg-base-directory-internal] but were not needed for compilation:
  163. 12.70 s [xdg-base-directory-internal] - yaya-0.6.2.3
  164. 12.70 s [xdg-base-directory-internal] - strict-0.5.1
  165. 12.70 s [xdg-base-directory-internal] - pathway-internal-0.1.0.0
  166. 12.70 s [xdg-base-directory-internal] - pathway-0.1.0.0
  167. 12.88 s [xdg-base-directory-internal]
  168. 12.94 s Progress: 0 of 1 built (1 failed)
  169. 12.94 s Failed to build xdg-base-directory-internal after 7.2s
  170. 12.97 s Cannot build '/nix/store/jsplhgywrncpdlrzdbq0h19b1rvhbi4n-xdg-base-directory-internal-0.0.1.0.drv'.
  171. 12.97 s Reason: builder failed with exit code 1.
  172. 12.97 s Output paths:
  173. 12.97 s /nix/store/46gkrbwnb03iyf5yg925hfk5nwsscsad-xdg-base-directory-internal-0.0.1.0
  174. 12.97 s /nix/store/nl287b66dq5zsplk84wfgn9m9jz0ad16-xdg-base-directory-internal-0.0.1.0-doc
  175. 12.97 s Last 153 log lines:
  176. 12.97 s > Running phase: setupCompilerEnvironmentPhase
  177. 12.97 s > Build with /nix/store/0vh9kdrb21vxnn95z2xdal211cfvk0sb-ghc-8.10.7.
  178. 12.97 s > Running phase: unpackPhase
  179. 12.97 s > unpacking source archive /nix/store/rchkdcbbia484ynzyiqgfc9m3wdm8pjx-5gla8zzrp17kd7s257qx06hp6d5z9s5z-source/./internal
  180. 12.97 s > source root is internal
  181. 12.97 s > Running phase: patchPhase
  182. 12.97 s > Running phase: compileBuildDriverPhase
  183. 12.97 s > setupCompileFlags: -package-db=/build/tmp.m3H28mWRw7/setup-package.conf.d -threaded
  184. 12.97 s > [1 of 1] Compiling Main ( Setup.hs, /build/tmp.m3H28mWRw7/Main.o )
  185. 12.97 s > Linking Setup ...
  186. 12.97 s > Running phase: updateAutotoolsGnuConfigScriptsPhase
  187. 12.97 s > Running phase: configurePhase
  188. 12.97 s > configureFlags: --verbose --prefix=/nix/store/46gkrbwnb03iyf5yg925hfk5nwsscsad-xdg-base-directory-internal-0.0.1.0 --libdir=$prefix/lib/$compiler --libsubdir=$abi/$libname --docdir=/nix/store/nl287b66dq5zsplk84wfgn9m9jz0ad16-xdg-base-directory-internal-0.0.1.0-doc/share/doc/xdg-base-directory-internal-0.0.1.0 --with-gcc=gcc --package-db=/build/tmp.m3H28mWRw7/package.conf.d --ghc-option=-j16 --ghc-option=+RTS --ghc-option=-A64M --ghc-option=-RTS --enable-library-profiling --profiling-detail=exported-functions --disable-profiling --enable-shared --disable-coverage --enable-static --disable-executable-dynamic --enable-tests --disable-benchmarks --enable-library-vanilla --disable-library-for-ghci --enable-split-sections --enable-library-stripping --enable-executable-stripping --ghc-options=-Werror --extra-lib-dirs=/nix/store/vfmnmqsnfiiqmphy7ffh2zqynsxfck1q-ncurses-6.5/lib --extra-lib-dirs=/nix/store/z2yynpqq1x1lb9xvnjd5r51b3vl9xmfh-libffi-3.3/lib --extra-lib-dirs=/nix/store/kxhsmlrscry4pvbpwkbbbxsksmzg0gp0-gmp-with-cxx-6.3.0/lib --extra-lib-dirs=/nix/store/0vh9kdrb21vxnn95z2xdal211cfvk0sb-ghc-8.10.7/lib
  189. 12.97 s > Using Parsec parser
  190. 12.97 s > Configuring xdg-base-directory-internal-0.0.1.0...
  191. 12.97 s > Flags chosen: noisy-deprecations=True
  192. 12.97 s > Dependency base >=4.8.2 && <4.9 || >=4.9.1 && <4.10 || >=4.10.1 && <4.11 ||
  193. 12.97 s > >=4.11.0 && <4.12 || >=4.12.0 && <4.13 || >=4.13.0 && <4.14 || >=4.14.0 &&
  194. 12.97 s > <4.15 || >=4.15.0 && <4.16 || >=4.16.0 && <4.17 || >=4.17.0 && <4.18 ||
  195. 12.97 s > >=4.18.0 && <4.19 || >=4.19.0 && <4.20 || >=4.20.0 && <4.21: using
  196. 12.97 s > base-4.14.3.0
  197. 12.97 s > Dependency directory -any: using directory-1.3.6.0
  198. 12.97 s > Dependency filepath -any: using filepath-1.4.2.1
  199. 12.97 s > Dependency pathway -any: using pathway-0.1.0.0
  200. 12.97 s > Dependency pathway-internal -any: using pathway-internal-0.1.0.0
  201. 12.97 s > Dependency strict -any: using strict-0.5.1
  202. 12.97 s > Dependency yaya -any: using yaya-0.6.2.3
  203. 12.97 s > Dependency base >=4.8.2 && <4.9 || >=4.9.1 && <4.10 || >=4.10.1 && <4.11 ||
  204. 12.97 s > >=4.11.0 && <4.12 || >=4.12.0 && <4.13 || >=4.13.0 && <4.14 || >=4.14.0 &&
  205. 12.97 s > <4.15 || >=4.15.0 && <4.16 || >=4.16.0 && <4.17 || >=4.17.0 && <4.18 ||
  206. 12.97 s > >=4.18.0 && <4.19 || >=4.19.0 && <4.20 || >=4.20.0 && <4.21: using
  207. 12.97 s > base-4.14.3.0
  208. 12.97 s > Dependency doctest >=0.16.0 && <0.17 || >=0.17.0 && <0.18 || >=0.18.0 && <0.19
  209. 12.97 s > || >=0.19.0 && <0.20 || >=0.20.0 && <0.21 || >=0.21.0 && <0.22 || >=0.22.0 &&
  210. 12.97 s > <0.23: using doctest-0.22.6
  211. 12.97 s > Dependency xdg-base-directory-internal -any: using
  212. 12.97 s > xdg-base-directory-internal-0.0.1.0
  213. 12.97 s > Source component graph:
  214. 12.97 s > component lib
  215. 12.97 s > component test:doctests dependency lib
  216. 12.97 s > Configured component graph:
  217. 12.97 s > component xdg-base-directory-internal-0.0.1.0-F4r8Pto1OAmI2wHVX14V5C
  218. 12.97 s > include base-4.14.3.0
  219. 12.97 s > include directory-1.3.6.0
  220. 12.97 s > include filepath-1.4.2.1
  221. 12.97 s > include pathway-0.1.0.0-ApYfFviduZq6K4pLVWuemU
  222. 12.97 s > include pathway-internal-0.1.0.0-1UEYu7yfooTK8S0MyXdeip
  223. 12.97 s > include strict-0.5.1-6mZjzgNbkwE50Y6JPhFw9J
  224. 12.97 s > include yaya-0.6.2.3-35aVjaET2ZTKiqggVH8SnZ
  225. 12.97 s > component xdg-base-directory-internal-0.0.1.0-MMc9FnnqmeKQaQmYP6HzM-doctests
  226. 12.97 s > include base-4.14.3.0
  227. 12.97 s > include doctest-0.22.6-67dcUYdlzxgByoqlGIcK6b
  228. 12.97 s > include xdg-base-directory-internal-0.0.1.0-F4r8Pto1OAmI2wHVX14V5C
  229. 12.97 s > Linked component graph:
  230. 12.97 s > unit xdg-base-directory-internal-0.0.1.0-F4r8Pto1OAmI2wHVX14V5C
  231. 12.97 s > include base-4.14.3.0
  232. 12.97 s > include directory-1.3.6.0
  233. 12.97 s > include filepath-1.4.2.1
  234. 12.97 s > include pathway-0.1.0.0-ApYfFviduZq6K4pLVWuemU
  235. 12.97 s > include pathway-internal-0.1.0.0-1UEYu7yfooTK8S0MyXdeip
  236. 12.97 s > include strict-0.5.1-6mZjzgNbkwE50Y6JPhFw9J
  237. 12.97 s > include yaya-0.6.2.3-35aVjaET2ZTKiqggVH8SnZ
  238. 12.97 s > Data.Path.Patch=xdg-base-directory-internal-0.0.1.0-F4r8Pto1OAmI2wHVX14V5C:Data.Path.Patch,XDG.BaseDirectory.Internal.System=xdg-base-directory-internal-0.0.1.0-F4r8Pto1OAmI2wHVX14V5C:XDG.BaseDirectory.Internal.System
  239. 12.97 s > unit xdg-base-directory-internal-0.0.1.0-MMc9FnnqmeKQaQmYP6HzM-doctests
  240. 12.97 s > include base-4.14.3.0
  241. 12.97 s > include doctest-0.22.6-67dcUYdlzxgByoqlGIcK6b
  242. 12.97 s > include xdg-base-directory-internal-0.0.1.0-F4r8Pto1OAmI2wHVX14V5C
  243. 12.97 s > Ready component graph:
  244. 12.97 s > definite xdg-base-directory-internal-0.0.1.0-F4r8Pto1OAmI2wHVX14V5C
  245. 12.97 s > depends base-4.14.3.0
  246. 12.97 s > depends directory-1.3.6.0
  247. 12.97 s > depends filepath-1.4.2.1
  248. 12.97 s > depends pathway-0.1.0.0-ApYfFviduZq6K4pLVWuemU
  249. 12.97 s > depends pathway-internal-0.1.0.0-1UEYu7yfooTK8S0MyXdeip
  250. 12.97 s > depends strict-0.5.1-6mZjzgNbkwE50Y6JPhFw9J
  251. 12.97 s > depends yaya-0.6.2.3-35aVjaET2ZTKiqggVH8SnZ
  252. 12.97 s > definite xdg-base-directory-internal-0.0.1.0-MMc9FnnqmeKQaQmYP6HzM-doctests
  253. 12.97 s > depends base-4.14.3.0
  254. 12.97 s > depends doctest-0.22.6-67dcUYdlzxgByoqlGIcK6b
  255. 12.97 s > depends xdg-base-directory-internal-0.0.1.0-F4r8Pto1OAmI2wHVX14V5C
  256. 12.97 s > Using Cabal-3.2.1.0 compiled by ghc-8.10
  257. 12.97 s > Using compiler: ghc-8.10.7
  258. 12.97 s > Using install prefix:
  259. 12.97 s > /nix/store/46gkrbwnb03iyf5yg925hfk5nwsscsad-xdg-base-directory-internal-0.0.1.0
  260. 12.97 s > Executables installed in:
  261. 12.97 s > /nix/store/46gkrbwnb03iyf5yg925hfk5nwsscsad-xdg-base-directory-internal-0.0.1.0/bin
  262. 12.97 s > Libraries installed in:
  263. 12.97 s > /nix/store/46gkrbwnb03iyf5yg925hfk5nwsscsad-xdg-base-directory-internal-0.0.1.0/lib/ghc-8.10.7/x86_64-linux-ghc-8.10.7/xdg-base-directory-internal-0.0.1.0-F4r8Pto1OAmI2wHVX14V5C
  264. 12.97 s > Dynamic Libraries installed in:
  265. 12.97 s > /nix/store/46gkrbwnb03iyf5yg925hfk5nwsscsad-xdg-base-directory-internal-0.0.1.0/lib/ghc-8.10.7/x86_64-linux-ghc-8.10.7
  266. 12.97 s > Private executables installed in:
  267. 12.97 s > /nix/store/46gkrbwnb03iyf5yg925hfk5nwsscsad-xdg-base-directory-internal-0.0.1.0/libexec/x86_64-linux-ghc-8.10.7/xdg-base-directory-internal-0.0.1.0
  268. 12.97 s > Data files installed in:
  269. 12.97 s > /nix/store/46gkrbwnb03iyf5yg925hfk5nwsscsad-xdg-base-directory-internal-0.0.1.0/share/x86_64-linux-ghc-8.10.7/xdg-base-directory-internal-0.0.1.0
  270. 12.97 s > Documentation installed in:
  271. 12.97 s > /nix/store/nl287b66dq5zsplk84wfgn9m9jz0ad16-xdg-base-directory-internal-0.0.1.0-doc/share/doc/xdg-base-directory-internal-0.0.1.0
  272. 12.97 s > Configuration files installed in:
  273. 12.97 s > /nix/store/46gkrbwnb03iyf5yg925hfk5nwsscsad-xdg-base-directory-internal-0.0.1.0/etc
  274. 12.97 s > No alex found
  275. 12.97 s > Using ar found on system at:
  276. 12.97 s > /nix/store/hhfm5fkvb1alg1np5a69m2qlcjqhr062-binutils-wrapper-2.44/bin/ar
  277. 12.97 s > No c2hs found
  278. 12.97 s > No cpphs found
  279. 12.97 s > Using doctest version 0.22.6 found on system at:
  280. 12.97 s > /nix/store/fplihjp338lzayp9gsblwh7kghka5037-doctest-0.22.6/bin/doctest
  281. 12.97 s > Using gcc version 14.2.1 given by user at:
  282. 12.97 s > /nix/store/0fsnicvfpf55nkza12cjnad0w84d6ba7-gcc-wrapper-14.2.1.20250322/bin/gcc
  283. 12.97 s > Using ghc version 8.10.7 found on system at:
  284. 12.97 s > /nix/store/0vh9kdrb21vxnn95z2xdal211cfvk0sb-ghc-8.10.7/bin/ghc
  285. 12.97 s > Using ghc-pkg version 8.10.7 found on system at:
  286. 12.97 s > /nix/store/0vh9kdrb21vxnn95z2xdal211cfvk0sb-ghc-8.10.7/bin/ghc-pkg
  287. 12.97 s > No ghcjs found
  288. 12.97 s > No ghcjs-pkg found
  289. 12.97 s > No greencard found
  290. 12.97 s > Using haddock version 2.24.2 found on system at:
  291. 12.97 s > /nix/store/0vh9kdrb21vxnn95z2xdal211cfvk0sb-ghc-8.10.7/bin/haddock
  292. 12.97 s > No happy found
  293. 12.97 s > Using haskell-suite found on system at: haskell-suite-dummy-location
  294. 12.97 s > Using haskell-suite-pkg found on system at: haskell-suite-pkg-dummy-location
  295. 12.97 s > No hmake found
  296. 12.97 s > Using hpc version 0.68 found on system at:
  297. 12.97 s > /nix/store/0vh9kdrb21vxnn95z2xdal211cfvk0sb-ghc-8.10.7/bin/hpc
  298. 12.97 s > Using hsc2hs version 0.68.7 found on system at:
  299. 12.97 s > /nix/store/0vh9kdrb21vxnn95z2xdal211cfvk0sb-ghc-8.10.7/bin/hsc2hs
  300. 12.97 s > Using hscolour version 1.25 found on system at:
  301. 12.97 s > /nix/store/dkxv7l2h9aks2fb1xmvar5xy9r7pyqby-hscolour-1.25/bin/HsColour
  302. 12.97 s > No jhc found
  303. 12.97 s > Using ld found on system at:
  304. 12.97 s > /nix/store/hhfm5fkvb1alg1np5a69m2qlcjqhr062-binutils-wrapper-2.44/bin/ld.gold
  305. 12.97 s > No pkg-config found
  306. 12.97 s > Using runghc version 8.10.7 found on system at:
  307. 12.97 s > /nix/store/0vh9kdrb21vxnn95z2xdal211cfvk0sb-ghc-8.10.7/bin/runghc
  308. 12.97 s > Using strip version 2.44 found on system at:
  309. 12.97 s > /nix/store/0fsnicvfpf55nkza12cjnad0w84d6ba7-gcc-wrapper-14.2.1.20250322/bin/strip
  310. 12.97 s > Using tar found on system at:
  311. 12.97 s > /nix/store/wrxvqj822kz8746608lgns7h8mkpn79f-gnutar-1.35/bin/tar
  312. 12.97 s > No uhc found
  313. 12.97 s > Running phase: buildPhase
  314. 12.97 s > Preprocessing library for xdg-base-directory-internal-0.0.1.0..
  315. 12.97 s > Building library for xdg-base-directory-internal-0.0.1.0..
  316. 12.97 s > [1 of 2] Compiling XDG.BaseDirectory.Internal.System ( src/XDG/BaseDirectory/Internal/System.hs, dist/build/XDG/BaseDirectory/Internal/System.o, dist/build/XDG/BaseDirectory/Internal/System.dyn_o )
  317. 12.97 s >
  318. 12.97 s > <no location info>: error: [-Wsafe, -Werror=safe]
  319. 12.97 s > ‘XDG.BaseDirectory.Internal.System’ has been inferred as safe!
  320. 12.97 s >
  321. 12.97 s > <no location info>: error: [-Wunused-packages, -Werror=unused-packages]
  322. 12.97 s > The following packages were specified via -package or -package-id flags,
  323. 12.97 s > but were not needed for compilation:
  324. 12.97 s > - yaya-0.6.2.3
  325. 12.97 s > - strict-0.5.1
  326. 12.97 s > - pathway-internal-0.1.0.0
  327. 12.97 s > - pathway-0.1.0.0
  328. 12.97 s >
  329. 12.97 s For full logs, run:
  330. 12.97 s nix log /nix/store/jsplhgywrncpdlrzdbq0h19b1rvhbi4n-xdg-base-directory-internal-0.0.1.0.drv
  331. 13.13 s Build failed.