build checks.x86_64-linux.gammaloop-check

Reproduce this run
Original Run
  1. 0.16 s $ /nix/store/9ypz3flqsrl5xl495mm8h645gadjsxi1-coreutils-9.11/bin/timeout --kill-after=15s 7200s /nix/store/23zk8sgzamrbmj1fday15szf7f2279s8-nix-2.34.7/bin/nix --extra-experimental-features nix-command --extra-experimental-features flakes --log-format internal-json build --no-link --print-out-paths git+https://github.com/alphal00p/gammaloop?ref=advanced_sampling&rev=06d470409cd34d8d57afa11b04a3fb208ca20890&shallow=1#checks.x86_64-linux.gammaloop-check --print-build-logs
  2. 1.00 s error (ignored): SQLite database '/var/cache/nix-ci-worker/eval-cache-v6/94fa1d4e764635858a8a977ddbe09d438888f0e645346bf600576055740a2a7d.sqlite' is busy
  3. 5.15 s
  4. 6.48 s Building /nix/store/i729pk8pca0mvg4wgc9cqnnlslm5qsi9-gammaloop-workspace-check-0.1.0.drv
  5. 6.66 s [gammaloop-workspace-check] Phase: unpackPhase
  6. 6.68 s [gammaloop-workspace-check] unpacking source archive /nix/store/qqslq36f7201lf1f2zyjcqsf7w9pg5dy-source
  7. 6.94 s [gammaloop-workspace-check] source root is source
  8. 7.01 s [gammaloop-workspace-check] Phase: patchPhase
  9. 7.02 s [gammaloop-workspace-check] Executing configureCargoCommonVars
  10. 7.04 s [gammaloop-workspace-check] decompressing cargo artifacts from /nix/store/50vpxlcgfxf2d57i27v3d10zjwxxbm2r-gammaloop-workspace-deps-deps-0.1.0/target.tar.zst to target
  11. 10.85 s [gammaloop-workspace-check] Phase: updateAutotoolsGnuConfigScriptsPhase
  12. 10.90 s [gammaloop-workspace-check] Phase: configurePhase
  13. 10.91 s [gammaloop-workspace-check] will append /build/source/.cargo-home/config.toml with contents of /nix/store/5drf77x6km4ky7gwlrzdx9bbd6fz09g3-vendor-cargo-deps/config.toml
  14. 10.91 s [gammaloop-workspace-check] default configurePhase, nothing to do
  15. 10.92 s [gammaloop-workspace-check] Phase: buildPhase
  16. 10.92 s [gammaloop-workspace-check] +++ command cargo --version
  17. 10.93 s [gammaloop-workspace-check] cargo 1.97.0 (c980f4866 2026-06-30)
  18. 10.98 s [gammaloop-workspace-check] +++ command cargo check --profile ci-optim --locked --workspace --features gammaloop-tracing-filter/clap,gammaloop-tracing-filter/symbolica,idenso/bincode,idenso/reference-cases,linnet/bincode,linnet/drawing,linnet/rkyv,linnet/serde,linnet/symbolica,spenso-macros/shadowing,spenso/shadowing,symbolica/tracing_max_level_info,three-dimensional-reps/display,three-dimensional-reps/eval,three-dimensional-reps/serde --all-targets
  19. 12.10 s [gammaloop-workspace-check] Checking cfg-if v1.0.4
  20. 12.10 s [gammaloop-workspace-check] Checking memchr v2.8.0
  21. 12.11 s [gammaloop-workspace-check] Checking once_cell v1.21.4
  22. 12.12 s [gammaloop-workspace-check] Checking either v1.15.0
  23. 12.14 s [gammaloop-workspace-check] Checking serde_core v1.0.228
  24. 12.14 s [gammaloop-workspace-check] Checking libc v0.2.186
  25. 12.14 s [gammaloop-workspace-check] Checking libm v0.2.16
  26. 12.14 s [gammaloop-workspace-check] Checking itoa v1.0.18
  27. 12.16 s [gammaloop-workspace-check] Checking log v0.4.29
  28. 12.16 s [gammaloop-workspace-check] Checking regex-syntax v0.8.10
  29. 12.17 s [gammaloop-workspace-check] Checking zerocopy v0.8.48
  30. 12.22 s [gammaloop-workspace-check] Checking crossbeam-utils v0.8.21
  31. 12.22 s [gammaloop-workspace-check] Checking equivalent v1.0.2
  32. 12.26 s [gammaloop-workspace-check] Checking zmij v1.0.21
  33. 12.27 s [gammaloop-workspace-check] Checking bytemuck v1.25.0
  34. 12.27 s [gammaloop-workspace-check] Checking lazy_static v1.5.0
  35. 12.27 s [gammaloop-workspace-check] Compiling target-lexicon v0.13.5
  36. 12.44 s [gammaloop-workspace-check] Checking arrayvec v0.7.6
  37. 12.53 s [gammaloop-workspace-check] Checking powerfmt v0.2.0
  38. 12.56 s [gammaloop-workspace-check] Checking num-conv v0.2.1
  39. 12.70 s [gammaloop-workspace-check] Checking num_threads v0.1.7
  40. 12.79 s [gammaloop-workspace-check] Checking pin-project-lite v0.2.17
  41. 12.81 s [gammaloop-workspace-check] Checking itertools v0.14.0
  42. 12.85 s [gammaloop-workspace-check] Checking time-core v0.1.8
  43. 13.03 s [gammaloop-workspace-check] Checking tracing-core v0.1.36
  44. 13.06 s [gammaloop-workspace-check] Checking allocator-api2 v0.2.21
  45. 13.15 s [gammaloop-workspace-check] Checking deranged v0.5.8
  46. 13.29 s [gammaloop-workspace-check] Checking foldhash v0.2.0
  47. 13.31 s [gammaloop-workspace-check] Checking safe_arch v0.7.4
  48. 13.37 s [gammaloop-workspace-check] Checking const-random v0.1.18
  49. 13.40 s [gammaloop-workspace-check] Checking nu-ansi-term v0.50.3
  50. 13.53 s [gammaloop-workspace-check] Checking winnow v1.0.2
  51. 13.60 s [gammaloop-workspace-check] Checking static_assertions v1.1.0
  52. 13.70 s [gammaloop-workspace-check] Checking unty v0.0.4
  53. 13.75 s [gammaloop-workspace-check] Checking safe_arch v1.0.0
  54. 13.76 s [gammaloop-workspace-check] Checking sharded-slab v0.1.7
  55. 14.42 s [gammaloop-workspace-check] Checking crossbeam-epoch v0.9.18
  56. 14.51 s [gammaloop-workspace-check] Checking aho-corasick v1.1.4
  57. 14.88 s [gammaloop-workspace-check] Checking thread_local v1.1.9
  58. 15.00 s [gammaloop-workspace-check] Checking wide v0.7.33
  59. 15.13 s [gammaloop-workspace-check] Checking hashbrown v0.16.1
  60. 15.27 s [gammaloop-workspace-check] Checking tracing v0.1.44
  61. 15.30 s [gammaloop-workspace-check] Checking tracing-log v0.2.0
  62. 15.33 s [gammaloop-workspace-check] Checking az v1.3.0
  63. 15.63 s [gammaloop-workspace-check] Checking crossbeam-deque v0.8.6
  64. 15.82 s [gammaloop-workspace-check] Checking indenter v0.3.4
  65. 15.98 s [gammaloop-workspace-check] Checking toml_writer v1.1.1+spec-1.1.0
  66. 16.07 s [gammaloop-workspace-check] Checking wide v1.3.0
  67. 16.45 s [gammaloop-workspace-check] Checking num-traits v0.2.19
  68. 16.46 s [gammaloop-workspace-check] Compiling phf_shared v0.11.3
  69. 16.48 s [gammaloop-workspace-check] Checking rayon-core v1.13.0
  70. 17.29 s [gammaloop-workspace-check] Checking anyhow v1.0.102
  71. 17.51 s [gammaloop-workspace-check] Checking approx v0.5.1
  72. 17.93 s [gammaloop-workspace-check] Checking num-integer v0.1.46
  73. 17.98 s [gammaloop-workspace-check] Checking dyn-clone v1.0.20
  74. 18.00 s [gammaloop-workspace-check] Checking rawpointer v0.2.1
  75. 18.11 s [gammaloop-workspace-check] Checking alloc-no-stdlib v2.0.4
  76. 18.12 s [gammaloop-workspace-check] Checking utf8parse v0.2.2
  77. 18.23 s [gammaloop-workspace-check] Checking matrixmultiply v0.3.10
  78. 18.25 s [gammaloop-workspace-check] Checking alloc-stdlib v0.2.2
  79. 18.37 s [gammaloop-workspace-check] Checking anstyle-parse v1.0.0
  80. 18.50 s [gammaloop-workspace-check] Checking colorchoice v1.0.5
  81. 18.62 s [gammaloop-workspace-check] Checking anstyle-query v1.1.5
  82. 18.69 s [gammaloop-workspace-check] Checking rayon v1.12.0
  83. 18.82 s [gammaloop-workspace-check] Checking is_terminal_polyfill v1.70.2
  84. 18.90 s [gammaloop-workspace-check] Checking colored v3.1.1
  85. 18.95 s [gammaloop-workspace-check] Checking anstyle v1.0.14
  86. 19.08 s [gammaloop-workspace-check] Compiling pyo3-build-config v0.28.3
  87. 19.19 s [gammaloop-workspace-check] Compiling phf_generator v0.11.3
  88. 19.30 s [gammaloop-workspace-check] Checking anstream v1.0.0
  89. 19.43 s [gammaloop-workspace-check] Checking eyre v0.6.12
  90. 19.43 s [gammaloop-workspace-check] Checking bitflags v1.3.2
  91. 19.49 s [gammaloop-workspace-check] Checking unicode-width v0.2.2
  92. 19.57 s [gammaloop-workspace-check] Checking brotli-decompressor v5.0.0
  93. 19.77 s [gammaloop-workspace-check] Checking spec_math v0.1.6
  94. 20.12 s [gammaloop-workspace-check] Compiling phf_codegen v0.11.3
  95. 20.17 s [gammaloop-workspace-check] Checking inventory v0.3.24
  96. 20.27 s [gammaloop-workspace-check] Checking thiserror v2.0.18
  97. 20.46 s [gammaloop-workspace-check] Compiling getopts v0.2.24
  98. 20.52 s [gammaloop-workspace-check] Checking libloading v0.9.0
  99. 20.61 s [gammaloop-workspace-check] Checking toml_parser v1.1.2+spec-1.1.0
  100. 20.70 s [gammaloop-workspace-check] Checking self_cell v1.2.2
  101. 20.85 s [gammaloop-workspace-check] Checking tinyjson v2.5.1
  102. 21.00 s [gammaloop-workspace-check] Checking append-only-vec v0.1.8
  103. 21.04 s [gammaloop-workspace-check] Checking bytes v1.11.1
  104. 21.26 s [gammaloop-workspace-check] Checking regex-automata v0.4.14
  105. 21.33 s [gammaloop-workspace-check] Checking byteorder v1.5.0
  106. 21.73 s [gammaloop-workspace-check] Compiling unicode_names2_generator v1.3.0
  107. 21.78 s [gammaloop-workspace-check] Checking linux-raw-sys v0.12.1
  108. 21.99 s [gammaloop-workspace-check] Compiling unic-common v0.9.0
  109. 22.20 s [gammaloop-workspace-check] Compiling unic-char-range v0.9.0
  110. 22.38 s [gammaloop-workspace-check] Compiling unic-char-property v0.9.0
  111. 22.74 s [gammaloop-workspace-check] Compiling unic-ucd-version v0.9.0
  112. 22.81 s [gammaloop-workspace-check] Checking serde v1.0.228
  113. 22.87 s [gammaloop-workspace-check] Checking serde_json v1.0.149
  114. 22.89 s [gammaloop-workspace-check] Checking bitflags v2.11.1
  115. 22.96 s [gammaloop-workspace-check] Checking serde_spanned v1.1.1
  116. 23.18 s [gammaloop-workspace-check] Checking toml_datetime v1.1.1+spec-1.1.0
  117. 23.21 s [gammaloop-workspace-check] Checking getrandom v0.3.4
  118. 23.36 s [gammaloop-workspace-check] Checking time v0.3.47
  119. 23.42 s [gammaloop-workspace-check] Checking rand_core v0.9.5
  120. 23.45 s [gammaloop-workspace-check] Checking gmp-mpfr-sys v1.7.1
  121. 23.57 s [gammaloop-workspace-check] Checking wasmtime-jit-icache-coherence v34.0.2
  122. 23.70 s [gammaloop-workspace-check] Checking hugepage-rs v0.1.1
  123. 23.79 s [gammaloop-workspace-check] Checking toml v1.1.2+spec-1.1.0
  124. 23.80 s [gammaloop-workspace-check] Checking region v3.0.2
  125. 24.10 s [gammaloop-workspace-check] Checking brotli v8.0.2
  126. 24.32 s [gammaloop-workspace-check] Compiling is-macro v0.3.7
  127. 24.40 s [gammaloop-workspace-check] Checking rustix v1.1.4
  128. 24.49 s [gammaloop-workspace-check] Compiling rustpython-parser-vendored v0.4.0
  129. 24.75 s [gammaloop-workspace-check] Checking iana-time-zone v0.1.65
  130. 24.89 s [gammaloop-workspace-check] Compiling rustpython-parser v0.4.0
  131. 25.19 s [gammaloop-workspace-check] Compiling phf v0.11.3
  132. 25.29 s [gammaloop-workspace-check] Checking rustc-hash v2.1.2
  133. 25.39 s [gammaloop-workspace-check] Compiling unic-emoji-char v0.9.0
  134. 25.41 s [gammaloop-workspace-check] Compiling unic-ucd-ident v0.9.0
  135. 25.53 s [gammaloop-workspace-check] Compiling lalrpop-util v0.20.2
  136. 25.59 s [gammaloop-workspace-check] Checking smallvec v1.15.1
  137. 25.82 s [gammaloop-workspace-check] Checking num-complex v0.4.6
  138. 25.94 s [gammaloop-workspace-check] Checking tracing-serde v0.2.0
  139. 26.03 s [gammaloop-workspace-check] Checking bincode v2.0.1
  140. 26.06 s [gammaloop-workspace-check] Checking smartstring v1.0.1
  141. 26.18 s [gammaloop-workspace-check] Checking chrono v0.4.44
  142. 26.43 s [gammaloop-workspace-check] Compiling rustc-hash v1.1.0
  143. 26.48 s [gammaloop-workspace-check] Checking rug v1.30.0
  144. 26.59 s [gammaloop-workspace-check] Compiling symbolica v2.2.0 (https://github.com/alphal00p/symbolica?rev=a277a8dadbaae5a8d6605f2f381991a601e1f345#a277a8da)
  145. 26.62 s [gammaloop-workspace-check] Checking unicode-segmentation v1.13.2
  146. 27.06 s [gammaloop-workspace-check] Checking simba v0.9.1
  147. 28.07 s [gammaloop-workspace-check] Checking ndarray v0.17.2
  148. 28.26 s [gammaloop-workspace-check] Checking typenum v1.20.0
  149. 29.01 s [gammaloop-workspace-check] Checking getrandom v0.2.17
  150. 29.22 s [gammaloop-workspace-check] Checking scopeguard v1.2.0
  151. 29.33 s [gammaloop-workspace-check] Checking lock_api v0.4.14
  152. 29.41 s [gammaloop-workspace-check] Checking parking_lot_core v0.9.12
  153. 30.07 s [gammaloop-workspace-check] Checking hashbrown v0.17.0
  154. 30.24 s [gammaloop-workspace-check] Checking unicode-ident v1.0.24
  155. 30.39 s [gammaloop-workspace-check] Checking errno v0.3.14
  156. 30.48 s [gammaloop-workspace-check] Checking clap_lex v1.1.0
  157. 30.58 s [gammaloop-workspace-check] Checking parking_lot v0.12.5
  158. 30.66 s [gammaloop-workspace-check] Checking strsim v0.11.1
  159. 30.92 s [gammaloop-workspace-check] Checking unicase v2.9.0
  160. 31.18 s [gammaloop-workspace-check] Checking signal-hook-registry v1.4.8
  161. 31.26 s [gammaloop-workspace-check] Checking vte v0.14.1
  162. 31.33 s [gammaloop-workspace-check] Checking same-file v1.0.6
  163. 31.73 s [gammaloop-workspace-check] Checking mio v1.2.0
  164. 31.86 s [gammaloop-workspace-check] Checking walkdir v2.5.0
  165. 31.91 s [gammaloop-workspace-check] Checking generic-array v0.14.7
  166. 31.93 s [gammaloop-workspace-check] Checking terminal_size v0.4.4
  167. 32.04 s [gammaloop-workspace-check] Checking signal-hook v0.3.18
  168. 32.16 s [gammaloop-workspace-check] Checking clap_builder v4.6.0
  169. 32.21 s [gammaloop-workspace-check] Checking ciborium-io v0.2.2
  170. 32.35 s [gammaloop-workspace-check] Checking minimal-lexical v0.2.1
  171. 32.81 s [gammaloop-workspace-check] Checking derive_more v2.1.1
  172. 32.92 s [gammaloop-workspace-check] Checking indexmap v2.14.0
  173. 33.03 s [gammaloop-workspace-check] Checking nom v7.1.3
  174. 33.10 s [gammaloop-workspace-check] Checking num-bigint v0.4.6
  175. 34.05 s [gammaloop-workspace-check] Checking signal-hook-mio v0.2.5
  176. 34.12 s [gammaloop-workspace-check] Checking console v0.16.3
  177. 34.52 s [gammaloop-workspace-check] Checking block-buffer v0.10.4
  178. 34.83 s [gammaloop-workspace-check] Checking crypto-common v0.1.7
  179. 35.05 s [gammaloop-workspace-check] Checking digest v0.10.7
  180. 35.64 s [gammaloop-workspace-check] Checking bstr v1.12.1
  181. 35.78 s [gammaloop-workspace-check] Checking cpufeatures v0.2.17
  182. 35.82 s [gammaloop-workspace-check] Checking winnow v0.7.15
  183. 35.86 s [gammaloop-workspace-check] Checking linux-raw-sys v0.4.15
  184. 37.04 s [gammaloop-workspace-check] Checking matchers v0.2.0
  185. 37.20 s [gammaloop-workspace-check] Checking tracing-subscriber v0.3.23
  186. 37.43 s [gammaloop-workspace-check] Checking regex v1.12.3
  187. 37.72 s [gammaloop-workspace-check] Checking ppv-lite86 v0.2.21
  188. 37.75 s [gammaloop-workspace-check] Checking ahash v0.8.12
  189. 37.96 s [gammaloop-workspace-check] Compiling unicode_names2 v1.3.0
  190. 38.15 s [gammaloop-workspace-check] Checking half v2.7.1
  191. 38.35 s [gammaloop-workspace-check] Checking rand_chacha v0.9.0
  192. 38.61 s [gammaloop-workspace-check] Checking ciborium-ll v0.2.2
  193. 38.68 s [gammaloop-workspace-check] Checking rand v0.9.4
  194. 39.12 s [gammaloop-workspace-check] Checking globset v0.4.18
  195. 39.12 s [gammaloop-workspace-check] Checking ciborium v0.2.2
  196. 39.25 s [gammaloop-workspace-check] Checking rustix v0.38.44
  197. 39.83 s [gammaloop-workspace-check] Checking sha2 v0.10.9
  198. 41.13 s [gammaloop-workspace-check] Checking getrandom v0.4.2
  199. 41.33 s [gammaloop-workspace-check] Checking rand_core v0.6.4
  200. 41.46 s [gammaloop-workspace-check] Checking ansitok v0.3.0
  201. 41.49 s [gammaloop-workspace-check] Checking symjit v2.21.0
  202. 41.61 s [gammaloop-workspace-check] Checking fnv v1.0.7
  203. 41.75 s [gammaloop-workspace-check] Checking plotters-backend v0.3.7
  204. 42.05 s [gammaloop-workspace-check] Checking fastrand v2.4.1
  205. 42.15 s [gammaloop-workspace-check] Checking rust-embed-utils v8.11.0
  206. 42.21 s [gammaloop-workspace-check] Checking toml_datetime v0.6.11
  207. 42.27 s [gammaloop-workspace-check] Checking crossterm v0.28.1
  208. 42.72 s [gammaloop-workspace-check] Checking plotters-svg v0.3.7
  209. 42.78 s [gammaloop-workspace-check] Checking serde_spanned v0.6.9
  210. 43.24 s [gammaloop-workspace-check] Checking itertools v0.10.5
  211. 43.27 s [gammaloop-workspace-check] Checking clap v4.6.1
  212. 43.34 s [gammaloop-workspace-check] Checking toml_write v0.1.2
  213. 43.37 s [gammaloop-workspace-check] Checking tap v1.0.1
  214. 43.40 s [gammaloop-workspace-check] Checking tempfile v3.27.0
  215. 43.50 s [gammaloop-workspace-check] Checking cast v0.3.0
  216. 43.55 s [gammaloop-workspace-check] Checking wyz v0.5.1
  217. 43.55 s [gammaloop-workspace-check] Checking plotters v0.3.7
  218. 43.62 s [gammaloop-workspace-check] Checking rand_chacha v0.3.1
  219. 43.66 s [gammaloop-workspace-check] Checking ansi-str v0.9.0
  220. 43.80 s [gammaloop-workspace-check] Checking toml_edit v0.22.27
  221. 43.92 s [gammaloop-workspace-check] Checking radium v0.7.0
  222. 43.99 s [gammaloop-workspace-check] Checking typeid v1.0.3
  223. 44.09 s [gammaloop-workspace-check] Checking similar v2.7.0
  224. 44.21 s [gammaloop-workspace-check] Checking tinytemplate v1.2.1
  225. 44.33 s [gammaloop-workspace-check] Checking is-terminal v0.4.17
  226. 44.50 s [gammaloop-workspace-check] Checking anes v0.1.6
  227. 44.53 s [gammaloop-workspace-check] Checking oorandom v11.1.5
  228. 44.70 s [gammaloop-workspace-check] Checking funty v2.0.0
  229. 45.01 s [gammaloop-workspace-check] Checking bytecount v0.6.9
  230. 45.05 s [gammaloop-workspace-check] Checking rand v0.8.6
  231. 45.23 s [gammaloop-workspace-check] Checking ron v0.12.1
  232. 45.25 s [gammaloop-workspace-check] Checking testing_table v0.3.0
  233. 45.29 s [gammaloop-workspace-check] Checking papergrid v0.17.0
  234. 45.44 s [gammaloop-workspace-check] Checking env_filter v1.0.1
  235. 46.01 s [gammaloop-workspace-check] Checking bitvec v1.0.1
  236. 46.03 s [gammaloop-workspace-check] Checking toml_edit v0.25.11+spec-1.1.0
  237. 46.49 s [gammaloop-workspace-check] Checking uncased v0.9.10
  238. 46.75 s [gammaloop-workspace-check] Checking jiff v0.2.24
  239. 47.11 s [gammaloop-workspace-check] Checking criterion-plot v0.5.0
  240. 47.11 s [gammaloop-workspace-check] Checking ptr_meta v0.1.4
  241. 47.29 s [gammaloop-workspace-check] Checking simdutf8 v0.1.5
  242. 47.33 s [gammaloop-workspace-check] Compiling pyo3-ffi v0.28.3
  243. 47.71 s [gammaloop-workspace-check] Compiling pyo3-macros-backend v0.28.3
  244. 47.81 s [gammaloop-workspace-check] Compiling pyo3 v0.28.3
  245. 48.03 s [gammaloop-workspace-check] Compiling numpy v0.28.0
  246. 48.05 s [gammaloop-workspace-check] Checking xprec v0.2.2
  247. 48.52 s [gammaloop-workspace-check] Checking ucd-trie v0.1.7
  248. 48.56 s [gammaloop-workspace-check] Checking criterion v0.5.1
  249. 48.59 s [gammaloop-workspace-check] Checking bytecheck v0.6.12
  250. 48.71 s [gammaloop-workspace-check] Checking ahash v0.7.8
  251. 48.77 s [gammaloop-workspace-check] Checking pest v2.8.6
  252. 49.20 s [gammaloop-workspace-check] Checking hashbrown v0.12.3
  253. 49.29 s [gammaloop-workspace-check] Checking approx v0.4.0
  254. 49.45 s [gammaloop-workspace-check] Checking seahash v4.1.0
  255. 49.54 s [gammaloop-workspace-check] Checking insta v1.47.2
  256. 49.77 s [gammaloop-workspace-check] Checking cgmath v0.18.0
  257. 49.88 s [gammaloop-workspace-check] Checking num-rational v0.4.2
  258. 49.99 s [gammaloop-workspace-check] Checking rend v0.4.2
  259. 50.47 s [gammaloop-workspace-check] Checking toml v0.8.23
  260. 50.52 s [gammaloop-workspace-check] Checking tabled v0.20.0
  261. 50.53 s [gammaloop-workspace-check] Checking num-iter v0.1.45
  262. 50.64 s [gammaloop-workspace-check] Checking ref-ops v0.2.5
  263. 50.82 s [gammaloop-workspace-check] Checking num v0.4.3
  264. 50.89 s [gammaloop-workspace-check] Checking rand_xoshiro v0.6.0
  265. 50.97 s [gammaloop-workspace-check] Checking features v0.10.0
  266. 51.08 s [gammaloop-workspace-check] Checking gat-lending-iterator v0.1.8
  267. 51.67 s [gammaloop-workspace-check] Checking constcat v0.5.1
  268. 51.76 s [gammaloop-workspace-check] Checking colored v2.2.0
  269. 51.91 s [gammaloop-workspace-check] Checking arrayref v0.3.9
  270. 52.00 s [gammaloop-workspace-check] Checking constant_time_eq v0.4.2
  271. 52.23 s [gammaloop-workspace-check] Checking figment v0.10.19
  272. 52.30 s [gammaloop-workspace-check] Checking cpufeatures v0.3.0
  273. 52.31 s [gammaloop-workspace-check] Checking base64 v0.22.1
  274. 52.46 s [gammaloop-workspace-check] Checking blake3 v1.8.5
  275. 53.11 s [gammaloop-workspace-check] Checking siphasher v1.0.2
  276. 53.84 s [gammaloop-workspace-check] Checking joinery v2.1.0
  277. 53.93 s [gammaloop-workspace-check] Checking phf_shared v0.13.1
  278. 53.97 s [gammaloop-workspace-check] Checking subprocess v0.2.15
  279. 54.09 s [gammaloop-workspace-check] Checking rust_lisp v0.18.0
  280. 54.26 s [gammaloop-workspace-check] Checking dot-parser v0.5.1
  281. 54.31 s [gammaloop-workspace-check] Checking titlecase v2.2.1
  282. 54.48 s [gammaloop-workspace-check] Compiling vakint v0.1.2 (/build/source/crates/vakint)
  283. 54.86 s [gammaloop-workspace-check] Checking phf v0.13.1
  284. 54.87 s [gammaloop-workspace-check] Checking version-compare v0.2.1
  285. 55.02 s [gammaloop-workspace-check] Checking xpct v0.5.1
  286. 55.05 s [gammaloop-workspace-check] Checking ryu v1.0.23
  287. 55.09 s [gammaloop-workspace-check] Checking castaway v0.2.4
  288. 55.13 s [gammaloop-workspace-check] Checking toml_datetime v0.7.5+spec-1.1.0
  289. 55.21 s [gammaloop-workspace-check] Checking strum v0.27.2
  290. 55.26 s [gammaloop-workspace-check] Checking compact_str v0.9.0
  291. 55.38 s [gammaloop-workspace-check] Checking unicode-truncate v2.0.1
  292. 55.45 s [gammaloop-workspace-check] Checking toml v0.9.12+spec-1.1.0
  293. 55.64 s [gammaloop-workspace-check] Checking kasuari v0.4.12
  294. 56.14 s [gammaloop-workspace-check] Checking lru v0.16.4
  295. 56.34 s [gammaloop-workspace-check] Checking vte v0.15.0
  296. 56.43 s [gammaloop-workspace-check] Checking portable-atomic v1.13.1
  297. 56.46 s [gammaloop-workspace-check] Checking unit-prefix v0.5.2
  298. 56.48 s [gammaloop-workspace-check] Checking rand_distr v0.4.3
  299. 56.48 s [gammaloop-workspace-check] Checking simba v0.6.0
  300. 56.58 s [gammaloop-workspace-check] Checking string-template-plus v0.4.3
  301. 56.78 s [gammaloop-workspace-check] Checking vt100 v0.16.2
  302. 56.78 s [gammaloop-workspace-check] Checking line-clipping v0.3.7
  303. 56.82 s [gammaloop-workspace-check] Compiling three-dimensional-reps v0.1.0 (/build/source/crates/three-dimensional-reps)
  304. 57.21 s [gammaloop-workspace-check] Checking adler2 v2.0.1
  305. 57.39 s [gammaloop-workspace-check] Checking ratatui-core v0.1.0
  306. 57.61 s [gammaloop-workspace-check] Checking gimli v0.32.3
  307. 57.62 s [gammaloop-workspace-check] Checking miniz_oxide v0.8.9
  308. 57.96 s [gammaloop-workspace-check] Checking thiserror v1.0.69
  309. 58.21 s [gammaloop-workspace-check] Checking derive_builder v0.11.2
  310. 58.28 s [gammaloop-workspace-check] Checking object v0.37.3
  311. 58.47 s [gammaloop-workspace-check] Checking owo-colors v4.3.0
  312. 58.50 s [gammaloop-workspace-check] Checking crossterm v0.29.0
  313. 58.71 s [gammaloop-workspace-check] Checking tracing-error v0.2.1
  314. 58.82 s [gammaloop-workspace-check] Checking indicatif v0.18.4
  315. 58.94 s [gammaloop-workspace-check] Compiling rustpython-parser-core v0.4.0
  316. 59.08 s [gammaloop-workspace-check] Checking typed-index-collections v3.5.0
  317. 59.72 s [gammaloop-workspace-check] Compiling rustpython-ast v0.4.0
  318. 60.12 s [gammaloop-workspace-check] Checking serde-big-array v0.5.1
  319. 60.23 s [gammaloop-workspace-check] Checking rkyv v0.7.46
  320. 60.26 s [gammaloop-workspace-check] Checking amd v0.2.2
  321. 60.48 s [gammaloop-workspace-check] Checking itertools v0.11.0
  322. 60.62 s [gammaloop-workspace-check] Compiling gammaloop-tracing-filter-macros v0.1.0 (/build/source/crates/gammaloop-tracing-filter-macros)
  323. 60.64 s [gammaloop-workspace-check] Checking option-ext v0.2.0
  324. 60.82 s [gammaloop-workspace-check] Checking rustc-demangle v0.1.27
  325. 60.87 s [gammaloop-workspace-check] Checking dirs-sys v0.5.0
  326. 61.24 s [gammaloop-workspace-check] Checking ref-cast v1.0.25
  327. 61.36 s [gammaloop-workspace-check] Checking nix v0.31.2
  328. 61.42 s [gammaloop-workspace-check] Checking brotli-decompressor v4.0.3
  329. 61.88 s [gammaloop-workspace-check] Checking env_logger v0.11.10
  330. 61.92 s [gammaloop-workspace-check] Checking ratatui-widgets v0.3.0
  331. 62.11 s [gammaloop-workspace-check] Checking integer-sqrt v0.1.5
  332. 62.18 s [gammaloop-workspace-check] Checking ratatui-crossterm v0.1.0
  333. 62.36 s [gammaloop-workspace-check] Checking crossbeam-channel v0.5.15
  334. 62.43 s [gammaloop-workspace-check] Checking itertools v0.12.1
  335. 62.61 s [gammaloop-workspace-check] Checking symlink v0.1.0
  336. 62.73 s [gammaloop-workspace-check] Compiling gammalooprs v0.3.4 (/build/source/crates/gammalooprs)
  337. 63.13 s [gammaloop-workspace-check] Checking unsafe-libyaml v0.2.11
  338. 63.73 s [gammaloop-workspace-check] Checking include_dir v0.7.4
  339. 63.88 s [gammaloop-workspace-check] Checking color-spantrace v0.3.0
  340. 64.00 s [gammaloop-workspace-check] Checking pathfinding v4.15.0
  341. 64.07 s [gammaloop-workspace-check] Checking ctrlc v3.5.2
  342. 64.28 s [gammaloop-workspace-check] Checking tracing-appender v0.2.5
  343. 64.45 s [gammaloop-workspace-check] Checking schemars v1.2.1
  344. 64.69 s [gammaloop-workspace-check] Checking slotmap v1.1.1
  345. 65.39 s [gammaloop-workspace-check] Checking dirs v6.0.0
  346. 65.48 s [gammaloop-workspace-check] Checking brotli v7.0.0
  347. 65.56 s [gammaloop-workspace-check] Checking ratatui-macros v0.7.0
  348. 65.58 s [gammaloop-workspace-check] Checking addr2line v0.25.1
  349. 65.66 s [gammaloop-workspace-check] Checking tracing-indicatif v0.3.14
  350. 65.69 s [gammaloop-workspace-check] Checking ratatui v0.30.0
  351. 66.14 s [gammaloop-workspace-check] Checking json5 v0.4.1
  352. 66.19 s [gammaloop-workspace-check] Checking vectorize v0.2.0
  353. 66.41 s [gammaloop-workspace-check] Checking ringbuffer v0.16.0
  354. 66.58 s [gammaloop-workspace-check] Checking base62 v2.2.4
  355. 67.11 s [gammaloop-workspace-check] Checking clarabel v0.11.1
  356. 67.19 s [gammaloop-workspace-check] Checking rust-embed v8.11.0
  357. 67.23 s [gammaloop-workspace-check] Checking clap_complete v4.6.3
  358. 67.35 s [gammaloop-workspace-check] Checking fd-lock v4.0.4
  359. 67.52 s [gammaloop-workspace-check] Checking serde_yaml v0.9.34+deprecated
  360. 67.58 s [gammaloop-workspace-check] Checking strip-ansi-escapes v0.2.1
  361. 67.66 s [gammaloop-workspace-check] Compiling gammaloop-api v0.1.0 (/build/source/crates/gammaloop-api)
  362. 67.75 s [gammaloop-workspace-check] Checking itertools v0.13.0
  363. 67.92 s [gammaloop-workspace-check] Checking strum v0.26.3
  364. 67.96 s [gammaloop-workspace-check] Checking sysinfo v0.33.1
  365. 68.17 s [gammaloop-workspace-check] Checking shlex v1.3.0
  366. 68.47 s [gammaloop-workspace-check] Checking slab v0.4.12
  367. 68.65 s [gammaloop-workspace-check] Checking futures-core v0.3.32
  368. 68.91 s [gammaloop-workspace-check] Checking futures-task v0.3.32
  369. 69.01 s [gammaloop-workspace-check] Checking sdd v3.0.10
  370. 69.12 s [gammaloop-workspace-check] Compiling gammaloop-integration-tests v0.1.0 (/build/source/tests)
  371. 69.14 s [gammaloop-workspace-check] Checking futures-util v0.3.32
  372. 69.23 s [gammaloop-workspace-check] Checking clap_complete_nushell v4.6.0
  373. 69.75 s [gammaloop-workspace-check] Compiling test-log-core v0.2.20
  374. 69.88 s [gammaloop-workspace-check] Checking scc v2.4.0
  375. 71.13 s [gammaloop-workspace-check] Compiling rustc_version v0.4.1
  376. 71.72 s [gammaloop-workspace-check] Checking reedline v0.42.0
  377. 72.03 s [gammaloop-workspace-check] Checking which v8.0.2
  378. 72.33 s [gammaloop-workspace-check] Checking bincode v1.3.3
  379. 72.58 s [gammaloop-workspace-check] Checking nalgebra v0.29.0
  380. 73.90 s [gammaloop-workspace-check] Compiling numerica v2.2.0 (https://github.com/alphal00p/symbolica?rev=a277a8dadbaae5a8d6605f2f381991a601e1f345#a277a8da)
  381. 74.00 s [gammaloop-workspace-check] Compiling gungraun-macros v0.8.0
  382. 74.06 s [gammaloop-workspace-check] Compiling gungraun-runner v0.18.2
  383. 74.23 s [gammaloop-workspace-check] Checking proc-macro2 v1.0.106
  384. 75.52 s [gammaloop-workspace-check] Checking quote v1.0.45
  385. 75.81 s [gammaloop-workspace-check] Checking maplit v1.0.2
  386. 75.96 s [gammaloop-workspace-check] Checking base64 v0.21.7
  387. 76.32 s [gammaloop-workspace-check] Checking backtrace v0.3.76
  388. 76.35 s [gammaloop-workspace-check] Compiling test-log-macros v0.2.20
  389. 76.45 s [gammaloop-workspace-check] Compiling iai-callgrind-runner v0.14.2
  390. 76.89 s [gammaloop-workspace-check] Checking ron v0.8.1
  391. 77.08 s [gammaloop-workspace-check] Checking kurbo v0.13.0
  392. 77.53 s [gammaloop-workspace-check] Checking color-eyre v0.6.5
  393. 77.64 s [gammaloop-workspace-check] Checking wait-timeout v0.2.1
  394. 77.82 s [gammaloop-workspace-check] Checking quick-error v1.2.3
  395. 77.94 s [gammaloop-workspace-check] Compiling iai-callgrind v0.14.2
  396. 78.28 s [gammaloop-workspace-check] Checking bit-vec v0.8.0
  397. 78.35 s [gammaloop-workspace-check] Checking futures-executor v0.3.32
  398. 78.46 s [gammaloop-workspace-check] Checking rusty-fork v0.3.1
  399. 78.62 s [gammaloop-workspace-check] Checking syn v2.0.117
  400. 78.64 s [gammaloop-workspace-check] Checking serial_test v3.4.0
  401. 78.75 s [gammaloop-workspace-check] Compiling iai-callgrind-macros v0.5.1
  402. 78.90 s [gammaloop-workspace-check] Checking bit-set v0.8.0
  403. 78.98 s [gammaloop-workspace-check] Checking rand_xorshift v0.4.0
  404. 79.12 s [gammaloop-workspace-check] Checking console v0.15.11
  405. 79.23 s [gammaloop-workspace-check] Checking pathdiff v0.2.3
  406. 79.34 s [gammaloop-workspace-check] Checking unarray v0.1.4
  407. 79.43 s [gammaloop-workspace-check] Checking proptest v1.11.0
  408. 80.09 s [gammaloop-workspace-check] Checking kurvst v0.1.0 (/build/source/crates/kurvst)
  409. 80.49 s [gammaloop-workspace-check] Checking similar-asserts v1.7.0
  410. 80.90 s [gammaloop-workspace-check] Checking clinnet v0.1.8 (/build/source/crates/clinnet)
  411. 84.70 s [gammaloop-workspace-check] Checking test-log v0.2.20
  412. 92.53 s [gammaloop-workspace-check] Compiling graphica v2.1.0 (https://github.com/alphal00p/symbolica?rev=a277a8dadbaae5a8d6605f2f381991a601e1f345#a277a8da)
  413. 101.56 s [gammaloop-workspace-check] Checking statrs v0.16.1
  414. 105.60 s [gammaloop-workspace-check] Checking gungraun v0.18.2
  415. 106.97 s [gammaloop-workspace-check] Checking momtrop v0.3.0
  416. 107.48 s [gammaloop-workspace-check] Compiling pyo3-stub-gen-derive v0.17.2
  417. 113.86 s [gammaloop-workspace-check] Compiling pyo3-macros v0.28.3
  418. 133.65 s [gammaloop-workspace-check] Checking pyo3-stub-gen v0.17.2
  419. 150.88 s [gammaloop-workspace-check] Checking symbolica-utils v0.1.0 (/build/source/crates/symbolica-utils)
  420. 150.88 s [gammaloop-workspace-check] Checking spenso-macros v0.3.2 (/build/source/crates/spenso-macros)
  421. 430.95 s [gammaloop-workspace-check] Compiling gammaloop-workspace-hack v0.1.0 (/build/source/crates/gammaloop-workspace-hack)
  422. 431.45 s [gammaloop-workspace-check] Checking linnet v0.17.0 (/build/source/crates/linnet)
  423. 436.75 s [gammaloop-workspace-check] Checking spenso v0.6.0 (/build/source/crates/spenso)
  424. 437.38 s [gammaloop-workspace-check] Checking linnet-py v0.1.0 (/build/source/crates/linnet-py)
  425. 437.38 s [gammaloop-workspace-check] Checking linnest v0.1.0 (/build/source/crates/linnest)
  426. 445.89 s [gammaloop-workspace-check] Checking idenso v0.3.0 (/build/source/crates/idenso)
  427. 445.89 s [gammaloop-workspace-check] Checking gammaloop-tracing-filter v0.1.0 (/build/source/crates/gammaloop-tracing-filter)
  428. 449.02 s [gammaloop-workspace-check] Checking spenso-hep-lib v0.1.7 (/build/source/crates/spenso-hep-lib)
  429. 449.44 s [gammaloop-workspace-check] Checking spynso3 v0.1.2 (/build/source/crates/spynso3)
  430. 498.66 s [gammaloop-workspace-check] error[E0560]: struct `CutInfo` has no field named `lmb_channel_id`
  431. 498.66 s [gammaloop-workspace-check] --> tests/tests/test_differential.rs:86:13
  432. 498.66 s [gammaloop-workspace-check] |
  433. 498.67 s [gammaloop-workspace-check] 86 | lmb_channel_id: None,
  434. 498.67 s [gammaloop-workspace-check] | ^^^^^^^^^^^^^^ `CutInfo` does not have this field
  435. 498.67 s [gammaloop-workspace-check] |
  436. 498.67 s [gammaloop-workspace-check] = note: available fields are: `sampling_channel_id`, `sampling_channel_edge_ids`
  437. 498.67 s [gammaloop-workspace-check]
  438. 498.67 s [gammaloop-workspace-check] error[E0560]: struct `CutInfo` has no field named `lmb_channel_edge_ids`
  439. 498.67 s [gammaloop-workspace-check] --> tests/tests/test_differential.rs:87:13
  440. 498.67 s [gammaloop-workspace-check] |
  441. 498.67 s [gammaloop-workspace-check] 87 | lmb_channel_edge_ids: None,
  442. 498.67 s [gammaloop-workspace-check] | ^^^^^^^^^^^^^^^^^^^^ `CutInfo` does not have this field
  443. 498.67 s [gammaloop-workspace-check] |
  444. 498.67 s [gammaloop-workspace-check] = note: available fields are: `sampling_channel_id`, `sampling_channel_edge_ids`
  445. 498.67 s [gammaloop-workspace-check]
  446. 498.68 s [gammaloop-workspace-check] error[E0063]: missing field `reference_moments` in initializer of `GraphEvaluationResult<_>`
  447. 498.68 s [gammaloop-workspace-check] --> tests/tests/test_differential.rs:532:19
  448. 498.68 s [gammaloop-workspace-check] |
  449. 498.68 s [gammaloop-workspace-check] 532 | let mut lhs = GraphEvaluationResult {
  450. 498.68 s [gammaloop-workspace-check] | ^^^^^^^^^^^^^^^^^^^^^ missing `reference_moments`
  451. 498.68 s [gammaloop-workspace-check]
  452. 498.68 s [gammaloop-workspace-check] error[E0063]: missing field `reference_moments` in initializer of `GraphEvaluationResult<_>`
  453. 498.68 s [gammaloop-workspace-check] --> tests/tests/test_differential.rs:539:15
  454. 498.68 s [gammaloop-workspace-check] |
  455. 498.68 s [gammaloop-workspace-check] 539 | let rhs = GraphEvaluationResult {
  456. 498.68 s [gammaloop-workspace-check] | ^^^^^^^^^^^^^^^^^^^^^ missing `reference_moments`
  457. 498.68 s [gammaloop-workspace-check]
  458. 498.69 s [gammaloop-workspace-check] error[E0609]: no field `lmb_channel_edge_ids` on type `CutInfo`
  459. 498.69 s [gammaloop-workspace-check] --> tests/tests/test_evaluation_api.rs:311:10
  460. 498.69 s [gammaloop-workspace-check] |
  461. 498.69 s [gammaloop-workspace-check] 311 | .lmb_channel_edge_ids
  462. 498.69 s [gammaloop-workspace-check] | ^^^^^^^^^^^^^^^^^^^^ unknown field
  463. 498.69 s [gammaloop-workspace-check] |
  464. 498.69 s [gammaloop-workspace-check] = note: available fields are: `particle_pdgs`, `cut_id`, `graph_id`, `graph_group_id`, `orientation_id` ... and 2 others
  465. 498.69 s [gammaloop-workspace-check]
  466. 498.72 s [gammaloop-workspace-check] error[E0609]: no field `lmb_channel_edge_ids` on type `CutInfo`
  467. 498.72 s [gammaloop-workspace-check] --> tests/tests/test_evaluation_api.rs:591:26
  468. 498.72 s [gammaloop-workspace-check] |
  469. 498.72 s [gammaloop-workspace-check] 591 | .lmb_channel_edge_ids
  470. 498.72 s [gammaloop-workspace-check] | ^^^^^^^^^^^^^^^^^^^^ unknown field
  471. 498.72 s [gammaloop-workspace-check] |
  472. 498.72 s [gammaloop-workspace-check] = note: available fields are: `particle_pdgs`, `cut_id`, `graph_id`, `graph_group_id`, `orientation_id` ... and 2 others
  473. 498.72 s [gammaloop-workspace-check]
  474. 498.77 s [gammaloop-workspace-check] Some errors have detailed explanations: E0063, E0560.
  475. 498.77 s [gammaloop-workspace-check] For more information about an error, try `rustc --explain E0063`.
  476. 498.78 s [gammaloop-workspace-check] error: could not compile `gammaloop-integration-tests` (test "test_differential") due to 4 previous errors
  477. 498.78 s [gammaloop-workspace-check] warning: build failed, waiting for other jobs to finish...
  478. 498.78 s [gammaloop-workspace-check] error[E0609]: no field `lmb_channel_edge_ids` on type `CutInfo`
  479. 498.78 s [gammaloop-workspace-check] --> tests/tests/test_evaluation_api.rs:1177:18
  480. 498.78 s [gammaloop-workspace-check] |
  481. 498.78 s [gammaloop-workspace-check] 1177 | .lmb_channel_edge_ids
  482. 498.78 s [gammaloop-workspace-check] | ^^^^^^^^^^^^^^^^^^^^ unknown field
  483. 498.78 s [gammaloop-workspace-check] |
  484. 498.78 s [gammaloop-workspace-check] = note: available fields are: `particle_pdgs`, `cut_id`, `graph_id`, `graph_group_id`, `orientation_id` ... and 2 others
  485. 498.78 s [gammaloop-workspace-check]
  486. 498.93 s [gammaloop-workspace-check] error[E0609]: no field `lmb_channel_edge_ids` on type `CutInfo`
  487. 498.93 s [gammaloop-workspace-check] --> tests/tests/test_evaluation_api.rs:1222:22
  488. 498.93 s [gammaloop-workspace-check] |
  489. 498.93 s [gammaloop-workspace-check] 1222 | .lmb_channel_edge_ids
  490. 498.93 s [gammaloop-workspace-check] | ^^^^^^^^^^^^^^^^^^^^ unknown field
  491. 498.93 s [gammaloop-workspace-check] |
  492. 498.93 s [gammaloop-workspace-check] = note: available fields are: `particle_pdgs`, `cut_id`, `graph_id`, `graph_group_id`, `orientation_id` ... and 2 others
  493. 498.93 s [gammaloop-workspace-check]
  494. 498.93 s [gammaloop-workspace-check] error[E0609]: no field `lmb_channel_edge_ids` on type `CutInfo`
  495. 498.93 s [gammaloop-workspace-check] --> tests/tests/test_evaluation_api.rs:1281:14
  496. 498.93 s [gammaloop-workspace-check] |
  497. 498.93 s [gammaloop-workspace-check] 1281 | .lmb_channel_edge_ids
  498. 498.93 s [gammaloop-workspace-check] | ^^^^^^^^^^^^^^^^^^^^ unknown field
  499. 498.93 s [gammaloop-workspace-check] |
  500. 498.93 s [gammaloop-workspace-check] = note: available fields are: `particle_pdgs`, `cut_id`, `graph_id`, `graph_group_id`, `orientation_id` ... and 2 others
  501. 498.93 s [gammaloop-workspace-check]
  502. 499.00 s [gammaloop-workspace-check] error[E0609]: no field `lmb_channel_edge_ids` on type `CutInfo`
  503. 499.00 s [gammaloop-workspace-check] --> tests/tests/test_evaluation_api.rs:1428:18
  504. 499.00 s [gammaloop-workspace-check] |
  505. 499.00 s [gammaloop-workspace-check] 1428 | .lmb_channel_edge_ids
  506. 499.00 s [gammaloop-workspace-check] | ^^^^^^^^^^^^^^^^^^^^ unknown field
  507. 499.00 s [gammaloop-workspace-check] |
  508. 499.00 s [gammaloop-workspace-check] = note: available fields are: `particle_pdgs`, `cut_id`, `graph_id`, `graph_group_id`, `orientation_id` ... and 2 others
  509. 499.00 s [gammaloop-workspace-check]
  510. 499.16 s [gammaloop-workspace-check] For more information about this error, try `rustc --explain E0609`.
  511. 499.18 s [gammaloop-workspace-check] error: could not compile `gammaloop-integration-tests` (test "test_evaluation_api") due to 6 previous errors
  512. 499.92 s [gammaloop-workspace-check] error[E0609]: no field `lmb_channel_id` on type `CutInfo`
  513. 499.92 s [gammaloop-workspace-check] --> tests/tests/test_runs/utils.rs:568:36
  514. 499.92 s [gammaloop-workspace-check] |
  515. 499.92 s [gammaloop-workspace-check] 568 | event.cut_info.lmb_channel_id,
  516. 499.92 s [gammaloop-workspace-check] | ^^^^^^^^^^^^^^ unknown field
  517. 499.92 s [gammaloop-workspace-check] |
  518. 499.92 s [gammaloop-workspace-check] = note: available fields are: `particle_pdgs`, `cut_id`, `graph_id`, `graph_group_id`, `orientation_id` ... and 2 others
  519. 499.92 s [gammaloop-workspace-check]
  520. 499.92 s [gammaloop-workspace-check] error[E0609]: no field `lmb_channel_id` on type `CutInfo`
  521. 499.92 s [gammaloop-workspace-check] --> tests/tests/test_runs/utils.rs:580:36
  522. 499.92 s [gammaloop-workspace-check] |
  523. 499.92 s [gammaloop-workspace-check] 580 | event.cut_info.lmb_channel_id,
  524. 499.92 s [gammaloop-workspace-check] | ^^^^^^^^^^^^^^ unknown field
  525. 499.92 s [gammaloop-workspace-check] |
  526. 499.92 s [gammaloop-workspace-check] = note: available fields are: `particle_pdgs`, `cut_id`, `graph_id`, `graph_group_id`, `orientation_id` ... and 2 others
  527. 499.92 s [gammaloop-workspace-check]
  528. 500.55 s [gammaloop-workspace-check] error: could not compile `gammaloop-integration-tests` (test "test_runs") due to 2 previous errors
  529. 501.33 s Progress: 0 of 1 built (1 failed)
  530. 501.33 s Failed to build gammaloop-workspace-check after 8m14s
  531. 501.34 s Cannot build '/nix/store/i729pk8pca0mvg4wgc9cqnnlslm5qsi9-gammaloop-workspace-check-0.1.0.drv'.
  532. 501.34 s Reason: builder failed with exit code 101.
  533. 501.34 s Output paths:
  534. 501.34 s /nix/store/hvg6j34250fq6p1xcmg7sqwh8dbfvya8-gammaloop-workspace-check-0.1.0
  535. 501.34 s Last 524 log lines:
  536. 501.34 s > Running phase: unpackPhase
  537. 501.34 s > unpacking source archive /nix/store/qqslq36f7201lf1f2zyjcqsf7w9pg5dy-source
  538. 501.34 s > source root is source
  539. 501.34 s > Running phase: patchPhase
  540. 501.34 s > Executing configureCargoCommonVars
  541. 501.34 s > decompressing cargo artifacts from /nix/store/50vpxlcgfxf2d57i27v3d10zjwxxbm2r-gammaloop-workspace-deps-deps-0.1.0/target.tar.zst to target
  542. 501.34 s > Running phase: updateAutotoolsGnuConfigScriptsPhase
  543. 501.34 s > Running phase: configurePhase
  544. 501.34 s > will append /build/source/.cargo-home/config.toml with contents of /nix/store/5drf77x6km4ky7gwlrzdx9bbd6fz09g3-vendor-cargo-deps/config.toml
  545. 501.34 s > default configurePhase, nothing to do
  546. 501.34 s > Running phase: buildPhase
  547. 501.34 s > +++ command cargo --version
  548. 501.34 s > cargo 1.97.0 (c980f4866 2026-06-30)
  549. 501.34 s > +++ command cargo check --profile ci-optim --locked --workspace --features gammaloop-tracing-filter/clap,gammaloop-tracing-filter/symbolica,idenso/bincode,idenso/reference-cases,linnet/bincode,linnet/drawing,linnet/rkyv,linnet/serde,linnet/symbolica,spenso-macros/shadowing,spenso/shadowing,symbolica/tracing_max_level_info,three-dimensional-reps/display,three-dimensional-reps/eval,three-dimensional-reps/serde --all-targets
  550. 501.34 s > Checking cfg-if v1.0.4
  551. 501.34 s > Checking memchr v2.8.0
  552. 501.34 s > Checking once_cell v1.21.4
  553. 501.34 s > Checking either v1.15.0
  554. 501.34 s > Checking serde_core v1.0.228
  555. 501.34 s > Checking libc v0.2.186
  556. 501.34 s > Checking libm v0.2.16
  557. 501.34 s > Checking itoa v1.0.18
  558. 501.34 s > Checking log v0.4.29
  559. 501.34 s > Checking regex-syntax v0.8.10
  560. 501.34 s > Checking zerocopy v0.8.48
  561. 501.34 s > Checking crossbeam-utils v0.8.21
  562. 501.34 s > Checking equivalent v1.0.2
  563. 501.34 s > Checking zmij v1.0.21
  564. 501.34 s > Checking bytemuck v1.25.0
  565. 501.34 s > Checking lazy_static v1.5.0
  566. 501.34 s > Compiling target-lexicon v0.13.5
  567. 501.34 s > Checking arrayvec v0.7.6
  568. 501.34 s > Checking powerfmt v0.2.0
  569. 501.34 s > Checking num-conv v0.2.1
  570. 501.34 s > Checking num_threads v0.1.7
  571. 501.34 s > Checking pin-project-lite v0.2.17
  572. 501.34 s > Checking itertools v0.14.0
  573. 501.34 s > Checking time-core v0.1.8
  574. 501.34 s > Checking tracing-core v0.1.36
  575. 501.34 s > Checking allocator-api2 v0.2.21
  576. 501.34 s > Checking deranged v0.5.8
  577. 501.34 s > Checking foldhash v0.2.0
  578. 501.34 s > Checking safe_arch v0.7.4
  579. 501.34 s > Checking const-random v0.1.18
  580. 501.34 s > Checking nu-ansi-term v0.50.3
  581. 501.34 s > Checking winnow v1.0.2
  582. 501.34 s > Checking static_assertions v1.1.0
  583. 501.34 s > Checking unty v0.0.4
  584. 501.34 s > Checking safe_arch v1.0.0
  585. 501.34 s > Checking sharded-slab v0.1.7
  586. 501.34 s > Checking crossbeam-epoch v0.9.18
  587. 501.34 s > Checking aho-corasick v1.1.4
  588. 501.34 s > Checking thread_local v1.1.9
  589. 501.34 s > Checking wide v0.7.33
  590. 501.34 s > Checking hashbrown v0.16.1
  591. 501.34 s > Checking tracing v0.1.44
  592. 501.34 s > Checking tracing-log v0.2.0
  593. 501.34 s > Checking az v1.3.0
  594. 501.34 s > Checking crossbeam-deque v0.8.6
  595. 501.34 s > Checking indenter v0.3.4
  596. 501.34 s > Checking toml_writer v1.1.1+spec-1.1.0
  597. 501.34 s > Checking wide v1.3.0
  598. 501.34 s > Checking num-traits v0.2.19
  599. 501.34 s > Compiling phf_shared v0.11.3
  600. 501.34 s > Checking rayon-core v1.13.0
  601. 501.34 s > Checking anyhow v1.0.102
  602. 501.34 s > Checking approx v0.5.1
  603. 501.34 s > Checking num-integer v0.1.46
  604. 501.34 s > Checking dyn-clone v1.0.20
  605. 501.34 s > Checking rawpointer v0.2.1
  606. 501.34 s > Checking alloc-no-stdlib v2.0.4
  607. 501.34 s > Checking utf8parse v0.2.2
  608. 501.34 s > Checking matrixmultiply v0.3.10
  609. 501.34 s > Checking alloc-stdlib v0.2.2
  610. 501.34 s > Checking anstyle-parse v1.0.0
  611. 501.34 s > Checking colorchoice v1.0.5
  612. 501.34 s > Checking anstyle-query v1.1.5
  613. 501.34 s > Checking rayon v1.12.0
  614. 501.34 s > Checking is_terminal_polyfill v1.70.2
  615. 501.34 s > Checking colored v3.1.1
  616. 501.34 s > Checking anstyle v1.0.14
  617. 501.34 s > Compiling pyo3-build-config v0.28.3
  618. 501.34 s > Compiling phf_generator v0.11.3
  619. 501.34 s > Checking anstream v1.0.0
  620. 501.34 s > Checking eyre v0.6.12
  621. 501.34 s > Checking bitflags v1.3.2
  622. 501.34 s > Checking unicode-width v0.2.2
  623. 501.34 s > Checking brotli-decompressor v5.0.0
  624. 501.34 s > Checking spec_math v0.1.6
  625. 501.34 s > Compiling phf_codegen v0.11.3
  626. 501.34 s > Checking inventory v0.3.24
  627. 501.34 s > Checking thiserror v2.0.18
  628. 501.34 s > Compiling getopts v0.2.24
  629. 501.34 s > Checking libloading v0.9.0
  630. 501.34 s > Checking toml_parser v1.1.2+spec-1.1.0
  631. 501.34 s > Checking self_cell v1.2.2
  632. 501.34 s > Checking tinyjson v2.5.1
  633. 501.34 s > Checking append-only-vec v0.1.8
  634. 501.34 s > Checking bytes v1.11.1
  635. 501.34 s > Checking regex-automata v0.4.14
  636. 501.34 s > Checking byteorder v1.5.0
  637. 501.34 s > Compiling unicode_names2_generator v1.3.0
  638. 501.34 s > Checking linux-raw-sys v0.12.1
  639. 501.34 s > Compiling unic-common v0.9.0
  640. 501.34 s > Compiling unic-char-range v0.9.0
  641. 501.34 s > Compiling unic-char-property v0.9.0
  642. 501.34 s > Compiling unic-ucd-version v0.9.0
  643. 501.34 s > Checking serde v1.0.228
  644. 501.34 s > Checking serde_json v1.0.149
  645. 501.34 s > Checking bitflags v2.11.1
  646. 501.34 s > Checking serde_spanned v1.1.1
  647. 501.34 s > Checking toml_datetime v1.1.1+spec-1.1.0
  648. 501.34 s > Checking getrandom v0.3.4
  649. 501.34 s > Checking time v0.3.47
  650. 501.34 s > Checking rand_core v0.9.5
  651. 501.34 s > Checking gmp-mpfr-sys v1.7.1
  652. 501.34 s > Checking wasmtime-jit-icache-coherence v34.0.2
  653. 501.34 s > Checking hugepage-rs v0.1.1
  654. 501.34 s > Checking toml v1.1.2+spec-1.1.0
  655. 501.34 s > Checking region v3.0.2
  656. 501.34 s > Checking brotli v8.0.2
  657. 501.34 s > Compiling is-macro v0.3.7
  658. 501.34 s > Checking rustix v1.1.4
  659. 501.34 s > Compiling rustpython-parser-vendored v0.4.0
  660. 501.34 s > Checking iana-time-zone v0.1.65
  661. 501.34 s > Compiling rustpython-parser v0.4.0
  662. 501.34 s > Compiling phf v0.11.3
  663. 501.34 s > Checking rustc-hash v2.1.2
  664. 501.34 s > Compiling unic-emoji-char v0.9.0
  665. 501.34 s > Compiling unic-ucd-ident v0.9.0
  666. 501.34 s > Compiling lalrpop-util v0.20.2
  667. 501.34 s > Checking smallvec v1.15.1
  668. 501.34 s > Checking num-complex v0.4.6
  669. 501.34 s > Checking tracing-serde v0.2.0
  670. 501.34 s > Checking bincode v2.0.1
  671. 501.34 s > Checking smartstring v1.0.1
  672. 501.34 s > Checking chrono v0.4.44
  673. 501.34 s > Compiling rustc-hash v1.1.0
  674. 501.34 s > Checking rug v1.30.0
  675. 501.34 s > Compiling symbolica v2.2.0 (https://github.com/alphal00p/symbolica?rev=a277a8dadbaae5a8d6605f2f381991a601e1f345#a277a8da)
  676. 501.34 s > Checking unicode-segmentation v1.13.2
  677. 501.34 s > Checking simba v0.9.1
  678. 501.34 s > Checking ndarray v0.17.2
  679. 501.34 s > Checking typenum v1.20.0
  680. 501.34 s > Checking getrandom v0.2.17
  681. 501.34 s > Checking scopeguard v1.2.0
  682. 501.34 s > Checking lock_api v0.4.14
  683. 501.34 s > Checking parking_lot_core v0.9.12
  684. 501.34 s > Checking hashbrown v0.17.0
  685. 501.34 s > Checking unicode-ident v1.0.24
  686. 501.34 s > Checking errno v0.3.14
  687. 501.34 s > Checking clap_lex v1.1.0
  688. 501.34 s > Checking parking_lot v0.12.5
  689. 501.34 s > Checking strsim v0.11.1
  690. 501.34 s > Checking unicase v2.9.0
  691. 501.34 s > Checking signal-hook-registry v1.4.8
  692. 501.34 s > Checking vte v0.14.1
  693. 501.34 s > Checking same-file v1.0.6
  694. 501.34 s > Checking mio v1.2.0
  695. 501.34 s > Checking walkdir v2.5.0
  696. 501.34 s > Checking generic-array v0.14.7
  697. 501.34 s > Checking terminal_size v0.4.4
  698. 501.34 s > Checking signal-hook v0.3.18
  699. 501.34 s > Checking clap_builder v4.6.0
  700. 501.34 s > Checking ciborium-io v0.2.2
  701. 501.34 s > Checking minimal-lexical v0.2.1
  702. 501.34 s > Checking derive_more v2.1.1
  703. 501.34 s > Checking indexmap v2.14.0
  704. 501.34 s > Checking nom v7.1.3
  705. 501.34 s > Checking num-bigint v0.4.6
  706. 501.34 s > Checking signal-hook-mio v0.2.5
  707. 501.34 s > Checking console v0.16.3
  708. 501.34 s > Checking block-buffer v0.10.4
  709. 501.34 s > Checking crypto-common v0.1.7
  710. 501.34 s > Checking digest v0.10.7
  711. 501.34 s > Checking bstr v1.12.1
  712. 501.34 s > Checking cpufeatures v0.2.17
  713. 501.34 s > Checking winnow v0.7.15
  714. 501.34 s > Checking linux-raw-sys v0.4.15
  715. 501.34 s > Checking matchers v0.2.0
  716. 501.34 s > Checking tracing-subscriber v0.3.23
  717. 501.34 s > Checking regex v1.12.3
  718. 501.34 s > Checking ppv-lite86 v0.2.21
  719. 501.34 s > Checking ahash v0.8.12
  720. 501.34 s > Compiling unicode_names2 v1.3.0
  721. 501.34 s > Checking half v2.7.1
  722. 501.34 s > Checking rand_chacha v0.9.0
  723. 501.34 s > Checking ciborium-ll v0.2.2
  724. 501.34 s > Checking rand v0.9.4
  725. 501.34 s > Checking globset v0.4.18
  726. 501.34 s > Checking ciborium v0.2.2
  727. 501.34 s > Checking rustix v0.38.44
  728. 501.34 s > Checking sha2 v0.10.9
  729. 501.34 s > Checking getrandom v0.4.2
  730. 501.34 s > Checking rand_core v0.6.4
  731. 501.34 s > Checking ansitok v0.3.0
  732. 501.34 s > Checking symjit v2.21.0
  733. 501.34 s > Checking fnv v1.0.7
  734. 501.34 s > Checking plotters-backend v0.3.7
  735. 501.34 s > Checking fastrand v2.4.1
  736. 501.34 s > Checking rust-embed-utils v8.11.0
  737. 501.34 s > Checking toml_datetime v0.6.11
  738. 501.34 s > Checking crossterm v0.28.1
  739. 501.34 s > Checking plotters-svg v0.3.7
  740. 501.34 s > Checking serde_spanned v0.6.9
  741. 501.34 s > Checking itertools v0.10.5
  742. 501.34 s > Checking clap v4.6.1
  743. 501.34 s > Checking toml_write v0.1.2
  744. 501.34 s > Checking tap v1.0.1
  745. 501.34 s > Checking tempfile v3.27.0
  746. 501.34 s > Checking cast v0.3.0
  747. 501.34 s > Checking wyz v0.5.1
  748. 501.34 s > Checking plotters v0.3.7
  749. 501.34 s > Checking rand_chacha v0.3.1
  750. 501.34 s > Checking ansi-str v0.9.0
  751. 501.34 s > Checking toml_edit v0.22.27
  752. 501.34 s > Checking radium v0.7.0
  753. 501.34 s > Checking typeid v1.0.3
  754. 501.34 s > Checking similar v2.7.0
  755. 501.34 s > Checking tinytemplate v1.2.1
  756. 501.34 s > Checking is-terminal v0.4.17
  757. 501.34 s > Checking anes v0.1.6
  758. 501.34 s > Checking oorandom v11.1.5
  759. 501.34 s > Checking funty v2.0.0
  760. 501.34 s > Checking bytecount v0.6.9
  761. 501.34 s > Checking rand v0.8.6
  762. 501.34 s > Checking ron v0.12.1
  763. 501.34 s > Checking testing_table v0.3.0
  764. 501.34 s > Checking papergrid v0.17.0
  765. 501.34 s > Checking env_filter v1.0.1
  766. 501.34 s > Checking bitvec v1.0.1
  767. 501.34 s > Checking toml_edit v0.25.11+spec-1.1.0
  768. 501.34 s > Checking uncased v0.9.10
  769. 501.34 s > Checking jiff v0.2.24
  770. 501.34 s > Checking criterion-plot v0.5.0
  771. 501.34 s > Checking ptr_meta v0.1.4
  772. 501.34 s > Checking simdutf8 v0.1.5
  773. 501.34 s > Compiling pyo3-ffi v0.28.3
  774. 501.34 s > Compiling pyo3-macros-backend v0.28.3
  775. 501.34 s > Compiling pyo3 v0.28.3
  776. 501.34 s > Compiling numpy v0.28.0
  777. 501.34 s > Checking xprec v0.2.2
  778. 501.34 s > Checking ucd-trie v0.1.7
  779. 501.34 s > Checking criterion v0.5.1
  780. 501.34 s > Checking bytecheck v0.6.12
  781. 501.34 s > Checking ahash v0.7.8
  782. 501.34 s > Checking pest v2.8.6
  783. 501.34 s > Checking hashbrown v0.12.3
  784. 501.34 s > Checking approx v0.4.0
  785. 501.34 s > Checking seahash v4.1.0
  786. 501.34 s > Checking insta v1.47.2
  787. 501.34 s > Checking cgmath v0.18.0
  788. 501.34 s > Checking num-rational v0.4.2
  789. 501.34 s > Checking rend v0.4.2
  790. 501.34 s > Checking toml v0.8.23
  791. 501.34 s > Checking tabled v0.20.0
  792. 501.34 s > Checking num-iter v0.1.45
  793. 501.34 s > Checking ref-ops v0.2.5
  794. 501.34 s > Checking num v0.4.3
  795. 501.34 s > Checking rand_xoshiro v0.6.0
  796. 501.34 s > Checking features v0.10.0
  797. 501.34 s > Checking gat-lending-iterator v0.1.8
  798. 501.34 s > Checking constcat v0.5.1
  799. 501.34 s > Checking colored v2.2.0
  800. 501.34 s > Checking arrayref v0.3.9
  801. 501.34 s > Checking constant_time_eq v0.4.2
  802. 501.34 s > Checking figment v0.10.19
  803. 501.34 s > Checking cpufeatures v0.3.0
  804. 501.34 s > Checking base64 v0.22.1
  805. 501.34 s > Checking blake3 v1.8.5
  806. 501.34 s > Checking siphasher v1.0.2
  807. 501.34 s > Checking joinery v2.1.0
  808. 501.34 s > Checking phf_shared v0.13.1
  809. 501.34 s > Checking subprocess v0.2.15
  810. 501.34 s > Checking rust_lisp v0.18.0
  811. 501.34 s > Checking dot-parser v0.5.1
  812. 501.34 s > Checking titlecase v2.2.1
  813. 501.34 s > Compiling vakint v0.1.2 (/build/source/crates/vakint)
  814. 501.34 s > Checking phf v0.13.1
  815. 501.34 s > Checking version-compare v0.2.1
  816. 501.34 s > Checking xpct v0.5.1
  817. 501.34 s > Checking ryu v1.0.23
  818. 501.34 s > Checking castaway v0.2.4
  819. 501.34 s > Checking toml_datetime v0.7.5+spec-1.1.0
  820. 501.34 s > Checking strum v0.27.2
  821. 501.34 s > Checking compact_str v0.9.0
  822. 501.34 s > Checking unicode-truncate v2.0.1
  823. 501.34 s > Checking toml v0.9.12+spec-1.1.0
  824. 501.34 s > Checking kasuari v0.4.12
  825. 501.34 s > Checking lru v0.16.4
  826. 501.34 s > Checking vte v0.15.0
  827. 501.34 s > Checking portable-atomic v1.13.1
  828. 501.34 s > Checking unit-prefix v0.5.2
  829. 501.34 s > Checking rand_distr v0.4.3
  830. 501.34 s > Checking simba v0.6.0
  831. 501.34 s > Checking string-template-plus v0.4.3
  832. 501.34 s > Checking vt100 v0.16.2
  833. 501.34 s > Checking line-clipping v0.3.7
  834. 501.34 s > Compiling three-dimensional-reps v0.1.0 (/build/source/crates/three-dimensional-reps)
  835. 501.34 s > Checking adler2 v2.0.1
  836. 501.34 s > Checking ratatui-core v0.1.0
  837. 501.34 s > Checking gimli v0.32.3
  838. 501.34 s > Checking miniz_oxide v0.8.9
  839. 501.34 s > Checking thiserror v1.0.69
  840. 501.34 s > Checking derive_builder v0.11.2
  841. 501.34 s > Checking object v0.37.3
  842. 501.34 s > Checking owo-colors v4.3.0
  843. 501.34 s > Checking crossterm v0.29.0
  844. 501.34 s > Checking tracing-error v0.2.1
  845. 501.34 s > Checking indicatif v0.18.4
  846. 501.34 s > Compiling rustpython-parser-core v0.4.0
  847. 501.34 s > Checking typed-index-collections v3.5.0
  848. 501.34 s > Compiling rustpython-ast v0.4.0
  849. 501.34 s > Checking serde-big-array v0.5.1
  850. 501.34 s > Checking rkyv v0.7.46
  851. 501.34 s > Checking amd v0.2.2
  852. 501.34 s > Checking itertools v0.11.0
  853. 501.34 s > Compiling gammaloop-tracing-filter-macros v0.1.0 (/build/source/crates/gammaloop-tracing-filter-macros)
  854. 501.34 s > Checking option-ext v0.2.0
  855. 501.34 s > Checking rustc-demangle v0.1.27
  856. 501.34 s > Checking dirs-sys v0.5.0
  857. 501.34 s > Checking ref-cast v1.0.25
  858. 501.34 s > Checking nix v0.31.2
  859. 501.34 s > Checking brotli-decompressor v4.0.3
  860. 501.34 s > Checking env_logger v0.11.10
  861. 501.34 s > Checking ratatui-widgets v0.3.0
  862. 501.34 s > Checking integer-sqrt v0.1.5
  863. 501.34 s > Checking ratatui-crossterm v0.1.0
  864. 501.34 s > Checking crossbeam-channel v0.5.15
  865. 501.34 s > Checking itertools v0.12.1
  866. 501.34 s > Checking symlink v0.1.0
  867. 501.34 s > Compiling gammalooprs v0.3.4 (/build/source/crates/gammalooprs)
  868. 501.34 s > Checking unsafe-libyaml v0.2.11
  869. 501.34 s > Checking include_dir v0.7.4
  870. 501.34 s > Checking color-spantrace v0.3.0
  871. 501.34 s > Checking pathfinding v4.15.0
  872. 501.34 s > Checking ctrlc v3.5.2
  873. 501.34 s > Checking tracing-appender v0.2.5
  874. 501.34 s > Checking schemars v1.2.1
  875. 501.34 s > Checking slotmap v1.1.1
  876. 501.34 s > Checking dirs v6.0.0
  877. 501.34 s > Checking brotli v7.0.0
  878. 501.34 s > Checking ratatui-macros v0.7.0
  879. 501.34 s > Checking addr2line v0.25.1
  880. 501.34 s > Checking tracing-indicatif v0.3.14
  881. 501.34 s > Checking ratatui v0.30.0
  882. 501.34 s > Checking json5 v0.4.1
  883. 501.34 s > Checking vectorize v0.2.0
  884. 501.34 s > Checking ringbuffer v0.16.0
  885. 501.34 s > Checking base62 v2.2.4
  886. 501.34 s > Checking clarabel v0.11.1
  887. 501.34 s > Checking rust-embed v8.11.0
  888. 501.34 s > Checking clap_complete v4.6.3
  889. 501.34 s > Checking fd-lock v4.0.4
  890. 501.34 s > Checking serde_yaml v0.9.34+deprecated
  891. 501.34 s > Checking strip-ansi-escapes v0.2.1
  892. 501.34 s > Compiling gammaloop-api v0.1.0 (/build/source/crates/gammaloop-api)
  893. 501.34 s > Checking itertools v0.13.0
  894. 501.34 s > Checking strum v0.26.3
  895. 501.34 s > Checking sysinfo v0.33.1
  896. 501.34 s > Checking shlex v1.3.0
  897. 501.34 s > Checking slab v0.4.12
  898. 501.34 s > Checking futures-core v0.3.32
  899. 501.34 s > Checking futures-task v0.3.32
  900. 501.34 s > Checking sdd v3.0.10
  901. 501.34 s > Compiling gammaloop-integration-tests v0.1.0 (/build/source/tests)
  902. 501.34 s > Checking futures-util v0.3.32
  903. 501.34 s > Checking clap_complete_nushell v4.6.0
  904. 501.34 s > Compiling test-log-core v0.2.20
  905. 501.34 s > Checking scc v2.4.0
  906. 501.34 s > Compiling rustc_version v0.4.1
  907. 501.34 s > Checking reedline v0.42.0
  908. 501.34 s > Checking which v8.0.2
  909. 501.34 s > Checking bincode v1.3.3
  910. 501.34 s > Checking nalgebra v0.29.0
  911. 501.34 s > Compiling numerica v2.2.0 (https://github.com/alphal00p/symbolica?rev=a277a8dadbaae5a8d6605f2f381991a601e1f345#a277a8da)
  912. 501.34 s > Compiling gungraun-macros v0.8.0
  913. 501.34 s > Compiling gungraun-runner v0.18.2
  914. 501.34 s > Checking proc-macro2 v1.0.106
  915. 501.34 s > Checking quote v1.0.45
  916. 501.34 s > Checking maplit v1.0.2
  917. 501.34 s > Checking base64 v0.21.7
  918. 501.34 s > Checking backtrace v0.3.76
  919. 501.34 s > Compiling test-log-macros v0.2.20
  920. 501.34 s > Compiling iai-callgrind-runner v0.14.2
  921. 501.34 s > Checking ron v0.8.1
  922. 501.34 s > Checking kurbo v0.13.0
  923. 501.34 s > Checking color-eyre v0.6.5
  924. 501.34 s > Checking wait-timeout v0.2.1
  925. 501.34 s > Checking quick-error v1.2.3
  926. 501.34 s > Compiling iai-callgrind v0.14.2
  927. 501.34 s > Checking bit-vec v0.8.0
  928. 501.34 s > Checking futures-executor v0.3.32
  929. 501.34 s > Checking rusty-fork v0.3.1
  930. 501.34 s > Checking syn v2.0.117
  931. 501.34 s > Checking serial_test v3.4.0
  932. 501.34 s > Compiling iai-callgrind-macros v0.5.1
  933. 501.34 s > Checking bit-set v0.8.0
  934. 501.34 s > Checking rand_xorshift v0.4.0
  935. 501.34 s > Checking console v0.15.11
  936. 501.34 s > Checking pathdiff v0.2.3
  937. 501.34 s > Checking unarray v0.1.4
  938. 501.34 s > Checking proptest v1.11.0
  939. 501.34 s > Checking kurvst v0.1.0 (/build/source/crates/kurvst)
  940. 501.34 s > Checking similar-asserts v1.7.0
  941. 501.34 s > Checking clinnet v0.1.8 (/build/source/crates/clinnet)
  942. 501.34 s > Checking test-log v0.2.20
  943. 501.34 s > Compiling graphica v2.1.0 (https://github.com/alphal00p/symbolica?rev=a277a8dadbaae5a8d6605f2f381991a601e1f345#a277a8da)
  944. 501.34 s > Checking statrs v0.16.1
  945. 501.34 s > Checking gungraun v0.18.2
  946. 501.34 s > Checking momtrop v0.3.0
  947. 501.34 s > Compiling pyo3-stub-gen-derive v0.17.2
  948. 501.34 s > Compiling pyo3-macros v0.28.3
  949. 501.34 s > Checking pyo3-stub-gen v0.17.2
  950. 501.34 s > Checking symbolica-utils v0.1.0 (/build/source/crates/symbolica-utils)
  951. 501.34 s > Checking spenso-macros v0.3.2 (/build/source/crates/spenso-macros)
  952. 501.34 s > Compiling gammaloop-workspace-hack v0.1.0 (/build/source/crates/gammaloop-workspace-hack)
  953. 501.34 s > Checking linnet v0.17.0 (/build/source/crates/linnet)
  954. 501.34 s > Checking spenso v0.6.0 (/build/source/crates/spenso)
  955. 501.34 s > Checking linnet-py v0.1.0 (/build/source/crates/linnet-py)
  956. 501.34 s > Checking linnest v0.1.0 (/build/source/crates/linnest)
  957. 501.34 s > Checking idenso v0.3.0 (/build/source/crates/idenso)
  958. 501.34 s > Checking gammaloop-tracing-filter v0.1.0 (/build/source/crates/gammaloop-tracing-filter)
  959. 501.34 s > Checking spenso-hep-lib v0.1.7 (/build/source/crates/spenso-hep-lib)
  960. 501.34 s > Checking spynso3 v0.1.2 (/build/source/crates/spynso3)
  961. 501.34 s > error[E0560]: struct `CutInfo` has no field named `lmb_channel_id`
  962. 501.34 s > --> tests/tests/test_differential.rs:86:13
  963. 501.34 s > |
  964. 501.34 s > 86 | lmb_channel_id: None,
  965. 501.34 s > | ^^^^^^^^^^^^^^ `CutInfo` does not have this field
  966. 501.34 s > |
  967. 501.34 s > = note: available fields are: `sampling_channel_id`, `sampling_channel_edge_ids`
  968. 501.34 s >
  969. 501.34 s > error[E0560]: struct `CutInfo` has no field named `lmb_channel_edge_ids`
  970. 501.34 s > --> tests/tests/test_differential.rs:87:13
  971. 501.34 s > |
  972. 501.34 s > 87 | lmb_channel_edge_ids: None,
  973. 501.34 s > | ^^^^^^^^^^^^^^^^^^^^ `CutInfo` does not have this field
  974. 501.34 s > |
  975. 501.34 s > = note: available fields are: `sampling_channel_id`, `sampling_channel_edge_ids`
  976. 501.34 s >
  977. 501.34 s > error[E0063]: missing field `reference_moments` in initializer of `GraphEvaluationResult<_>`
  978. 501.34 s > --> tests/tests/test_differential.rs:532:19
  979. 501.34 s > |
  980. 501.34 s > 532 | let mut lhs = GraphEvaluationResult {
  981. 501.34 s > | ^^^^^^^^^^^^^^^^^^^^^ missing `reference_moments`
  982. 501.34 s >
  983. 501.34 s > error[E0063]: missing field `reference_moments` in initializer of `GraphEvaluationResult<_>`
  984. 501.34 s > --> tests/tests/test_differential.rs:539:15
  985. 501.34 s > |
  986. 501.34 s > 539 | let rhs = GraphEvaluationResult {
  987. 501.34 s > | ^^^^^^^^^^^^^^^^^^^^^ missing `reference_moments`
  988. 501.34 s >
  989. 501.34 s > error[E0609]: no field `lmb_channel_edge_ids` on type `CutInfo`
  990. 501.34 s > --> tests/tests/test_evaluation_api.rs:311:10
  991. 501.34 s > |
  992. 501.34 s > 311 | .lmb_channel_edge_ids
  993. 501.34 s > | ^^^^^^^^^^^^^^^^^^^^ unknown field
  994. 501.34 s > |
  995. 501.34 s > = note: available fields are: `particle_pdgs`, `cut_id`, `graph_id`, `graph_group_id`, `orientation_id` ... and 2 others
  996. 501.34 s >
  997. 501.34 s > error[E0609]: no field `lmb_channel_edge_ids` on type `CutInfo`
  998. 501.34 s > --> tests/tests/test_evaluation_api.rs:591:26
  999. 501.34 s > |
  1000. 501.34 s > 591 | .lmb_channel_edge_ids
  1001. 501.34 s > | ^^^^^^^^^^^^^^^^^^^^ unknown field
  1002. 501.34 s > |
  1003. 501.34 s > = note: available fields are: `particle_pdgs`, `cut_id`, `graph_id`, `graph_group_id`, `orientation_id` ... and 2 others
  1004. 501.34 s >
  1005. 501.34 s > Some errors have detailed explanations: E0063, E0560.
  1006. 501.34 s > For more information about an error, try `rustc --explain E0063`.
  1007. 501.34 s > error: could not compile `gammaloop-integration-tests` (test "test_differential") due to 4 previous errors
  1008. 501.34 s > warning: build failed, waiting for other jobs to finish...
  1009. 501.34 s > error[E0609]: no field `lmb_channel_edge_ids` on type `CutInfo`
  1010. 501.34 s > --> tests/tests/test_evaluation_api.rs:1177:18
  1011. 501.34 s > |
  1012. 501.34 s > 1177 | .lmb_channel_edge_ids
  1013. 501.34 s > | ^^^^^^^^^^^^^^^^^^^^ unknown field
  1014. 501.34 s > |
  1015. 501.34 s > = note: available fields are: `particle_pdgs`, `cut_id`, `graph_id`, `graph_group_id`, `orientation_id` ... and 2 others
  1016. 501.34 s >
  1017. 501.34 s > error[E0609]: no field `lmb_channel_edge_ids` on type `CutInfo`
  1018. 501.34 s > --> tests/tests/test_evaluation_api.rs:1222:22
  1019. 501.34 s > |
  1020. 501.34 s > 1222 | .lmb_channel_edge_ids
  1021. 501.34 s > | ^^^^^^^^^^^^^^^^^^^^ unknown field
  1022. 501.34 s > |
  1023. 501.34 s > = note: available fields are: `particle_pdgs`, `cut_id`, `graph_id`, `graph_group_id`, `orientation_id` ... and 2 others
  1024. 501.34 s >
  1025. 501.34 s > error[E0609]: no field `lmb_channel_edge_ids` on type `CutInfo`
  1026. 501.34 s > --> tests/tests/test_evaluation_api.rs:1281:14
  1027. 501.34 s > |
  1028. 501.34 s > 1281 | .lmb_channel_edge_ids
  1029. 501.34 s > | ^^^^^^^^^^^^^^^^^^^^ unknown field
  1030. 501.34 s > |
  1031. 501.34 s > = note: available fields are: `particle_pdgs`, `cut_id`, `graph_id`, `graph_group_id`, `orientation_id` ... and 2 others
  1032. 501.34 s >
  1033. 501.34 s > error[E0609]: no field `lmb_channel_edge_ids` on type `CutInfo`
  1034. 501.34 s > --> tests/tests/test_evaluation_api.rs:1428:18
  1035. 501.34 s > |
  1036. 501.34 s > 1428 | .lmb_channel_edge_ids
  1037. 501.34 s > | ^^^^^^^^^^^^^^^^^^^^ unknown field
  1038. 501.34 s > |
  1039. 501.34 s > = note: available fields are: `particle_pdgs`, `cut_id`, `graph_id`, `graph_group_id`, `orientation_id` ... and 2 others
  1040. 501.34 s >
  1041. 501.34 s > For more information about this error, try `rustc --explain E0609`.
  1042. 501.34 s > error: could not compile `gammaloop-integration-tests` (test "test_evaluation_api") due to 6 previous errors
  1043. 501.34 s > error[E0609]: no field `lmb_channel_id` on type `CutInfo`
  1044. 501.34 s > --> tests/tests/test_runs/utils.rs:568:36
  1045. 501.34 s > |
  1046. 501.34 s > 568 | event.cut_info.lmb_channel_id,
  1047. 501.34 s > | ^^^^^^^^^^^^^^ unknown field
  1048. 501.34 s > |
  1049. 501.34 s > = note: available fields are: `particle_pdgs`, `cut_id`, `graph_id`, `graph_group_id`, `orientation_id` ... and 2 others
  1050. 501.34 s >
  1051. 501.34 s > error[E0609]: no field `lmb_channel_id` on type `CutInfo`
  1052. 501.34 s > --> tests/tests/test_runs/utils.rs:580:36
  1053. 501.34 s > |
  1054. 501.34 s > 580 | event.cut_info.lmb_channel_id,
  1055. 501.34 s > | ^^^^^^^^^^^^^^ unknown field
  1056. 501.34 s > |
  1057. 501.34 s > = note: available fields are: `particle_pdgs`, `cut_id`, `graph_id`, `graph_group_id`, `orientation_id` ... and 2 others
  1058. 501.34 s >
  1059. 501.34 s > error: could not compile `gammaloop-integration-tests` (test "test_runs") due to 2 previous errors
  1060. 501.34 s For full logs, run:
  1061. 501.34 s nix log /nix/store/i729pk8pca0mvg4wgc9cqnnlslm5qsi9-gammaloop-workspace-check-0.1.0.drv
  1062. 501.40 s Build failed.