0.16 s
$ /nix/store/9ypz3flqsrl5xl495mm8h645gadjsxi1-coreutils-9.11/bin/timeout --kill-after=15s 7200s /nix/store/23zk8sgzamrbmj1fday15szf7f2279s8-nix-2.34.7/bin/nix --extra-experimental-features nix-command --extra-experimental-features flakes --log-format internal-json build --no-link --print-out-paths git+https://github.com/alphal00p/gammaloop?ref=advanced_sampling&rev=06d470409cd34d8d57afa11b04a3fb208ca20890&shallow=1#checks.x86_64-linux.gammaloop-check --print-build-logs
1.00 s
error (ignored): SQLite database '/var/cache/nix-ci-worker/eval-cache-v6/94fa1d4e764635858a8a977ddbe09d438888f0e645346bf600576055740a2a7d.sqlite ' is busy
5.15 s
6.48 s
Building /nix/store/i729pk8pca0mvg4wgc9cqnnlslm5qsi9-gammaloop-workspace-check-0.1.0.drv
6.66 s
[gammaloop-workspace-check] Phase: unpackPhase
6.68 s
[gammaloop-workspace-check] unpacking source archive /nix/store/qqslq36f7201lf1f2zyjcqsf7w9pg5dy-source
6.94 s
[gammaloop-workspace-check] source root is source
7.01 s
[gammaloop-workspace-check] Phase: patchPhase
7.02 s
[gammaloop-workspace-check] Executing configureCargoCommonVars
7.04 s
[gammaloop-workspace-check] decompressing cargo artifacts from /nix/store/50vpxlcgfxf2d57i27v3d10zjwxxbm2r-gammaloop-workspace-deps-deps-0.1.0/target.tar.zst to target
10.85 s
[gammaloop-workspace-check] Phase: updateAutotoolsGnuConfigScriptsPhase
10.90 s
[gammaloop-workspace-check] Phase: configurePhase
10.91 s
[gammaloop-workspace-check] will append /build/source/.cargo-home/config.toml with contents of /nix/store/5drf77x6km4ky7gwlrzdx9bbd6fz09g3-vendor-cargo-deps/config.toml
10.91 s
[gammaloop-workspace-check] default configurePhase, nothing to do
10.92 s
[gammaloop-workspace-check] Phase: buildPhase
10.92 s
[gammaloop-workspace-check] +++ command cargo --version
10.93 s
[gammaloop-workspace-check] cargo 1.97.0 (c980f4866 2026-06-30)
10.98 s
[gammaloop-workspace-check] +++ command cargo check --profile ci-optim --locked --workspace --features gammaloop-tracing-filter/clap,gammaloop-tracing-filter/symbolica,idenso/bincode,idenso/reference-cases,linnet/bincode,linnet/drawing,linnet/rkyv,linnet/serde,linnet/symbolica,spenso-macros/shadowing,spenso/shadowing,symbolica/tracing_max_level_info,three-dimensional-reps/display,three-dimensional-reps/eval,three-dimensional-reps/serde --all-targets
12.10 s
[gammaloop-workspace-check] Checking cfg-if v1.0.4
12.10 s
[gammaloop-workspace-check] Checking memchr v2.8.0
12.11 s
[gammaloop-workspace-check] Checking once_cell v1.21.4
12.12 s
[gammaloop-workspace-check] Checking either v1.15.0
12.14 s
[gammaloop-workspace-check] Checking serde_core v1.0.228
12.14 s
[gammaloop-workspace-check] Checking libc v0.2.186
12.14 s
[gammaloop-workspace-check] Checking libm v0.2.16
12.14 s
[gammaloop-workspace-check] Checking itoa v1.0.18
12.16 s
[gammaloop-workspace-check] Checking log v0.4.29
12.16 s
[gammaloop-workspace-check] Checking regex-syntax v0.8.10
12.17 s
[gammaloop-workspace-check] Checking zerocopy v0.8.48
12.22 s
[gammaloop-workspace-check] Checking crossbeam-utils v0.8.21
12.22 s
[gammaloop-workspace-check] Checking equivalent v1.0.2
12.26 s
[gammaloop-workspace-check] Checking zmij v1.0.21
12.27 s
[gammaloop-workspace-check] Checking bytemuck v1.25.0
12.27 s
[gammaloop-workspace-check] Checking lazy_static v1.5.0
12.27 s
[gammaloop-workspace-check] Compiling target-lexicon v0.13.5
12.44 s
[gammaloop-workspace-check] Checking arrayvec v0.7.6
12.53 s
[gammaloop-workspace-check] Checking powerfmt v0.2.0
12.56 s
[gammaloop-workspace-check] Checking num-conv v0.2.1
12.70 s
[gammaloop-workspace-check] Checking num_threads v0.1.7
12.79 s
[gammaloop-workspace-check] Checking pin-project-lite v0.2.17
12.81 s
[gammaloop-workspace-check] Checking itertools v0.14.0
12.85 s
[gammaloop-workspace-check] Checking time-core v0.1.8
13.03 s
[gammaloop-workspace-check] Checking tracing-core v0.1.36
13.06 s
[gammaloop-workspace-check] Checking allocator-api2 v0.2.21
13.15 s
[gammaloop-workspace-check] Checking deranged v0.5.8
13.29 s
[gammaloop-workspace-check] Checking foldhash v0.2.0
13.31 s
[gammaloop-workspace-check] Checking safe_arch v0.7.4
13.37 s
[gammaloop-workspace-check] Checking const-random v0.1.18
13.40 s
[gammaloop-workspace-check] Checking nu-ansi-term v0.50.3
13.53 s
[gammaloop-workspace-check] Checking winnow v1.0.2
13.60 s
[gammaloop-workspace-check] Checking static_assertions v1.1.0
13.70 s
[gammaloop-workspace-check] Checking unty v0.0.4
13.75 s
[gammaloop-workspace-check] Checking safe_arch v1.0.0
13.76 s
[gammaloop-workspace-check] Checking sharded-slab v0.1.7
14.42 s
[gammaloop-workspace-check] Checking crossbeam-epoch v0.9.18
14.51 s
[gammaloop-workspace-check] Checking aho-corasick v1.1.4
14.88 s
[gammaloop-workspace-check] Checking thread_local v1.1.9
15.00 s
[gammaloop-workspace-check] Checking wide v0.7.33
15.13 s
[gammaloop-workspace-check] Checking hashbrown v0.16.1
15.27 s
[gammaloop-workspace-check] Checking tracing v0.1.44
15.30 s
[gammaloop-workspace-check] Checking tracing-log v0.2.0
15.33 s
[gammaloop-workspace-check] Checking az v1.3.0
15.63 s
[gammaloop-workspace-check] Checking crossbeam-deque v0.8.6
15.82 s
[gammaloop-workspace-check] Checking indenter v0.3.4
15.98 s
[gammaloop-workspace-check] Checking toml_writer v1.1.1+spec-1.1.0
16.07 s
[gammaloop-workspace-check] Checking wide v1.3.0
16.45 s
[gammaloop-workspace-check] Checking num-traits v0.2.19
16.46 s
[gammaloop-workspace-check] Compiling phf_shared v0.11.3
16.48 s
[gammaloop-workspace-check] Checking rayon-core v1.13.0
17.29 s
[gammaloop-workspace-check] Checking anyhow v1.0.102
17.51 s
[gammaloop-workspace-check] Checking approx v0.5.1
17.93 s
[gammaloop-workspace-check] Checking num-integer v0.1.46
17.98 s
[gammaloop-workspace-check] Checking dyn-clone v1.0.20
18.00 s
[gammaloop-workspace-check] Checking rawpointer v0.2.1
18.11 s
[gammaloop-workspace-check] Checking alloc-no-stdlib v2.0.4
18.12 s
[gammaloop-workspace-check] Checking utf8parse v0.2.2
18.23 s
[gammaloop-workspace-check] Checking matrixmultiply v0.3.10
18.25 s
[gammaloop-workspace-check] Checking alloc-stdlib v0.2.2
18.37 s
[gammaloop-workspace-check] Checking anstyle-parse v1.0.0
18.50 s
[gammaloop-workspace-check] Checking colorchoice v1.0.5
18.62 s
[gammaloop-workspace-check] Checking anstyle-query v1.1.5
18.69 s
[gammaloop-workspace-check] Checking rayon v1.12.0
18.82 s
[gammaloop-workspace-check] Checking is_terminal_polyfill v1.70.2
18.90 s
[gammaloop-workspace-check] Checking colored v3.1.1
18.95 s
[gammaloop-workspace-check] Checking anstyle v1.0.14
19.08 s
[gammaloop-workspace-check] Compiling pyo3-build-config v0.28.3
19.19 s
[gammaloop-workspace-check] Compiling phf_generator v0.11.3
19.30 s
[gammaloop-workspace-check] Checking anstream v1.0.0
19.43 s
[gammaloop-workspace-check] Checking eyre v0.6.12
19.43 s
[gammaloop-workspace-check] Checking bitflags v1.3.2
19.49 s
[gammaloop-workspace-check] Checking unicode-width v0.2.2
19.57 s
[gammaloop-workspace-check] Checking brotli-decompressor v5.0.0
19.77 s
[gammaloop-workspace-check] Checking spec_math v0.1.6
20.12 s
[gammaloop-workspace-check] Compiling phf_codegen v0.11.3
20.17 s
[gammaloop-workspace-check] Checking inventory v0.3.24
20.27 s
[gammaloop-workspace-check] Checking thiserror v2.0.18
20.46 s
[gammaloop-workspace-check] Compiling getopts v0.2.24
20.52 s
[gammaloop-workspace-check] Checking libloading v0.9.0
20.61 s
[gammaloop-workspace-check] Checking toml_parser v1.1.2+spec-1.1.0
20.70 s
[gammaloop-workspace-check] Checking self_cell v1.2.2
20.85 s
[gammaloop-workspace-check] Checking tinyjson v2.5.1
21.00 s
[gammaloop-workspace-check] Checking append-only-vec v0.1.8
21.04 s
[gammaloop-workspace-check] Checking bytes v1.11.1
21.26 s
[gammaloop-workspace-check] Checking regex-automata v0.4.14
21.33 s
[gammaloop-workspace-check] Checking byteorder v1.5.0
21.73 s
[gammaloop-workspace-check] Compiling unicode_names2_generator v1.3.0
21.78 s
[gammaloop-workspace-check] Checking linux-raw-sys v0.12.1
21.99 s
[gammaloop-workspace-check] Compiling unic-common v0.9.0
22.20 s
[gammaloop-workspace-check] Compiling unic-char-range v0.9.0
22.38 s
[gammaloop-workspace-check] Compiling unic-char-property v0.9.0
22.74 s
[gammaloop-workspace-check] Compiling unic-ucd-version v0.9.0
22.81 s
[gammaloop-workspace-check] Checking serde v1.0.228
22.87 s
[gammaloop-workspace-check] Checking serde_json v1.0.149
22.89 s
[gammaloop-workspace-check] Checking bitflags v2.11.1
22.96 s
[gammaloop-workspace-check] Checking serde_spanned v1.1.1
23.18 s
[gammaloop-workspace-check] Checking toml_datetime v1.1.1+spec-1.1.0
23.21 s
[gammaloop-workspace-check] Checking getrandom v0.3.4
23.36 s
[gammaloop-workspace-check] Checking time v0.3.47
23.42 s
[gammaloop-workspace-check] Checking rand_core v0.9.5
23.45 s
[gammaloop-workspace-check] Checking gmp-mpfr-sys v1.7.1
23.57 s
[gammaloop-workspace-check] Checking wasmtime-jit-icache-coherence v34.0.2
23.70 s
[gammaloop-workspace-check] Checking hugepage-rs v0.1.1
23.79 s
[gammaloop-workspace-check] Checking toml v1.1.2+spec-1.1.0
23.80 s
[gammaloop-workspace-check] Checking region v3.0.2
24.10 s
[gammaloop-workspace-check] Checking brotli v8.0.2
24.32 s
[gammaloop-workspace-check] Compiling is-macro v0.3.7
24.40 s
[gammaloop-workspace-check] Checking rustix v1.1.4
24.49 s
[gammaloop-workspace-check] Compiling rustpython-parser-vendored v0.4.0
24.75 s
[gammaloop-workspace-check] Checking iana-time-zone v0.1.65
24.89 s
[gammaloop-workspace-check] Compiling rustpython-parser v0.4.0
25.19 s
[gammaloop-workspace-check] Compiling phf v0.11.3
25.29 s
[gammaloop-workspace-check] Checking rustc-hash v2.1.2
25.39 s
[gammaloop-workspace-check] Compiling unic-emoji-char v0.9.0
25.41 s
[gammaloop-workspace-check] Compiling unic-ucd-ident v0.9.0
25.53 s
[gammaloop-workspace-check] Compiling lalrpop-util v0.20.2
25.59 s
[gammaloop-workspace-check] Checking smallvec v1.15.1
25.82 s
[gammaloop-workspace-check] Checking num-complex v0.4.6
25.94 s
[gammaloop-workspace-check] Checking tracing-serde v0.2.0
26.03 s
[gammaloop-workspace-check] Checking bincode v2.0.1
26.06 s
[gammaloop-workspace-check] Checking smartstring v1.0.1
26.18 s
[gammaloop-workspace-check] Checking chrono v0.4.44
26.43 s
[gammaloop-workspace-check] Compiling rustc-hash v1.1.0
26.48 s
[gammaloop-workspace-check] Checking rug v1.30.0
26.59 s
[gammaloop-workspace-check] Compiling symbolica v2.2.0 (https://github.com/alphal00p/symbolica?rev=a277a8dadbaae5a8d6605f2f381991a601e1f345#a277a8da)
26.62 s
[gammaloop-workspace-check] Checking unicode-segmentation v1.13.2
27.06 s
[gammaloop-workspace-check] Checking simba v0.9.1
28.07 s
[gammaloop-workspace-check] Checking ndarray v0.17.2
28.26 s
[gammaloop-workspace-check] Checking typenum v1.20.0
29.01 s
[gammaloop-workspace-check] Checking getrandom v0.2.17
29.22 s
[gammaloop-workspace-check] Checking scopeguard v1.2.0
29.33 s
[gammaloop-workspace-check] Checking lock_api v0.4.14
29.41 s
[gammaloop-workspace-check] Checking parking_lot_core v0.9.12
30.07 s
[gammaloop-workspace-check] Checking hashbrown v0.17.0
30.24 s
[gammaloop-workspace-check] Checking unicode-ident v1.0.24
30.39 s
[gammaloop-workspace-check] Checking errno v0.3.14
30.48 s
[gammaloop-workspace-check] Checking clap_lex v1.1.0
30.58 s
[gammaloop-workspace-check] Checking parking_lot v0.12.5
30.66 s
[gammaloop-workspace-check] Checking strsim v0.11.1
30.92 s
[gammaloop-workspace-check] Checking unicase v2.9.0
31.18 s
[gammaloop-workspace-check] Checking signal-hook-registry v1.4.8
31.26 s
[gammaloop-workspace-check] Checking vte v0.14.1
31.33 s
[gammaloop-workspace-check] Checking same-file v1.0.6
31.73 s
[gammaloop-workspace-check] Checking mio v1.2.0
31.86 s
[gammaloop-workspace-check] Checking walkdir v2.5.0
31.91 s
[gammaloop-workspace-check] Checking generic-array v0.14.7
31.93 s
[gammaloop-workspace-check] Checking terminal_size v0.4.4
32.04 s
[gammaloop-workspace-check] Checking signal-hook v0.3.18
32.16 s
[gammaloop-workspace-check] Checking clap_builder v4.6.0
32.21 s
[gammaloop-workspace-check] Checking ciborium-io v0.2.2
32.35 s
[gammaloop-workspace-check] Checking minimal-lexical v0.2.1
32.81 s
[gammaloop-workspace-check] Checking derive_more v2.1.1
32.92 s
[gammaloop-workspace-check] Checking indexmap v2.14.0
33.03 s
[gammaloop-workspace-check] Checking nom v7.1.3
33.10 s
[gammaloop-workspace-check] Checking num-bigint v0.4.6
34.05 s
[gammaloop-workspace-check] Checking signal-hook-mio v0.2.5
34.12 s
[gammaloop-workspace-check] Checking console v0.16.3
34.52 s
[gammaloop-workspace-check] Checking block-buffer v0.10.4
34.83 s
[gammaloop-workspace-check] Checking crypto-common v0.1.7
35.05 s
[gammaloop-workspace-check] Checking digest v0.10.7
35.64 s
[gammaloop-workspace-check] Checking bstr v1.12.1
35.78 s
[gammaloop-workspace-check] Checking cpufeatures v0.2.17
35.82 s
[gammaloop-workspace-check] Checking winnow v0.7.15
35.86 s
[gammaloop-workspace-check] Checking linux-raw-sys v0.4.15
37.04 s
[gammaloop-workspace-check] Checking matchers v0.2.0
37.20 s
[gammaloop-workspace-check] Checking tracing-subscriber v0.3.23
37.43 s
[gammaloop-workspace-check] Checking regex v1.12.3
37.72 s
[gammaloop-workspace-check] Checking ppv-lite86 v0.2.21
37.75 s
[gammaloop-workspace-check] Checking ahash v0.8.12
37.96 s
[gammaloop-workspace-check] Compiling unicode_names2 v1.3.0
38.15 s
[gammaloop-workspace-check] Checking half v2.7.1
38.35 s
[gammaloop-workspace-check] Checking rand_chacha v0.9.0
38.61 s
[gammaloop-workspace-check] Checking ciborium-ll v0.2.2
38.68 s
[gammaloop-workspace-check] Checking rand v0.9.4
39.12 s
[gammaloop-workspace-check] Checking globset v0.4.18
39.12 s
[gammaloop-workspace-check] Checking ciborium v0.2.2
39.25 s
[gammaloop-workspace-check] Checking rustix v0.38.44
39.83 s
[gammaloop-workspace-check] Checking sha2 v0.10.9
41.13 s
[gammaloop-workspace-check] Checking getrandom v0.4.2
41.33 s
[gammaloop-workspace-check] Checking rand_core v0.6.4
41.46 s
[gammaloop-workspace-check] Checking ansitok v0.3.0
41.49 s
[gammaloop-workspace-check] Checking symjit v2.21.0
41.61 s
[gammaloop-workspace-check] Checking fnv v1.0.7
41.75 s
[gammaloop-workspace-check] Checking plotters-backend v0.3.7
42.05 s
[gammaloop-workspace-check] Checking fastrand v2.4.1
42.15 s
[gammaloop-workspace-check] Checking rust-embed-utils v8.11.0
42.21 s
[gammaloop-workspace-check] Checking toml_datetime v0.6.11
42.27 s
[gammaloop-workspace-check] Checking crossterm v0.28.1
42.72 s
[gammaloop-workspace-check] Checking plotters-svg v0.3.7
42.78 s
[gammaloop-workspace-check] Checking serde_spanned v0.6.9
43.24 s
[gammaloop-workspace-check] Checking itertools v0.10.5
43.27 s
[gammaloop-workspace-check] Checking clap v4.6.1
43.34 s
[gammaloop-workspace-check] Checking toml_write v0.1.2
43.37 s
[gammaloop-workspace-check] Checking tap v1.0.1
43.40 s
[gammaloop-workspace-check] Checking tempfile v3.27.0
43.50 s
[gammaloop-workspace-check] Checking cast v0.3.0
43.55 s
[gammaloop-workspace-check] Checking wyz v0.5.1
43.55 s
[gammaloop-workspace-check] Checking plotters v0.3.7
43.62 s
[gammaloop-workspace-check] Checking rand_chacha v0.3.1
43.66 s
[gammaloop-workspace-check] Checking ansi-str v0.9.0
43.80 s
[gammaloop-workspace-check] Checking toml_edit v0.22.27
43.92 s
[gammaloop-workspace-check] Checking radium v0.7.0
43.99 s
[gammaloop-workspace-check] Checking typeid v1.0.3
44.09 s
[gammaloop-workspace-check] Checking similar v2.7.0
44.21 s
[gammaloop-workspace-check] Checking tinytemplate v1.2.1
44.33 s
[gammaloop-workspace-check] Checking is-terminal v0.4.17
44.50 s
[gammaloop-workspace-check] Checking anes v0.1.6
44.53 s
[gammaloop-workspace-check] Checking oorandom v11.1.5
44.70 s
[gammaloop-workspace-check] Checking funty v2.0.0
45.01 s
[gammaloop-workspace-check] Checking bytecount v0.6.9
45.05 s
[gammaloop-workspace-check] Checking rand v0.8.6
45.23 s
[gammaloop-workspace-check] Checking ron v0.12.1
45.25 s
[gammaloop-workspace-check] Checking testing_table v0.3.0
45.29 s
[gammaloop-workspace-check] Checking papergrid v0.17.0
45.44 s
[gammaloop-workspace-check] Checking env_filter v1.0.1
46.01 s
[gammaloop-workspace-check] Checking bitvec v1.0.1
46.03 s
[gammaloop-workspace-check] Checking toml_edit v0.25.11+spec-1.1.0
46.49 s
[gammaloop-workspace-check] Checking uncased v0.9.10
46.75 s
[gammaloop-workspace-check] Checking jiff v0.2.24
47.11 s
[gammaloop-workspace-check] Checking criterion-plot v0.5.0
47.11 s
[gammaloop-workspace-check] Checking ptr_meta v0.1.4
47.29 s
[gammaloop-workspace-check] Checking simdutf8 v0.1.5
47.33 s
[gammaloop-workspace-check] Compiling pyo3-ffi v0.28.3
47.71 s
[gammaloop-workspace-check] Compiling pyo3-macros-backend v0.28.3
47.81 s
[gammaloop-workspace-check] Compiling pyo3 v0.28.3
48.03 s
[gammaloop-workspace-check] Compiling numpy v0.28.0
48.05 s
[gammaloop-workspace-check] Checking xprec v0.2.2
48.52 s
[gammaloop-workspace-check] Checking ucd-trie v0.1.7
48.56 s
[gammaloop-workspace-check] Checking criterion v0.5.1
48.59 s
[gammaloop-workspace-check] Checking bytecheck v0.6.12
48.71 s
[gammaloop-workspace-check] Checking ahash v0.7.8
48.77 s
[gammaloop-workspace-check] Checking pest v2.8.6
49.20 s
[gammaloop-workspace-check] Checking hashbrown v0.12.3
49.29 s
[gammaloop-workspace-check] Checking approx v0.4.0
49.45 s
[gammaloop-workspace-check] Checking seahash v4.1.0
49.54 s
[gammaloop-workspace-check] Checking insta v1.47.2
49.77 s
[gammaloop-workspace-check] Checking cgmath v0.18.0
49.88 s
[gammaloop-workspace-check] Checking num-rational v0.4.2
49.99 s
[gammaloop-workspace-check] Checking rend v0.4.2
50.47 s
[gammaloop-workspace-check] Checking toml v0.8.23
50.52 s
[gammaloop-workspace-check] Checking tabled v0.20.0
50.53 s
[gammaloop-workspace-check] Checking num-iter v0.1.45
50.64 s
[gammaloop-workspace-check] Checking ref-ops v0.2.5
50.82 s
[gammaloop-workspace-check] Checking num v0.4.3
50.89 s
[gammaloop-workspace-check] Checking rand_xoshiro v0.6.0
50.97 s
[gammaloop-workspace-check] Checking features v0.10.0
51.08 s
[gammaloop-workspace-check] Checking gat-lending-iterator v0.1.8
51.67 s
[gammaloop-workspace-check] Checking constcat v0.5.1
51.76 s
[gammaloop-workspace-check] Checking colored v2.2.0
51.91 s
[gammaloop-workspace-check] Checking arrayref v0.3.9
52.00 s
[gammaloop-workspace-check] Checking constant_time_eq v0.4.2
52.23 s
[gammaloop-workspace-check] Checking figment v0.10.19
52.30 s
[gammaloop-workspace-check] Checking cpufeatures v0.3.0
52.31 s
[gammaloop-workspace-check] Checking base64 v0.22.1
52.46 s
[gammaloop-workspace-check] Checking blake3 v1.8.5
53.11 s
[gammaloop-workspace-check] Checking siphasher v1.0.2
53.84 s
[gammaloop-workspace-check] Checking joinery v2.1.0
53.93 s
[gammaloop-workspace-check] Checking phf_shared v0.13.1
53.97 s
[gammaloop-workspace-check] Checking subprocess v0.2.15
54.09 s
[gammaloop-workspace-check] Checking rust_lisp v0.18.0
54.26 s
[gammaloop-workspace-check] Checking dot-parser v0.5.1
54.31 s
[gammaloop-workspace-check] Checking titlecase v2.2.1
54.48 s
[gammaloop-workspace-check] Compiling vakint v0.1.2 (/build/source/crates/vakint)
54.86 s
[gammaloop-workspace-check] Checking phf v0.13.1
54.87 s
[gammaloop-workspace-check] Checking version-compare v0.2.1
55.02 s
[gammaloop-workspace-check] Checking xpct v0.5.1
55.05 s
[gammaloop-workspace-check] Checking ryu v1.0.23
55.09 s
[gammaloop-workspace-check] Checking castaway v0.2.4
55.13 s
[gammaloop-workspace-check] Checking toml_datetime v0.7.5+spec-1.1.0
55.21 s
[gammaloop-workspace-check] Checking strum v0.27.2
55.26 s
[gammaloop-workspace-check] Checking compact_str v0.9.0
55.38 s
[gammaloop-workspace-check] Checking unicode-truncate v2.0.1
55.45 s
[gammaloop-workspace-check] Checking toml v0.9.12+spec-1.1.0
55.64 s
[gammaloop-workspace-check] Checking kasuari v0.4.12
56.14 s
[gammaloop-workspace-check] Checking lru v0.16.4
56.34 s
[gammaloop-workspace-check] Checking vte v0.15.0
56.43 s
[gammaloop-workspace-check] Checking portable-atomic v1.13.1
56.46 s
[gammaloop-workspace-check] Checking unit-prefix v0.5.2
56.48 s
[gammaloop-workspace-check] Checking rand_distr v0.4.3
56.48 s
[gammaloop-workspace-check] Checking simba v0.6.0
56.58 s
[gammaloop-workspace-check] Checking string-template-plus v0.4.3
56.78 s
[gammaloop-workspace-check] Checking vt100 v0.16.2
56.78 s
[gammaloop-workspace-check] Checking line-clipping v0.3.7
56.82 s
[gammaloop-workspace-check] Compiling three-dimensional-reps v0.1.0 (/build/source/crates/three-dimensional-reps)
57.21 s
[gammaloop-workspace-check] Checking adler2 v2.0.1
57.39 s
[gammaloop-workspace-check] Checking ratatui-core v0.1.0
57.61 s
[gammaloop-workspace-check] Checking gimli v0.32.3
57.62 s
[gammaloop-workspace-check] Checking miniz_oxide v0.8.9
57.96 s
[gammaloop-workspace-check] Checking thiserror v1.0.69
58.21 s
[gammaloop-workspace-check] Checking derive_builder v0.11.2
58.28 s
[gammaloop-workspace-check] Checking object v0.37.3
58.47 s
[gammaloop-workspace-check] Checking owo-colors v4.3.0
58.50 s
[gammaloop-workspace-check] Checking crossterm v0.29.0
58.71 s
[gammaloop-workspace-check] Checking tracing-error v0.2.1
58.82 s
[gammaloop-workspace-check] Checking indicatif v0.18.4
58.94 s
[gammaloop-workspace-check] Compiling rustpython-parser-core v0.4.0
59.08 s
[gammaloop-workspace-check] Checking typed-index-collections v3.5.0
59.72 s
[gammaloop-workspace-check] Compiling rustpython-ast v0.4.0
60.12 s
[gammaloop-workspace-check] Checking serde-big-array v0.5.1
60.23 s
[gammaloop-workspace-check] Checking rkyv v0.7.46
60.26 s
[gammaloop-workspace-check] Checking amd v0.2.2
60.48 s
[gammaloop-workspace-check] Checking itertools v0.11.0
60.62 s
[gammaloop-workspace-check] Compiling gammaloop-tracing-filter-macros v0.1.0 (/build/source/crates/gammaloop-tracing-filter-macros)
60.64 s
[gammaloop-workspace-check] Checking option-ext v0.2.0
60.82 s
[gammaloop-workspace-check] Checking rustc-demangle v0.1.27
60.87 s
[gammaloop-workspace-check] Checking dirs-sys v0.5.0
61.24 s
[gammaloop-workspace-check] Checking ref-cast v1.0.25
61.36 s
[gammaloop-workspace-check] Checking nix v0.31.2
61.42 s
[gammaloop-workspace-check] Checking brotli-decompressor v4.0.3
61.88 s
[gammaloop-workspace-check] Checking env_logger v0.11.10
61.92 s
[gammaloop-workspace-check] Checking ratatui-widgets v0.3.0
62.11 s
[gammaloop-workspace-check] Checking integer-sqrt v0.1.5
62.18 s
[gammaloop-workspace-check] Checking ratatui-crossterm v0.1.0
62.36 s
[gammaloop-workspace-check] Checking crossbeam-channel v0.5.15
62.43 s
[gammaloop-workspace-check] Checking itertools v0.12.1
62.61 s
[gammaloop-workspace-check] Checking symlink v0.1.0
62.73 s
[gammaloop-workspace-check] Compiling gammalooprs v0.3.4 (/build/source/crates/gammalooprs)
63.13 s
[gammaloop-workspace-check] Checking unsafe-libyaml v0.2.11
63.73 s
[gammaloop-workspace-check] Checking include_dir v0.7.4
63.88 s
[gammaloop-workspace-check] Checking color-spantrace v0.3.0
64.00 s
[gammaloop-workspace-check] Checking pathfinding v4.15.0
64.07 s
[gammaloop-workspace-check] Checking ctrlc v3.5.2
64.28 s
[gammaloop-workspace-check] Checking tracing-appender v0.2.5
64.45 s
[gammaloop-workspace-check] Checking schemars v1.2.1
64.69 s
[gammaloop-workspace-check] Checking slotmap v1.1.1
65.39 s
[gammaloop-workspace-check] Checking dirs v6.0.0
65.48 s
[gammaloop-workspace-check] Checking brotli v7.0.0
65.56 s
[gammaloop-workspace-check] Checking ratatui-macros v0.7.0
65.58 s
[gammaloop-workspace-check] Checking addr2line v0.25.1
65.66 s
[gammaloop-workspace-check] Checking tracing-indicatif v0.3.14
65.69 s
[gammaloop-workspace-check] Checking ratatui v0.30.0
66.14 s
[gammaloop-workspace-check] Checking json5 v0.4.1
66.19 s
[gammaloop-workspace-check] Checking vectorize v0.2.0
66.41 s
[gammaloop-workspace-check] Checking ringbuffer v0.16.0
66.58 s
[gammaloop-workspace-check] Checking base62 v2.2.4
67.11 s
[gammaloop-workspace-check] Checking clarabel v0.11.1
67.19 s
[gammaloop-workspace-check] Checking rust-embed v8.11.0
67.23 s
[gammaloop-workspace-check] Checking clap_complete v4.6.3
67.35 s
[gammaloop-workspace-check] Checking fd-lock v4.0.4
67.52 s
[gammaloop-workspace-check] Checking serde_yaml v0.9.34+deprecated
67.58 s
[gammaloop-workspace-check] Checking strip-ansi-escapes v0.2.1
67.66 s
[gammaloop-workspace-check] Compiling gammaloop-api v0.1.0 (/build/source/crates/gammaloop-api)
67.75 s
[gammaloop-workspace-check] Checking itertools v0.13.0
67.92 s
[gammaloop-workspace-check] Checking strum v0.26.3
67.96 s
[gammaloop-workspace-check] Checking sysinfo v0.33.1
68.17 s
[gammaloop-workspace-check] Checking shlex v1.3.0
68.47 s
[gammaloop-workspace-check] Checking slab v0.4.12
68.65 s
[gammaloop-workspace-check] Checking futures-core v0.3.32
68.91 s
[gammaloop-workspace-check] Checking futures-task v0.3.32
69.01 s
[gammaloop-workspace-check] Checking sdd v3.0.10
69.12 s
[gammaloop-workspace-check] Compiling gammaloop-integration-tests v0.1.0 (/build/source/tests)
69.14 s
[gammaloop-workspace-check] Checking futures-util v0.3.32
69.23 s
[gammaloop-workspace-check] Checking clap_complete_nushell v4.6.0
69.75 s
[gammaloop-workspace-check] Compiling test-log-core v0.2.20
69.88 s
[gammaloop-workspace-check] Checking scc v2.4.0
71.13 s
[gammaloop-workspace-check] Compiling rustc_version v0.4.1
71.72 s
[gammaloop-workspace-check] Checking reedline v0.42.0
72.03 s
[gammaloop-workspace-check] Checking which v8.0.2
72.33 s
[gammaloop-workspace-check] Checking bincode v1.3.3
72.58 s
[gammaloop-workspace-check] Checking nalgebra v0.29.0
73.90 s
[gammaloop-workspace-check] Compiling numerica v2.2.0 (https://github.com/alphal00p/symbolica?rev=a277a8dadbaae5a8d6605f2f381991a601e1f345#a277a8da)
74.00 s
[gammaloop-workspace-check] Compiling gungraun-macros v0.8.0
74.06 s
[gammaloop-workspace-check] Compiling gungraun-runner v0.18.2
74.23 s
[gammaloop-workspace-check] Checking proc-macro2 v1.0.106
75.52 s
[gammaloop-workspace-check] Checking quote v1.0.45
75.81 s
[gammaloop-workspace-check] Checking maplit v1.0.2
75.96 s
[gammaloop-workspace-check] Checking base64 v0.21.7
76.32 s
[gammaloop-workspace-check] Checking backtrace v0.3.76
76.35 s
[gammaloop-workspace-check] Compiling test-log-macros v0.2.20
76.45 s
[gammaloop-workspace-check] Compiling iai-callgrind-runner v0.14.2
76.89 s
[gammaloop-workspace-check] Checking ron v0.8.1
77.08 s
[gammaloop-workspace-check] Checking kurbo v0.13.0
77.53 s
[gammaloop-workspace-check] Checking color-eyre v0.6.5
77.64 s
[gammaloop-workspace-check] Checking wait-timeout v0.2.1
77.82 s
[gammaloop-workspace-check] Checking quick-error v1.2.3
77.94 s
[gammaloop-workspace-check] Compiling iai-callgrind v0.14.2
78.28 s
[gammaloop-workspace-check] Checking bit-vec v0.8.0
78.35 s
[gammaloop-workspace-check] Checking futures-executor v0.3.32
78.46 s
[gammaloop-workspace-check] Checking rusty-fork v0.3.1
78.62 s
[gammaloop-workspace-check] Checking syn v2.0.117
78.64 s
[gammaloop-workspace-check] Checking serial_test v3.4.0
78.75 s
[gammaloop-workspace-check] Compiling iai-callgrind-macros v0.5.1
78.90 s
[gammaloop-workspace-check] Checking bit-set v0.8.0
78.98 s
[gammaloop-workspace-check] Checking rand_xorshift v0.4.0
79.12 s
[gammaloop-workspace-check] Checking console v0.15.11
79.23 s
[gammaloop-workspace-check] Checking pathdiff v0.2.3
79.34 s
[gammaloop-workspace-check] Checking unarray v0.1.4
79.43 s
[gammaloop-workspace-check] Checking proptest v1.11.0
80.09 s
[gammaloop-workspace-check] Checking kurvst v0.1.0 (/build/source/crates/kurvst)
80.49 s
[gammaloop-workspace-check] Checking similar-asserts v1.7.0
80.90 s
[gammaloop-workspace-check] Checking clinnet v0.1.8 (/build/source/crates/clinnet)
84.70 s
[gammaloop-workspace-check] Checking test-log v0.2.20
92.53 s
[gammaloop-workspace-check] Compiling graphica v2.1.0 (https://github.com/alphal00p/symbolica?rev=a277a8dadbaae5a8d6605f2f381991a601e1f345#a277a8da)
101.56 s
[gammaloop-workspace-check] Checking statrs v0.16.1
105.60 s
[gammaloop-workspace-check] Checking gungraun v0.18.2
106.97 s
[gammaloop-workspace-check] Checking momtrop v0.3.0
107.48 s
[gammaloop-workspace-check] Compiling pyo3-stub-gen-derive v0.17.2
113.86 s
[gammaloop-workspace-check] Compiling pyo3-macros v0.28.3
133.65 s
[gammaloop-workspace-check] Checking pyo3-stub-gen v0.17.2
150.88 s
[gammaloop-workspace-check] Checking symbolica-utils v0.1.0 (/build/source/crates/symbolica-utils)
150.88 s
[gammaloop-workspace-check] Checking spenso-macros v0.3.2 (/build/source/crates/spenso-macros)
430.95 s
[gammaloop-workspace-check] Compiling gammaloop-workspace-hack v0.1.0 (/build/source/crates/gammaloop-workspace-hack)
431.45 s
[gammaloop-workspace-check] Checking linnet v0.17.0 (/build/source/crates/linnet)
436.75 s
[gammaloop-workspace-check] Checking spenso v0.6.0 (/build/source/crates/spenso)
437.38 s
[gammaloop-workspace-check] Checking linnet-py v0.1.0 (/build/source/crates/linnet-py)
437.38 s
[gammaloop-workspace-check] Checking linnest v0.1.0 (/build/source/crates/linnest)
445.89 s
[gammaloop-workspace-check] Checking idenso v0.3.0 (/build/source/crates/idenso)
445.89 s
[gammaloop-workspace-check] Checking gammaloop-tracing-filter v0.1.0 (/build/source/crates/gammaloop-tracing-filter)
449.02 s
[gammaloop-workspace-check] Checking spenso-hep-lib v0.1.7 (/build/source/crates/spenso-hep-lib)
449.44 s
[gammaloop-workspace-check] Checking spynso3 v0.1.2 (/build/source/crates/spynso3)
498.66 s
[gammaloop-workspace-check] error[E0560] : struct `CutInfo` has no field named `lmb_channel_id`
498.66 s
[gammaloop-workspace-check] --> tests/tests/test_differential.rs:86:13
498.66 s
[gammaloop-workspace-check] |
498.67 s
[gammaloop-workspace-check] 86 | lmb_channel_id: None,
498.67 s
[gammaloop-workspace-check] | ^^^^^^^^^^^^^^ `CutInfo` does not have this field
498.67 s
[gammaloop-workspace-check] |
498.67 s
[gammaloop-workspace-check] = note : available fields are: `sampling_channel_id`, `sampling_channel_edge_ids`
498.67 s
[gammaloop-workspace-check]
498.67 s
[gammaloop-workspace-check] error[E0560] : struct `CutInfo` has no field named `lmb_channel_edge_ids`
498.67 s
[gammaloop-workspace-check] --> tests/tests/test_differential.rs:87:13
498.67 s
[gammaloop-workspace-check] |
498.67 s
[gammaloop-workspace-check] 87 | lmb_channel_edge_ids: None,
498.67 s
[gammaloop-workspace-check] | ^^^^^^^^^^^^^^^^^^^^ `CutInfo` does not have this field
498.67 s
[gammaloop-workspace-check] |
498.67 s
[gammaloop-workspace-check] = note : available fields are: `sampling_channel_id`, `sampling_channel_edge_ids`
498.67 s
[gammaloop-workspace-check]
498.68 s
[gammaloop-workspace-check] error[E0063] : missing field `reference_moments` in initializer of `GraphEvaluationResult<_>`
498.68 s
[gammaloop-workspace-check] --> tests/tests/test_differential.rs:532:19
498.68 s
[gammaloop-workspace-check] |
498.68 s
[gammaloop-workspace-check] 532 | let mut lhs = GraphEvaluationResult {
498.68 s
[gammaloop-workspace-check] | ^^^^^^^^^^^^^^^^^^^^^ missing `reference_moments`
498.68 s
[gammaloop-workspace-check]
498.68 s
[gammaloop-workspace-check] error[E0063] : missing field `reference_moments` in initializer of `GraphEvaluationResult<_>`
498.68 s
[gammaloop-workspace-check] --> tests/tests/test_differential.rs:539:15
498.68 s
[gammaloop-workspace-check] |
498.68 s
[gammaloop-workspace-check] 539 | let rhs = GraphEvaluationResult {
498.68 s
[gammaloop-workspace-check] | ^^^^^^^^^^^^^^^^^^^^^ missing `reference_moments`
498.68 s
[gammaloop-workspace-check]
498.69 s
[gammaloop-workspace-check] error[E0609] : no field `lmb_channel_edge_ids` on type `CutInfo`
498.69 s
[gammaloop-workspace-check] --> tests/tests/test_evaluation_api.rs:311:10
498.69 s
[gammaloop-workspace-check] |
498.69 s
[gammaloop-workspace-check] 311 | .lmb_channel_edge_ids
498.69 s
[gammaloop-workspace-check] | ^^^^^^^^^^^^^^^^^^^^ unknown field
498.69 s
[gammaloop-workspace-check] |
498.69 s
[gammaloop-workspace-check] = note : available fields are: `particle_pdgs`, `cut_id`, `graph_id`, `graph_group_id`, `orientation_id` ... and 2 others
498.69 s
[gammaloop-workspace-check]
498.72 s
[gammaloop-workspace-check] error[E0609] : no field `lmb_channel_edge_ids` on type `CutInfo`
498.72 s
[gammaloop-workspace-check] --> tests/tests/test_evaluation_api.rs:591:26
498.72 s
[gammaloop-workspace-check] |
498.72 s
[gammaloop-workspace-check] 591 | .lmb_channel_edge_ids
498.72 s
[gammaloop-workspace-check] | ^^^^^^^^^^^^^^^^^^^^ unknown field
498.72 s
[gammaloop-workspace-check] |
498.72 s
[gammaloop-workspace-check] = note : available fields are: `particle_pdgs`, `cut_id`, `graph_id`, `graph_group_id`, `orientation_id` ... and 2 others
498.72 s
[gammaloop-workspace-check]
498.77 s
[gammaloop-workspace-check] Some errors have detailed explanations: E0063, E0560.
498.77 s
[gammaloop-workspace-check] For more information about an error, try `rustc --explain E0063`.
498.78 s
[gammaloop-workspace-check] error : could not compile `gammaloop-integration-tests` (test "test_differential") due to 4 previous errors
498.78 s
[gammaloop-workspace-check] warning : build failed, waiting for other jobs to finish...
498.78 s
[gammaloop-workspace-check] error[E0609] : no field `lmb_channel_edge_ids` on type `CutInfo`
498.78 s
[gammaloop-workspace-check] --> tests/tests/test_evaluation_api.rs:1177:18
498.78 s
[gammaloop-workspace-check] |
498.78 s
[gammaloop-workspace-check] 1177 | .lmb_channel_edge_ids
498.78 s
[gammaloop-workspace-check] | ^^^^^^^^^^^^^^^^^^^^ unknown field
498.78 s
[gammaloop-workspace-check] |
498.78 s
[gammaloop-workspace-check] = note : available fields are: `particle_pdgs`, `cut_id`, `graph_id`, `graph_group_id`, `orientation_id` ... and 2 others
498.78 s
[gammaloop-workspace-check]
498.93 s
[gammaloop-workspace-check] error[E0609] : no field `lmb_channel_edge_ids` on type `CutInfo`
498.93 s
[gammaloop-workspace-check] --> tests/tests/test_evaluation_api.rs:1222:22
498.93 s
[gammaloop-workspace-check] |
498.93 s
[gammaloop-workspace-check] 1222 | .lmb_channel_edge_ids
498.93 s
[gammaloop-workspace-check] | ^^^^^^^^^^^^^^^^^^^^ unknown field
498.93 s
[gammaloop-workspace-check] |
498.93 s
[gammaloop-workspace-check] = note : available fields are: `particle_pdgs`, `cut_id`, `graph_id`, `graph_group_id`, `orientation_id` ... and 2 others
498.93 s
[gammaloop-workspace-check]
498.93 s
[gammaloop-workspace-check] error[E0609] : no field `lmb_channel_edge_ids` on type `CutInfo`
498.93 s
[gammaloop-workspace-check] --> tests/tests/test_evaluation_api.rs:1281:14
498.93 s
[gammaloop-workspace-check] |
498.93 s
[gammaloop-workspace-check] 1281 | .lmb_channel_edge_ids
498.93 s
[gammaloop-workspace-check] | ^^^^^^^^^^^^^^^^^^^^ unknown field
498.93 s
[gammaloop-workspace-check] |
498.93 s
[gammaloop-workspace-check] = note : available fields are: `particle_pdgs`, `cut_id`, `graph_id`, `graph_group_id`, `orientation_id` ... and 2 others
498.93 s
[gammaloop-workspace-check]
499.00 s
[gammaloop-workspace-check] error[E0609] : no field `lmb_channel_edge_ids` on type `CutInfo`
499.00 s
[gammaloop-workspace-check] --> tests/tests/test_evaluation_api.rs:1428:18
499.00 s
[gammaloop-workspace-check] |
499.00 s
[gammaloop-workspace-check] 1428 | .lmb_channel_edge_ids
499.00 s
[gammaloop-workspace-check] | ^^^^^^^^^^^^^^^^^^^^ unknown field
499.00 s
[gammaloop-workspace-check] |
499.00 s
[gammaloop-workspace-check] = note : available fields are: `particle_pdgs`, `cut_id`, `graph_id`, `graph_group_id`, `orientation_id` ... and 2 others
499.00 s
[gammaloop-workspace-check]
499.16 s
[gammaloop-workspace-check] For more information about this error, try `rustc --explain E0609`.
499.18 s
[gammaloop-workspace-check] error : could not compile `gammaloop-integration-tests` (test "test_evaluation_api") due to 6 previous errors
499.92 s
[gammaloop-workspace-check] error[E0609] : no field `lmb_channel_id` on type `CutInfo`
499.92 s
[gammaloop-workspace-check] --> tests/tests/test_runs/utils.rs:568:36
499.92 s
[gammaloop-workspace-check] |
499.92 s
[gammaloop-workspace-check] 568 | event.cut_info.lmb_channel_id,
499.92 s
[gammaloop-workspace-check] | ^^^^^^^^^^^^^^ unknown field
499.92 s
[gammaloop-workspace-check] |
499.92 s
[gammaloop-workspace-check] = note : available fields are: `particle_pdgs`, `cut_id`, `graph_id`, `graph_group_id`, `orientation_id` ... and 2 others
499.92 s
[gammaloop-workspace-check]
499.92 s
[gammaloop-workspace-check] error[E0609] : no field `lmb_channel_id` on type `CutInfo`
499.92 s
[gammaloop-workspace-check] --> tests/tests/test_runs/utils.rs:580:36
499.92 s
[gammaloop-workspace-check] |
499.92 s
[gammaloop-workspace-check] 580 | event.cut_info.lmb_channel_id,
499.92 s
[gammaloop-workspace-check] | ^^^^^^^^^^^^^^ unknown field
499.92 s
[gammaloop-workspace-check] |
499.92 s
[gammaloop-workspace-check] = note : available fields are: `particle_pdgs`, `cut_id`, `graph_id`, `graph_group_id`, `orientation_id` ... and 2 others
499.92 s
[gammaloop-workspace-check]
500.55 s
[gammaloop-workspace-check] error : could not compile `gammaloop-integration-tests` (test "test_runs") due to 2 previous errors
501.33 s
Progress: 0 of 1 built (1 failed)
501.33 s
Failed to build gammaloop-workspace-check after 8m14s
501.34 s
Cannot build ' /nix/store/i729pk8pca0mvg4wgc9cqnnlslm5qsi9-gammaloop-workspace-check-0.1.0.drv '.
501.34 s
Reason: builder failed with exit code 101 .
501.34 s
Output paths:
501.34 s
/nix/store/hvg6j34250fq6p1xcmg7sqwh8dbfvya8-gammaloop-workspace-check-0.1.0
501.34 s
Last 524 log lines:
501.34 s
> Running phase: unpackPhase
501.34 s
> unpacking source archive /nix/store/qqslq36f7201lf1f2zyjcqsf7w9pg5dy-source
501.34 s
> source root is source
501.34 s
> Running phase: patchPhase
501.34 s
> Executing configureCargoCommonVars
501.34 s
> decompressing cargo artifacts from /nix/store/50vpxlcgfxf2d57i27v3d10zjwxxbm2r-gammaloop-workspace-deps-deps-0.1.0/target.tar.zst to target
501.34 s
> Running phase: updateAutotoolsGnuConfigScriptsPhase
501.34 s
> Running phase: configurePhase
501.34 s
> will append /build/source/.cargo-home/config.toml with contents of /nix/store/5drf77x6km4ky7gwlrzdx9bbd6fz09g3-vendor-cargo-deps/config.toml
501.34 s
> default configurePhase, nothing to do
501.34 s
> Running phase: buildPhase
501.34 s
> +++ command cargo --version
501.34 s
> cargo 1.97.0 (c980f4866 2026-06-30)
501.34 s
> +++ command cargo check --profile ci-optim --locked --workspace --features gammaloop-tracing-filter/clap,gammaloop-tracing-filter/symbolica,idenso/bincode,idenso/reference-cases,linnet/bincode,linnet/drawing,linnet/rkyv,linnet/serde,linnet/symbolica,spenso-macros/shadowing,spenso/shadowing,symbolica/tracing_max_level_info,three-dimensional-reps/display,three-dimensional-reps/eval,three-dimensional-reps/serde --all-targets
501.34 s
> Checking cfg-if v1.0.4
501.34 s
> Checking memchr v2.8.0
501.34 s
> Checking once_cell v1.21.4
501.34 s
> Checking either v1.15.0
501.34 s
> Checking serde_core v1.0.228
501.34 s
> Checking libc v0.2.186
501.34 s
> Checking libm v0.2.16
501.34 s
> Checking itoa v1.0.18
501.34 s
> Checking log v0.4.29
501.34 s
> Checking regex-syntax v0.8.10
501.34 s
> Checking zerocopy v0.8.48
501.34 s
> Checking crossbeam-utils v0.8.21
501.34 s
> Checking equivalent v1.0.2
501.34 s
> Checking zmij v1.0.21
501.34 s
> Checking bytemuck v1.25.0
501.34 s
> Checking lazy_static v1.5.0
501.34 s
> Compiling target-lexicon v0.13.5
501.34 s
> Checking arrayvec v0.7.6
501.34 s
> Checking powerfmt v0.2.0
501.34 s
> Checking num-conv v0.2.1
501.34 s
> Checking num_threads v0.1.7
501.34 s
> Checking pin-project-lite v0.2.17
501.34 s
> Checking itertools v0.14.0
501.34 s
> Checking time-core v0.1.8
501.34 s
> Checking tracing-core v0.1.36
501.34 s
> Checking allocator-api2 v0.2.21
501.34 s
> Checking deranged v0.5.8
501.34 s
> Checking foldhash v0.2.0
501.34 s
> Checking safe_arch v0.7.4
501.34 s
> Checking const-random v0.1.18
501.34 s
> Checking nu-ansi-term v0.50.3
501.34 s
> Checking winnow v1.0.2
501.34 s
> Checking static_assertions v1.1.0
501.34 s
> Checking unty v0.0.4
501.34 s
> Checking safe_arch v1.0.0
501.34 s
> Checking sharded-slab v0.1.7
501.34 s
> Checking crossbeam-epoch v0.9.18
501.34 s
> Checking aho-corasick v1.1.4
501.34 s
> Checking thread_local v1.1.9
501.34 s
> Checking wide v0.7.33
501.34 s
> Checking hashbrown v0.16.1
501.34 s
> Checking tracing v0.1.44
501.34 s
> Checking tracing-log v0.2.0
501.34 s
> Checking az v1.3.0
501.34 s
> Checking crossbeam-deque v0.8.6
501.34 s
> Checking indenter v0.3.4
501.34 s
> Checking toml_writer v1.1.1+spec-1.1.0
501.34 s
> Checking wide v1.3.0
501.34 s
> Checking num-traits v0.2.19
501.34 s
> Compiling phf_shared v0.11.3
501.34 s
> Checking rayon-core v1.13.0
501.34 s
> Checking anyhow v1.0.102
501.34 s
> Checking approx v0.5.1
501.34 s
> Checking num-integer v0.1.46
501.34 s
> Checking dyn-clone v1.0.20
501.34 s
> Checking rawpointer v0.2.1
501.34 s
> Checking alloc-no-stdlib v2.0.4
501.34 s
> Checking utf8parse v0.2.2
501.34 s
> Checking matrixmultiply v0.3.10
501.34 s
> Checking alloc-stdlib v0.2.2
501.34 s
> Checking anstyle-parse v1.0.0
501.34 s
> Checking colorchoice v1.0.5
501.34 s
> Checking anstyle-query v1.1.5
501.34 s
> Checking rayon v1.12.0
501.34 s
> Checking is_terminal_polyfill v1.70.2
501.34 s
> Checking colored v3.1.1
501.34 s
> Checking anstyle v1.0.14
501.34 s
> Compiling pyo3-build-config v0.28.3
501.34 s
> Compiling phf_generator v0.11.3
501.34 s
> Checking anstream v1.0.0
501.34 s
> Checking eyre v0.6.12
501.34 s
> Checking bitflags v1.3.2
501.34 s
> Checking unicode-width v0.2.2
501.34 s
> Checking brotli-decompressor v5.0.0
501.34 s
> Checking spec_math v0.1.6
501.34 s
> Compiling phf_codegen v0.11.3
501.34 s
> Checking inventory v0.3.24
501.34 s
> Checking thiserror v2.0.18
501.34 s
> Compiling getopts v0.2.24
501.34 s
> Checking libloading v0.9.0
501.34 s
> Checking toml_parser v1.1.2+spec-1.1.0
501.34 s
> Checking self_cell v1.2.2
501.34 s
> Checking tinyjson v2.5.1
501.34 s
> Checking append-only-vec v0.1.8
501.34 s
> Checking bytes v1.11.1
501.34 s
> Checking regex-automata v0.4.14
501.34 s
> Checking byteorder v1.5.0
501.34 s
> Compiling unicode_names2_generator v1.3.0
501.34 s
> Checking linux-raw-sys v0.12.1
501.34 s
> Compiling unic-common v0.9.0
501.34 s
> Compiling unic-char-range v0.9.0
501.34 s
> Compiling unic-char-property v0.9.0
501.34 s
> Compiling unic-ucd-version v0.9.0
501.34 s
> Checking serde v1.0.228
501.34 s
> Checking serde_json v1.0.149
501.34 s
> Checking bitflags v2.11.1
501.34 s
> Checking serde_spanned v1.1.1
501.34 s
> Checking toml_datetime v1.1.1+spec-1.1.0
501.34 s
> Checking getrandom v0.3.4
501.34 s
> Checking time v0.3.47
501.34 s
> Checking rand_core v0.9.5
501.34 s
> Checking gmp-mpfr-sys v1.7.1
501.34 s
> Checking wasmtime-jit-icache-coherence v34.0.2
501.34 s
> Checking hugepage-rs v0.1.1
501.34 s
> Checking toml v1.1.2+spec-1.1.0
501.34 s
> Checking region v3.0.2
501.34 s
> Checking brotli v8.0.2
501.34 s
> Compiling is-macro v0.3.7
501.34 s
> Checking rustix v1.1.4
501.34 s
> Compiling rustpython-parser-vendored v0.4.0
501.34 s
> Checking iana-time-zone v0.1.65
501.34 s
> Compiling rustpython-parser v0.4.0
501.34 s
> Compiling phf v0.11.3
501.34 s
> Checking rustc-hash v2.1.2
501.34 s
> Compiling unic-emoji-char v0.9.0
501.34 s
> Compiling unic-ucd-ident v0.9.0
501.34 s
> Compiling lalrpop-util v0.20.2
501.34 s
> Checking smallvec v1.15.1
501.34 s
> Checking num-complex v0.4.6
501.34 s
> Checking tracing-serde v0.2.0
501.34 s
> Checking bincode v2.0.1
501.34 s
> Checking smartstring v1.0.1
501.34 s
> Checking chrono v0.4.44
501.34 s
> Compiling rustc-hash v1.1.0
501.34 s
> Checking rug v1.30.0
501.34 s
> Compiling symbolica v2.2.0 (https://github.com/alphal00p/symbolica?rev=a277a8dadbaae5a8d6605f2f381991a601e1f345#a277a8da)
501.34 s
> Checking unicode-segmentation v1.13.2
501.34 s
> Checking simba v0.9.1
501.34 s
> Checking ndarray v0.17.2
501.34 s
> Checking typenum v1.20.0
501.34 s
> Checking getrandom v0.2.17
501.34 s
> Checking scopeguard v1.2.0
501.34 s
> Checking lock_api v0.4.14
501.34 s
> Checking parking_lot_core v0.9.12
501.34 s
> Checking hashbrown v0.17.0
501.34 s
> Checking unicode-ident v1.0.24
501.34 s
> Checking errno v0.3.14
501.34 s
> Checking clap_lex v1.1.0
501.34 s
> Checking parking_lot v0.12.5
501.34 s
> Checking strsim v0.11.1
501.34 s
> Checking unicase v2.9.0
501.34 s
> Checking signal-hook-registry v1.4.8
501.34 s
> Checking vte v0.14.1
501.34 s
> Checking same-file v1.0.6
501.34 s
> Checking mio v1.2.0
501.34 s
> Checking walkdir v2.5.0
501.34 s
> Checking generic-array v0.14.7
501.34 s
> Checking terminal_size v0.4.4
501.34 s
> Checking signal-hook v0.3.18
501.34 s
> Checking clap_builder v4.6.0
501.34 s
> Checking ciborium-io v0.2.2
501.34 s
> Checking minimal-lexical v0.2.1
501.34 s
> Checking derive_more v2.1.1
501.34 s
> Checking indexmap v2.14.0
501.34 s
> Checking nom v7.1.3
501.34 s
> Checking num-bigint v0.4.6
501.34 s
> Checking signal-hook-mio v0.2.5
501.34 s
> Checking console v0.16.3
501.34 s
> Checking block-buffer v0.10.4
501.34 s
> Checking crypto-common v0.1.7
501.34 s
> Checking digest v0.10.7
501.34 s
> Checking bstr v1.12.1
501.34 s
> Checking cpufeatures v0.2.17
501.34 s
> Checking winnow v0.7.15
501.34 s
> Checking linux-raw-sys v0.4.15
501.34 s
> Checking matchers v0.2.0
501.34 s
> Checking tracing-subscriber v0.3.23
501.34 s
> Checking regex v1.12.3
501.34 s
> Checking ppv-lite86 v0.2.21
501.34 s
> Checking ahash v0.8.12
501.34 s
> Compiling unicode_names2 v1.3.0
501.34 s
> Checking half v2.7.1
501.34 s
> Checking rand_chacha v0.9.0
501.34 s
> Checking ciborium-ll v0.2.2
501.34 s
> Checking rand v0.9.4
501.34 s
> Checking globset v0.4.18
501.34 s
> Checking ciborium v0.2.2
501.34 s
> Checking rustix v0.38.44
501.34 s
> Checking sha2 v0.10.9
501.34 s
> Checking getrandom v0.4.2
501.34 s
> Checking rand_core v0.6.4
501.34 s
> Checking ansitok v0.3.0
501.34 s
> Checking symjit v2.21.0
501.34 s
> Checking fnv v1.0.7
501.34 s
> Checking plotters-backend v0.3.7
501.34 s
> Checking fastrand v2.4.1
501.34 s
> Checking rust-embed-utils v8.11.0
501.34 s
> Checking toml_datetime v0.6.11
501.34 s
> Checking crossterm v0.28.1
501.34 s
> Checking plotters-svg v0.3.7
501.34 s
> Checking serde_spanned v0.6.9
501.34 s
> Checking itertools v0.10.5
501.34 s
> Checking clap v4.6.1
501.34 s
> Checking toml_write v0.1.2
501.34 s
> Checking tap v1.0.1
501.34 s
> Checking tempfile v3.27.0
501.34 s
> Checking cast v0.3.0
501.34 s
> Checking wyz v0.5.1
501.34 s
> Checking plotters v0.3.7
501.34 s
> Checking rand_chacha v0.3.1
501.34 s
> Checking ansi-str v0.9.0
501.34 s
> Checking toml_edit v0.22.27
501.34 s
> Checking radium v0.7.0
501.34 s
> Checking typeid v1.0.3
501.34 s
> Checking similar v2.7.0
501.34 s
> Checking tinytemplate v1.2.1
501.34 s
> Checking is-terminal v0.4.17
501.34 s
> Checking anes v0.1.6
501.34 s
> Checking oorandom v11.1.5
501.34 s
> Checking funty v2.0.0
501.34 s
> Checking bytecount v0.6.9
501.34 s
> Checking rand v0.8.6
501.34 s
> Checking ron v0.12.1
501.34 s
> Checking testing_table v0.3.0
501.34 s
> Checking papergrid v0.17.0
501.34 s
> Checking env_filter v1.0.1
501.34 s
> Checking bitvec v1.0.1
501.34 s
> Checking toml_edit v0.25.11+spec-1.1.0
501.34 s
> Checking uncased v0.9.10
501.34 s
> Checking jiff v0.2.24
501.34 s
> Checking criterion-plot v0.5.0
501.34 s
> Checking ptr_meta v0.1.4
501.34 s
> Checking simdutf8 v0.1.5
501.34 s
> Compiling pyo3-ffi v0.28.3
501.34 s
> Compiling pyo3-macros-backend v0.28.3
501.34 s
> Compiling pyo3 v0.28.3
501.34 s
> Compiling numpy v0.28.0
501.34 s
> Checking xprec v0.2.2
501.34 s
> Checking ucd-trie v0.1.7
501.34 s
> Checking criterion v0.5.1
501.34 s
> Checking bytecheck v0.6.12
501.34 s
> Checking ahash v0.7.8
501.34 s
> Checking pest v2.8.6
501.34 s
> Checking hashbrown v0.12.3
501.34 s
> Checking approx v0.4.0
501.34 s
> Checking seahash v4.1.0
501.34 s
> Checking insta v1.47.2
501.34 s
> Checking cgmath v0.18.0
501.34 s
> Checking num-rational v0.4.2
501.34 s
> Checking rend v0.4.2
501.34 s
> Checking toml v0.8.23
501.34 s
> Checking tabled v0.20.0
501.34 s
> Checking num-iter v0.1.45
501.34 s
> Checking ref-ops v0.2.5
501.34 s
> Checking num v0.4.3
501.34 s
> Checking rand_xoshiro v0.6.0
501.34 s
> Checking features v0.10.0
501.34 s
> Checking gat-lending-iterator v0.1.8
501.34 s
> Checking constcat v0.5.1
501.34 s
> Checking colored v2.2.0
501.34 s
> Checking arrayref v0.3.9
501.34 s
> Checking constant_time_eq v0.4.2
501.34 s
> Checking figment v0.10.19
501.34 s
> Checking cpufeatures v0.3.0
501.34 s
> Checking base64 v0.22.1
501.34 s
> Checking blake3 v1.8.5
501.34 s
> Checking siphasher v1.0.2
501.34 s
> Checking joinery v2.1.0
501.34 s
> Checking phf_shared v0.13.1
501.34 s
> Checking subprocess v0.2.15
501.34 s
> Checking rust_lisp v0.18.0
501.34 s
> Checking dot-parser v0.5.1
501.34 s
> Checking titlecase v2.2.1
501.34 s
> Compiling vakint v0.1.2 (/build/source/crates/vakint)
501.34 s
> Checking phf v0.13.1
501.34 s
> Checking version-compare v0.2.1
501.34 s
> Checking xpct v0.5.1
501.34 s
> Checking ryu v1.0.23
501.34 s
> Checking castaway v0.2.4
501.34 s
> Checking toml_datetime v0.7.5+spec-1.1.0
501.34 s
> Checking strum v0.27.2
501.34 s
> Checking compact_str v0.9.0
501.34 s
> Checking unicode-truncate v2.0.1
501.34 s
> Checking toml v0.9.12+spec-1.1.0
501.34 s
> Checking kasuari v0.4.12
501.34 s
> Checking lru v0.16.4
501.34 s
> Checking vte v0.15.0
501.34 s
> Checking portable-atomic v1.13.1
501.34 s
> Checking unit-prefix v0.5.2
501.34 s
> Checking rand_distr v0.4.3
501.34 s
> Checking simba v0.6.0
501.34 s
> Checking string-template-plus v0.4.3
501.34 s
> Checking vt100 v0.16.2
501.34 s
> Checking line-clipping v0.3.7
501.34 s
> Compiling three-dimensional-reps v0.1.0 (/build/source/crates/three-dimensional-reps)
501.34 s
> Checking adler2 v2.0.1
501.34 s
> Checking ratatui-core v0.1.0
501.34 s
> Checking gimli v0.32.3
501.34 s
> Checking miniz_oxide v0.8.9
501.34 s
> Checking thiserror v1.0.69
501.34 s
> Checking derive_builder v0.11.2
501.34 s
> Checking object v0.37.3
501.34 s
> Checking owo-colors v4.3.0
501.34 s
> Checking crossterm v0.29.0
501.34 s
> Checking tracing-error v0.2.1
501.34 s
> Checking indicatif v0.18.4
501.34 s
> Compiling rustpython-parser-core v0.4.0
501.34 s
> Checking typed-index-collections v3.5.0
501.34 s
> Compiling rustpython-ast v0.4.0
501.34 s
> Checking serde-big-array v0.5.1
501.34 s
> Checking rkyv v0.7.46
501.34 s
> Checking amd v0.2.2
501.34 s
> Checking itertools v0.11.0
501.34 s
> Compiling gammaloop-tracing-filter-macros v0.1.0 (/build/source/crates/gammaloop-tracing-filter-macros)
501.34 s
> Checking option-ext v0.2.0
501.34 s
> Checking rustc-demangle v0.1.27
501.34 s
> Checking dirs-sys v0.5.0
501.34 s
> Checking ref-cast v1.0.25
501.34 s
> Checking nix v0.31.2
501.34 s
> Checking brotli-decompressor v4.0.3
501.34 s
> Checking env_logger v0.11.10
501.34 s
> Checking ratatui-widgets v0.3.0
501.34 s
> Checking integer-sqrt v0.1.5
501.34 s
> Checking ratatui-crossterm v0.1.0
501.34 s
> Checking crossbeam-channel v0.5.15
501.34 s
> Checking itertools v0.12.1
501.34 s
> Checking symlink v0.1.0
501.34 s
> Compiling gammalooprs v0.3.4 (/build/source/crates/gammalooprs)
501.34 s
> Checking unsafe-libyaml v0.2.11
501.34 s
> Checking include_dir v0.7.4
501.34 s
> Checking color-spantrace v0.3.0
501.34 s
> Checking pathfinding v4.15.0
501.34 s
> Checking ctrlc v3.5.2
501.34 s
> Checking tracing-appender v0.2.5
501.34 s
> Checking schemars v1.2.1
501.34 s
> Checking slotmap v1.1.1
501.34 s
> Checking dirs v6.0.0
501.34 s
> Checking brotli v7.0.0
501.34 s
> Checking ratatui-macros v0.7.0
501.34 s
> Checking addr2line v0.25.1
501.34 s
> Checking tracing-indicatif v0.3.14
501.34 s
> Checking ratatui v0.30.0
501.34 s
> Checking json5 v0.4.1
501.34 s
> Checking vectorize v0.2.0
501.34 s
> Checking ringbuffer v0.16.0
501.34 s
> Checking base62 v2.2.4
501.34 s
> Checking clarabel v0.11.1
501.34 s
> Checking rust-embed v8.11.0
501.34 s
> Checking clap_complete v4.6.3
501.34 s
> Checking fd-lock v4.0.4
501.34 s
> Checking serde_yaml v0.9.34+deprecated
501.34 s
> Checking strip-ansi-escapes v0.2.1
501.34 s
> Compiling gammaloop-api v0.1.0 (/build/source/crates/gammaloop-api)
501.34 s
> Checking itertools v0.13.0
501.34 s
> Checking strum v0.26.3
501.34 s
> Checking sysinfo v0.33.1
501.34 s
> Checking shlex v1.3.0
501.34 s
> Checking slab v0.4.12
501.34 s
> Checking futures-core v0.3.32
501.34 s
> Checking futures-task v0.3.32
501.34 s
> Checking sdd v3.0.10
501.34 s
> Compiling gammaloop-integration-tests v0.1.0 (/build/source/tests)
501.34 s
> Checking futures-util v0.3.32
501.34 s
> Checking clap_complete_nushell v4.6.0
501.34 s
> Compiling test-log-core v0.2.20
501.34 s
> Checking scc v2.4.0
501.34 s
> Compiling rustc_version v0.4.1
501.34 s
> Checking reedline v0.42.0
501.34 s
> Checking which v8.0.2
501.34 s
> Checking bincode v1.3.3
501.34 s
> Checking nalgebra v0.29.0
501.34 s
> Compiling numerica v2.2.0 (https://github.com/alphal00p/symbolica?rev=a277a8dadbaae5a8d6605f2f381991a601e1f345#a277a8da)
501.34 s
> Compiling gungraun-macros v0.8.0
501.34 s
> Compiling gungraun-runner v0.18.2
501.34 s
> Checking proc-macro2 v1.0.106
501.34 s
> Checking quote v1.0.45
501.34 s
> Checking maplit v1.0.2
501.34 s
> Checking base64 v0.21.7
501.34 s
> Checking backtrace v0.3.76
501.34 s
> Compiling test-log-macros v0.2.20
501.34 s
> Compiling iai-callgrind-runner v0.14.2
501.34 s
> Checking ron v0.8.1
501.34 s
> Checking kurbo v0.13.0
501.34 s
> Checking color-eyre v0.6.5
501.34 s
> Checking wait-timeout v0.2.1
501.34 s
> Checking quick-error v1.2.3
501.34 s
> Compiling iai-callgrind v0.14.2
501.34 s
> Checking bit-vec v0.8.0
501.34 s
> Checking futures-executor v0.3.32
501.34 s
> Checking rusty-fork v0.3.1
501.34 s
> Checking syn v2.0.117
501.34 s
> Checking serial_test v3.4.0
501.34 s
> Compiling iai-callgrind-macros v0.5.1
501.34 s
> Checking bit-set v0.8.0
501.34 s
> Checking rand_xorshift v0.4.0
501.34 s
> Checking console v0.15.11
501.34 s
> Checking pathdiff v0.2.3
501.34 s
> Checking unarray v0.1.4
501.34 s
> Checking proptest v1.11.0
501.34 s
> Checking kurvst v0.1.0 (/build/source/crates/kurvst)
501.34 s
> Checking similar-asserts v1.7.0
501.34 s
> Checking clinnet v0.1.8 (/build/source/crates/clinnet)
501.34 s
> Checking test-log v0.2.20
501.34 s
> Compiling graphica v2.1.0 (https://github.com/alphal00p/symbolica?rev=a277a8dadbaae5a8d6605f2f381991a601e1f345#a277a8da)
501.34 s
> Checking statrs v0.16.1
501.34 s
> Checking gungraun v0.18.2
501.34 s
> Checking momtrop v0.3.0
501.34 s
> Compiling pyo3-stub-gen-derive v0.17.2
501.34 s
> Compiling pyo3-macros v0.28.3
501.34 s
> Checking pyo3-stub-gen v0.17.2
501.34 s
> Checking symbolica-utils v0.1.0 (/build/source/crates/symbolica-utils)
501.34 s
> Checking spenso-macros v0.3.2 (/build/source/crates/spenso-macros)
501.34 s
> Compiling gammaloop-workspace-hack v0.1.0 (/build/source/crates/gammaloop-workspace-hack)
501.34 s
> Checking linnet v0.17.0 (/build/source/crates/linnet)
501.34 s
> Checking spenso v0.6.0 (/build/source/crates/spenso)
501.34 s
> Checking linnet-py v0.1.0 (/build/source/crates/linnet-py)
501.34 s
> Checking linnest v0.1.0 (/build/source/crates/linnest)
501.34 s
> Checking idenso v0.3.0 (/build/source/crates/idenso)
501.34 s
> Checking gammaloop-tracing-filter v0.1.0 (/build/source/crates/gammaloop-tracing-filter)
501.34 s
> Checking spenso-hep-lib v0.1.7 (/build/source/crates/spenso-hep-lib)
501.34 s
> Checking spynso3 v0.1.2 (/build/source/crates/spynso3)
501.34 s
> error[E0560] : struct `CutInfo` has no field named `lmb_channel_id`
501.34 s
> --> tests/tests/test_differential.rs:86:13
501.34 s
> |
501.34 s
> 86 | lmb_channel_id: None,
501.34 s
> | ^^^^^^^^^^^^^^ `CutInfo` does not have this field
501.34 s
> |
501.34 s
> = note : available fields are: `sampling_channel_id`, `sampling_channel_edge_ids`
501.34 s
>
501.34 s
> error[E0560] : struct `CutInfo` has no field named `lmb_channel_edge_ids`
501.34 s
> --> tests/tests/test_differential.rs:87:13
501.34 s
> |
501.34 s
> 87 | lmb_channel_edge_ids: None,
501.34 s
> | ^^^^^^^^^^^^^^^^^^^^ `CutInfo` does not have this field
501.34 s
> |
501.34 s
> = note : available fields are: `sampling_channel_id`, `sampling_channel_edge_ids`
501.34 s
>
501.34 s
> error[E0063] : missing field `reference_moments` in initializer of `GraphEvaluationResult<_>`
501.34 s
> --> tests/tests/test_differential.rs:532:19
501.34 s
> |
501.34 s
> 532 | let mut lhs = GraphEvaluationResult {
501.34 s
> | ^^^^^^^^^^^^^^^^^^^^^ missing `reference_moments`
501.34 s
>
501.34 s
> error[E0063] : missing field `reference_moments` in initializer of `GraphEvaluationResult<_>`
501.34 s
> --> tests/tests/test_differential.rs:539:15
501.34 s
> |
501.34 s
> 539 | let rhs = GraphEvaluationResult {
501.34 s
> | ^^^^^^^^^^^^^^^^^^^^^ missing `reference_moments`
501.34 s
>
501.34 s
> error[E0609] : no field `lmb_channel_edge_ids` on type `CutInfo`
501.34 s
> --> tests/tests/test_evaluation_api.rs:311:10
501.34 s
> |
501.34 s
> 311 | .lmb_channel_edge_ids
501.34 s
> | ^^^^^^^^^^^^^^^^^^^^ unknown field
501.34 s
> |
501.34 s
> = note : available fields are: `particle_pdgs`, `cut_id`, `graph_id`, `graph_group_id`, `orientation_id` ... and 2 others
501.34 s
>
501.34 s
> error[E0609] : no field `lmb_channel_edge_ids` on type `CutInfo`
501.34 s
> --> tests/tests/test_evaluation_api.rs:591:26
501.34 s
> |
501.34 s
> 591 | .lmb_channel_edge_ids
501.34 s
> | ^^^^^^^^^^^^^^^^^^^^ unknown field
501.34 s
> |
501.34 s
> = note : available fields are: `particle_pdgs`, `cut_id`, `graph_id`, `graph_group_id`, `orientation_id` ... and 2 others
501.34 s
>
501.34 s
> Some errors have detailed explanations: E0063, E0560.
501.34 s
> For more information about an error, try `rustc --explain E0063`.
501.34 s
> error : could not compile `gammaloop-integration-tests` (test "test_differential") due to 4 previous errors
501.34 s
> warning : build failed, waiting for other jobs to finish...
501.34 s
> error[E0609] : no field `lmb_channel_edge_ids` on type `CutInfo`
501.34 s
> --> tests/tests/test_evaluation_api.rs:1177:18
501.34 s
> |
501.34 s
> 1177 | .lmb_channel_edge_ids
501.34 s
> | ^^^^^^^^^^^^^^^^^^^^ unknown field
501.34 s
> |
501.34 s
> = note : available fields are: `particle_pdgs`, `cut_id`, `graph_id`, `graph_group_id`, `orientation_id` ... and 2 others
501.34 s
>
501.34 s
> error[E0609] : no field `lmb_channel_edge_ids` on type `CutInfo`
501.34 s
> --> tests/tests/test_evaluation_api.rs:1222:22
501.34 s
> |
501.34 s
> 1222 | .lmb_channel_edge_ids
501.34 s
> | ^^^^^^^^^^^^^^^^^^^^ unknown field
501.34 s
> |
501.34 s
> = note : available fields are: `particle_pdgs`, `cut_id`, `graph_id`, `graph_group_id`, `orientation_id` ... and 2 others
501.34 s
>
501.34 s
> error[E0609] : no field `lmb_channel_edge_ids` on type `CutInfo`
501.34 s
> --> tests/tests/test_evaluation_api.rs:1281:14
501.34 s
> |
501.34 s
> 1281 | .lmb_channel_edge_ids
501.34 s
> | ^^^^^^^^^^^^^^^^^^^^ unknown field
501.34 s
> |
501.34 s
> = note : available fields are: `particle_pdgs`, `cut_id`, `graph_id`, `graph_group_id`, `orientation_id` ... and 2 others
501.34 s
>
501.34 s
> error[E0609] : no field `lmb_channel_edge_ids` on type `CutInfo`
501.34 s
> --> tests/tests/test_evaluation_api.rs:1428:18
501.34 s
> |
501.34 s
> 1428 | .lmb_channel_edge_ids
501.34 s
> | ^^^^^^^^^^^^^^^^^^^^ unknown field
501.34 s
> |
501.34 s
> = note : available fields are: `particle_pdgs`, `cut_id`, `graph_id`, `graph_group_id`, `orientation_id` ... and 2 others
501.34 s
>
501.34 s
> For more information about this error, try `rustc --explain E0609`.
501.34 s
> error : could not compile `gammaloop-integration-tests` (test "test_evaluation_api") due to 6 previous errors
501.34 s
> error[E0609] : no field `lmb_channel_id` on type `CutInfo`
501.34 s
> --> tests/tests/test_runs/utils.rs:568:36
501.34 s
> |
501.34 s
> 568 | event.cut_info.lmb_channel_id,
501.34 s
> | ^^^^^^^^^^^^^^ unknown field
501.34 s
> |
501.34 s
> = note : available fields are: `particle_pdgs`, `cut_id`, `graph_id`, `graph_group_id`, `orientation_id` ... and 2 others
501.34 s
>
501.34 s
> error[E0609] : no field `lmb_channel_id` on type `CutInfo`
501.34 s
> --> tests/tests/test_runs/utils.rs:580:36
501.34 s
> |
501.34 s
> 580 | event.cut_info.lmb_channel_id,
501.34 s
> | ^^^^^^^^^^^^^^ unknown field
501.34 s
> |
501.34 s
> = note : available fields are: `particle_pdgs`, `cut_id`, `graph_id`, `graph_group_id`, `orientation_id` ... and 2 others
501.34 s
>
501.34 s
> error : could not compile `gammaloop-integration-tests` (test "test_runs") due to 2 previous errors
501.34 s
For full logs, run:
501.34 s
nix log /nix/store/i729pk8pca0mvg4wgc9cqnnlslm5qsi9-gammaloop-workspace-check-0.1.0.drv
501.40 s
Build failed.