build checks.x86_64-linux.gammaloop-check
0.02 s
$ /nix/store/9ypz3flqsrl5xl495mm8h645gadjsxi1-coreutils-9.11/bin/timeout --kill-after=15s 7200s /nix/store/23zk8sgzamrbmj1fday15szf7f2279s8-nix-2.34.7/bin/nix --extra-experimental-features nix-command --extra-experimental-features flakes --log-format internal-json build --no-link --print-out-paths git+https://github.com/alphal00p/gammaloop?ref=advanced_sampling&rev=17cab6f72c1df1d8c1446d47281e0e8c60d52e8b&shallow=1#checks.x86_64-linux.gammaloop-check --print-build-logs
5.89 s
7.30 s
Building /nix/store/ws66y79brahbksfmnksfcdd9g1qvcyzb-gammaloop-workspace-check-0.1.0.drv
7.42 s
[gammaloop-workspace-check] Phase: unpackPhase
7.42 s
[gammaloop-workspace-check] unpacking source archive /nix/store/ypmxspggpi4qfj1zy7ml6kwz1d0c3m10-source
7.62 s
[gammaloop-workspace-check] source root is source
7.69 s
[gammaloop-workspace-check] Phase: patchPhase
7.70 s
[gammaloop-workspace-check] Executing configureCargoCommonVars
7.70 s
[gammaloop-workspace-check] decompressing cargo artifacts from /nix/store/50vpxlcgfxf2d57i27v3d10zjwxxbm2r-gammaloop-workspace-deps-deps-0.1.0/target.tar.zst to target
11.46 s
[gammaloop-workspace-check] Phase: updateAutotoolsGnuConfigScriptsPhase
11.51 s
[gammaloop-workspace-check] Phase: configurePhase
11.51 s
[gammaloop-workspace-check] will append /build/source/.cargo-home/config.toml with contents of /nix/store/5drf77x6km4ky7gwlrzdx9bbd6fz09g3-vendor-cargo-deps/config.toml
11.52 s
[gammaloop-workspace-check] default configurePhase, nothing to do
11.52 s
[gammaloop-workspace-check] Phase: buildPhase
11.52 s
[gammaloop-workspace-check] +++ command cargo --version
11.53 s
[gammaloop-workspace-check] cargo 1.97.0 (c980f4866 2026-06-30)
11.57 s
[gammaloop-workspace-check] +++ command cargo check --profile ci-optim --locked --workspace --features gammaloop-tracing-filter/clap,gammaloop-tracing-filter/symbolica,idenso/bincode,idenso/reference-cases,linnet/bincode,linnet/drawing,linnet/rkyv,linnet/serde,linnet/symbolica,spenso-macros/shadowing,spenso/shadowing,symbolica/tracing_max_level_info,three-dimensional-reps/display,three-dimensional-reps/eval,three-dimensional-reps/serde --all-targets
12.48 s
[gammaloop-workspace-check] Checking cfg-if v1.0.4
12.48 s
[gammaloop-workspace-check] Checking memchr v2.8.0
12.48 s
[gammaloop-workspace-check] Checking once_cell v1.21.4
12.48 s
[gammaloop-workspace-check] Checking either v1.15.0
12.49 s
[gammaloop-workspace-check] Checking serde_core v1.0.228
12.49 s
[gammaloop-workspace-check] Checking libc v0.2.186
12.50 s
[gammaloop-workspace-check] Checking libm v0.2.16
12.52 s
[gammaloop-workspace-check] Checking itoa v1.0.18
12.54 s
[gammaloop-workspace-check] Checking log v0.4.29
12.54 s
[gammaloop-workspace-check] Checking regex-syntax v0.8.10
12.55 s
[gammaloop-workspace-check] Checking zerocopy v0.8.48
12.55 s
[gammaloop-workspace-check] Checking crossbeam-utils v0.8.21
12.55 s
[gammaloop-workspace-check] Checking equivalent v1.0.2
12.57 s
[gammaloop-workspace-check] Checking zmij v1.0.21
12.59 s
[gammaloop-workspace-check] Checking bytemuck v1.25.0
12.60 s
[gammaloop-workspace-check] Checking lazy_static v1.5.0
12.66 s
[gammaloop-workspace-check] Compiling target-lexicon v0.13.5
12.67 s
[gammaloop-workspace-check] Checking arrayvec v0.7.6
12.67 s
[gammaloop-workspace-check] Checking powerfmt v0.2.0
12.71 s
[gammaloop-workspace-check] Checking num_threads v0.1.7
12.81 s
[gammaloop-workspace-check] Checking num-conv v0.2.1
12.83 s
[gammaloop-workspace-check] Checking safe_arch v0.7.4
12.84 s
[gammaloop-workspace-check] Checking time-core v0.1.8
12.87 s
[gammaloop-workspace-check] Checking pin-project-lite v0.2.17
12.92 s
[gammaloop-workspace-check] Checking tracing-core v0.1.36
12.95 s
[gammaloop-workspace-check] Checking itertools v0.14.0
12.95 s
[gammaloop-workspace-check] Checking deranged v0.5.8
12.97 s
[gammaloop-workspace-check] Checking foldhash v0.2.0
12.98 s
[gammaloop-workspace-check] Checking allocator-api2 v0.2.21
13.04 s
[gammaloop-workspace-check] Checking const-random v0.1.18
13.09 s
[gammaloop-workspace-check] Checking winnow v1.0.2
13.11 s
[gammaloop-workspace-check] Checking unty v0.0.4
13.11 s
[gammaloop-workspace-check] Checking nu-ansi-term v0.50.3
13.18 s
[gammaloop-workspace-check] Checking static_assertions v1.1.0
13.23 s
[gammaloop-workspace-check] Checking crossbeam-epoch v0.9.18
13.27 s
[gammaloop-workspace-check] Checking safe_arch v1.0.0
13.47 s
[gammaloop-workspace-check] Checking sharded-slab v0.1.7
13.58 s
[gammaloop-workspace-check] Checking wide v0.7.33
13.81 s
[gammaloop-workspace-check] Checking hashbrown v0.16.1
13.93 s
[gammaloop-workspace-check] Checking thread_local v1.1.9
13.97 s
[gammaloop-workspace-check] Checking tracing v0.1.44
13.97 s
[gammaloop-workspace-check] Checking crossbeam-deque v0.8.6
14.16 s
[gammaloop-workspace-check] Checking tracing-log v0.2.0
14.20 s
[gammaloop-workspace-check] Checking indenter v0.3.4
14.25 s
[gammaloop-workspace-check] Checking rayon-core v1.13.0
14.27 s
[gammaloop-workspace-check] Checking toml_writer v1.1.1+spec-1.1.0
14.29 s
[gammaloop-workspace-check] Checking az v1.3.0
14.38 s
[gammaloop-workspace-check] Checking wide v1.3.0
14.51 s
[gammaloop-workspace-check] Compiling phf_shared v0.11.3
14.73 s
[gammaloop-workspace-check] Checking anyhow v1.0.102
14.76 s
[gammaloop-workspace-check] Checking num-traits v0.2.19
14.87 s
[gammaloop-workspace-check] Checking aho-corasick v1.1.4
15.11 s
[gammaloop-workspace-check] Checking rawpointer v0.2.1
15.23 s
[gammaloop-workspace-check] Checking dyn-clone v1.0.20
15.33 s
[gammaloop-workspace-check] Checking rayon v1.12.0
15.37 s
[gammaloop-workspace-check] Checking alloc-no-stdlib v2.0.4
15.54 s
[gammaloop-workspace-check] Checking utf8parse v0.2.2
15.71 s
[gammaloop-workspace-check] Checking anstyle-parse v1.0.0
15.90 s
[gammaloop-workspace-check] Checking alloc-stdlib v0.2.2
15.92 s
[gammaloop-workspace-check] Checking matrixmultiply v0.3.10
15.94 s
[gammaloop-workspace-check] Checking approx v0.5.1
16.11 s
[gammaloop-workspace-check] Checking num-integer v0.1.46
16.13 s
[gammaloop-workspace-check] Checking colored v3.1.1
16.41 s
[gammaloop-workspace-check] Compiling pyo3-build-config v0.28.3
16.43 s
[gammaloop-workspace-check] Checking anstyle-query v1.1.5
16.48 s
[gammaloop-workspace-check] Checking anstyle v1.0.14
16.53 s
[gammaloop-workspace-check] Checking colorchoice v1.0.5
16.60 s
[gammaloop-workspace-check] Checking is_terminal_polyfill v1.70.2
16.64 s
[gammaloop-workspace-check] Compiling phf_generator v0.11.3
16.69 s
[gammaloop-workspace-check] Checking eyre v0.6.12
16.72 s
[gammaloop-workspace-check] Checking toml_parser v1.1.2+spec-1.1.0
16.73 s
[gammaloop-workspace-check] Checking unicode-width v0.2.2
16.74 s
[gammaloop-workspace-check] Checking bitflags v1.3.2
16.78 s
[gammaloop-workspace-check] Checking anstream v1.0.0
16.91 s
[gammaloop-workspace-check] Checking brotli-decompressor v5.0.0
16.91 s
[gammaloop-workspace-check] Checking inventory v0.3.24
17.06 s
[gammaloop-workspace-check] Checking spec_math v0.1.6
17.16 s
[gammaloop-workspace-check] Compiling phf_codegen v0.11.3
17.18 s
[gammaloop-workspace-check] Checking thiserror v2.0.18
17.22 s
[gammaloop-workspace-check] Checking libloading v0.9.0
17.30 s
[gammaloop-workspace-check] Compiling getopts v0.2.24
17.34 s
[gammaloop-workspace-check] Checking tinyjson v2.5.1
17.38 s
[gammaloop-workspace-check] Checking append-only-vec v0.1.8
17.38 s
[gammaloop-workspace-check] Checking bytes v1.11.1
17.44 s
[gammaloop-workspace-check] Checking self_cell v1.2.2
17.46 s
[gammaloop-workspace-check] Checking byteorder v1.5.0
17.58 s
[gammaloop-workspace-check] Compiling unic-common v0.9.0
17.59 s
[gammaloop-workspace-check] Compiling unic-char-range v0.9.0
17.67 s
[gammaloop-workspace-check] Checking linux-raw-sys v0.12.1
17.70 s
[gammaloop-workspace-check] Compiling unic-ucd-version v0.9.0
17.86 s
[gammaloop-workspace-check] Compiling unic-char-property v0.9.0
17.88 s
[gammaloop-workspace-check] Compiling is-macro v0.3.7
17.91 s
[gammaloop-workspace-check] Checking regex-automata v0.4.14
17.91 s
[gammaloop-workspace-check] Compiling unicode_names2_generator v1.3.0
17.97 s
[gammaloop-workspace-check] Compiling rustpython-parser-vendored v0.4.0
18.02 s
[gammaloop-workspace-check] Checking iana-time-zone v0.1.65
18.09 s
[gammaloop-workspace-check] Compiling rustpython-parser v0.4.0
18.44 s
[gammaloop-workspace-check] Compiling phf v0.11.3
18.51 s
[gammaloop-workspace-check] Checking getrandom v0.3.4
18.62 s
[gammaloop-workspace-check] Checking time v0.3.47
18.64 s
[gammaloop-workspace-check] Checking gmp-mpfr-sys v1.7.1
18.86 s
[gammaloop-workspace-check] Checking rand_core v0.9.5
18.90 s
[gammaloop-workspace-check] Checking region v3.0.2
18.94 s
[gammaloop-workspace-check] Checking wasmtime-jit-icache-coherence v34.0.2
19.06 s
[gammaloop-workspace-check] Checking hugepage-rs v0.1.1
19.08 s
[gammaloop-workspace-check] Checking rustc-hash v2.1.2
19.21 s
[gammaloop-workspace-check] Compiling unic-emoji-char v0.9.0
19.24 s
[gammaloop-workspace-check] Compiling unic-ucd-ident v0.9.0
19.27 s
[gammaloop-workspace-check] Compiling rustc-hash v1.1.0
19.34 s
[gammaloop-workspace-check] Compiling lalrpop-util v0.20.2
19.40 s
[gammaloop-workspace-check] Checking brotli v8.0.2
19.42 s
[gammaloop-workspace-check] Checking unicode-segmentation v1.13.2
19.62 s
[gammaloop-workspace-check] Compiling symbolica v2.2.0 (https://github.com/alphal00p/symbolica?rev=a277a8dadbaae5a8d6605f2f381991a601e1f345#a277a8da)
19.72 s
[gammaloop-workspace-check] Compiling rug v1.30.0
19.75 s
[gammaloop-workspace-check] Checking typenum v1.20.0
19.90 s
[gammaloop-workspace-check] Checking getrandom v0.2.17
20.16 s
[gammaloop-workspace-check] Checking scopeguard v1.2.0
20.17 s
[gammaloop-workspace-check] Checking unicode-ident v1.0.24
20.25 s
[gammaloop-workspace-check] Checking hashbrown v0.17.0
20.30 s
[gammaloop-workspace-check] Checking lock_api v0.4.14
20.38 s
[gammaloop-workspace-check] Checking errno v0.3.14
20.42 s
[gammaloop-workspace-check] Checking strsim v0.11.1
20.53 s
[gammaloop-workspace-check] Checking clap_lex v1.1.0
20.76 s
[gammaloop-workspace-check] Checking unicase v2.9.0
20.86 s
[gammaloop-workspace-check] Checking signal-hook-registry v1.4.8
20.88 s
[gammaloop-workspace-check] Checking vte v0.14.1
21.00 s
[gammaloop-workspace-check] Checking same-file v1.0.6
21.04 s
[gammaloop-workspace-check] Checking serde v1.0.228
21.08 s
[gammaloop-workspace-check] Checking serde_json v1.0.149
21.12 s
[gammaloop-workspace-check] Checking bitflags v2.11.1
21.22 s
[gammaloop-workspace-check] Checking serde_spanned v1.1.1
21.25 s
[gammaloop-workspace-check] Checking toml_datetime v1.1.1+spec-1.1.0
21.49 s
[gammaloop-workspace-check] Checking signal-hook v0.3.18
21.49 s
[gammaloop-workspace-check] Checking generic-array v0.14.7
21.52 s
[gammaloop-workspace-check] Checking indexmap v2.14.0
21.54 s
[gammaloop-workspace-check] Checking toml v1.1.2+spec-1.1.0
21.54 s
[gammaloop-workspace-check] Checking rustix v1.1.4
21.90 s
[gammaloop-workspace-check] Checking walkdir v2.5.0
22.01 s
[gammaloop-workspace-check] Checking mio v1.2.0
22.41 s
[gammaloop-workspace-check] Checking ciborium-io v0.2.2
22.55 s
[gammaloop-workspace-check] Checking minimal-lexical v0.2.1
22.57 s
[gammaloop-workspace-check] Checking block-buffer v0.10.4
22.70 s
[gammaloop-workspace-check] Checking crypto-common v0.1.7
22.93 s
[gammaloop-workspace-check] Checking digest v0.10.7
22.97 s
[gammaloop-workspace-check] Checking signal-hook-mio v0.2.5
23.08 s
[gammaloop-workspace-check] Checking smallvec v1.15.1
23.09 s
[gammaloop-workspace-check] Checking num-complex v0.4.6
23.13 s
[gammaloop-workspace-check] Checking tracing-serde v0.2.0
23.24 s
[gammaloop-workspace-check] Checking bincode v2.0.1
23.29 s
[gammaloop-workspace-check] Checking smartstring v1.0.1
23.35 s
[gammaloop-workspace-check] Checking chrono v0.4.44
23.59 s
[gammaloop-workspace-check] Checking parking_lot_core v0.9.12
23.83 s
[gammaloop-workspace-check] Checking nom v7.1.3
24.06 s
[gammaloop-workspace-check] Checking parking_lot v0.12.5
24.06 s
[gammaloop-workspace-check] Checking simba v0.9.1
24.63 s
[gammaloop-workspace-check] Checking ndarray v0.17.2
24.73 s
[gammaloop-workspace-check] Checking num-bigint v0.4.6
24.84 s
[gammaloop-workspace-check] Checking derive_more v2.1.1
24.85 s
[gammaloop-workspace-check] Checking console v0.16.3
24.98 s
[gammaloop-workspace-check] Checking bstr v1.12.1
25.78 s
[gammaloop-workspace-check] Checking linux-raw-sys v0.4.15
25.83 s
[gammaloop-workspace-check] Checking ppv-lite86 v0.2.21
25.86 s
[gammaloop-workspace-check] Checking ahash v0.8.12
26.19 s
[gammaloop-workspace-check] Checking half v2.7.1
26.40 s
[gammaloop-workspace-check] Checking cpufeatures v0.2.17
26.51 s
[gammaloop-workspace-check] Checking winnow v0.7.15
26.70 s
[gammaloop-workspace-check] Checking rustix v0.38.44
26.81 s
[gammaloop-workspace-check] Checking ciborium-ll v0.2.2
26.93 s
[gammaloop-workspace-check] Checking rand_chacha v0.9.0
26.99 s
[gammaloop-workspace-check] Checking matchers v0.2.0
27.21 s
[gammaloop-workspace-check] Checking tracing-subscriber v0.3.23
27.45 s
[gammaloop-workspace-check] Checking regex v1.12.3
27.49 s
[gammaloop-workspace-check] Checking rand v0.9.4
27.71 s
[gammaloop-workspace-check] Checking terminal_size v0.4.4
27.90 s
[gammaloop-workspace-check] Checking clap_builder v4.6.0
28.22 s
[gammaloop-workspace-check] Checking ansitok v0.3.0
28.31 s
[gammaloop-workspace-check] Checking ciborium v0.2.2
28.66 s
[gammaloop-workspace-check] Compiling unicode_names2 v1.3.0
28.99 s
[gammaloop-workspace-check] Checking globset v0.4.18
29.06 s
[gammaloop-workspace-check] Checking symjit v2.21.0
29.26 s
[gammaloop-workspace-check] Checking sha2 v0.10.9
29.29 s
[gammaloop-workspace-check] Checking rand_core v0.6.4
29.75 s
[gammaloop-workspace-check] Checking getrandom v0.4.2
29.89 s
[gammaloop-workspace-check] Checking plotters-backend v0.3.7
29.98 s
[gammaloop-workspace-check] Checking fnv v1.0.7
30.08 s
[gammaloop-workspace-check] Checking fastrand v2.4.1
30.11 s
[gammaloop-workspace-check] Checking crossterm v0.28.1
30.26 s
[gammaloop-workspace-check] Checking rust-embed-utils v8.11.0
30.45 s
[gammaloop-workspace-check] Checking tempfile v3.27.0
30.49 s
[gammaloop-workspace-check] Checking toml_datetime v0.6.11
30.52 s
[gammaloop-workspace-check] Checking plotters-svg v0.3.7
30.54 s
[gammaloop-workspace-check] Checking serde_spanned v0.6.9
30.56 s
[gammaloop-workspace-check] Checking itertools v0.10.5
30.71 s
[gammaloop-workspace-check] Checking cast v0.3.0
30.81 s
[gammaloop-workspace-check] Checking toml_write v0.1.2
30.91 s
[gammaloop-workspace-check] Checking tap v1.0.1
30.93 s
[gammaloop-workspace-check] Checking plotters v0.3.7
31.12 s
[gammaloop-workspace-check] Checking rand_chacha v0.3.1
31.19 s
[gammaloop-workspace-check] Checking wyz v0.5.1
31.33 s
[gammaloop-workspace-check] Checking ansi-str v0.9.0
31.45 s
[gammaloop-workspace-check] Checking tinytemplate v1.2.1
31.63 s
[gammaloop-workspace-check] Checking radium v0.7.0
31.95 s
[gammaloop-workspace-check] Checking similar v2.7.0
32.14 s
[gammaloop-workspace-check] Checking typeid v1.0.3
32.19 s
[gammaloop-workspace-check] Checking toml_edit v0.22.27
32.26 s
[gammaloop-workspace-check] Checking is-terminal v0.4.17
32.32 s
[gammaloop-workspace-check] Checking funty v2.0.0
32.39 s
[gammaloop-workspace-check] Checking bytecount v0.6.9
32.48 s
[gammaloop-workspace-check] Checking oorandom v11.1.5
32.69 s
[gammaloop-workspace-check] Checking anes v0.1.6
33.48 s
[gammaloop-workspace-check] Checking papergrid v0.17.0
33.65 s
[gammaloop-workspace-check] Checking ron v0.12.1
33.71 s
[gammaloop-workspace-check] Checking rand v0.8.6
34.10 s
[gammaloop-workspace-check] Checking bitvec v1.0.1
34.31 s
[gammaloop-workspace-check] Checking criterion-plot v0.5.0
35.26 s
[gammaloop-workspace-check] Checking testing_table v0.3.0
35.58 s
[gammaloop-workspace-check] Checking env_filter v1.0.1
35.71 s
[gammaloop-workspace-check] Checking toml_edit v0.25.11+spec-1.1.0
35.74 s
[gammaloop-workspace-check] Checking xprec v0.2.2
35.74 s
[gammaloop-workspace-check] Checking clap v4.6.1
35.89 s
[gammaloop-workspace-check] Checking uncased v0.9.10
35.95 s
[gammaloop-workspace-check] Checking jiff v0.2.24
36.05 s
[gammaloop-workspace-check] Checking ptr_meta v0.1.4
36.19 s
[gammaloop-workspace-check] Checking simdutf8 v0.1.5
36.22 s
[gammaloop-workspace-check] Checking ucd-trie v0.1.7
36.34 s
[gammaloop-workspace-check] Checking ahash v0.7.8
36.49 s
[gammaloop-workspace-check] Checking approx v0.4.0
36.57 s
[gammaloop-workspace-check] Checking pest v2.8.6
36.67 s
[gammaloop-workspace-check] Checking bytecheck v0.6.12
36.67 s
[gammaloop-workspace-check] Checking seahash v4.1.0
36.92 s
[gammaloop-workspace-check] Checking cgmath v0.18.0
36.97 s
[gammaloop-workspace-check] Checking hashbrown v0.12.3
37.00 s
[gammaloop-workspace-check] Checking num-rational v0.4.2
37.02 s
[gammaloop-workspace-check] Checking tabled v0.20.0
37.05 s
[gammaloop-workspace-check] Checking criterion v0.5.1
37.71 s
[gammaloop-workspace-check] Compiling pyo3-ffi v0.28.3
37.88 s
[gammaloop-workspace-check] Compiling pyo3-macros-backend v0.28.3
37.99 s
[gammaloop-workspace-check] Compiling pyo3 v0.28.3
38.17 s
[gammaloop-workspace-check] Compiling numpy v0.28.0
38.49 s
[gammaloop-workspace-check] Checking toml v0.8.23
38.71 s
[gammaloop-workspace-check] Checking rend v0.4.2
38.75 s
[gammaloop-workspace-check] Checking num-iter v0.1.45
38.86 s
[gammaloop-workspace-check] Checking ref-ops v0.2.5
39.08 s
[gammaloop-workspace-check] Checking num v0.4.3
39.22 s
[gammaloop-workspace-check] Checking rand_xoshiro v0.6.0
39.60 s
[gammaloop-workspace-check] Checking features v0.10.0
39.72 s
[gammaloop-workspace-check] Checking figment v0.10.19
39.80 s
[gammaloop-workspace-check] Checking gat-lending-iterator v0.1.8
40.43 s
[gammaloop-workspace-check] Checking constcat v0.5.1
40.55 s
[gammaloop-workspace-check] Checking colored v2.2.0
40.74 s
[gammaloop-workspace-check] Checking insta v1.47.2
40.79 s
[gammaloop-workspace-check] Checking dot-parser v0.5.1
40.99 s
[gammaloop-workspace-check] Checking cpufeatures v0.3.0
41.06 s
[gammaloop-workspace-check] Checking arrayref v0.3.9
41.12 s
[gammaloop-workspace-check] Checking constant_time_eq v0.4.2
41.17 s
[gammaloop-workspace-check] Checking base64 v0.22.1
41.31 s
[gammaloop-workspace-check] Checking blake3 v1.8.5
41.94 s
[gammaloop-workspace-check] Checking joinery v2.1.0
42.40 s
[gammaloop-workspace-check] Checking siphasher v1.0.2
42.90 s
[gammaloop-workspace-check] Checking titlecase v2.2.1
43.02 s
[gammaloop-workspace-check] Checking subprocess v0.2.15
43.02 s
[gammaloop-workspace-check] Checking rust_lisp v0.18.0
43.07 s
[gammaloop-workspace-check] Compiling vakint v0.1.2 (/build/source/crates/vakint)
43.10 s
[gammaloop-workspace-check] Checking version-compare v0.2.1
43.13 s
[gammaloop-workspace-check] Checking xpct v0.5.1
43.17 s
[gammaloop-workspace-check] Checking phf_shared v0.13.1
43.24 s
[gammaloop-workspace-check] Checking ryu v1.0.23
43.26 s
[gammaloop-workspace-check] Checking castaway v0.2.4
43.35 s
[gammaloop-workspace-check] Checking toml_datetime v0.7.5+spec-1.1.0
43.50 s
[gammaloop-workspace-check] Checking strum v0.27.2
43.62 s
[gammaloop-workspace-check] Checking compact_str v0.9.0
43.67 s
[gammaloop-workspace-check] Checking unicode-truncate v2.0.1
43.78 s
[gammaloop-workspace-check] Checking kasuari v0.4.12
43.80 s
[gammaloop-workspace-check] Checking phf v0.13.1
43.95 s
[gammaloop-workspace-check] Checking lru v0.16.4
44.14 s
[gammaloop-workspace-check] Checking vte v0.15.0
44.27 s
[gammaloop-workspace-check] Checking portable-atomic v1.13.1
44.30 s
[gammaloop-workspace-check] Checking unit-prefix v0.5.2
44.44 s
[gammaloop-workspace-check] Checking toml v0.9.12+spec-1.1.0
44.49 s
[gammaloop-workspace-check] Compiling rustpython-parser-core v0.4.0
44.55 s
[gammaloop-workspace-check] Checking rand_distr v0.4.3
44.66 s
[gammaloop-workspace-check] Checking simba v0.6.0
44.71 s
[gammaloop-workspace-check] Checking line-clipping v0.3.7
44.74 s
[gammaloop-workspace-check] Checking vt100 v0.16.2
44.79 s
[gammaloop-workspace-check] Checking adler2 v2.0.1
45.06 s
[gammaloop-workspace-check] Compiling rustpython-ast v0.4.0
45.27 s
[gammaloop-workspace-check] Checking ratatui-core v0.1.0
45.39 s
[gammaloop-workspace-check] Checking gimli v0.32.3
45.43 s
[gammaloop-workspace-check] Compiling three-dimensional-reps v0.1.0 (/build/source/crates/three-dimensional-reps)
45.61 s
[gammaloop-workspace-check] Checking miniz_oxide v0.8.9
45.66 s
[gammaloop-workspace-check] Checking string-template-plus v0.4.3
45.69 s
[gammaloop-workspace-check] Checking thiserror v1.0.69
45.87 s
[gammaloop-workspace-check] Checking indicatif v0.18.4
45.92 s
[gammaloop-workspace-check] Checking derive_builder v0.11.2
46.12 s
[gammaloop-workspace-check] Checking object v0.37.3
46.16 s
[gammaloop-workspace-check] Checking crossterm v0.29.0
46.19 s
[gammaloop-workspace-check] Checking owo-colors v4.3.0
46.22 s
[gammaloop-workspace-check] Checking env_logger v0.11.10
46.50 s
[gammaloop-workspace-check] Checking tracing-error v0.2.1
46.55 s
[gammaloop-workspace-check] Checking typed-index-collections v3.5.0
46.95 s
[gammaloop-workspace-check] Checking serde-big-array v0.5.1
47.28 s
[gammaloop-workspace-check] Checking amd v0.2.2
47.30 s
[gammaloop-workspace-check] Checking itertools v0.11.0
47.38 s
[gammaloop-workspace-check] Compiling gammaloop-tracing-filter-macros v0.1.0 (/build/source/crates/gammaloop-tracing-filter-macros)
47.50 s
[gammaloop-workspace-check] Checking rustc-demangle v0.1.27
47.62 s
[gammaloop-workspace-check] Checking rkyv v0.7.46
47.70 s
[gammaloop-workspace-check] Checking option-ext v0.2.0
47.89 s
[gammaloop-workspace-check] Checking dirs-sys v0.5.0
48.15 s
[gammaloop-workspace-check] Checking ref-cast v1.0.25
48.21 s
[gammaloop-workspace-check] Checking nix v0.31.2
48.35 s
[gammaloop-workspace-check] Checking brotli-decompressor v4.0.3
48.41 s
[gammaloop-workspace-check] Checking integer-sqrt v0.1.5
48.45 s
[gammaloop-workspace-check] Checking crossbeam-channel v0.5.15
48.49 s
[gammaloop-workspace-check] Checking itertools v0.12.1
48.53 s
[gammaloop-workspace-check] Compiling gammalooprs v0.3.4 (/build/source/crates/gammalooprs)
48.61 s
[gammaloop-workspace-check] Checking unsafe-libyaml v0.2.11
48.65 s
[gammaloop-workspace-check] Checking color-spantrace v0.3.0
48.84 s
[gammaloop-workspace-check] Checking symlink v0.1.0
49.00 s
[gammaloop-workspace-check] Checking pathfinding v4.15.0
49.16 s
[gammaloop-workspace-check] Checking include_dir v0.7.4
49.64 s
[gammaloop-workspace-check] Checking ratatui-widgets v0.3.0
49.67 s
[gammaloop-workspace-check] Checking ratatui-crossterm v0.1.0
50.11 s
[gammaloop-workspace-check] Compiling numerica v2.2.0 (https://github.com/alphal00p/symbolica?rev=a277a8dadbaae5a8d6605f2f381991a601e1f345#a277a8da)
50.22 s
[gammaloop-workspace-check] Checking tracing-appender v0.2.5
50.50 s
[gammaloop-workspace-check] Checking brotli v7.0.0
50.66 s
[gammaloop-workspace-check] Checking ctrlc v3.5.2
51.03 s
[gammaloop-workspace-check] Checking tracing-indicatif v0.3.14
51.33 s
[gammaloop-workspace-check] Checking clarabel v0.11.1
51.66 s
[gammaloop-workspace-check] Checking dirs v6.0.0
51.72 s
[gammaloop-workspace-check] Checking schemars v1.2.1
51.81 s
[gammaloop-workspace-check] Checking slotmap v1.1.1
51.84 s
[gammaloop-workspace-check] Checking serde_yaml v0.9.34+deprecated
51.90 s
[gammaloop-workspace-check] Checking json5 v0.4.1
52.53 s
[gammaloop-workspace-check] Checking ratatui-macros v0.7.0
52.85 s
[gammaloop-workspace-check] Checking ratatui v0.30.0
53.31 s
[gammaloop-workspace-check] Checking vectorize v0.2.0
53.35 s
[gammaloop-workspace-check] Checking ringbuffer v0.16.0
53.42 s
[gammaloop-workspace-check] Checking addr2line v0.25.1
53.59 s
[gammaloop-workspace-check] Checking base62 v2.2.4
54.06 s
[gammaloop-workspace-check] Checking rust-embed v8.11.0
54.07 s
[gammaloop-workspace-check] Checking clap_complete v4.6.3
54.20 s
[gammaloop-workspace-check] Checking fd-lock v4.0.4
54.42 s
[gammaloop-workspace-check] Checking strip-ansi-escapes v0.2.1
54.45 s
[gammaloop-workspace-check] Compiling gammaloop-api v0.1.0 (/build/source/crates/gammaloop-api)
54.57 s
[gammaloop-workspace-check] Checking itertools v0.13.0
54.61 s
[gammaloop-workspace-check] Checking strum v0.26.3
54.74 s
[gammaloop-workspace-check] Checking sysinfo v0.33.1
54.78 s
[gammaloop-workspace-check] Checking shlex v1.3.0
54.95 s
[gammaloop-workspace-check] Checking slab v0.4.12
55.09 s
[gammaloop-workspace-check] Checking futures-task v0.3.32
55.12 s
[gammaloop-workspace-check] Checking futures-core v0.3.32
55.16 s
[gammaloop-workspace-check] Checking sdd v3.0.10
55.21 s
[gammaloop-workspace-check] Compiling gammaloop-integration-tests v0.1.0 (/build/source/tests)
55.35 s
[gammaloop-workspace-check] Compiling test-log-core v0.2.20
55.43 s
[gammaloop-workspace-check] Compiling rustc_version v0.4.1
55.44 s
[gammaloop-workspace-check] Checking futures-util v0.3.32
55.81 s
[gammaloop-workspace-check] Checking clap_complete_nushell v4.6.0
55.97 s
[gammaloop-workspace-check] Checking which v8.0.2
56.29 s
[gammaloop-workspace-check] Checking bincode v1.3.3
56.33 s
[gammaloop-workspace-check] Checking scc v2.4.0
56.89 s
[gammaloop-workspace-check] Compiling gungraun-runner v0.18.2
57.72 s
[gammaloop-workspace-check] Checking proc-macro2 v1.0.106
57.99 s
[gammaloop-workspace-check] Compiling gungraun-macros v0.8.0
58.08 s
[gammaloop-workspace-check] Checking backtrace v0.3.76
58.69 s
[gammaloop-workspace-check] Checking reedline v0.42.0
59.18 s
[gammaloop-workspace-check] Checking color-eyre v0.6.5
59.64 s
[gammaloop-workspace-check] Checking quote v1.0.45
59.73 s
[gammaloop-workspace-check] Checking base64 v0.21.7
59.88 s
[gammaloop-workspace-check] Checking maplit v1.0.2
59.93 s
[gammaloop-workspace-check] Compiling iai-callgrind-runner v0.14.2
59.95 s
[gammaloop-workspace-check] Checking kurbo v0.13.0
60.43 s
[gammaloop-workspace-check] Checking wait-timeout v0.2.1
60.45 s
[gammaloop-workspace-check] Checking ron v0.8.1
60.53 s
[gammaloop-workspace-check] Checking nalgebra v0.29.0
60.67 s
[gammaloop-workspace-check] Checking quick-error v1.2.3
60.83 s
[gammaloop-workspace-check] Checking bit-vec v0.8.0
61.27 s
[gammaloop-workspace-check] Compiling iai-callgrind v0.14.2
61.34 s
[gammaloop-workspace-check] Checking bit-set v0.8.0
61.60 s
[gammaloop-workspace-check] Checking rusty-fork v0.3.1
61.84 s
[gammaloop-workspace-check] Checking syn v2.0.117
61.87 s
[gammaloop-workspace-check] Compiling iai-callgrind-macros v0.5.1
61.90 s
[gammaloop-workspace-check] Checking futures-executor v0.3.32
62.15 s
[gammaloop-workspace-check] Compiling graphica v2.1.0 (https://github.com/alphal00p/symbolica?rev=a277a8dadbaae5a8d6605f2f381991a601e1f345#a277a8da)
62.19 s
[gammaloop-workspace-check] Checking serial_test v3.4.0
62.28 s
[gammaloop-workspace-check] Compiling test-log-macros v0.2.20
62.55 s
[gammaloop-workspace-check] Checking rand_xorshift v0.4.0
62.57 s
[gammaloop-workspace-check] Checking console v0.15.11
62.75 s
[gammaloop-workspace-check] Checking pathdiff v0.2.3
62.92 s
[gammaloop-workspace-check] Checking unarray v0.1.4
63.04 s
[gammaloop-workspace-check] Checking proptest v1.11.0
63.69 s
[gammaloop-workspace-check] Checking similar-asserts v1.7.0
64.04 s
[gammaloop-workspace-check] Checking clinnet v0.1.8 (/build/source/crates/clinnet)
65.26 s
[gammaloop-workspace-check] Checking kurvst v0.1.0 (/build/source/crates/kurvst)
71.60 s
[gammaloop-workspace-check] Checking test-log v0.2.20
84.87 s
[gammaloop-workspace-check] Checking gungraun v0.18.2
91.25 s
[gammaloop-workspace-check] Checking statrs v0.16.1
92.82 s
[gammaloop-workspace-check] Checking momtrop v0.3.0
93.74 s
[gammaloop-workspace-check] Compiling pyo3-macros v0.28.3
95.22 s
[gammaloop-workspace-check] Compiling pyo3-stub-gen-derive v0.17.2
105.84 s
[gammaloop-workspace-check] Checking pyo3-stub-gen v0.17.2
116.75 s
[gammaloop-workspace-check] Checking symbolica-utils v0.1.0 (/build/source/crates/symbolica-utils)
116.75 s
[gammaloop-workspace-check] Checking spenso-macros v0.3.2 (/build/source/crates/spenso-macros)
353.60 s
[gammaloop-workspace-check] Compiling gammaloop-workspace-hack v0.1.0 (/build/source/crates/gammaloop-workspace-hack)
354.03 s
[gammaloop-workspace-check] Checking linnet v0.17.0 (/build/source/crates/linnet)
359.09 s
[gammaloop-workspace-check] Checking spenso v0.6.0 (/build/source/crates/spenso)
359.45 s
[gammaloop-workspace-check] Checking linnet-py v0.1.0 (/build/source/crates/linnet-py)
359.45 s
[gammaloop-workspace-check] Checking linnest v0.1.0 (/build/source/crates/linnest)
366.14 s
[gammaloop-workspace-check] Checking idenso v0.3.0 (/build/source/crates/idenso)
366.14 s
[gammaloop-workspace-check] Checking gammaloop-tracing-filter v0.1.0 (/build/source/crates/gammaloop-tracing-filter)
368.19 s
[gammaloop-workspace-check] Checking spenso-hep-lib v0.1.7 (/build/source/crates/spenso-hep-lib)
368.38 s
[gammaloop-workspace-check] Checking spynso3 v0.1.2 (/build/source/crates/spynso3)
394.36 s
[gammaloop-workspace-check] error[E0560] : struct `CutInfo` has no field named `lmb_channel_id`
394.36 s
[gammaloop-workspace-check] --> tests/tests/test_differential.rs:86:13
394.36 s
[gammaloop-workspace-check] |
394.36 s
[gammaloop-workspace-check] 86 | lmb_channel_id: None,
394.36 s
[gammaloop-workspace-check] | ^^^^^^^^^^^^^^ `CutInfo` does not have this field
394.36 s
[gammaloop-workspace-check] |
394.36 s
[gammaloop-workspace-check] = note : available fields are: `sampling_channel_id`, `sampling_channel_edge_ids`
394.36 s
[gammaloop-workspace-check]
394.36 s
[gammaloop-workspace-check] error[E0560] : struct `CutInfo` has no field named `lmb_channel_edge_ids`
394.36 s
[gammaloop-workspace-check] --> tests/tests/test_differential.rs:87:13
394.36 s
[gammaloop-workspace-check] |
394.36 s
[gammaloop-workspace-check] 87 | lmb_channel_edge_ids: None,
394.36 s
[gammaloop-workspace-check] | ^^^^^^^^^^^^^^^^^^^^ `CutInfo` does not have this field
394.36 s
[gammaloop-workspace-check] |
394.36 s
[gammaloop-workspace-check] = note : available fields are: `sampling_channel_id`, `sampling_channel_edge_ids`
394.36 s
[gammaloop-workspace-check]
394.39 s
[gammaloop-workspace-check] error[E0609] : no field `lmb_channel_edge_ids` on type `CutInfo`
394.39 s
[gammaloop-workspace-check] --> tests/tests/test_evaluation_api.rs:311:10
394.39 s
[gammaloop-workspace-check] |
394.39 s
[gammaloop-workspace-check] 311 | .lmb_channel_edge_ids
394.39 s
[gammaloop-workspace-check] | ^^^^^^^^^^^^^^^^^^^^ unknown field
394.39 s
[gammaloop-workspace-check] |
394.39 s
[gammaloop-workspace-check] = note : available fields are: `particle_pdgs`, `cut_id`, `graph_id`, `graph_group_id`, `orientation_id` ... and 2 others
394.39 s
[gammaloop-workspace-check]
394.41 s
[gammaloop-workspace-check] error[E0609] : no field `lmb_channel_edge_ids` on type `CutInfo`
394.41 s
[gammaloop-workspace-check] --> tests/tests/test_evaluation_api.rs:591:26
394.41 s
[gammaloop-workspace-check] |
394.41 s
[gammaloop-workspace-check] 591 | .lmb_channel_edge_ids
394.41 s
[gammaloop-workspace-check] | ^^^^^^^^^^^^^^^^^^^^ unknown field
394.41 s
[gammaloop-workspace-check] |
394.41 s
[gammaloop-workspace-check] = note : available fields are: `particle_pdgs`, `cut_id`, `graph_id`, `graph_group_id`, `orientation_id` ... and 2 others
394.41 s
[gammaloop-workspace-check]
394.43 s
[gammaloop-workspace-check] For more information about this error, try `rustc --explain E0560`.
394.44 s
[gammaloop-workspace-check] error : could not compile `gammaloop-integration-tests` (test "test_differential") due to 2 previous errors
394.44 s
[gammaloop-workspace-check] warning : build failed, waiting for other jobs to finish...
394.44 s
[gammaloop-workspace-check] error[E0609] : no field `lmb_channel_edge_ids` on type `CutInfo`
394.44 s
[gammaloop-workspace-check] --> tests/tests/test_evaluation_api.rs:1177:18
394.44 s
[gammaloop-workspace-check] |
394.44 s
[gammaloop-workspace-check] 1177 | .lmb_channel_edge_ids
394.44 s
[gammaloop-workspace-check] | ^^^^^^^^^^^^^^^^^^^^ unknown field
394.44 s
[gammaloop-workspace-check] |
394.44 s
[gammaloop-workspace-check] = note : available fields are: `particle_pdgs`, `cut_id`, `graph_id`, `graph_group_id`, `orientation_id` ... and 2 others
394.44 s
[gammaloop-workspace-check]
394.52 s
[gammaloop-workspace-check] error[E0609] : no field `lmb_channel_edge_ids` on type `CutInfo`
394.52 s
[gammaloop-workspace-check] --> tests/tests/test_evaluation_api.rs:1222:22
394.52 s
[gammaloop-workspace-check] |
394.52 s
[gammaloop-workspace-check] 1222 | .lmb_channel_edge_ids
394.52 s
[gammaloop-workspace-check] | ^^^^^^^^^^^^^^^^^^^^ unknown field
394.52 s
[gammaloop-workspace-check] |
394.52 s
[gammaloop-workspace-check] = note : available fields are: `particle_pdgs`, `cut_id`, `graph_id`, `graph_group_id`, `orientation_id` ... and 2 others
394.52 s
[gammaloop-workspace-check]
394.53 s
[gammaloop-workspace-check] error[E0609] : no field `lmb_channel_edge_ids` on type `CutInfo`
394.53 s
[gammaloop-workspace-check] --> tests/tests/test_evaluation_api.rs:1281:14
394.53 s
[gammaloop-workspace-check] |
394.53 s
[gammaloop-workspace-check] 1281 | .lmb_channel_edge_ids
394.53 s
[gammaloop-workspace-check] | ^^^^^^^^^^^^^^^^^^^^ unknown field
394.53 s
[gammaloop-workspace-check] |
394.53 s
[gammaloop-workspace-check] = note : available fields are: `particle_pdgs`, `cut_id`, `graph_id`, `graph_group_id`, `orientation_id` ... and 2 others
394.53 s
[gammaloop-workspace-check]
394.56 s
[gammaloop-workspace-check] error[E0609] : no field `lmb_channel_edge_ids` on type `CutInfo`
394.56 s
[gammaloop-workspace-check] --> tests/tests/test_evaluation_api.rs:1428:18
394.56 s
[gammaloop-workspace-check] |
394.56 s
[gammaloop-workspace-check] 1428 | .lmb_channel_edge_ids
394.56 s
[gammaloop-workspace-check] | ^^^^^^^^^^^^^^^^^^^^ unknown field
394.56 s
[gammaloop-workspace-check] |
394.56 s
[gammaloop-workspace-check] = note : available fields are: `particle_pdgs`, `cut_id`, `graph_id`, `graph_group_id`, `orientation_id` ... and 2 others
394.56 s
[gammaloop-workspace-check]
394.63 s
[gammaloop-workspace-check] For more information about this error, try `rustc --explain E0609`.
394.64 s
[gammaloop-workspace-check] error : could not compile `gammaloop-integration-tests` (test "test_evaluation_api") due to 6 previous errors
395.05 s
[gammaloop-workspace-check] error[E0609] : no field `lmb_channel_id` on type `CutInfo`
395.05 s
[gammaloop-workspace-check] --> tests/tests/test_runs/utils.rs:568:36
395.05 s
[gammaloop-workspace-check] |
395.05 s
[gammaloop-workspace-check] 568 | event.cut_info.lmb_channel_id,
395.05 s
[gammaloop-workspace-check] | ^^^^^^^^^^^^^^ unknown field
395.05 s
[gammaloop-workspace-check] |
395.05 s
[gammaloop-workspace-check] = note : available fields are: `particle_pdgs`, `cut_id`, `graph_id`, `graph_group_id`, `orientation_id` ... and 2 others
395.05 s
[gammaloop-workspace-check]
395.05 s
[gammaloop-workspace-check] error[E0609] : no field `lmb_channel_id` on type `CutInfo`
395.05 s
[gammaloop-workspace-check] --> tests/tests/test_runs/utils.rs:580:36
395.05 s
[gammaloop-workspace-check] |
395.05 s
[gammaloop-workspace-check] 580 | event.cut_info.lmb_channel_id,
395.05 s
[gammaloop-workspace-check] | ^^^^^^^^^^^^^^ unknown field
395.05 s
[gammaloop-workspace-check] |
395.05 s
[gammaloop-workspace-check] = note : available fields are: `particle_pdgs`, `cut_id`, `graph_id`, `graph_group_id`, `orientation_id` ... and 2 others
395.05 s
[gammaloop-workspace-check]
395.45 s
[gammaloop-workspace-check] error : could not compile `gammaloop-integration-tests` (test "test_runs") due to 2 previous errors
395.83 s
Progress: 0 of 1 built (1 failed)
395.83 s
Failed to build gammaloop-workspace-check after 6m28s
395.83 s
Cannot build ' /nix/store/ws66y79brahbksfmnksfcdd9g1qvcyzb-gammaloop-workspace-check-0.1.0.drv '.
395.83 s
Reason: builder failed with exit code 101 .
395.83 s
Output paths:
395.83 s
/nix/store/d6pr1iwb3y055dnrdwwziahk8xn6ixw1-gammaloop-workspace-check-0.1.0
395.83 s
Last 511 log lines:
395.83 s
> Running phase: unpackPhase
395.83 s
> unpacking source archive /nix/store/ypmxspggpi4qfj1zy7ml6kwz1d0c3m10-source
395.83 s
> source root is source
395.83 s
> Running phase: patchPhase
395.83 s
> Executing configureCargoCommonVars
395.83 s
> decompressing cargo artifacts from /nix/store/50vpxlcgfxf2d57i27v3d10zjwxxbm2r-gammaloop-workspace-deps-deps-0.1.0/target.tar.zst to target
395.83 s
> Running phase: updateAutotoolsGnuConfigScriptsPhase
395.83 s
> Running phase: configurePhase
395.83 s
> will append /build/source/.cargo-home/config.toml with contents of /nix/store/5drf77x6km4ky7gwlrzdx9bbd6fz09g3-vendor-cargo-deps/config.toml
395.83 s
> default configurePhase, nothing to do
395.83 s
> Running phase: buildPhase
395.83 s
> +++ command cargo --version
395.83 s
> cargo 1.97.0 (c980f4866 2026-06-30)
395.83 s
> +++ command cargo check --profile ci-optim --locked --workspace --features gammaloop-tracing-filter/clap,gammaloop-tracing-filter/symbolica,idenso/bincode,idenso/reference-cases,linnet/bincode,linnet/drawing,linnet/rkyv,linnet/serde,linnet/symbolica,spenso-macros/shadowing,spenso/shadowing,symbolica/tracing_max_level_info,three-dimensional-reps/display,three-dimensional-reps/eval,three-dimensional-reps/serde --all-targets
395.83 s
> Checking cfg-if v1.0.4
395.83 s
> Checking memchr v2.8.0
395.83 s
> Checking once_cell v1.21.4
395.83 s
> Checking either v1.15.0
395.83 s
> Checking serde_core v1.0.228
395.83 s
> Checking libc v0.2.186
395.83 s
> Checking libm v0.2.16
395.83 s
> Checking itoa v1.0.18
395.83 s
> Checking log v0.4.29
395.83 s
> Checking regex-syntax v0.8.10
395.83 s
> Checking zerocopy v0.8.48
395.83 s
> Checking crossbeam-utils v0.8.21
395.83 s
> Checking equivalent v1.0.2
395.83 s
> Checking zmij v1.0.21
395.83 s
> Checking bytemuck v1.25.0
395.83 s
> Checking lazy_static v1.5.0
395.83 s
> Compiling target-lexicon v0.13.5
395.83 s
> Checking arrayvec v0.7.6
395.83 s
> Checking powerfmt v0.2.0
395.83 s
> Checking num_threads v0.1.7
395.83 s
> Checking num-conv v0.2.1
395.83 s
> Checking safe_arch v0.7.4
395.83 s
> Checking time-core v0.1.8
395.83 s
> Checking pin-project-lite v0.2.17
395.83 s
> Checking tracing-core v0.1.36
395.83 s
> Checking itertools v0.14.0
395.83 s
> Checking deranged v0.5.8
395.83 s
> Checking foldhash v0.2.0
395.83 s
> Checking allocator-api2 v0.2.21
395.83 s
> Checking const-random v0.1.18
395.83 s
> Checking winnow v1.0.2
395.83 s
> Checking unty v0.0.4
395.83 s
> Checking nu-ansi-term v0.50.3
395.83 s
> Checking static_assertions v1.1.0
395.83 s
> Checking crossbeam-epoch v0.9.18
395.83 s
> Checking safe_arch v1.0.0
395.83 s
> Checking sharded-slab v0.1.7
395.83 s
> Checking wide v0.7.33
395.83 s
> Checking hashbrown v0.16.1
395.83 s
> Checking thread_local v1.1.9
395.83 s
> Checking tracing v0.1.44
395.83 s
> Checking crossbeam-deque v0.8.6
395.83 s
> Checking tracing-log v0.2.0
395.83 s
> Checking indenter v0.3.4
395.83 s
> Checking rayon-core v1.13.0
395.83 s
> Checking toml_writer v1.1.1+spec-1.1.0
395.83 s
> Checking az v1.3.0
395.83 s
> Checking wide v1.3.0
395.83 s
> Compiling phf_shared v0.11.3
395.83 s
> Checking anyhow v1.0.102
395.83 s
> Checking num-traits v0.2.19
395.83 s
> Checking aho-corasick v1.1.4
395.83 s
> Checking rawpointer v0.2.1
395.83 s
> Checking dyn-clone v1.0.20
395.83 s
> Checking rayon v1.12.0
395.83 s
> Checking alloc-no-stdlib v2.0.4
395.83 s
> Checking utf8parse v0.2.2
395.83 s
> Checking anstyle-parse v1.0.0
395.83 s
> Checking alloc-stdlib v0.2.2
395.83 s
> Checking matrixmultiply v0.3.10
395.83 s
> Checking approx v0.5.1
395.83 s
> Checking num-integer v0.1.46
395.83 s
> Checking colored v3.1.1
395.83 s
> Compiling pyo3-build-config v0.28.3
395.83 s
> Checking anstyle-query v1.1.5
395.83 s
> Checking anstyle v1.0.14
395.83 s
> Checking colorchoice v1.0.5
395.83 s
> Checking is_terminal_polyfill v1.70.2
395.83 s
> Compiling phf_generator v0.11.3
395.83 s
> Checking eyre v0.6.12
395.83 s
> Checking toml_parser v1.1.2+spec-1.1.0
395.83 s
> Checking unicode-width v0.2.2
395.83 s
> Checking bitflags v1.3.2
395.83 s
> Checking anstream v1.0.0
395.83 s
> Checking brotli-decompressor v5.0.0
395.83 s
> Checking inventory v0.3.24
395.83 s
> Checking spec_math v0.1.6
395.83 s
> Compiling phf_codegen v0.11.3
395.83 s
> Checking thiserror v2.0.18
395.83 s
> Checking libloading v0.9.0
395.83 s
> Compiling getopts v0.2.24
395.83 s
> Checking tinyjson v2.5.1
395.83 s
> Checking append-only-vec v0.1.8
395.83 s
> Checking bytes v1.11.1
395.83 s
> Checking self_cell v1.2.2
395.83 s
> Checking byteorder v1.5.0
395.83 s
> Compiling unic-common v0.9.0
395.83 s
> Compiling unic-char-range v0.9.0
395.83 s
> Checking linux-raw-sys v0.12.1
395.83 s
> Compiling unic-ucd-version v0.9.0
395.83 s
> Compiling unic-char-property v0.9.0
395.83 s
> Compiling is-macro v0.3.7
395.83 s
> Checking regex-automata v0.4.14
395.83 s
> Compiling unicode_names2_generator v1.3.0
395.83 s
> Compiling rustpython-parser-vendored v0.4.0
395.83 s
> Checking iana-time-zone v0.1.65
395.83 s
> Compiling rustpython-parser v0.4.0
395.83 s
> Compiling phf v0.11.3
395.83 s
> Checking getrandom v0.3.4
395.83 s
> Checking time v0.3.47
395.83 s
> Checking gmp-mpfr-sys v1.7.1
395.83 s
> Checking rand_core v0.9.5
395.83 s
> Checking region v3.0.2
395.83 s
> Checking wasmtime-jit-icache-coherence v34.0.2
395.83 s
> Checking hugepage-rs v0.1.1
395.83 s
> Checking rustc-hash v2.1.2
395.83 s
> Compiling unic-emoji-char v0.9.0
395.83 s
> Compiling unic-ucd-ident v0.9.0
395.83 s
> Compiling rustc-hash v1.1.0
395.83 s
> Compiling lalrpop-util v0.20.2
395.83 s
> Checking brotli v8.0.2
395.83 s
> Checking unicode-segmentation v1.13.2
395.83 s
> Compiling symbolica v2.2.0 (https://github.com/alphal00p/symbolica?rev=a277a8dadbaae5a8d6605f2f381991a601e1f345#a277a8da)
395.83 s
> Compiling rug v1.30.0
395.83 s
> Checking typenum v1.20.0
395.83 s
> Checking getrandom v0.2.17
395.83 s
> Checking scopeguard v1.2.0
395.83 s
> Checking unicode-ident v1.0.24
395.83 s
> Checking hashbrown v0.17.0
395.83 s
> Checking lock_api v0.4.14
395.83 s
> Checking errno v0.3.14
395.83 s
> Checking strsim v0.11.1
395.83 s
> Checking clap_lex v1.1.0
395.83 s
> Checking unicase v2.9.0
395.83 s
> Checking signal-hook-registry v1.4.8
395.83 s
> Checking vte v0.14.1
395.83 s
> Checking same-file v1.0.6
395.83 s
> Checking serde v1.0.228
395.83 s
> Checking serde_json v1.0.149
395.83 s
> Checking bitflags v2.11.1
395.83 s
> Checking serde_spanned v1.1.1
395.83 s
> Checking toml_datetime v1.1.1+spec-1.1.0
395.83 s
> Checking signal-hook v0.3.18
395.83 s
> Checking generic-array v0.14.7
395.83 s
> Checking indexmap v2.14.0
395.83 s
> Checking toml v1.1.2+spec-1.1.0
395.83 s
> Checking rustix v1.1.4
395.83 s
> Checking walkdir v2.5.0
395.83 s
> Checking mio v1.2.0
395.83 s
> Checking ciborium-io v0.2.2
395.83 s
> Checking minimal-lexical v0.2.1
395.83 s
> Checking block-buffer v0.10.4
395.83 s
> Checking crypto-common v0.1.7
395.83 s
> Checking digest v0.10.7
395.83 s
> Checking signal-hook-mio v0.2.5
395.83 s
> Checking smallvec v1.15.1
395.83 s
> Checking num-complex v0.4.6
395.83 s
> Checking tracing-serde v0.2.0
395.83 s
> Checking bincode v2.0.1
395.83 s
> Checking smartstring v1.0.1
395.83 s
> Checking chrono v0.4.44
395.83 s
> Checking parking_lot_core v0.9.12
395.83 s
> Checking nom v7.1.3
395.83 s
> Checking parking_lot v0.12.5
395.83 s
> Checking simba v0.9.1
395.83 s
> Checking ndarray v0.17.2
395.83 s
> Checking num-bigint v0.4.6
395.83 s
> Checking derive_more v2.1.1
395.83 s
> Checking console v0.16.3
395.83 s
> Checking bstr v1.12.1
395.83 s
> Checking linux-raw-sys v0.4.15
395.83 s
> Checking ppv-lite86 v0.2.21
395.83 s
> Checking ahash v0.8.12
395.83 s
> Checking half v2.7.1
395.83 s
> Checking cpufeatures v0.2.17
395.83 s
> Checking winnow v0.7.15
395.83 s
> Checking rustix v0.38.44
395.83 s
> Checking ciborium-ll v0.2.2
395.83 s
> Checking rand_chacha v0.9.0
395.83 s
> Checking matchers v0.2.0
395.83 s
> Checking tracing-subscriber v0.3.23
395.83 s
> Checking regex v1.12.3
395.83 s
> Checking rand v0.9.4
395.83 s
> Checking terminal_size v0.4.4
395.83 s
> Checking clap_builder v4.6.0
395.83 s
> Checking ansitok v0.3.0
395.83 s
> Checking ciborium v0.2.2
395.83 s
> Compiling unicode_names2 v1.3.0
395.83 s
> Checking globset v0.4.18
395.83 s
> Checking symjit v2.21.0
395.83 s
> Checking sha2 v0.10.9
395.83 s
> Checking rand_core v0.6.4
395.83 s
> Checking getrandom v0.4.2
395.83 s
> Checking plotters-backend v0.3.7
395.83 s
> Checking fnv v1.0.7
395.83 s
> Checking fastrand v2.4.1
395.83 s
> Checking crossterm v0.28.1
395.83 s
> Checking rust-embed-utils v8.11.0
395.83 s
> Checking tempfile v3.27.0
395.83 s
> Checking toml_datetime v0.6.11
395.83 s
> Checking plotters-svg v0.3.7
395.83 s
> Checking serde_spanned v0.6.9
395.83 s
> Checking itertools v0.10.5
395.83 s
> Checking cast v0.3.0
395.83 s
> Checking toml_write v0.1.2
395.83 s
> Checking tap v1.0.1
395.83 s
> Checking plotters v0.3.7
395.83 s
> Checking rand_chacha v0.3.1
395.83 s
> Checking wyz v0.5.1
395.83 s
> Checking ansi-str v0.9.0
395.83 s
> Checking tinytemplate v1.2.1
395.83 s
> Checking radium v0.7.0
395.83 s
> Checking similar v2.7.0
395.83 s
> Checking typeid v1.0.3
395.83 s
> Checking toml_edit v0.22.27
395.83 s
> Checking is-terminal v0.4.17
395.83 s
> Checking funty v2.0.0
395.83 s
> Checking bytecount v0.6.9
395.83 s
> Checking oorandom v11.1.5
395.83 s
> Checking anes v0.1.6
395.83 s
> Checking papergrid v0.17.0
395.83 s
> Checking ron v0.12.1
395.83 s
> Checking rand v0.8.6
395.83 s
> Checking bitvec v1.0.1
395.83 s
> Checking criterion-plot v0.5.0
395.83 s
> Checking testing_table v0.3.0
395.83 s
> Checking env_filter v1.0.1
395.83 s
> Checking toml_edit v0.25.11+spec-1.1.0
395.83 s
> Checking xprec v0.2.2
395.83 s
> Checking clap v4.6.1
395.83 s
> Checking uncased v0.9.10
395.83 s
> Checking jiff v0.2.24
395.83 s
> Checking ptr_meta v0.1.4
395.83 s
> Checking simdutf8 v0.1.5
395.83 s
> Checking ucd-trie v0.1.7
395.83 s
> Checking ahash v0.7.8
395.83 s
> Checking approx v0.4.0
395.83 s
> Checking pest v2.8.6
395.83 s
> Checking bytecheck v0.6.12
395.83 s
> Checking seahash v4.1.0
395.83 s
> Checking cgmath v0.18.0
395.83 s
> Checking hashbrown v0.12.3
395.83 s
> Checking num-rational v0.4.2
395.83 s
> Checking tabled v0.20.0
395.83 s
> Checking criterion v0.5.1
395.83 s
> Compiling pyo3-ffi v0.28.3
395.83 s
> Compiling pyo3-macros-backend v0.28.3
395.83 s
> Compiling pyo3 v0.28.3
395.83 s
> Compiling numpy v0.28.0
395.83 s
> Checking toml v0.8.23
395.83 s
> Checking rend v0.4.2
395.83 s
> Checking num-iter v0.1.45
395.83 s
> Checking ref-ops v0.2.5
395.83 s
> Checking num v0.4.3
395.83 s
> Checking rand_xoshiro v0.6.0
395.83 s
> Checking features v0.10.0
395.83 s
> Checking figment v0.10.19
395.83 s
> Checking gat-lending-iterator v0.1.8
395.83 s
> Checking constcat v0.5.1
395.83 s
> Checking colored v2.2.0
395.83 s
> Checking insta v1.47.2
395.83 s
> Checking dot-parser v0.5.1
395.83 s
> Checking cpufeatures v0.3.0
395.83 s
> Checking arrayref v0.3.9
395.83 s
> Checking constant_time_eq v0.4.2
395.83 s
> Checking base64 v0.22.1
395.83 s
> Checking blake3 v1.8.5
395.83 s
> Checking joinery v2.1.0
395.83 s
> Checking siphasher v1.0.2
395.83 s
> Checking titlecase v2.2.1
395.83 s
> Checking subprocess v0.2.15
395.83 s
> Checking rust_lisp v0.18.0
395.83 s
> Compiling vakint v0.1.2 (/build/source/crates/vakint)
395.83 s
> Checking version-compare v0.2.1
395.83 s
> Checking xpct v0.5.1
395.83 s
> Checking phf_shared v0.13.1
395.83 s
> Checking ryu v1.0.23
395.83 s
> Checking castaway v0.2.4
395.83 s
> Checking toml_datetime v0.7.5+spec-1.1.0
395.83 s
> Checking strum v0.27.2
395.83 s
> Checking compact_str v0.9.0
395.83 s
> Checking unicode-truncate v2.0.1
395.83 s
> Checking kasuari v0.4.12
395.83 s
> Checking phf v0.13.1
395.83 s
> Checking lru v0.16.4
395.83 s
> Checking vte v0.15.0
395.83 s
> Checking portable-atomic v1.13.1
395.83 s
> Checking unit-prefix v0.5.2
395.83 s
> Checking toml v0.9.12+spec-1.1.0
395.83 s
> Compiling rustpython-parser-core v0.4.0
395.83 s
> Checking rand_distr v0.4.3
395.83 s
> Checking simba v0.6.0
395.83 s
> Checking line-clipping v0.3.7
395.83 s
> Checking vt100 v0.16.2
395.83 s
> Checking adler2 v2.0.1
395.83 s
> Compiling rustpython-ast v0.4.0
395.83 s
> Checking ratatui-core v0.1.0
395.83 s
> Checking gimli v0.32.3
395.83 s
> Compiling three-dimensional-reps v0.1.0 (/build/source/crates/three-dimensional-reps)
395.83 s
> Checking miniz_oxide v0.8.9
395.83 s
> Checking string-template-plus v0.4.3
395.83 s
> Checking thiserror v1.0.69
395.83 s
> Checking indicatif v0.18.4
395.83 s
> Checking derive_builder v0.11.2
395.83 s
> Checking object v0.37.3
395.83 s
> Checking crossterm v0.29.0
395.83 s
> Checking owo-colors v4.3.0
395.83 s
> Checking env_logger v0.11.10
395.83 s
> Checking tracing-error v0.2.1
395.83 s
> Checking typed-index-collections v3.5.0
395.83 s
> Checking serde-big-array v0.5.1
395.83 s
> Checking amd v0.2.2
395.83 s
> Checking itertools v0.11.0
395.83 s
> Compiling gammaloop-tracing-filter-macros v0.1.0 (/build/source/crates/gammaloop-tracing-filter-macros)
395.83 s
> Checking rustc-demangle v0.1.27
395.83 s
> Checking rkyv v0.7.46
395.83 s
> Checking option-ext v0.2.0
395.83 s
> Checking dirs-sys v0.5.0
395.83 s
> Checking ref-cast v1.0.25
395.83 s
> Checking nix v0.31.2
395.83 s
> Checking brotli-decompressor v4.0.3
395.83 s
> Checking integer-sqrt v0.1.5
395.83 s
> Checking crossbeam-channel v0.5.15
395.83 s
> Checking itertools v0.12.1
395.83 s
> Compiling gammalooprs v0.3.4 (/build/source/crates/gammalooprs)
395.83 s
> Checking unsafe-libyaml v0.2.11
395.83 s
> Checking color-spantrace v0.3.0
395.83 s
> Checking symlink v0.1.0
395.83 s
> Checking pathfinding v4.15.0
395.83 s
> Checking include_dir v0.7.4
395.83 s
> Checking ratatui-widgets v0.3.0
395.83 s
> Checking ratatui-crossterm v0.1.0
395.83 s
> Compiling numerica v2.2.0 (https://github.com/alphal00p/symbolica?rev=a277a8dadbaae5a8d6605f2f381991a601e1f345#a277a8da)
395.83 s
> Checking tracing-appender v0.2.5
395.83 s
> Checking brotli v7.0.0
395.83 s
> Checking ctrlc v3.5.2
395.83 s
> Checking tracing-indicatif v0.3.14
395.83 s
> Checking clarabel v0.11.1
395.83 s
> Checking dirs v6.0.0
395.83 s
> Checking schemars v1.2.1
395.83 s
> Checking slotmap v1.1.1
395.83 s
> Checking serde_yaml v0.9.34+deprecated
395.83 s
> Checking json5 v0.4.1
395.83 s
> Checking ratatui-macros v0.7.0
395.83 s
> Checking ratatui v0.30.0
395.83 s
> Checking vectorize v0.2.0
395.83 s
> Checking ringbuffer v0.16.0
395.83 s
> Checking addr2line v0.25.1
395.83 s
> Checking base62 v2.2.4
395.83 s
> Checking rust-embed v8.11.0
395.83 s
> Checking clap_complete v4.6.3
395.83 s
> Checking fd-lock v4.0.4
395.83 s
> Checking strip-ansi-escapes v0.2.1
395.83 s
> Compiling gammaloop-api v0.1.0 (/build/source/crates/gammaloop-api)
395.83 s
> Checking itertools v0.13.0
395.83 s
> Checking strum v0.26.3
395.83 s
> Checking sysinfo v0.33.1
395.83 s
> Checking shlex v1.3.0
395.83 s
> Checking slab v0.4.12
395.83 s
> Checking futures-task v0.3.32
395.83 s
> Checking futures-core v0.3.32
395.83 s
> Checking sdd v3.0.10
395.83 s
> Compiling gammaloop-integration-tests v0.1.0 (/build/source/tests)
395.83 s
> Compiling test-log-core v0.2.20
395.83 s
> Compiling rustc_version v0.4.1
395.83 s
> Checking futures-util v0.3.32
395.83 s
> Checking clap_complete_nushell v4.6.0
395.83 s
> Checking which v8.0.2
395.83 s
> Checking bincode v1.3.3
395.83 s
> Checking scc v2.4.0
395.83 s
> Compiling gungraun-runner v0.18.2
395.83 s
> Checking proc-macro2 v1.0.106
395.83 s
> Compiling gungraun-macros v0.8.0
395.83 s
> Checking backtrace v0.3.76
395.83 s
> Checking reedline v0.42.0
395.83 s
> Checking color-eyre v0.6.5
395.83 s
> Checking quote v1.0.45
395.83 s
> Checking base64 v0.21.7
395.83 s
> Checking maplit v1.0.2
395.83 s
> Compiling iai-callgrind-runner v0.14.2
395.83 s
> Checking kurbo v0.13.0
395.83 s
> Checking wait-timeout v0.2.1
395.83 s
> Checking ron v0.8.1
395.83 s
> Checking nalgebra v0.29.0
395.83 s
> Checking quick-error v1.2.3
395.83 s
> Checking bit-vec v0.8.0
395.83 s
> Compiling iai-callgrind v0.14.2
395.83 s
> Checking bit-set v0.8.0
395.83 s
> Checking rusty-fork v0.3.1
395.83 s
> Checking syn v2.0.117
395.83 s
> Compiling iai-callgrind-macros v0.5.1
395.83 s
> Checking futures-executor v0.3.32
395.83 s
> Compiling graphica v2.1.0 (https://github.com/alphal00p/symbolica?rev=a277a8dadbaae5a8d6605f2f381991a601e1f345#a277a8da)
395.83 s
> Checking serial_test v3.4.0
395.83 s
> Compiling test-log-macros v0.2.20
395.83 s
> Checking rand_xorshift v0.4.0
395.83 s
> Checking console v0.15.11
395.83 s
> Checking pathdiff v0.2.3
395.83 s
> Checking unarray v0.1.4
395.83 s
> Checking proptest v1.11.0
395.83 s
> Checking similar-asserts v1.7.0
395.83 s
> Checking clinnet v0.1.8 (/build/source/crates/clinnet)
395.83 s
> Checking kurvst v0.1.0 (/build/source/crates/kurvst)
395.83 s
> Checking test-log v0.2.20
395.83 s
> Checking gungraun v0.18.2
395.83 s
> Checking statrs v0.16.1
395.83 s
> Checking momtrop v0.3.0
395.83 s
> Compiling pyo3-macros v0.28.3
395.83 s
> Compiling pyo3-stub-gen-derive v0.17.2
395.83 s
> Checking pyo3-stub-gen v0.17.2
395.83 s
> Checking symbolica-utils v0.1.0 (/build/source/crates/symbolica-utils)
395.83 s
> Checking spenso-macros v0.3.2 (/build/source/crates/spenso-macros)
395.83 s
> Compiling gammaloop-workspace-hack v0.1.0 (/build/source/crates/gammaloop-workspace-hack)
395.83 s
> Checking linnet v0.17.0 (/build/source/crates/linnet)
395.83 s
> Checking spenso v0.6.0 (/build/source/crates/spenso)
395.83 s
> Checking linnet-py v0.1.0 (/build/source/crates/linnet-py)
395.83 s
> Checking linnest v0.1.0 (/build/source/crates/linnest)
395.83 s
> Checking idenso v0.3.0 (/build/source/crates/idenso)
395.83 s
> Checking gammaloop-tracing-filter v0.1.0 (/build/source/crates/gammaloop-tracing-filter)
395.83 s
> Checking spenso-hep-lib v0.1.7 (/build/source/crates/spenso-hep-lib)
395.83 s
> Checking spynso3 v0.1.2 (/build/source/crates/spynso3)
395.83 s
> error[E0560] : struct `CutInfo` has no field named `lmb_channel_id`
395.83 s
> --> tests/tests/test_differential.rs:86:13
395.83 s
> |
395.83 s
> 86 | lmb_channel_id: None,
395.83 s
> | ^^^^^^^^^^^^^^ `CutInfo` does not have this field
395.83 s
> |
395.83 s
> = note : available fields are: `sampling_channel_id`, `sampling_channel_edge_ids`
395.83 s
>
395.83 s
> error[E0560] : struct `CutInfo` has no field named `lmb_channel_edge_ids`
395.83 s
> --> tests/tests/test_differential.rs:87:13
395.83 s
> |
395.83 s
> 87 | lmb_channel_edge_ids: None,
395.83 s
> | ^^^^^^^^^^^^^^^^^^^^ `CutInfo` does not have this field
395.83 s
> |
395.83 s
> = note : available fields are: `sampling_channel_id`, `sampling_channel_edge_ids`
395.83 s
>
395.83 s
> error[E0609] : no field `lmb_channel_edge_ids` on type `CutInfo`
395.83 s
> --> tests/tests/test_evaluation_api.rs:311:10
395.83 s
> |
395.83 s
> 311 | .lmb_channel_edge_ids
395.83 s
> | ^^^^^^^^^^^^^^^^^^^^ unknown field
395.83 s
> |
395.83 s
> = note : available fields are: `particle_pdgs`, `cut_id`, `graph_id`, `graph_group_id`, `orientation_id` ... and 2 others
395.83 s
>
395.83 s
> error[E0609] : no field `lmb_channel_edge_ids` on type `CutInfo`
395.83 s
> --> tests/tests/test_evaluation_api.rs:591:26
395.83 s
> |
395.83 s
> 591 | .lmb_channel_edge_ids
395.83 s
> | ^^^^^^^^^^^^^^^^^^^^ unknown field
395.83 s
> |
395.83 s
> = note : available fields are: `particle_pdgs`, `cut_id`, `graph_id`, `graph_group_id`, `orientation_id` ... and 2 others
395.83 s
>
395.83 s
> For more information about this error, try `rustc --explain E0560`.
395.83 s
> error : could not compile `gammaloop-integration-tests` (test "test_differential") due to 2 previous errors
395.83 s
> warning : build failed, waiting for other jobs to finish...
395.83 s
> error[E0609] : no field `lmb_channel_edge_ids` on type `CutInfo`
395.83 s
> --> tests/tests/test_evaluation_api.rs:1177:18
395.83 s
> |
395.83 s
> 1177 | .lmb_channel_edge_ids
395.83 s
> | ^^^^^^^^^^^^^^^^^^^^ unknown field
395.83 s
> |
395.83 s
> = note : available fields are: `particle_pdgs`, `cut_id`, `graph_id`, `graph_group_id`, `orientation_id` ... and 2 others
395.83 s
>
395.83 s
> error[E0609] : no field `lmb_channel_edge_ids` on type `CutInfo`
395.83 s
> --> tests/tests/test_evaluation_api.rs:1222:22
395.83 s
> |
395.83 s
> 1222 | .lmb_channel_edge_ids
395.83 s
> | ^^^^^^^^^^^^^^^^^^^^ unknown field
395.83 s
> |
395.83 s
> = note : available fields are: `particle_pdgs`, `cut_id`, `graph_id`, `graph_group_id`, `orientation_id` ... and 2 others
395.83 s
>
395.83 s
> error[E0609] : no field `lmb_channel_edge_ids` on type `CutInfo`
395.83 s
> --> tests/tests/test_evaluation_api.rs:1281:14
395.83 s
> |
395.83 s
> 1281 | .lmb_channel_edge_ids
395.83 s
> | ^^^^^^^^^^^^^^^^^^^^ unknown field
395.83 s
> |
395.83 s
> = note : available fields are: `particle_pdgs`, `cut_id`, `graph_id`, `graph_group_id`, `orientation_id` ... and 2 others
395.83 s
>
395.83 s
> error[E0609] : no field `lmb_channel_edge_ids` on type `CutInfo`
395.83 s
> --> tests/tests/test_evaluation_api.rs:1428:18
395.83 s
> |
395.83 s
> 1428 | .lmb_channel_edge_ids
395.83 s
> | ^^^^^^^^^^^^^^^^^^^^ unknown field
395.83 s
> |
395.83 s
> = note : available fields are: `particle_pdgs`, `cut_id`, `graph_id`, `graph_group_id`, `orientation_id` ... and 2 others
395.83 s
>
395.83 s
> For more information about this error, try `rustc --explain E0609`.
395.83 s
> error : could not compile `gammaloop-integration-tests` (test "test_evaluation_api") due to 6 previous errors
395.83 s
> error[E0609] : no field `lmb_channel_id` on type `CutInfo`
395.83 s
> --> tests/tests/test_runs/utils.rs:568:36
395.83 s
> |
395.83 s
> 568 | event.cut_info.lmb_channel_id,
395.83 s
> | ^^^^^^^^^^^^^^ unknown field
395.83 s
> |
395.83 s
> = note : available fields are: `particle_pdgs`, `cut_id`, `graph_id`, `graph_group_id`, `orientation_id` ... and 2 others
395.83 s
>
395.83 s
> error[E0609] : no field `lmb_channel_id` on type `CutInfo`
395.83 s
> --> tests/tests/test_runs/utils.rs:580:36
395.83 s
> |
395.83 s
> 580 | event.cut_info.lmb_channel_id,
395.83 s
> | ^^^^^^^^^^^^^^ unknown field
395.83 s
> |
395.83 s
> = note : available fields are: `particle_pdgs`, `cut_id`, `graph_id`, `graph_group_id`, `orientation_id` ... and 2 others
395.83 s
>
395.83 s
> error : could not compile `gammaloop-integration-tests` (test "test_runs") due to 2 previous errors
395.83 s
For full logs, run:
395.83 s
nix log /nix/store/ws66y79brahbksfmnksfcdd9g1qvcyzb-gammaloop-workspace-check-0.1.0.drv
395.86 s
Build failed.