1. 0.02 s $ /nix/store/9ypz3flqsrl5xl495mm8h645gadjsxi1-coreutils-9.11/bin/timeout --kill-after=15s 7200s /nix/store/23zk8sgzamrbmj1fday15szf7f2279s8-nix-2.34.7/bin/nix --extra-experimental-features nix-command --extra-experimental-features flakes --log-format internal-json build --no-link --print-out-paths git+https://github.com/alphal00p/gammaloop?ref=advanced_sampling&rev=17cab6f72c1df1d8c1446d47281e0e8c60d52e8b&shallow=1#checks.x86_64-linux.gammaloop-check --print-build-logs
  2. 5.89 s
  3. 7.30 s Building /nix/store/ws66y79brahbksfmnksfcdd9g1qvcyzb-gammaloop-workspace-check-0.1.0.drv
  4. 7.42 s [gammaloop-workspace-check] Phase: unpackPhase
  5. 7.42 s [gammaloop-workspace-check] unpacking source archive /nix/store/ypmxspggpi4qfj1zy7ml6kwz1d0c3m10-source
  6. 7.62 s [gammaloop-workspace-check] source root is source
  7. 7.69 s [gammaloop-workspace-check] Phase: patchPhase
  8. 7.70 s [gammaloop-workspace-check] Executing configureCargoCommonVars
  9. 7.70 s [gammaloop-workspace-check] decompressing cargo artifacts from /nix/store/50vpxlcgfxf2d57i27v3d10zjwxxbm2r-gammaloop-workspace-deps-deps-0.1.0/target.tar.zst to target
  10. 11.46 s [gammaloop-workspace-check] Phase: updateAutotoolsGnuConfigScriptsPhase
  11. 11.51 s [gammaloop-workspace-check] Phase: configurePhase
  12. 11.51 s [gammaloop-workspace-check] will append /build/source/.cargo-home/config.toml with contents of /nix/store/5drf77x6km4ky7gwlrzdx9bbd6fz09g3-vendor-cargo-deps/config.toml
  13. 11.52 s [gammaloop-workspace-check] default configurePhase, nothing to do
  14. 11.52 s [gammaloop-workspace-check] Phase: buildPhase
  15. 11.52 s [gammaloop-workspace-check] +++ command cargo --version
  16. 11.53 s [gammaloop-workspace-check] cargo 1.97.0 (c980f4866 2026-06-30)
  17. 11.57 s [gammaloop-workspace-check] +++ command cargo check --profile ci-optim --locked --workspace --features gammaloop-tracing-filter/clap,gammaloop-tracing-filter/symbolica,idenso/bincode,idenso/reference-cases,linnet/bincode,linnet/drawing,linnet/rkyv,linnet/serde,linnet/symbolica,spenso-macros/shadowing,spenso/shadowing,symbolica/tracing_max_level_info,three-dimensional-reps/display,three-dimensional-reps/eval,three-dimensional-reps/serde --all-targets
  18. 12.48 s [gammaloop-workspace-check] Checking cfg-if v1.0.4
  19. 12.48 s [gammaloop-workspace-check] Checking memchr v2.8.0
  20. 12.48 s [gammaloop-workspace-check] Checking once_cell v1.21.4
  21. 12.48 s [gammaloop-workspace-check] Checking either v1.15.0
  22. 12.49 s [gammaloop-workspace-check] Checking serde_core v1.0.228
  23. 12.49 s [gammaloop-workspace-check] Checking libc v0.2.186
  24. 12.50 s [gammaloop-workspace-check] Checking libm v0.2.16
  25. 12.52 s [gammaloop-workspace-check] Checking itoa v1.0.18
  26. 12.54 s [gammaloop-workspace-check] Checking log v0.4.29
  27. 12.54 s [gammaloop-workspace-check] Checking regex-syntax v0.8.10
  28. 12.55 s [gammaloop-workspace-check] Checking zerocopy v0.8.48
  29. 12.55 s [gammaloop-workspace-check] Checking crossbeam-utils v0.8.21
  30. 12.55 s [gammaloop-workspace-check] Checking equivalent v1.0.2
  31. 12.57 s [gammaloop-workspace-check] Checking zmij v1.0.21
  32. 12.59 s [gammaloop-workspace-check] Checking bytemuck v1.25.0
  33. 12.60 s [gammaloop-workspace-check] Checking lazy_static v1.5.0
  34. 12.66 s [gammaloop-workspace-check] Compiling target-lexicon v0.13.5
  35. 12.67 s [gammaloop-workspace-check] Checking arrayvec v0.7.6
  36. 12.67 s [gammaloop-workspace-check] Checking powerfmt v0.2.0
  37. 12.71 s [gammaloop-workspace-check] Checking num_threads v0.1.7
  38. 12.81 s [gammaloop-workspace-check] Checking num-conv v0.2.1
  39. 12.83 s [gammaloop-workspace-check] Checking safe_arch v0.7.4
  40. 12.84 s [gammaloop-workspace-check] Checking time-core v0.1.8
  41. 12.87 s [gammaloop-workspace-check] Checking pin-project-lite v0.2.17
  42. 12.92 s [gammaloop-workspace-check] Checking tracing-core v0.1.36
  43. 12.95 s [gammaloop-workspace-check] Checking itertools v0.14.0
  44. 12.95 s [gammaloop-workspace-check] Checking deranged v0.5.8
  45. 12.97 s [gammaloop-workspace-check] Checking foldhash v0.2.0
  46. 12.98 s [gammaloop-workspace-check] Checking allocator-api2 v0.2.21
  47. 13.04 s [gammaloop-workspace-check] Checking const-random v0.1.18
  48. 13.09 s [gammaloop-workspace-check] Checking winnow v1.0.2
  49. 13.11 s [gammaloop-workspace-check] Checking unty v0.0.4
  50. 13.11 s [gammaloop-workspace-check] Checking nu-ansi-term v0.50.3
  51. 13.18 s [gammaloop-workspace-check] Checking static_assertions v1.1.0
  52. 13.23 s [gammaloop-workspace-check] Checking crossbeam-epoch v0.9.18
  53. 13.27 s [gammaloop-workspace-check] Checking safe_arch v1.0.0
  54. 13.47 s [gammaloop-workspace-check] Checking sharded-slab v0.1.7
  55. 13.58 s [gammaloop-workspace-check] Checking wide v0.7.33
  56. 13.81 s [gammaloop-workspace-check] Checking hashbrown v0.16.1
  57. 13.93 s [gammaloop-workspace-check] Checking thread_local v1.1.9
  58. 13.97 s [gammaloop-workspace-check] Checking tracing v0.1.44
  59. 13.97 s [gammaloop-workspace-check] Checking crossbeam-deque v0.8.6
  60. 14.16 s [gammaloop-workspace-check] Checking tracing-log v0.2.0
  61. 14.20 s [gammaloop-workspace-check] Checking indenter v0.3.4
  62. 14.25 s [gammaloop-workspace-check] Checking rayon-core v1.13.0
  63. 14.27 s [gammaloop-workspace-check] Checking toml_writer v1.1.1+spec-1.1.0
  64. 14.29 s [gammaloop-workspace-check] Checking az v1.3.0
  65. 14.38 s [gammaloop-workspace-check] Checking wide v1.3.0
  66. 14.51 s [gammaloop-workspace-check] Compiling phf_shared v0.11.3
  67. 14.73 s [gammaloop-workspace-check] Checking anyhow v1.0.102
  68. 14.76 s [gammaloop-workspace-check] Checking num-traits v0.2.19
  69. 14.87 s [gammaloop-workspace-check] Checking aho-corasick v1.1.4
  70. 15.11 s [gammaloop-workspace-check] Checking rawpointer v0.2.1
  71. 15.23 s [gammaloop-workspace-check] Checking dyn-clone v1.0.20
  72. 15.33 s [gammaloop-workspace-check] Checking rayon v1.12.0
  73. 15.37 s [gammaloop-workspace-check] Checking alloc-no-stdlib v2.0.4
  74. 15.54 s [gammaloop-workspace-check] Checking utf8parse v0.2.2
  75. 15.71 s [gammaloop-workspace-check] Checking anstyle-parse v1.0.0
  76. 15.90 s [gammaloop-workspace-check] Checking alloc-stdlib v0.2.2
  77. 15.92 s [gammaloop-workspace-check] Checking matrixmultiply v0.3.10
  78. 15.94 s [gammaloop-workspace-check] Checking approx v0.5.1
  79. 16.11 s [gammaloop-workspace-check] Checking num-integer v0.1.46
  80. 16.13 s [gammaloop-workspace-check] Checking colored v3.1.1
  81. 16.41 s [gammaloop-workspace-check] Compiling pyo3-build-config v0.28.3
  82. 16.43 s [gammaloop-workspace-check] Checking anstyle-query v1.1.5
  83. 16.48 s [gammaloop-workspace-check] Checking anstyle v1.0.14
  84. 16.53 s [gammaloop-workspace-check] Checking colorchoice v1.0.5
  85. 16.60 s [gammaloop-workspace-check] Checking is_terminal_polyfill v1.70.2
  86. 16.64 s [gammaloop-workspace-check] Compiling phf_generator v0.11.3
  87. 16.69 s [gammaloop-workspace-check] Checking eyre v0.6.12
  88. 16.72 s [gammaloop-workspace-check] Checking toml_parser v1.1.2+spec-1.1.0
  89. 16.73 s [gammaloop-workspace-check] Checking unicode-width v0.2.2
  90. 16.74 s [gammaloop-workspace-check] Checking bitflags v1.3.2
  91. 16.78 s [gammaloop-workspace-check] Checking anstream v1.0.0
  92. 16.91 s [gammaloop-workspace-check] Checking brotli-decompressor v5.0.0
  93. 16.91 s [gammaloop-workspace-check] Checking inventory v0.3.24
  94. 17.06 s [gammaloop-workspace-check] Checking spec_math v0.1.6
  95. 17.16 s [gammaloop-workspace-check] Compiling phf_codegen v0.11.3
  96. 17.18 s [gammaloop-workspace-check] Checking thiserror v2.0.18
  97. 17.22 s [gammaloop-workspace-check] Checking libloading v0.9.0
  98. 17.30 s [gammaloop-workspace-check] Compiling getopts v0.2.24
  99. 17.34 s [gammaloop-workspace-check] Checking tinyjson v2.5.1
  100. 17.38 s [gammaloop-workspace-check] Checking append-only-vec v0.1.8
  101. 17.38 s [gammaloop-workspace-check] Checking bytes v1.11.1
  102. 17.44 s [gammaloop-workspace-check] Checking self_cell v1.2.2
  103. 17.46 s [gammaloop-workspace-check] Checking byteorder v1.5.0
  104. 17.58 s [gammaloop-workspace-check] Compiling unic-common v0.9.0
  105. 17.59 s [gammaloop-workspace-check] Compiling unic-char-range v0.9.0
  106. 17.67 s [gammaloop-workspace-check] Checking linux-raw-sys v0.12.1
  107. 17.70 s [gammaloop-workspace-check] Compiling unic-ucd-version v0.9.0
  108. 17.86 s [gammaloop-workspace-check] Compiling unic-char-property v0.9.0
  109. 17.88 s [gammaloop-workspace-check] Compiling is-macro v0.3.7
  110. 17.91 s [gammaloop-workspace-check] Checking regex-automata v0.4.14
  111. 17.91 s [gammaloop-workspace-check] Compiling unicode_names2_generator v1.3.0
  112. 17.97 s [gammaloop-workspace-check] Compiling rustpython-parser-vendored v0.4.0
  113. 18.02 s [gammaloop-workspace-check] Checking iana-time-zone v0.1.65
  114. 18.09 s [gammaloop-workspace-check] Compiling rustpython-parser v0.4.0
  115. 18.44 s [gammaloop-workspace-check] Compiling phf v0.11.3
  116. 18.51 s [gammaloop-workspace-check] Checking getrandom v0.3.4
  117. 18.62 s [gammaloop-workspace-check] Checking time v0.3.47
  118. 18.64 s [gammaloop-workspace-check] Checking gmp-mpfr-sys v1.7.1
  119. 18.86 s [gammaloop-workspace-check] Checking rand_core v0.9.5
  120. 18.90 s [gammaloop-workspace-check] Checking region v3.0.2
  121. 18.94 s [gammaloop-workspace-check] Checking wasmtime-jit-icache-coherence v34.0.2
  122. 19.06 s [gammaloop-workspace-check] Checking hugepage-rs v0.1.1
  123. 19.08 s [gammaloop-workspace-check] Checking rustc-hash v2.1.2
  124. 19.21 s [gammaloop-workspace-check] Compiling unic-emoji-char v0.9.0
  125. 19.24 s [gammaloop-workspace-check] Compiling unic-ucd-ident v0.9.0
  126. 19.27 s [gammaloop-workspace-check] Compiling rustc-hash v1.1.0
  127. 19.34 s [gammaloop-workspace-check] Compiling lalrpop-util v0.20.2
  128. 19.40 s [gammaloop-workspace-check] Checking brotli v8.0.2
  129. 19.42 s [gammaloop-workspace-check] Checking unicode-segmentation v1.13.2
  130. 19.62 s [gammaloop-workspace-check] Compiling symbolica v2.2.0 (https://github.com/alphal00p/symbolica?rev=a277a8dadbaae5a8d6605f2f381991a601e1f345#a277a8da)
  131. 19.72 s [gammaloop-workspace-check] Compiling rug v1.30.0
  132. 19.75 s [gammaloop-workspace-check] Checking typenum v1.20.0
  133. 19.90 s [gammaloop-workspace-check] Checking getrandom v0.2.17
  134. 20.16 s [gammaloop-workspace-check] Checking scopeguard v1.2.0
  135. 20.17 s [gammaloop-workspace-check] Checking unicode-ident v1.0.24
  136. 20.25 s [gammaloop-workspace-check] Checking hashbrown v0.17.0
  137. 20.30 s [gammaloop-workspace-check] Checking lock_api v0.4.14
  138. 20.38 s [gammaloop-workspace-check] Checking errno v0.3.14
  139. 20.42 s [gammaloop-workspace-check] Checking strsim v0.11.1
  140. 20.53 s [gammaloop-workspace-check] Checking clap_lex v1.1.0
  141. 20.76 s [gammaloop-workspace-check] Checking unicase v2.9.0
  142. 20.86 s [gammaloop-workspace-check] Checking signal-hook-registry v1.4.8
  143. 20.88 s [gammaloop-workspace-check] Checking vte v0.14.1
  144. 21.00 s [gammaloop-workspace-check] Checking same-file v1.0.6
  145. 21.04 s [gammaloop-workspace-check] Checking serde v1.0.228
  146. 21.08 s [gammaloop-workspace-check] Checking serde_json v1.0.149
  147. 21.12 s [gammaloop-workspace-check] Checking bitflags v2.11.1
  148. 21.22 s [gammaloop-workspace-check] Checking serde_spanned v1.1.1
  149. 21.25 s [gammaloop-workspace-check] Checking toml_datetime v1.1.1+spec-1.1.0
  150. 21.49 s [gammaloop-workspace-check] Checking signal-hook v0.3.18
  151. 21.49 s [gammaloop-workspace-check] Checking generic-array v0.14.7
  152. 21.52 s [gammaloop-workspace-check] Checking indexmap v2.14.0
  153. 21.54 s [gammaloop-workspace-check] Checking toml v1.1.2+spec-1.1.0
  154. 21.54 s [gammaloop-workspace-check] Checking rustix v1.1.4
  155. 21.90 s [gammaloop-workspace-check] Checking walkdir v2.5.0
  156. 22.01 s [gammaloop-workspace-check] Checking mio v1.2.0
  157. 22.41 s [gammaloop-workspace-check] Checking ciborium-io v0.2.2
  158. 22.55 s [gammaloop-workspace-check] Checking minimal-lexical v0.2.1
  159. 22.57 s [gammaloop-workspace-check] Checking block-buffer v0.10.4
  160. 22.70 s [gammaloop-workspace-check] Checking crypto-common v0.1.7
  161. 22.93 s [gammaloop-workspace-check] Checking digest v0.10.7
  162. 22.97 s [gammaloop-workspace-check] Checking signal-hook-mio v0.2.5
  163. 23.08 s [gammaloop-workspace-check] Checking smallvec v1.15.1
  164. 23.09 s [gammaloop-workspace-check] Checking num-complex v0.4.6
  165. 23.13 s [gammaloop-workspace-check] Checking tracing-serde v0.2.0
  166. 23.24 s [gammaloop-workspace-check] Checking bincode v2.0.1
  167. 23.29 s [gammaloop-workspace-check] Checking smartstring v1.0.1
  168. 23.35 s [gammaloop-workspace-check] Checking chrono v0.4.44
  169. 23.59 s [gammaloop-workspace-check] Checking parking_lot_core v0.9.12
  170. 23.83 s [gammaloop-workspace-check] Checking nom v7.1.3
  171. 24.06 s [gammaloop-workspace-check] Checking parking_lot v0.12.5
  172. 24.06 s [gammaloop-workspace-check] Checking simba v0.9.1
  173. 24.63 s [gammaloop-workspace-check] Checking ndarray v0.17.2
  174. 24.73 s [gammaloop-workspace-check] Checking num-bigint v0.4.6
  175. 24.84 s [gammaloop-workspace-check] Checking derive_more v2.1.1
  176. 24.85 s [gammaloop-workspace-check] Checking console v0.16.3
  177. 24.98 s [gammaloop-workspace-check] Checking bstr v1.12.1
  178. 25.78 s [gammaloop-workspace-check] Checking linux-raw-sys v0.4.15
  179. 25.83 s [gammaloop-workspace-check] Checking ppv-lite86 v0.2.21
  180. 25.86 s [gammaloop-workspace-check] Checking ahash v0.8.12
  181. 26.19 s [gammaloop-workspace-check] Checking half v2.7.1
  182. 26.40 s [gammaloop-workspace-check] Checking cpufeatures v0.2.17
  183. 26.51 s [gammaloop-workspace-check] Checking winnow v0.7.15
  184. 26.70 s [gammaloop-workspace-check] Checking rustix v0.38.44
  185. 26.81 s [gammaloop-workspace-check] Checking ciborium-ll v0.2.2
  186. 26.93 s [gammaloop-workspace-check] Checking rand_chacha v0.9.0
  187. 26.99 s [gammaloop-workspace-check] Checking matchers v0.2.0
  188. 27.21 s [gammaloop-workspace-check] Checking tracing-subscriber v0.3.23
  189. 27.45 s [gammaloop-workspace-check] Checking regex v1.12.3
  190. 27.49 s [gammaloop-workspace-check] Checking rand v0.9.4
  191. 27.71 s [gammaloop-workspace-check] Checking terminal_size v0.4.4
  192. 27.90 s [gammaloop-workspace-check] Checking clap_builder v4.6.0
  193. 28.22 s [gammaloop-workspace-check] Checking ansitok v0.3.0
  194. 28.31 s [gammaloop-workspace-check] Checking ciborium v0.2.2
  195. 28.66 s [gammaloop-workspace-check] Compiling unicode_names2 v1.3.0
  196. 28.99 s [gammaloop-workspace-check] Checking globset v0.4.18
  197. 29.06 s [gammaloop-workspace-check] Checking symjit v2.21.0
  198. 29.26 s [gammaloop-workspace-check] Checking sha2 v0.10.9
  199. 29.29 s [gammaloop-workspace-check] Checking rand_core v0.6.4
  200. 29.75 s [gammaloop-workspace-check] Checking getrandom v0.4.2
  201. 29.89 s [gammaloop-workspace-check] Checking plotters-backend v0.3.7
  202. 29.98 s [gammaloop-workspace-check] Checking fnv v1.0.7
  203. 30.08 s [gammaloop-workspace-check] Checking fastrand v2.4.1
  204. 30.11 s [gammaloop-workspace-check] Checking crossterm v0.28.1
  205. 30.26 s [gammaloop-workspace-check] Checking rust-embed-utils v8.11.0
  206. 30.45 s [gammaloop-workspace-check] Checking tempfile v3.27.0
  207. 30.49 s [gammaloop-workspace-check] Checking toml_datetime v0.6.11
  208. 30.52 s [gammaloop-workspace-check] Checking plotters-svg v0.3.7
  209. 30.54 s [gammaloop-workspace-check] Checking serde_spanned v0.6.9
  210. 30.56 s [gammaloop-workspace-check] Checking itertools v0.10.5
  211. 30.71 s [gammaloop-workspace-check] Checking cast v0.3.0
  212. 30.81 s [gammaloop-workspace-check] Checking toml_write v0.1.2
  213. 30.91 s [gammaloop-workspace-check] Checking tap v1.0.1
  214. 30.93 s [gammaloop-workspace-check] Checking plotters v0.3.7
  215. 31.12 s [gammaloop-workspace-check] Checking rand_chacha v0.3.1
  216. 31.19 s [gammaloop-workspace-check] Checking wyz v0.5.1
  217. 31.33 s [gammaloop-workspace-check] Checking ansi-str v0.9.0
  218. 31.45 s [gammaloop-workspace-check] Checking tinytemplate v1.2.1
  219. 31.63 s [gammaloop-workspace-check] Checking radium v0.7.0
  220. 31.95 s [gammaloop-workspace-check] Checking similar v2.7.0
  221. 32.14 s [gammaloop-workspace-check] Checking typeid v1.0.3
  222. 32.19 s [gammaloop-workspace-check] Checking toml_edit v0.22.27
  223. 32.26 s [gammaloop-workspace-check] Checking is-terminal v0.4.17
  224. 32.32 s [gammaloop-workspace-check] Checking funty v2.0.0
  225. 32.39 s [gammaloop-workspace-check] Checking bytecount v0.6.9
  226. 32.48 s [gammaloop-workspace-check] Checking oorandom v11.1.5
  227. 32.69 s [gammaloop-workspace-check] Checking anes v0.1.6
  228. 33.48 s [gammaloop-workspace-check] Checking papergrid v0.17.0
  229. 33.65 s [gammaloop-workspace-check] Checking ron v0.12.1
  230. 33.71 s [gammaloop-workspace-check] Checking rand v0.8.6
  231. 34.10 s [gammaloop-workspace-check] Checking bitvec v1.0.1
  232. 34.31 s [gammaloop-workspace-check] Checking criterion-plot v0.5.0
  233. 35.26 s [gammaloop-workspace-check] Checking testing_table v0.3.0
  234. 35.58 s [gammaloop-workspace-check] Checking env_filter v1.0.1
  235. 35.71 s [gammaloop-workspace-check] Checking toml_edit v0.25.11+spec-1.1.0
  236. 35.74 s [gammaloop-workspace-check] Checking xprec v0.2.2
  237. 35.74 s [gammaloop-workspace-check] Checking clap v4.6.1
  238. 35.89 s [gammaloop-workspace-check] Checking uncased v0.9.10
  239. 35.95 s [gammaloop-workspace-check] Checking jiff v0.2.24
  240. 36.05 s [gammaloop-workspace-check] Checking ptr_meta v0.1.4
  241. 36.19 s [gammaloop-workspace-check] Checking simdutf8 v0.1.5
  242. 36.22 s [gammaloop-workspace-check] Checking ucd-trie v0.1.7
  243. 36.34 s [gammaloop-workspace-check] Checking ahash v0.7.8
  244. 36.49 s [gammaloop-workspace-check] Checking approx v0.4.0
  245. 36.57 s [gammaloop-workspace-check] Checking pest v2.8.6
  246. 36.67 s [gammaloop-workspace-check] Checking bytecheck v0.6.12
  247. 36.67 s [gammaloop-workspace-check] Checking seahash v4.1.0
  248. 36.92 s [gammaloop-workspace-check] Checking cgmath v0.18.0
  249. 36.97 s [gammaloop-workspace-check] Checking hashbrown v0.12.3
  250. 37.00 s [gammaloop-workspace-check] Checking num-rational v0.4.2
  251. 37.02 s [gammaloop-workspace-check] Checking tabled v0.20.0
  252. 37.05 s [gammaloop-workspace-check] Checking criterion v0.5.1
  253. 37.71 s [gammaloop-workspace-check] Compiling pyo3-ffi v0.28.3
  254. 37.88 s [gammaloop-workspace-check] Compiling pyo3-macros-backend v0.28.3
  255. 37.99 s [gammaloop-workspace-check] Compiling pyo3 v0.28.3
  256. 38.17 s [gammaloop-workspace-check] Compiling numpy v0.28.0
  257. 38.49 s [gammaloop-workspace-check] Checking toml v0.8.23
  258. 38.71 s [gammaloop-workspace-check] Checking rend v0.4.2
  259. 38.75 s [gammaloop-workspace-check] Checking num-iter v0.1.45
  260. 38.86 s [gammaloop-workspace-check] Checking ref-ops v0.2.5
  261. 39.08 s [gammaloop-workspace-check] Checking num v0.4.3
  262. 39.22 s [gammaloop-workspace-check] Checking rand_xoshiro v0.6.0
  263. 39.60 s [gammaloop-workspace-check] Checking features v0.10.0
  264. 39.72 s [gammaloop-workspace-check] Checking figment v0.10.19
  265. 39.80 s [gammaloop-workspace-check] Checking gat-lending-iterator v0.1.8
  266. 40.43 s [gammaloop-workspace-check] Checking constcat v0.5.1
  267. 40.55 s [gammaloop-workspace-check] Checking colored v2.2.0
  268. 40.74 s [gammaloop-workspace-check] Checking insta v1.47.2
  269. 40.79 s [gammaloop-workspace-check] Checking dot-parser v0.5.1
  270. 40.99 s [gammaloop-workspace-check] Checking cpufeatures v0.3.0
  271. 41.06 s [gammaloop-workspace-check] Checking arrayref v0.3.9
  272. 41.12 s [gammaloop-workspace-check] Checking constant_time_eq v0.4.2
  273. 41.17 s [gammaloop-workspace-check] Checking base64 v0.22.1
  274. 41.31 s [gammaloop-workspace-check] Checking blake3 v1.8.5
  275. 41.94 s [gammaloop-workspace-check] Checking joinery v2.1.0
  276. 42.40 s [gammaloop-workspace-check] Checking siphasher v1.0.2
  277. 42.90 s [gammaloop-workspace-check] Checking titlecase v2.2.1
  278. 43.02 s [gammaloop-workspace-check] Checking subprocess v0.2.15
  279. 43.02 s [gammaloop-workspace-check] Checking rust_lisp v0.18.0
  280. 43.07 s [gammaloop-workspace-check] Compiling vakint v0.1.2 (/build/source/crates/vakint)
  281. 43.10 s [gammaloop-workspace-check] Checking version-compare v0.2.1
  282. 43.13 s [gammaloop-workspace-check] Checking xpct v0.5.1
  283. 43.17 s [gammaloop-workspace-check] Checking phf_shared v0.13.1
  284. 43.24 s [gammaloop-workspace-check] Checking ryu v1.0.23
  285. 43.26 s [gammaloop-workspace-check] Checking castaway v0.2.4
  286. 43.35 s [gammaloop-workspace-check] Checking toml_datetime v0.7.5+spec-1.1.0
  287. 43.50 s [gammaloop-workspace-check] Checking strum v0.27.2
  288. 43.62 s [gammaloop-workspace-check] Checking compact_str v0.9.0
  289. 43.67 s [gammaloop-workspace-check] Checking unicode-truncate v2.0.1
  290. 43.78 s [gammaloop-workspace-check] Checking kasuari v0.4.12
  291. 43.80 s [gammaloop-workspace-check] Checking phf v0.13.1
  292. 43.95 s [gammaloop-workspace-check] Checking lru v0.16.4
  293. 44.14 s [gammaloop-workspace-check] Checking vte v0.15.0
  294. 44.27 s [gammaloop-workspace-check] Checking portable-atomic v1.13.1
  295. 44.30 s [gammaloop-workspace-check] Checking unit-prefix v0.5.2
  296. 44.44 s [gammaloop-workspace-check] Checking toml v0.9.12+spec-1.1.0
  297. 44.49 s [gammaloop-workspace-check] Compiling rustpython-parser-core v0.4.0
  298. 44.55 s [gammaloop-workspace-check] Checking rand_distr v0.4.3
  299. 44.66 s [gammaloop-workspace-check] Checking simba v0.6.0
  300. 44.71 s [gammaloop-workspace-check] Checking line-clipping v0.3.7
  301. 44.74 s [gammaloop-workspace-check] Checking vt100 v0.16.2
  302. 44.79 s [gammaloop-workspace-check] Checking adler2 v2.0.1
  303. 45.06 s [gammaloop-workspace-check] Compiling rustpython-ast v0.4.0
  304. 45.27 s [gammaloop-workspace-check] Checking ratatui-core v0.1.0
  305. 45.39 s [gammaloop-workspace-check] Checking gimli v0.32.3
  306. 45.43 s [gammaloop-workspace-check] Compiling three-dimensional-reps v0.1.0 (/build/source/crates/three-dimensional-reps)
  307. 45.61 s [gammaloop-workspace-check] Checking miniz_oxide v0.8.9
  308. 45.66 s [gammaloop-workspace-check] Checking string-template-plus v0.4.3
  309. 45.69 s [gammaloop-workspace-check] Checking thiserror v1.0.69
  310. 45.87 s [gammaloop-workspace-check] Checking indicatif v0.18.4
  311. 45.92 s [gammaloop-workspace-check] Checking derive_builder v0.11.2
  312. 46.12 s [gammaloop-workspace-check] Checking object v0.37.3
  313. 46.16 s [gammaloop-workspace-check] Checking crossterm v0.29.0
  314. 46.19 s [gammaloop-workspace-check] Checking owo-colors v4.3.0
  315. 46.22 s [gammaloop-workspace-check] Checking env_logger v0.11.10
  316. 46.50 s [gammaloop-workspace-check] Checking tracing-error v0.2.1
  317. 46.55 s [gammaloop-workspace-check] Checking typed-index-collections v3.5.0
  318. 46.95 s [gammaloop-workspace-check] Checking serde-big-array v0.5.1
  319. 47.28 s [gammaloop-workspace-check] Checking amd v0.2.2
  320. 47.30 s [gammaloop-workspace-check] Checking itertools v0.11.0
  321. 47.38 s [gammaloop-workspace-check] Compiling gammaloop-tracing-filter-macros v0.1.0 (/build/source/crates/gammaloop-tracing-filter-macros)
  322. 47.50 s [gammaloop-workspace-check] Checking rustc-demangle v0.1.27
  323. 47.62 s [gammaloop-workspace-check] Checking rkyv v0.7.46
  324. 47.70 s [gammaloop-workspace-check] Checking option-ext v0.2.0
  325. 47.89 s [gammaloop-workspace-check] Checking dirs-sys v0.5.0
  326. 48.15 s [gammaloop-workspace-check] Checking ref-cast v1.0.25
  327. 48.21 s [gammaloop-workspace-check] Checking nix v0.31.2
  328. 48.35 s [gammaloop-workspace-check] Checking brotli-decompressor v4.0.3
  329. 48.41 s [gammaloop-workspace-check] Checking integer-sqrt v0.1.5
  330. 48.45 s [gammaloop-workspace-check] Checking crossbeam-channel v0.5.15
  331. 48.49 s [gammaloop-workspace-check] Checking itertools v0.12.1
  332. 48.53 s [gammaloop-workspace-check] Compiling gammalooprs v0.3.4 (/build/source/crates/gammalooprs)
  333. 48.61 s [gammaloop-workspace-check] Checking unsafe-libyaml v0.2.11
  334. 48.65 s [gammaloop-workspace-check] Checking color-spantrace v0.3.0
  335. 48.84 s [gammaloop-workspace-check] Checking symlink v0.1.0
  336. 49.00 s [gammaloop-workspace-check] Checking pathfinding v4.15.0
  337. 49.16 s [gammaloop-workspace-check] Checking include_dir v0.7.4
  338. 49.64 s [gammaloop-workspace-check] Checking ratatui-widgets v0.3.0
  339. 49.67 s [gammaloop-workspace-check] Checking ratatui-crossterm v0.1.0
  340. 50.11 s [gammaloop-workspace-check] Compiling numerica v2.2.0 (https://github.com/alphal00p/symbolica?rev=a277a8dadbaae5a8d6605f2f381991a601e1f345#a277a8da)
  341. 50.22 s [gammaloop-workspace-check] Checking tracing-appender v0.2.5
  342. 50.50 s [gammaloop-workspace-check] Checking brotli v7.0.0
  343. 50.66 s [gammaloop-workspace-check] Checking ctrlc v3.5.2
  344. 51.03 s [gammaloop-workspace-check] Checking tracing-indicatif v0.3.14
  345. 51.33 s [gammaloop-workspace-check] Checking clarabel v0.11.1
  346. 51.66 s [gammaloop-workspace-check] Checking dirs v6.0.0
  347. 51.72 s [gammaloop-workspace-check] Checking schemars v1.2.1
  348. 51.81 s [gammaloop-workspace-check] Checking slotmap v1.1.1
  349. 51.84 s [gammaloop-workspace-check] Checking serde_yaml v0.9.34+deprecated
  350. 51.90 s [gammaloop-workspace-check] Checking json5 v0.4.1
  351. 52.53 s [gammaloop-workspace-check] Checking ratatui-macros v0.7.0
  352. 52.85 s [gammaloop-workspace-check] Checking ratatui v0.30.0
  353. 53.31 s [gammaloop-workspace-check] Checking vectorize v0.2.0
  354. 53.35 s [gammaloop-workspace-check] Checking ringbuffer v0.16.0
  355. 53.42 s [gammaloop-workspace-check] Checking addr2line v0.25.1
  356. 53.59 s [gammaloop-workspace-check] Checking base62 v2.2.4
  357. 54.06 s [gammaloop-workspace-check] Checking rust-embed v8.11.0
  358. 54.07 s [gammaloop-workspace-check] Checking clap_complete v4.6.3
  359. 54.20 s [gammaloop-workspace-check] Checking fd-lock v4.0.4
  360. 54.42 s [gammaloop-workspace-check] Checking strip-ansi-escapes v0.2.1
  361. 54.45 s [gammaloop-workspace-check] Compiling gammaloop-api v0.1.0 (/build/source/crates/gammaloop-api)
  362. 54.57 s [gammaloop-workspace-check] Checking itertools v0.13.0
  363. 54.61 s [gammaloop-workspace-check] Checking strum v0.26.3
  364. 54.74 s [gammaloop-workspace-check] Checking sysinfo v0.33.1
  365. 54.78 s [gammaloop-workspace-check] Checking shlex v1.3.0
  366. 54.95 s [gammaloop-workspace-check] Checking slab v0.4.12
  367. 55.09 s [gammaloop-workspace-check] Checking futures-task v0.3.32
  368. 55.12 s [gammaloop-workspace-check] Checking futures-core v0.3.32
  369. 55.16 s [gammaloop-workspace-check] Checking sdd v3.0.10
  370. 55.21 s [gammaloop-workspace-check] Compiling gammaloop-integration-tests v0.1.0 (/build/source/tests)
  371. 55.35 s [gammaloop-workspace-check] Compiling test-log-core v0.2.20
  372. 55.43 s [gammaloop-workspace-check] Compiling rustc_version v0.4.1
  373. 55.44 s [gammaloop-workspace-check] Checking futures-util v0.3.32
  374. 55.81 s [gammaloop-workspace-check] Checking clap_complete_nushell v4.6.0
  375. 55.97 s [gammaloop-workspace-check] Checking which v8.0.2
  376. 56.29 s [gammaloop-workspace-check] Checking bincode v1.3.3
  377. 56.33 s [gammaloop-workspace-check] Checking scc v2.4.0
  378. 56.89 s [gammaloop-workspace-check] Compiling gungraun-runner v0.18.2
  379. 57.72 s [gammaloop-workspace-check] Checking proc-macro2 v1.0.106
  380. 57.99 s [gammaloop-workspace-check] Compiling gungraun-macros v0.8.0
  381. 58.08 s [gammaloop-workspace-check] Checking backtrace v0.3.76
  382. 58.69 s [gammaloop-workspace-check] Checking reedline v0.42.0
  383. 59.18 s [gammaloop-workspace-check] Checking color-eyre v0.6.5
  384. 59.64 s [gammaloop-workspace-check] Checking quote v1.0.45
  385. 59.73 s [gammaloop-workspace-check] Checking base64 v0.21.7
  386. 59.88 s [gammaloop-workspace-check] Checking maplit v1.0.2
  387. 59.93 s [gammaloop-workspace-check] Compiling iai-callgrind-runner v0.14.2
  388. 59.95 s [gammaloop-workspace-check] Checking kurbo v0.13.0
  389. 60.43 s [gammaloop-workspace-check] Checking wait-timeout v0.2.1
  390. 60.45 s [gammaloop-workspace-check] Checking ron v0.8.1
  391. 60.53 s [gammaloop-workspace-check] Checking nalgebra v0.29.0
  392. 60.67 s [gammaloop-workspace-check] Checking quick-error v1.2.3
  393. 60.83 s [gammaloop-workspace-check] Checking bit-vec v0.8.0
  394. 61.27 s [gammaloop-workspace-check] Compiling iai-callgrind v0.14.2
  395. 61.34 s [gammaloop-workspace-check] Checking bit-set v0.8.0
  396. 61.60 s [gammaloop-workspace-check] Checking rusty-fork v0.3.1
  397. 61.84 s [gammaloop-workspace-check] Checking syn v2.0.117
  398. 61.87 s [gammaloop-workspace-check] Compiling iai-callgrind-macros v0.5.1
  399. 61.90 s [gammaloop-workspace-check] Checking futures-executor v0.3.32
  400. 62.15 s [gammaloop-workspace-check] Compiling graphica v2.1.0 (https://github.com/alphal00p/symbolica?rev=a277a8dadbaae5a8d6605f2f381991a601e1f345#a277a8da)
  401. 62.19 s [gammaloop-workspace-check] Checking serial_test v3.4.0
  402. 62.28 s [gammaloop-workspace-check] Compiling test-log-macros v0.2.20
  403. 62.55 s [gammaloop-workspace-check] Checking rand_xorshift v0.4.0
  404. 62.57 s [gammaloop-workspace-check] Checking console v0.15.11
  405. 62.75 s [gammaloop-workspace-check] Checking pathdiff v0.2.3
  406. 62.92 s [gammaloop-workspace-check] Checking unarray v0.1.4
  407. 63.04 s [gammaloop-workspace-check] Checking proptest v1.11.0
  408. 63.69 s [gammaloop-workspace-check] Checking similar-asserts v1.7.0
  409. 64.04 s [gammaloop-workspace-check] Checking clinnet v0.1.8 (/build/source/crates/clinnet)
  410. 65.26 s [gammaloop-workspace-check] Checking kurvst v0.1.0 (/build/source/crates/kurvst)
  411. 71.60 s [gammaloop-workspace-check] Checking test-log v0.2.20
  412. 84.87 s [gammaloop-workspace-check] Checking gungraun v0.18.2
  413. 91.25 s [gammaloop-workspace-check] Checking statrs v0.16.1
  414. 92.82 s [gammaloop-workspace-check] Checking momtrop v0.3.0
  415. 93.74 s [gammaloop-workspace-check] Compiling pyo3-macros v0.28.3
  416. 95.22 s [gammaloop-workspace-check] Compiling pyo3-stub-gen-derive v0.17.2
  417. 105.84 s [gammaloop-workspace-check] Checking pyo3-stub-gen v0.17.2
  418. 116.75 s [gammaloop-workspace-check] Checking symbolica-utils v0.1.0 (/build/source/crates/symbolica-utils)
  419. 116.75 s [gammaloop-workspace-check] Checking spenso-macros v0.3.2 (/build/source/crates/spenso-macros)
  420. 353.60 s [gammaloop-workspace-check] Compiling gammaloop-workspace-hack v0.1.0 (/build/source/crates/gammaloop-workspace-hack)
  421. 354.03 s [gammaloop-workspace-check] Checking linnet v0.17.0 (/build/source/crates/linnet)
  422. 359.09 s [gammaloop-workspace-check] Checking spenso v0.6.0 (/build/source/crates/spenso)
  423. 359.45 s [gammaloop-workspace-check] Checking linnet-py v0.1.0 (/build/source/crates/linnet-py)
  424. 359.45 s [gammaloop-workspace-check] Checking linnest v0.1.0 (/build/source/crates/linnest)
  425. 366.14 s [gammaloop-workspace-check] Checking idenso v0.3.0 (/build/source/crates/idenso)
  426. 366.14 s [gammaloop-workspace-check] Checking gammaloop-tracing-filter v0.1.0 (/build/source/crates/gammaloop-tracing-filter)
  427. 368.19 s [gammaloop-workspace-check] Checking spenso-hep-lib v0.1.7 (/build/source/crates/spenso-hep-lib)
  428. 368.38 s [gammaloop-workspace-check] Checking spynso3 v0.1.2 (/build/source/crates/spynso3)
  429. 394.36 s [gammaloop-workspace-check] error[E0560]: struct `CutInfo` has no field named `lmb_channel_id`
  430. 394.36 s [gammaloop-workspace-check] --> tests/tests/test_differential.rs:86:13
  431. 394.36 s [gammaloop-workspace-check] |
  432. 394.36 s [gammaloop-workspace-check] 86 | lmb_channel_id: None,
  433. 394.36 s [gammaloop-workspace-check] | ^^^^^^^^^^^^^^ `CutInfo` does not have this field
  434. 394.36 s [gammaloop-workspace-check] |
  435. 394.36 s [gammaloop-workspace-check] = note: available fields are: `sampling_channel_id`, `sampling_channel_edge_ids`
  436. 394.36 s [gammaloop-workspace-check]
  437. 394.36 s [gammaloop-workspace-check] error[E0560]: struct `CutInfo` has no field named `lmb_channel_edge_ids`
  438. 394.36 s [gammaloop-workspace-check] --> tests/tests/test_differential.rs:87:13
  439. 394.36 s [gammaloop-workspace-check] |
  440. 394.36 s [gammaloop-workspace-check] 87 | lmb_channel_edge_ids: None,
  441. 394.36 s [gammaloop-workspace-check] | ^^^^^^^^^^^^^^^^^^^^ `CutInfo` does not have this field
  442. 394.36 s [gammaloop-workspace-check] |
  443. 394.36 s [gammaloop-workspace-check] = note: available fields are: `sampling_channel_id`, `sampling_channel_edge_ids`
  444. 394.36 s [gammaloop-workspace-check]
  445. 394.39 s [gammaloop-workspace-check] error[E0609]: no field `lmb_channel_edge_ids` on type `CutInfo`
  446. 394.39 s [gammaloop-workspace-check] --> tests/tests/test_evaluation_api.rs:311:10
  447. 394.39 s [gammaloop-workspace-check] |
  448. 394.39 s [gammaloop-workspace-check] 311 | .lmb_channel_edge_ids
  449. 394.39 s [gammaloop-workspace-check] | ^^^^^^^^^^^^^^^^^^^^ unknown field
  450. 394.39 s [gammaloop-workspace-check] |
  451. 394.39 s [gammaloop-workspace-check] = note: available fields are: `particle_pdgs`, `cut_id`, `graph_id`, `graph_group_id`, `orientation_id` ... and 2 others
  452. 394.39 s [gammaloop-workspace-check]
  453. 394.41 s [gammaloop-workspace-check] error[E0609]: no field `lmb_channel_edge_ids` on type `CutInfo`
  454. 394.41 s [gammaloop-workspace-check] --> tests/tests/test_evaluation_api.rs:591:26
  455. 394.41 s [gammaloop-workspace-check] |
  456. 394.41 s [gammaloop-workspace-check] 591 | .lmb_channel_edge_ids
  457. 394.41 s [gammaloop-workspace-check] | ^^^^^^^^^^^^^^^^^^^^ unknown field
  458. 394.41 s [gammaloop-workspace-check] |
  459. 394.41 s [gammaloop-workspace-check] = note: available fields are: `particle_pdgs`, `cut_id`, `graph_id`, `graph_group_id`, `orientation_id` ... and 2 others
  460. 394.41 s [gammaloop-workspace-check]
  461. 394.43 s [gammaloop-workspace-check] For more information about this error, try `rustc --explain E0560`.
  462. 394.44 s [gammaloop-workspace-check] error: could not compile `gammaloop-integration-tests` (test "test_differential") due to 2 previous errors
  463. 394.44 s [gammaloop-workspace-check] warning: build failed, waiting for other jobs to finish...
  464. 394.44 s [gammaloop-workspace-check] error[E0609]: no field `lmb_channel_edge_ids` on type `CutInfo`
  465. 394.44 s [gammaloop-workspace-check] --> tests/tests/test_evaluation_api.rs:1177:18
  466. 394.44 s [gammaloop-workspace-check] |
  467. 394.44 s [gammaloop-workspace-check] 1177 | .lmb_channel_edge_ids
  468. 394.44 s [gammaloop-workspace-check] | ^^^^^^^^^^^^^^^^^^^^ unknown field
  469. 394.44 s [gammaloop-workspace-check] |
  470. 394.44 s [gammaloop-workspace-check] = note: available fields are: `particle_pdgs`, `cut_id`, `graph_id`, `graph_group_id`, `orientation_id` ... and 2 others
  471. 394.44 s [gammaloop-workspace-check]
  472. 394.52 s [gammaloop-workspace-check] error[E0609]: no field `lmb_channel_edge_ids` on type `CutInfo`
  473. 394.52 s [gammaloop-workspace-check] --> tests/tests/test_evaluation_api.rs:1222:22
  474. 394.52 s [gammaloop-workspace-check] |
  475. 394.52 s [gammaloop-workspace-check] 1222 | .lmb_channel_edge_ids
  476. 394.52 s [gammaloop-workspace-check] | ^^^^^^^^^^^^^^^^^^^^ unknown field
  477. 394.52 s [gammaloop-workspace-check] |
  478. 394.52 s [gammaloop-workspace-check] = note: available fields are: `particle_pdgs`, `cut_id`, `graph_id`, `graph_group_id`, `orientation_id` ... and 2 others
  479. 394.52 s [gammaloop-workspace-check]
  480. 394.53 s [gammaloop-workspace-check] error[E0609]: no field `lmb_channel_edge_ids` on type `CutInfo`
  481. 394.53 s [gammaloop-workspace-check] --> tests/tests/test_evaluation_api.rs:1281:14
  482. 394.53 s [gammaloop-workspace-check] |
  483. 394.53 s [gammaloop-workspace-check] 1281 | .lmb_channel_edge_ids
  484. 394.53 s [gammaloop-workspace-check] | ^^^^^^^^^^^^^^^^^^^^ unknown field
  485. 394.53 s [gammaloop-workspace-check] |
  486. 394.53 s [gammaloop-workspace-check] = note: available fields are: `particle_pdgs`, `cut_id`, `graph_id`, `graph_group_id`, `orientation_id` ... and 2 others
  487. 394.53 s [gammaloop-workspace-check]
  488. 394.56 s [gammaloop-workspace-check] error[E0609]: no field `lmb_channel_edge_ids` on type `CutInfo`
  489. 394.56 s [gammaloop-workspace-check] --> tests/tests/test_evaluation_api.rs:1428:18
  490. 394.56 s [gammaloop-workspace-check] |
  491. 394.56 s [gammaloop-workspace-check] 1428 | .lmb_channel_edge_ids
  492. 394.56 s [gammaloop-workspace-check] | ^^^^^^^^^^^^^^^^^^^^ unknown field
  493. 394.56 s [gammaloop-workspace-check] |
  494. 394.56 s [gammaloop-workspace-check] = note: available fields are: `particle_pdgs`, `cut_id`, `graph_id`, `graph_group_id`, `orientation_id` ... and 2 others
  495. 394.56 s [gammaloop-workspace-check]
  496. 394.63 s [gammaloop-workspace-check] For more information about this error, try `rustc --explain E0609`.
  497. 394.64 s [gammaloop-workspace-check] error: could not compile `gammaloop-integration-tests` (test "test_evaluation_api") due to 6 previous errors
  498. 395.05 s [gammaloop-workspace-check] error[E0609]: no field `lmb_channel_id` on type `CutInfo`
  499. 395.05 s [gammaloop-workspace-check] --> tests/tests/test_runs/utils.rs:568:36
  500. 395.05 s [gammaloop-workspace-check] |
  501. 395.05 s [gammaloop-workspace-check] 568 | event.cut_info.lmb_channel_id,
  502. 395.05 s [gammaloop-workspace-check] | ^^^^^^^^^^^^^^ unknown field
  503. 395.05 s [gammaloop-workspace-check] |
  504. 395.05 s [gammaloop-workspace-check] = note: available fields are: `particle_pdgs`, `cut_id`, `graph_id`, `graph_group_id`, `orientation_id` ... and 2 others
  505. 395.05 s [gammaloop-workspace-check]
  506. 395.05 s [gammaloop-workspace-check] error[E0609]: no field `lmb_channel_id` on type `CutInfo`
  507. 395.05 s [gammaloop-workspace-check] --> tests/tests/test_runs/utils.rs:580:36
  508. 395.05 s [gammaloop-workspace-check] |
  509. 395.05 s [gammaloop-workspace-check] 580 | event.cut_info.lmb_channel_id,
  510. 395.05 s [gammaloop-workspace-check] | ^^^^^^^^^^^^^^ unknown field
  511. 395.05 s [gammaloop-workspace-check] |
  512. 395.05 s [gammaloop-workspace-check] = note: available fields are: `particle_pdgs`, `cut_id`, `graph_id`, `graph_group_id`, `orientation_id` ... and 2 others
  513. 395.05 s [gammaloop-workspace-check]
  514. 395.45 s [gammaloop-workspace-check] error: could not compile `gammaloop-integration-tests` (test "test_runs") due to 2 previous errors
  515. 395.83 s Progress: 0 of 1 built (1 failed)
  516. 395.83 s Failed to build gammaloop-workspace-check after 6m28s
  517. 395.83 s Cannot build '/nix/store/ws66y79brahbksfmnksfcdd9g1qvcyzb-gammaloop-workspace-check-0.1.0.drv'.
  518. 395.83 s Reason: builder failed with exit code 101.
  519. 395.83 s Output paths:
  520. 395.83 s /nix/store/d6pr1iwb3y055dnrdwwziahk8xn6ixw1-gammaloop-workspace-check-0.1.0
  521. 395.83 s Last 511 log lines:
  522. 395.83 s > Running phase: unpackPhase
  523. 395.83 s > unpacking source archive /nix/store/ypmxspggpi4qfj1zy7ml6kwz1d0c3m10-source
  524. 395.83 s > source root is source
  525. 395.83 s > Running phase: patchPhase
  526. 395.83 s > Executing configureCargoCommonVars
  527. 395.83 s > decompressing cargo artifacts from /nix/store/50vpxlcgfxf2d57i27v3d10zjwxxbm2r-gammaloop-workspace-deps-deps-0.1.0/target.tar.zst to target
  528. 395.83 s > Running phase: updateAutotoolsGnuConfigScriptsPhase
  529. 395.83 s > Running phase: configurePhase
  530. 395.83 s > will append /build/source/.cargo-home/config.toml with contents of /nix/store/5drf77x6km4ky7gwlrzdx9bbd6fz09g3-vendor-cargo-deps/config.toml
  531. 395.83 s > default configurePhase, nothing to do
  532. 395.83 s > Running phase: buildPhase
  533. 395.83 s > +++ command cargo --version
  534. 395.83 s > cargo 1.97.0 (c980f4866 2026-06-30)
  535. 395.83 s > +++ command cargo check --profile ci-optim --locked --workspace --features gammaloop-tracing-filter/clap,gammaloop-tracing-filter/symbolica,idenso/bincode,idenso/reference-cases,linnet/bincode,linnet/drawing,linnet/rkyv,linnet/serde,linnet/symbolica,spenso-macros/shadowing,spenso/shadowing,symbolica/tracing_max_level_info,three-dimensional-reps/display,three-dimensional-reps/eval,three-dimensional-reps/serde --all-targets
  536. 395.83 s > Checking cfg-if v1.0.4
  537. 395.83 s > Checking memchr v2.8.0
  538. 395.83 s > Checking once_cell v1.21.4
  539. 395.83 s > Checking either v1.15.0
  540. 395.83 s > Checking serde_core v1.0.228
  541. 395.83 s > Checking libc v0.2.186
  542. 395.83 s > Checking libm v0.2.16
  543. 395.83 s > Checking itoa v1.0.18
  544. 395.83 s > Checking log v0.4.29
  545. 395.83 s > Checking regex-syntax v0.8.10
  546. 395.83 s > Checking zerocopy v0.8.48
  547. 395.83 s > Checking crossbeam-utils v0.8.21
  548. 395.83 s > Checking equivalent v1.0.2
  549. 395.83 s > Checking zmij v1.0.21
  550. 395.83 s > Checking bytemuck v1.25.0
  551. 395.83 s > Checking lazy_static v1.5.0
  552. 395.83 s > Compiling target-lexicon v0.13.5
  553. 395.83 s > Checking arrayvec v0.7.6
  554. 395.83 s > Checking powerfmt v0.2.0
  555. 395.83 s > Checking num_threads v0.1.7
  556. 395.83 s > Checking num-conv v0.2.1
  557. 395.83 s > Checking safe_arch v0.7.4
  558. 395.83 s > Checking time-core v0.1.8
  559. 395.83 s > Checking pin-project-lite v0.2.17
  560. 395.83 s > Checking tracing-core v0.1.36
  561. 395.83 s > Checking itertools v0.14.0
  562. 395.83 s > Checking deranged v0.5.8
  563. 395.83 s > Checking foldhash v0.2.0
  564. 395.83 s > Checking allocator-api2 v0.2.21
  565. 395.83 s > Checking const-random v0.1.18
  566. 395.83 s > Checking winnow v1.0.2
  567. 395.83 s > Checking unty v0.0.4
  568. 395.83 s > Checking nu-ansi-term v0.50.3
  569. 395.83 s > Checking static_assertions v1.1.0
  570. 395.83 s > Checking crossbeam-epoch v0.9.18
  571. 395.83 s > Checking safe_arch v1.0.0
  572. 395.83 s > Checking sharded-slab v0.1.7
  573. 395.83 s > Checking wide v0.7.33
  574. 395.83 s > Checking hashbrown v0.16.1
  575. 395.83 s > Checking thread_local v1.1.9
  576. 395.83 s > Checking tracing v0.1.44
  577. 395.83 s > Checking crossbeam-deque v0.8.6
  578. 395.83 s > Checking tracing-log v0.2.0
  579. 395.83 s > Checking indenter v0.3.4
  580. 395.83 s > Checking rayon-core v1.13.0
  581. 395.83 s > Checking toml_writer v1.1.1+spec-1.1.0
  582. 395.83 s > Checking az v1.3.0
  583. 395.83 s > Checking wide v1.3.0
  584. 395.83 s > Compiling phf_shared v0.11.3
  585. 395.83 s > Checking anyhow v1.0.102
  586. 395.83 s > Checking num-traits v0.2.19
  587. 395.83 s > Checking aho-corasick v1.1.4
  588. 395.83 s > Checking rawpointer v0.2.1
  589. 395.83 s > Checking dyn-clone v1.0.20
  590. 395.83 s > Checking rayon v1.12.0
  591. 395.83 s > Checking alloc-no-stdlib v2.0.4
  592. 395.83 s > Checking utf8parse v0.2.2
  593. 395.83 s > Checking anstyle-parse v1.0.0
  594. 395.83 s > Checking alloc-stdlib v0.2.2
  595. 395.83 s > Checking matrixmultiply v0.3.10
  596. 395.83 s > Checking approx v0.5.1
  597. 395.83 s > Checking num-integer v0.1.46
  598. 395.83 s > Checking colored v3.1.1
  599. 395.83 s > Compiling pyo3-build-config v0.28.3
  600. 395.83 s > Checking anstyle-query v1.1.5
  601. 395.83 s > Checking anstyle v1.0.14
  602. 395.83 s > Checking colorchoice v1.0.5
  603. 395.83 s > Checking is_terminal_polyfill v1.70.2
  604. 395.83 s > Compiling phf_generator v0.11.3
  605. 395.83 s > Checking eyre v0.6.12
  606. 395.83 s > Checking toml_parser v1.1.2+spec-1.1.0
  607. 395.83 s > Checking unicode-width v0.2.2
  608. 395.83 s > Checking bitflags v1.3.2
  609. 395.83 s > Checking anstream v1.0.0
  610. 395.83 s > Checking brotli-decompressor v5.0.0
  611. 395.83 s > Checking inventory v0.3.24
  612. 395.83 s > Checking spec_math v0.1.6
  613. 395.83 s > Compiling phf_codegen v0.11.3
  614. 395.83 s > Checking thiserror v2.0.18
  615. 395.83 s > Checking libloading v0.9.0
  616. 395.83 s > Compiling getopts v0.2.24
  617. 395.83 s > Checking tinyjson v2.5.1
  618. 395.83 s > Checking append-only-vec v0.1.8
  619. 395.83 s > Checking bytes v1.11.1
  620. 395.83 s > Checking self_cell v1.2.2
  621. 395.83 s > Checking byteorder v1.5.0
  622. 395.83 s > Compiling unic-common v0.9.0
  623. 395.83 s > Compiling unic-char-range v0.9.0
  624. 395.83 s > Checking linux-raw-sys v0.12.1
  625. 395.83 s > Compiling unic-ucd-version v0.9.0
  626. 395.83 s > Compiling unic-char-property v0.9.0
  627. 395.83 s > Compiling is-macro v0.3.7
  628. 395.83 s > Checking regex-automata v0.4.14
  629. 395.83 s > Compiling unicode_names2_generator v1.3.0
  630. 395.83 s > Compiling rustpython-parser-vendored v0.4.0
  631. 395.83 s > Checking iana-time-zone v0.1.65
  632. 395.83 s > Compiling rustpython-parser v0.4.0
  633. 395.83 s > Compiling phf v0.11.3
  634. 395.83 s > Checking getrandom v0.3.4
  635. 395.83 s > Checking time v0.3.47
  636. 395.83 s > Checking gmp-mpfr-sys v1.7.1
  637. 395.83 s > Checking rand_core v0.9.5
  638. 395.83 s > Checking region v3.0.2
  639. 395.83 s > Checking wasmtime-jit-icache-coherence v34.0.2
  640. 395.83 s > Checking hugepage-rs v0.1.1
  641. 395.83 s > Checking rustc-hash v2.1.2
  642. 395.83 s > Compiling unic-emoji-char v0.9.0
  643. 395.83 s > Compiling unic-ucd-ident v0.9.0
  644. 395.83 s > Compiling rustc-hash v1.1.0
  645. 395.83 s > Compiling lalrpop-util v0.20.2
  646. 395.83 s > Checking brotli v8.0.2
  647. 395.83 s > Checking unicode-segmentation v1.13.2
  648. 395.83 s > Compiling symbolica v2.2.0 (https://github.com/alphal00p/symbolica?rev=a277a8dadbaae5a8d6605f2f381991a601e1f345#a277a8da)
  649. 395.83 s > Compiling rug v1.30.0
  650. 395.83 s > Checking typenum v1.20.0
  651. 395.83 s > Checking getrandom v0.2.17
  652. 395.83 s > Checking scopeguard v1.2.0
  653. 395.83 s > Checking unicode-ident v1.0.24
  654. 395.83 s > Checking hashbrown v0.17.0
  655. 395.83 s > Checking lock_api v0.4.14
  656. 395.83 s > Checking errno v0.3.14
  657. 395.83 s > Checking strsim v0.11.1
  658. 395.83 s > Checking clap_lex v1.1.0
  659. 395.83 s > Checking unicase v2.9.0
  660. 395.83 s > Checking signal-hook-registry v1.4.8
  661. 395.83 s > Checking vte v0.14.1
  662. 395.83 s > Checking same-file v1.0.6
  663. 395.83 s > Checking serde v1.0.228
  664. 395.83 s > Checking serde_json v1.0.149
  665. 395.83 s > Checking bitflags v2.11.1
  666. 395.83 s > Checking serde_spanned v1.1.1
  667. 395.83 s > Checking toml_datetime v1.1.1+spec-1.1.0
  668. 395.83 s > Checking signal-hook v0.3.18
  669. 395.83 s > Checking generic-array v0.14.7
  670. 395.83 s > Checking indexmap v2.14.0
  671. 395.83 s > Checking toml v1.1.2+spec-1.1.0
  672. 395.83 s > Checking rustix v1.1.4
  673. 395.83 s > Checking walkdir v2.5.0
  674. 395.83 s > Checking mio v1.2.0
  675. 395.83 s > Checking ciborium-io v0.2.2
  676. 395.83 s > Checking minimal-lexical v0.2.1
  677. 395.83 s > Checking block-buffer v0.10.4
  678. 395.83 s > Checking crypto-common v0.1.7
  679. 395.83 s > Checking digest v0.10.7
  680. 395.83 s > Checking signal-hook-mio v0.2.5
  681. 395.83 s > Checking smallvec v1.15.1
  682. 395.83 s > Checking num-complex v0.4.6
  683. 395.83 s > Checking tracing-serde v0.2.0
  684. 395.83 s > Checking bincode v2.0.1
  685. 395.83 s > Checking smartstring v1.0.1
  686. 395.83 s > Checking chrono v0.4.44
  687. 395.83 s > Checking parking_lot_core v0.9.12
  688. 395.83 s > Checking nom v7.1.3
  689. 395.83 s > Checking parking_lot v0.12.5
  690. 395.83 s > Checking simba v0.9.1
  691. 395.83 s > Checking ndarray v0.17.2
  692. 395.83 s > Checking num-bigint v0.4.6
  693. 395.83 s > Checking derive_more v2.1.1
  694. 395.83 s > Checking console v0.16.3
  695. 395.83 s > Checking bstr v1.12.1
  696. 395.83 s > Checking linux-raw-sys v0.4.15
  697. 395.83 s > Checking ppv-lite86 v0.2.21
  698. 395.83 s > Checking ahash v0.8.12
  699. 395.83 s > Checking half v2.7.1
  700. 395.83 s > Checking cpufeatures v0.2.17
  701. 395.83 s > Checking winnow v0.7.15
  702. 395.83 s > Checking rustix v0.38.44
  703. 395.83 s > Checking ciborium-ll v0.2.2
  704. 395.83 s > Checking rand_chacha v0.9.0
  705. 395.83 s > Checking matchers v0.2.0
  706. 395.83 s > Checking tracing-subscriber v0.3.23
  707. 395.83 s > Checking regex v1.12.3
  708. 395.83 s > Checking rand v0.9.4
  709. 395.83 s > Checking terminal_size v0.4.4
  710. 395.83 s > Checking clap_builder v4.6.0
  711. 395.83 s > Checking ansitok v0.3.0
  712. 395.83 s > Checking ciborium v0.2.2
  713. 395.83 s > Compiling unicode_names2 v1.3.0
  714. 395.83 s > Checking globset v0.4.18
  715. 395.83 s > Checking symjit v2.21.0
  716. 395.83 s > Checking sha2 v0.10.9
  717. 395.83 s > Checking rand_core v0.6.4
  718. 395.83 s > Checking getrandom v0.4.2
  719. 395.83 s > Checking plotters-backend v0.3.7
  720. 395.83 s > Checking fnv v1.0.7
  721. 395.83 s > Checking fastrand v2.4.1
  722. 395.83 s > Checking crossterm v0.28.1
  723. 395.83 s > Checking rust-embed-utils v8.11.0
  724. 395.83 s > Checking tempfile v3.27.0
  725. 395.83 s > Checking toml_datetime v0.6.11
  726. 395.83 s > Checking plotters-svg v0.3.7
  727. 395.83 s > Checking serde_spanned v0.6.9
  728. 395.83 s > Checking itertools v0.10.5
  729. 395.83 s > Checking cast v0.3.0
  730. 395.83 s > Checking toml_write v0.1.2
  731. 395.83 s > Checking tap v1.0.1
  732. 395.83 s > Checking plotters v0.3.7
  733. 395.83 s > Checking rand_chacha v0.3.1
  734. 395.83 s > Checking wyz v0.5.1
  735. 395.83 s > Checking ansi-str v0.9.0
  736. 395.83 s > Checking tinytemplate v1.2.1
  737. 395.83 s > Checking radium v0.7.0
  738. 395.83 s > Checking similar v2.7.0
  739. 395.83 s > Checking typeid v1.0.3
  740. 395.83 s > Checking toml_edit v0.22.27
  741. 395.83 s > Checking is-terminal v0.4.17
  742. 395.83 s > Checking funty v2.0.0
  743. 395.83 s > Checking bytecount v0.6.9
  744. 395.83 s > Checking oorandom v11.1.5
  745. 395.83 s > Checking anes v0.1.6
  746. 395.83 s > Checking papergrid v0.17.0
  747. 395.83 s > Checking ron v0.12.1
  748. 395.83 s > Checking rand v0.8.6
  749. 395.83 s > Checking bitvec v1.0.1
  750. 395.83 s > Checking criterion-plot v0.5.0
  751. 395.83 s > Checking testing_table v0.3.0
  752. 395.83 s > Checking env_filter v1.0.1
  753. 395.83 s > Checking toml_edit v0.25.11+spec-1.1.0
  754. 395.83 s > Checking xprec v0.2.2
  755. 395.83 s > Checking clap v4.6.1
  756. 395.83 s > Checking uncased v0.9.10
  757. 395.83 s > Checking jiff v0.2.24
  758. 395.83 s > Checking ptr_meta v0.1.4
  759. 395.83 s > Checking simdutf8 v0.1.5
  760. 395.83 s > Checking ucd-trie v0.1.7
  761. 395.83 s > Checking ahash v0.7.8
  762. 395.83 s > Checking approx v0.4.0
  763. 395.83 s > Checking pest v2.8.6
  764. 395.83 s > Checking bytecheck v0.6.12
  765. 395.83 s > Checking seahash v4.1.0
  766. 395.83 s > Checking cgmath v0.18.0
  767. 395.83 s > Checking hashbrown v0.12.3
  768. 395.83 s > Checking num-rational v0.4.2
  769. 395.83 s > Checking tabled v0.20.0
  770. 395.83 s > Checking criterion v0.5.1
  771. 395.83 s > Compiling pyo3-ffi v0.28.3
  772. 395.83 s > Compiling pyo3-macros-backend v0.28.3
  773. 395.83 s > Compiling pyo3 v0.28.3
  774. 395.83 s > Compiling numpy v0.28.0
  775. 395.83 s > Checking toml v0.8.23
  776. 395.83 s > Checking rend v0.4.2
  777. 395.83 s > Checking num-iter v0.1.45
  778. 395.83 s > Checking ref-ops v0.2.5
  779. 395.83 s > Checking num v0.4.3
  780. 395.83 s > Checking rand_xoshiro v0.6.0
  781. 395.83 s > Checking features v0.10.0
  782. 395.83 s > Checking figment v0.10.19
  783. 395.83 s > Checking gat-lending-iterator v0.1.8
  784. 395.83 s > Checking constcat v0.5.1
  785. 395.83 s > Checking colored v2.2.0
  786. 395.83 s > Checking insta v1.47.2
  787. 395.83 s > Checking dot-parser v0.5.1
  788. 395.83 s > Checking cpufeatures v0.3.0
  789. 395.83 s > Checking arrayref v0.3.9
  790. 395.83 s > Checking constant_time_eq v0.4.2
  791. 395.83 s > Checking base64 v0.22.1
  792. 395.83 s > Checking blake3 v1.8.5
  793. 395.83 s > Checking joinery v2.1.0
  794. 395.83 s > Checking siphasher v1.0.2
  795. 395.83 s > Checking titlecase v2.2.1
  796. 395.83 s > Checking subprocess v0.2.15
  797. 395.83 s > Checking rust_lisp v0.18.0
  798. 395.83 s > Compiling vakint v0.1.2 (/build/source/crates/vakint)
  799. 395.83 s > Checking version-compare v0.2.1
  800. 395.83 s > Checking xpct v0.5.1
  801. 395.83 s > Checking phf_shared v0.13.1
  802. 395.83 s > Checking ryu v1.0.23
  803. 395.83 s > Checking castaway v0.2.4
  804. 395.83 s > Checking toml_datetime v0.7.5+spec-1.1.0
  805. 395.83 s > Checking strum v0.27.2
  806. 395.83 s > Checking compact_str v0.9.0
  807. 395.83 s > Checking unicode-truncate v2.0.1
  808. 395.83 s > Checking kasuari v0.4.12
  809. 395.83 s > Checking phf v0.13.1
  810. 395.83 s > Checking lru v0.16.4
  811. 395.83 s > Checking vte v0.15.0
  812. 395.83 s > Checking portable-atomic v1.13.1
  813. 395.83 s > Checking unit-prefix v0.5.2
  814. 395.83 s > Checking toml v0.9.12+spec-1.1.0
  815. 395.83 s > Compiling rustpython-parser-core v0.4.0
  816. 395.83 s > Checking rand_distr v0.4.3
  817. 395.83 s > Checking simba v0.6.0
  818. 395.83 s > Checking line-clipping v0.3.7
  819. 395.83 s > Checking vt100 v0.16.2
  820. 395.83 s > Checking adler2 v2.0.1
  821. 395.83 s > Compiling rustpython-ast v0.4.0
  822. 395.83 s > Checking ratatui-core v0.1.0
  823. 395.83 s > Checking gimli v0.32.3
  824. 395.83 s > Compiling three-dimensional-reps v0.1.0 (/build/source/crates/three-dimensional-reps)
  825. 395.83 s > Checking miniz_oxide v0.8.9
  826. 395.83 s > Checking string-template-plus v0.4.3
  827. 395.83 s > Checking thiserror v1.0.69
  828. 395.83 s > Checking indicatif v0.18.4
  829. 395.83 s > Checking derive_builder v0.11.2
  830. 395.83 s > Checking object v0.37.3
  831. 395.83 s > Checking crossterm v0.29.0
  832. 395.83 s > Checking owo-colors v4.3.0
  833. 395.83 s > Checking env_logger v0.11.10
  834. 395.83 s > Checking tracing-error v0.2.1
  835. 395.83 s > Checking typed-index-collections v3.5.0
  836. 395.83 s > Checking serde-big-array v0.5.1
  837. 395.83 s > Checking amd v0.2.2
  838. 395.83 s > Checking itertools v0.11.0
  839. 395.83 s > Compiling gammaloop-tracing-filter-macros v0.1.0 (/build/source/crates/gammaloop-tracing-filter-macros)
  840. 395.83 s > Checking rustc-demangle v0.1.27
  841. 395.83 s > Checking rkyv v0.7.46
  842. 395.83 s > Checking option-ext v0.2.0
  843. 395.83 s > Checking dirs-sys v0.5.0
  844. 395.83 s > Checking ref-cast v1.0.25
  845. 395.83 s > Checking nix v0.31.2
  846. 395.83 s > Checking brotli-decompressor v4.0.3
  847. 395.83 s > Checking integer-sqrt v0.1.5
  848. 395.83 s > Checking crossbeam-channel v0.5.15
  849. 395.83 s > Checking itertools v0.12.1
  850. 395.83 s > Compiling gammalooprs v0.3.4 (/build/source/crates/gammalooprs)
  851. 395.83 s > Checking unsafe-libyaml v0.2.11
  852. 395.83 s > Checking color-spantrace v0.3.0
  853. 395.83 s > Checking symlink v0.1.0
  854. 395.83 s > Checking pathfinding v4.15.0
  855. 395.83 s > Checking include_dir v0.7.4
  856. 395.83 s > Checking ratatui-widgets v0.3.0
  857. 395.83 s > Checking ratatui-crossterm v0.1.0
  858. 395.83 s > Compiling numerica v2.2.0 (https://github.com/alphal00p/symbolica?rev=a277a8dadbaae5a8d6605f2f381991a601e1f345#a277a8da)
  859. 395.83 s > Checking tracing-appender v0.2.5
  860. 395.83 s > Checking brotli v7.0.0
  861. 395.83 s > Checking ctrlc v3.5.2
  862. 395.83 s > Checking tracing-indicatif v0.3.14
  863. 395.83 s > Checking clarabel v0.11.1
  864. 395.83 s > Checking dirs v6.0.0
  865. 395.83 s > Checking schemars v1.2.1
  866. 395.83 s > Checking slotmap v1.1.1
  867. 395.83 s > Checking serde_yaml v0.9.34+deprecated
  868. 395.83 s > Checking json5 v0.4.1
  869. 395.83 s > Checking ratatui-macros v0.7.0
  870. 395.83 s > Checking ratatui v0.30.0
  871. 395.83 s > Checking vectorize v0.2.0
  872. 395.83 s > Checking ringbuffer v0.16.0
  873. 395.83 s > Checking addr2line v0.25.1
  874. 395.83 s > Checking base62 v2.2.4
  875. 395.83 s > Checking rust-embed v8.11.0
  876. 395.83 s > Checking clap_complete v4.6.3
  877. 395.83 s > Checking fd-lock v4.0.4
  878. 395.83 s > Checking strip-ansi-escapes v0.2.1
  879. 395.83 s > Compiling gammaloop-api v0.1.0 (/build/source/crates/gammaloop-api)
  880. 395.83 s > Checking itertools v0.13.0
  881. 395.83 s > Checking strum v0.26.3
  882. 395.83 s > Checking sysinfo v0.33.1
  883. 395.83 s > Checking shlex v1.3.0
  884. 395.83 s > Checking slab v0.4.12
  885. 395.83 s > Checking futures-task v0.3.32
  886. 395.83 s > Checking futures-core v0.3.32
  887. 395.83 s > Checking sdd v3.0.10
  888. 395.83 s > Compiling gammaloop-integration-tests v0.1.0 (/build/source/tests)
  889. 395.83 s > Compiling test-log-core v0.2.20
  890. 395.83 s > Compiling rustc_version v0.4.1
  891. 395.83 s > Checking futures-util v0.3.32
  892. 395.83 s > Checking clap_complete_nushell v4.6.0
  893. 395.83 s > Checking which v8.0.2
  894. 395.83 s > Checking bincode v1.3.3
  895. 395.83 s > Checking scc v2.4.0
  896. 395.83 s > Compiling gungraun-runner v0.18.2
  897. 395.83 s > Checking proc-macro2 v1.0.106
  898. 395.83 s > Compiling gungraun-macros v0.8.0
  899. 395.83 s > Checking backtrace v0.3.76
  900. 395.83 s > Checking reedline v0.42.0
  901. 395.83 s > Checking color-eyre v0.6.5
  902. 395.83 s > Checking quote v1.0.45
  903. 395.83 s > Checking base64 v0.21.7
  904. 395.83 s > Checking maplit v1.0.2
  905. 395.83 s > Compiling iai-callgrind-runner v0.14.2
  906. 395.83 s > Checking kurbo v0.13.0
  907. 395.83 s > Checking wait-timeout v0.2.1
  908. 395.83 s > Checking ron v0.8.1
  909. 395.83 s > Checking nalgebra v0.29.0
  910. 395.83 s > Checking quick-error v1.2.3
  911. 395.83 s > Checking bit-vec v0.8.0
  912. 395.83 s > Compiling iai-callgrind v0.14.2
  913. 395.83 s > Checking bit-set v0.8.0
  914. 395.83 s > Checking rusty-fork v0.3.1
  915. 395.83 s > Checking syn v2.0.117
  916. 395.83 s > Compiling iai-callgrind-macros v0.5.1
  917. 395.83 s > Checking futures-executor v0.3.32
  918. 395.83 s > Compiling graphica v2.1.0 (https://github.com/alphal00p/symbolica?rev=a277a8dadbaae5a8d6605f2f381991a601e1f345#a277a8da)
  919. 395.83 s > Checking serial_test v3.4.0
  920. 395.83 s > Compiling test-log-macros v0.2.20
  921. 395.83 s > Checking rand_xorshift v0.4.0
  922. 395.83 s > Checking console v0.15.11
  923. 395.83 s > Checking pathdiff v0.2.3
  924. 395.83 s > Checking unarray v0.1.4
  925. 395.83 s > Checking proptest v1.11.0
  926. 395.83 s > Checking similar-asserts v1.7.0
  927. 395.83 s > Checking clinnet v0.1.8 (/build/source/crates/clinnet)
  928. 395.83 s > Checking kurvst v0.1.0 (/build/source/crates/kurvst)
  929. 395.83 s > Checking test-log v0.2.20
  930. 395.83 s > Checking gungraun v0.18.2
  931. 395.83 s > Checking statrs v0.16.1
  932. 395.83 s > Checking momtrop v0.3.0
  933. 395.83 s > Compiling pyo3-macros v0.28.3
  934. 395.83 s > Compiling pyo3-stub-gen-derive v0.17.2
  935. 395.83 s > Checking pyo3-stub-gen v0.17.2
  936. 395.83 s > Checking symbolica-utils v0.1.0 (/build/source/crates/symbolica-utils)
  937. 395.83 s > Checking spenso-macros v0.3.2 (/build/source/crates/spenso-macros)
  938. 395.83 s > Compiling gammaloop-workspace-hack v0.1.0 (/build/source/crates/gammaloop-workspace-hack)
  939. 395.83 s > Checking linnet v0.17.0 (/build/source/crates/linnet)
  940. 395.83 s > Checking spenso v0.6.0 (/build/source/crates/spenso)
  941. 395.83 s > Checking linnet-py v0.1.0 (/build/source/crates/linnet-py)
  942. 395.83 s > Checking linnest v0.1.0 (/build/source/crates/linnest)
  943. 395.83 s > Checking idenso v0.3.0 (/build/source/crates/idenso)
  944. 395.83 s > Checking gammaloop-tracing-filter v0.1.0 (/build/source/crates/gammaloop-tracing-filter)
  945. 395.83 s > Checking spenso-hep-lib v0.1.7 (/build/source/crates/spenso-hep-lib)
  946. 395.83 s > Checking spynso3 v0.1.2 (/build/source/crates/spynso3)
  947. 395.83 s > error[E0560]: struct `CutInfo` has no field named `lmb_channel_id`
  948. 395.83 s > --> tests/tests/test_differential.rs:86:13
  949. 395.83 s > |
  950. 395.83 s > 86 | lmb_channel_id: None,
  951. 395.83 s > | ^^^^^^^^^^^^^^ `CutInfo` does not have this field
  952. 395.83 s > |
  953. 395.83 s > = note: available fields are: `sampling_channel_id`, `sampling_channel_edge_ids`
  954. 395.83 s >
  955. 395.83 s > error[E0560]: struct `CutInfo` has no field named `lmb_channel_edge_ids`
  956. 395.83 s > --> tests/tests/test_differential.rs:87:13
  957. 395.83 s > |
  958. 395.83 s > 87 | lmb_channel_edge_ids: None,
  959. 395.83 s > | ^^^^^^^^^^^^^^^^^^^^ `CutInfo` does not have this field
  960. 395.83 s > |
  961. 395.83 s > = note: available fields are: `sampling_channel_id`, `sampling_channel_edge_ids`
  962. 395.83 s >
  963. 395.83 s > error[E0609]: no field `lmb_channel_edge_ids` on type `CutInfo`
  964. 395.83 s > --> tests/tests/test_evaluation_api.rs:311:10
  965. 395.83 s > |
  966. 395.83 s > 311 | .lmb_channel_edge_ids
  967. 395.83 s > | ^^^^^^^^^^^^^^^^^^^^ unknown field
  968. 395.83 s > |
  969. 395.83 s > = note: available fields are: `particle_pdgs`, `cut_id`, `graph_id`, `graph_group_id`, `orientation_id` ... and 2 others
  970. 395.83 s >
  971. 395.83 s > error[E0609]: no field `lmb_channel_edge_ids` on type `CutInfo`
  972. 395.83 s > --> tests/tests/test_evaluation_api.rs:591:26
  973. 395.83 s > |
  974. 395.83 s > 591 | .lmb_channel_edge_ids
  975. 395.83 s > | ^^^^^^^^^^^^^^^^^^^^ unknown field
  976. 395.83 s > |
  977. 395.83 s > = note: available fields are: `particle_pdgs`, `cut_id`, `graph_id`, `graph_group_id`, `orientation_id` ... and 2 others
  978. 395.83 s >
  979. 395.83 s > For more information about this error, try `rustc --explain E0560`.
  980. 395.83 s > error: could not compile `gammaloop-integration-tests` (test "test_differential") due to 2 previous errors
  981. 395.83 s > warning: build failed, waiting for other jobs to finish...
  982. 395.83 s > error[E0609]: no field `lmb_channel_edge_ids` on type `CutInfo`
  983. 395.83 s > --> tests/tests/test_evaluation_api.rs:1177:18
  984. 395.83 s > |
  985. 395.83 s > 1177 | .lmb_channel_edge_ids
  986. 395.83 s > | ^^^^^^^^^^^^^^^^^^^^ unknown field
  987. 395.83 s > |
  988. 395.83 s > = note: available fields are: `particle_pdgs`, `cut_id`, `graph_id`, `graph_group_id`, `orientation_id` ... and 2 others
  989. 395.83 s >
  990. 395.83 s > error[E0609]: no field `lmb_channel_edge_ids` on type `CutInfo`
  991. 395.83 s > --> tests/tests/test_evaluation_api.rs:1222:22
  992. 395.83 s > |
  993. 395.83 s > 1222 | .lmb_channel_edge_ids
  994. 395.83 s > | ^^^^^^^^^^^^^^^^^^^^ unknown field
  995. 395.83 s > |
  996. 395.83 s > = note: available fields are: `particle_pdgs`, `cut_id`, `graph_id`, `graph_group_id`, `orientation_id` ... and 2 others
  997. 395.83 s >
  998. 395.83 s > error[E0609]: no field `lmb_channel_edge_ids` on type `CutInfo`
  999. 395.83 s > --> tests/tests/test_evaluation_api.rs:1281:14
  1000. 395.83 s > |
  1001. 395.83 s > 1281 | .lmb_channel_edge_ids
  1002. 395.83 s > | ^^^^^^^^^^^^^^^^^^^^ unknown field
  1003. 395.83 s > |
  1004. 395.83 s > = note: available fields are: `particle_pdgs`, `cut_id`, `graph_id`, `graph_group_id`, `orientation_id` ... and 2 others
  1005. 395.83 s >
  1006. 395.83 s > error[E0609]: no field `lmb_channel_edge_ids` on type `CutInfo`
  1007. 395.83 s > --> tests/tests/test_evaluation_api.rs:1428:18
  1008. 395.83 s > |
  1009. 395.83 s > 1428 | .lmb_channel_edge_ids
  1010. 395.83 s > | ^^^^^^^^^^^^^^^^^^^^ unknown field
  1011. 395.83 s > |
  1012. 395.83 s > = note: available fields are: `particle_pdgs`, `cut_id`, `graph_id`, `graph_group_id`, `orientation_id` ... and 2 others
  1013. 395.83 s >
  1014. 395.83 s > For more information about this error, try `rustc --explain E0609`.
  1015. 395.83 s > error: could not compile `gammaloop-integration-tests` (test "test_evaluation_api") due to 6 previous errors
  1016. 395.83 s > error[E0609]: no field `lmb_channel_id` on type `CutInfo`
  1017. 395.83 s > --> tests/tests/test_runs/utils.rs:568:36
  1018. 395.83 s > |
  1019. 395.83 s > 568 | event.cut_info.lmb_channel_id,
  1020. 395.83 s > | ^^^^^^^^^^^^^^ unknown field
  1021. 395.83 s > |
  1022. 395.83 s > = note: available fields are: `particle_pdgs`, `cut_id`, `graph_id`, `graph_group_id`, `orientation_id` ... and 2 others
  1023. 395.83 s >
  1024. 395.83 s > error[E0609]: no field `lmb_channel_id` on type `CutInfo`
  1025. 395.83 s > --> tests/tests/test_runs/utils.rs:580:36
  1026. 395.83 s > |
  1027. 395.83 s > 580 | event.cut_info.lmb_channel_id,
  1028. 395.83 s > | ^^^^^^^^^^^^^^ unknown field
  1029. 395.83 s > |
  1030. 395.83 s > = note: available fields are: `particle_pdgs`, `cut_id`, `graph_id`, `graph_group_id`, `orientation_id` ... and 2 others
  1031. 395.83 s >
  1032. 395.83 s > error: could not compile `gammaloop-integration-tests` (test "test_runs") due to 2 previous errors
  1033. 395.83 s For full logs, run:
  1034. 395.83 s nix log /nix/store/ws66y79brahbksfmnksfcdd9g1qvcyzb-gammaloop-workspace-check-0.1.0.drv
  1035. 395.86 s Build failed.