1. 0.01 s $ /nix/store/9ypz3flqsrl5xl495mm8h645gadjsxi1-coreutils-9.11/bin/timeout --kill-after=15s 7200s /nix/store/23zk8sgzamrbmj1fday15szf7f2279s8-nix-2.34.7/bin/nix --extra-experimental-features nix-command --extra-experimental-features flakes --log-format internal-json build --no-link --print-out-paths git+https://github.com/alphal00p/gammaloop?ref=advanced_sampling&rev=1df7aa38b6fd28fa9cd50ca94e59c90067ab0bb7&shallow=1#checks.x86_64-linux.gammaloop-check --print-build-logs
  2. 0.56 s error (ignored): SQLite database '/var/cache/nix-ci-worker/eval-cache-v6/7db5b3ee960e117db536bb846779e7633d150451926acbd99d708a335ef61e1a.sqlite' is busy
  3. 3.55 s
  4. 4.19 s Building /nix/store/axwybdrvnz6g31i8j22ivzmz2ysf3s4g-gammaloop-workspace-check-0.1.0.drv
  5. 4.29 s [gammaloop-workspace-check] Phase: unpackPhase
  6. 4.29 s [gammaloop-workspace-check] unpacking source archive /nix/store/z5pb9ly08pscbnc755wvrwn7ad3dvc0j-source
  7. 4.49 s [gammaloop-workspace-check] source root is source
  8. 4.53 s [gammaloop-workspace-check] Phase: patchPhase
  9. 4.54 s [gammaloop-workspace-check] Executing configureCargoCommonVars
  10. 4.54 s [gammaloop-workspace-check] decompressing cargo artifacts from /nix/store/50vpxlcgfxf2d57i27v3d10zjwxxbm2r-gammaloop-workspace-deps-deps-0.1.0/target.tar.zst to target
  11. 6.85 s [gammaloop-workspace-check] Phase: updateAutotoolsGnuConfigScriptsPhase
  12. 6.89 s [gammaloop-workspace-check] Phase: configurePhase
  13. 6.90 s [gammaloop-workspace-check] will append /build/source/.cargo-home/config.toml with contents of /nix/store/5drf77x6km4ky7gwlrzdx9bbd6fz09g3-vendor-cargo-deps/config.toml
  14. 6.90 s [gammaloop-workspace-check] default configurePhase, nothing to do
  15. 6.91 s [gammaloop-workspace-check] Phase: buildPhase
  16. 6.91 s [gammaloop-workspace-check] +++ command cargo --version
  17. 6.92 s [gammaloop-workspace-check] cargo 1.97.0 (c980f4866 2026-06-30)
  18. 6.96 s [gammaloop-workspace-check] +++ command cargo check --profile ci-optim --locked --workspace --features gammaloop-tracing-filter/clap,gammaloop-tracing-filter/symbolica,idenso/bincode,idenso/reference-cases,linnet/bincode,linnet/drawing,linnet/rkyv,linnet/serde,linnet/symbolica,spenso-macros/shadowing,spenso/shadowing,symbolica/tracing_max_level_info,three-dimensional-reps/display,three-dimensional-reps/eval,three-dimensional-reps/serde --all-targets
  19. 8.74 s [gammaloop-workspace-check] Checking serde_core v1.0.228
  20. 8.74 s [gammaloop-workspace-check] Checking libc v0.2.186
  21. 8.74 s [gammaloop-workspace-check] Checking cfg-if v1.0.4
  22. 8.74 s [gammaloop-workspace-check] Checking memchr v2.8.0
  23. 8.75 s [gammaloop-workspace-check] Checking once_cell v1.21.4
  24. 8.75 s [gammaloop-workspace-check] Checking either v1.15.0
  25. 8.75 s [gammaloop-workspace-check] Checking libm v0.2.16
  26. 8.75 s [gammaloop-workspace-check] Checking itoa v1.0.18
  27. 8.78 s [gammaloop-workspace-check] Checking log v0.4.29
  28. 8.78 s [gammaloop-workspace-check] Checking zerocopy v0.8.48
  29. 8.78 s [gammaloop-workspace-check] Checking regex-syntax v0.8.10
  30. 8.82 s [gammaloop-workspace-check] Checking crossbeam-utils v0.8.21
  31. 8.82 s [gammaloop-workspace-check] Checking equivalent v1.0.2
  32. 8.82 s [gammaloop-workspace-check] Checking zmij v1.0.21
  33. 8.84 s [gammaloop-workspace-check] Checking lazy_static v1.5.0
  34. 8.86 s [gammaloop-workspace-check] Checking bytemuck v1.25.0
  35. 8.99 s [gammaloop-workspace-check] Compiling target-lexicon v0.13.5
  36. 9.04 s [gammaloop-workspace-check] Checking arrayvec v0.7.6
  37. 9.06 s [gammaloop-workspace-check] Checking powerfmt v0.2.0
  38. 9.08 s [gammaloop-workspace-check] Checking pin-project-lite v0.2.17
  39. 9.15 s [gammaloop-workspace-check] Checking time-core v0.1.8
  40. 9.22 s [gammaloop-workspace-check] Checking num_threads v0.1.7
  41. 9.27 s [gammaloop-workspace-check] Checking safe_arch v0.7.4
  42. 9.31 s [gammaloop-workspace-check] Checking num-conv v0.2.1
  43. 9.31 s [gammaloop-workspace-check] Checking foldhash v0.2.0
  44. 9.33 s [gammaloop-workspace-check] Checking deranged v0.5.8
  45. 9.33 s [gammaloop-workspace-check] Checking allocator-api2 v0.2.21
  46. 9.42 s [gammaloop-workspace-check] Checking const-random v0.1.18
  47. 9.47 s [gammaloop-workspace-check] Checking unty v0.0.4
  48. 9.49 s [gammaloop-workspace-check] Checking nu-ansi-term v0.50.3
  49. 9.51 s [gammaloop-workspace-check] Checking static_assertions v1.1.0
  50. 9.55 s [gammaloop-workspace-check] Checking winnow v1.0.2
  51. 9.57 s [gammaloop-workspace-check] Checking safe_arch v1.0.0
  52. 9.60 s [gammaloop-workspace-check] Checking tracing-core v0.1.36
  53. 9.63 s [gammaloop-workspace-check] Checking itertools v0.14.0
  54. 9.79 s [gammaloop-workspace-check] Checking hashbrown v0.16.1
  55. 9.88 s [gammaloop-workspace-check] Checking thread_local v1.1.9
  56. 10.04 s [gammaloop-workspace-check] Checking sharded-slab v0.1.7
  57. 10.09 s [gammaloop-workspace-check] Checking toml_writer v1.1.1+spec-1.1.0
  58. 10.12 s [gammaloop-workspace-check] Checking crossbeam-epoch v0.9.18
  59. 10.20 s [gammaloop-workspace-check] Checking aho-corasick v1.1.4
  60. 10.30 s [gammaloop-workspace-check] Checking wide v0.7.33
  61. 10.42 s [gammaloop-workspace-check] Checking az v1.3.0
  62. 10.43 s [gammaloop-workspace-check] Checking crossbeam-deque v0.8.6
  63. 11.20 s [gammaloop-workspace-check] Checking tracing-log v0.2.0
  64. 11.20 s [gammaloop-workspace-check] Checking tracing v0.1.44
  65. 11.20 s [gammaloop-workspace-check] Checking rayon-core v1.13.0
  66. 11.20 s [gammaloop-workspace-check] Checking indenter v0.3.4
  67. 11.20 s [gammaloop-workspace-check] Checking wide v1.3.0
  68. 11.37 s [gammaloop-workspace-check] Compiling phf_shared v0.11.3
  69. 11.53 s [gammaloop-workspace-check] Checking anyhow v1.0.102
  70. 11.61 s [gammaloop-workspace-check] Checking rawpointer v0.2.1
  71. 11.66 s [gammaloop-workspace-check] Checking utf8parse v0.2.2
  72. 11.81 s [gammaloop-workspace-check] Checking dyn-clone v1.0.20
  73. 11.93 s [gammaloop-workspace-check] Checking alloc-no-stdlib v2.0.4
  74. 11.95 s [gammaloop-workspace-check] Checking rayon v1.12.0
  75. 11.96 s [gammaloop-workspace-check] Checking anstyle-parse v1.0.0
  76. 12.06 s [gammaloop-workspace-check] Checking alloc-stdlib v0.2.2
  77. 12.12 s [gammaloop-workspace-check] Checking matrixmultiply v0.3.10
  78. 12.13 s [gammaloop-workspace-check] Checking anstyle-query v1.1.5
  79. 12.18 s [gammaloop-workspace-check] Checking anstyle v1.0.14
  80. 12.21 s [gammaloop-workspace-check] Checking colorchoice v1.0.5
  81. 12.30 s [gammaloop-workspace-check] Checking colored v3.1.1
  82. 12.41 s [gammaloop-workspace-check] Checking is_terminal_polyfill v1.70.2
  83. 12.50 s [gammaloop-workspace-check] Checking anstream v1.0.0
  84. 12.54 s [gammaloop-workspace-check] Checking num-traits v0.2.19
  85. 12.54 s [gammaloop-workspace-check] Compiling phf_generator v0.11.3
  86. 12.56 s [gammaloop-workspace-check] Checking toml_parser v1.1.2+spec-1.1.0
  87. 12.67 s [gammaloop-workspace-check] Checking eyre v0.6.12
  88. 12.73 s [gammaloop-workspace-check] Checking bitflags v1.3.2
  89. 12.79 s [gammaloop-workspace-check] Checking unicode-width v0.2.2
  90. 12.80 s [gammaloop-workspace-check] Compiling phf_codegen v0.11.3
  91. 12.89 s [gammaloop-workspace-check] Checking brotli-decompressor v5.0.0
  92. 12.98 s [gammaloop-workspace-check] Checking inventory v0.3.24
  93. 13.06 s [gammaloop-workspace-check] Checking spec_math v0.1.6
  94. 13.16 s [gammaloop-workspace-check] Checking thiserror v2.0.18
  95. 13.22 s [gammaloop-workspace-check] Checking libloading v0.9.0
  96. 13.27 s [gammaloop-workspace-check] Compiling getopts v0.2.24
  97. 13.36 s [gammaloop-workspace-check] Checking self_cell v1.2.2
  98. 13.37 s [gammaloop-workspace-check] Checking byteorder v1.5.0
  99. 13.39 s [gammaloop-workspace-check] Compiling pyo3-build-config v0.28.3
  100. 13.50 s [gammaloop-workspace-check] Checking serde v1.0.228
  101. 13.51 s [gammaloop-workspace-check] Checking serde_json v1.0.149
  102. 13.52 s [gammaloop-workspace-check] Checking approx v0.5.1
  103. 13.57 s [gammaloop-workspace-check] Checking getrandom v0.3.4
  104. 13.65 s [gammaloop-workspace-check] Checking bitflags v2.11.1
  105. 13.67 s [gammaloop-workspace-check] Checking time v0.3.47
  106. 13.94 s [gammaloop-workspace-check] Checking num-integer v0.1.46
  107. 14.00 s [gammaloop-workspace-check] Checking gmp-mpfr-sys v1.7.1
  108. 14.19 s [gammaloop-workspace-check] Checking rand_core v0.9.5
  109. 14.40 s [gammaloop-workspace-check] Checking regex-automata v0.4.14
  110. 14.59 s [gammaloop-workspace-check] Checking serde_spanned v1.1.1
  111. 14.63 s [gammaloop-workspace-check] Checking toml_datetime v1.1.1+spec-1.1.0
  112. 14.73 s [gammaloop-workspace-check] Checking region v3.0.2
  113. 14.79 s [gammaloop-workspace-check] Checking hugepage-rs v0.1.1
  114. 15.04 s [gammaloop-workspace-check] Checking wasmtime-jit-icache-coherence v34.0.2
  115. 15.14 s [gammaloop-workspace-check] Checking append-only-vec v0.1.8
  116. 15.16 s [gammaloop-workspace-check] Checking bytes v1.11.1
  117. 15.26 s [gammaloop-workspace-check] Checking tinyjson v2.5.1
  118. 15.30 s [gammaloop-workspace-check] Checking toml v1.1.2+spec-1.1.0
  119. 15.41 s [gammaloop-workspace-check] Compiling unicode_names2_generator v1.3.0
  120. 15.49 s [gammaloop-workspace-check] Compiling unic-char-range v0.9.0
  121. 15.53 s [gammaloop-workspace-check] Compiling unic-common v0.9.0
  122. 15.72 s [gammaloop-workspace-check] Checking linux-raw-sys v0.12.1
  123. 15.90 s [gammaloop-workspace-check] Compiling unic-char-property v0.9.0
  124. 15.98 s [gammaloop-workspace-check] Compiling unic-ucd-version v0.9.0
  125. 16.03 s [gammaloop-workspace-check] Compiling is-macro v0.3.7
  126. 16.14 s [gammaloop-workspace-check] Compiling rustpython-parser-vendored v0.4.0
  127. 16.38 s [gammaloop-workspace-check] Checking rustix v1.1.4
  128. 16.67 s [gammaloop-workspace-check] Checking brotli v8.0.2
  129. 16.93 s [gammaloop-workspace-check] Checking iana-time-zone v0.1.65
  130. 17.06 s [gammaloop-workspace-check] Checking smallvec v1.15.1
  131. 17.17 s [gammaloop-workspace-check] Checking num-complex v0.4.6
  132. 17.25 s [gammaloop-workspace-check] Checking tracing-serde v0.2.0
  133. 17.34 s [gammaloop-workspace-check] Checking bincode v2.0.1
  134. 17.39 s [gammaloop-workspace-check] Checking smartstring v1.0.1
  135. 17.53 s [gammaloop-workspace-check] Checking chrono v0.4.44
  136. 17.69 s [gammaloop-workspace-check] Compiling rustpython-parser v0.4.0
  137. 17.97 s [gammaloop-workspace-check] Compiling phf v0.11.3
  138. 18.03 s [gammaloop-workspace-check] Checking simba v0.9.1
  139. 18.29 s [gammaloop-workspace-check] Checking rustc-hash v2.1.2
  140. 18.38 s [gammaloop-workspace-check] Checking ndarray v0.17.2
  141. 18.79 s [gammaloop-workspace-check] Compiling unic-ucd-ident v0.9.0
  142. 19.23 s [gammaloop-workspace-check] Compiling unic-emoji-char v0.9.0
  143. 19.35 s [gammaloop-workspace-check] Compiling lalrpop-util v0.20.2
  144. 19.60 s [gammaloop-workspace-check] Compiling rustc-hash v1.1.0
  145. 19.73 s [gammaloop-workspace-check] Checking rug v1.30.0
  146. 19.75 s [gammaloop-workspace-check] Compiling symbolica v2.2.0 (https://github.com/alphal00p/symbolica?rev=a277a8dadbaae5a8d6605f2f381991a601e1f345#a277a8da)
  147. 20.57 s [gammaloop-workspace-check] Checking unicode-segmentation v1.13.2
  148. 20.68 s [gammaloop-workspace-check] Checking typenum v1.20.0
  149. 20.68 s [gammaloop-workspace-check] Checking getrandom v0.2.17
  150. 20.80 s [gammaloop-workspace-check] Checking scopeguard v1.2.0
  151. 20.86 s [gammaloop-workspace-check] Checking lock_api v0.4.14
  152. 20.93 s [gammaloop-workspace-check] Checking parking_lot_core v0.9.12
  153. 21.05 s [gammaloop-workspace-check] Checking unicode-ident v1.0.24
  154. 21.09 s [gammaloop-workspace-check] Checking hashbrown v0.17.0
  155. 21.11 s [gammaloop-workspace-check] Checking parking_lot v0.12.5
  156. 21.14 s [gammaloop-workspace-check] Checking terminal_size v0.4.4
  157. 21.16 s [gammaloop-workspace-check] Checking errno v0.3.14
  158. 21.21 s [gammaloop-workspace-check] Checking clap_lex v1.1.0
  159. 21.28 s [gammaloop-workspace-check] Checking strsim v0.11.1
  160. 21.40 s [gammaloop-workspace-check] Checking unicase v2.9.0
  161. 21.49 s [gammaloop-workspace-check] Checking signal-hook-registry v1.4.8
  162. 21.53 s [gammaloop-workspace-check] Checking vte v0.14.1
  163. 21.53 s [gammaloop-workspace-check] Checking same-file v1.0.6
  164. 21.70 s [gammaloop-workspace-check] Checking walkdir v2.5.0
  165. 21.77 s [gammaloop-workspace-check] Checking signal-hook v0.3.18
  166. 21.82 s [gammaloop-workspace-check] Checking mio v1.2.0
  167. 21.94 s [gammaloop-workspace-check] Checking indexmap v2.14.0
  168. 22.00 s [gammaloop-workspace-check] Checking minimal-lexical v0.2.1
  169. 22.07 s [gammaloop-workspace-check] Checking ciborium-io v0.2.2
  170. 22.16 s [gammaloop-workspace-check] Checking derive_more v2.1.1
  171. 22.26 s [gammaloop-workspace-check] Checking num-bigint v0.4.6
  172. 22.27 s [gammaloop-workspace-check] Checking nom v7.1.3
  173. 22.33 s [gammaloop-workspace-check] Checking clap_builder v4.6.0
  174. 22.45 s [gammaloop-workspace-check] Checking signal-hook-mio v0.2.5
  175. 22.53 s [gammaloop-workspace-check] Checking console v0.16.3
  176. 22.57 s [gammaloop-workspace-check] Checking ppv-lite86 v0.2.21
  177. 22.80 s [gammaloop-workspace-check] Checking ahash v0.8.12
  178. 23.00 s [gammaloop-workspace-check] Checking half v2.7.1
  179. 23.10 s [gammaloop-workspace-check] Checking bstr v1.12.1
  180. 23.21 s [gammaloop-workspace-check] Checking matchers v0.2.0
  181. 23.27 s [gammaloop-workspace-check] Checking tracing-subscriber v0.3.23
  182. 23.38 s [gammaloop-workspace-check] Checking regex v1.12.3
  183. 23.48 s [gammaloop-workspace-check] Checking ciborium-ll v0.2.2
  184. 23.63 s [gammaloop-workspace-check] Checking linux-raw-sys v0.4.15
  185. 23.64 s [gammaloop-workspace-check] Compiling unicode_names2 v1.3.0
  186. 23.81 s [gammaloop-workspace-check] Checking winnow v0.7.15
  187. 23.98 s [gammaloop-workspace-check] Checking cpufeatures v0.2.17
  188. 23.99 s [gammaloop-workspace-check] Checking rustix v0.38.44
  189. 24.03 s [gammaloop-workspace-check] Checking ciborium v0.2.2
  190. 24.59 s [gammaloop-workspace-check] Checking globset v0.4.18
  191. 24.71 s [gammaloop-workspace-check] Checking rand_chacha v0.9.0
  192. 24.95 s [gammaloop-workspace-check] Checking generic-array v0.14.7
  193. 24.97 s [gammaloop-workspace-check] Checking rand_core v0.6.4
  194. 25.00 s [gammaloop-workspace-check] Checking rand v0.9.4
  195. 25.16 s [gammaloop-workspace-check] Checking getrandom v0.4.2
  196. 25.35 s [gammaloop-workspace-check] Checking fastrand v2.4.1
  197. 25.35 s [gammaloop-workspace-check] Checking plotters-backend v0.3.7
  198. 25.45 s [gammaloop-workspace-check] Checking fnv v1.0.7
  199. 25.51 s [gammaloop-workspace-check] Checking toml_datetime v0.6.11
  200. 25.52 s [gammaloop-workspace-check] Checking plotters-svg v0.3.7
  201. 25.54 s [gammaloop-workspace-check] Checking tempfile v3.27.0
  202. 25.58 s [gammaloop-workspace-check] Checking crossterm v0.28.1
  203. 25.63 s [gammaloop-workspace-check] Checking serde_spanned v0.6.9
  204. 25.69 s [gammaloop-workspace-check] Checking itertools v0.10.5
  205. 25.80 s [gammaloop-workspace-check] Checking clap v4.6.1
  206. 25.86 s [gammaloop-workspace-check] Checking tap v1.0.1
  207. 25.90 s [gammaloop-workspace-check] Checking cast v0.3.0
  208. 25.93 s [gammaloop-workspace-check] Checking toml_write v0.1.2
  209. 26.00 s [gammaloop-workspace-check] Checking wyz v0.5.1
  210. 26.09 s [gammaloop-workspace-check] Checking plotters v0.3.7
  211. 26.22 s [gammaloop-workspace-check] Checking rand_chacha v0.3.1
  212. 26.24 s [gammaloop-workspace-check] Checking crypto-common v0.1.7
  213. 26.35 s [gammaloop-workspace-check] Checking block-buffer v0.10.4
  214. 26.47 s [gammaloop-workspace-check] Checking digest v0.10.7
  215. 26.49 s [gammaloop-workspace-check] Checking toml_edit v0.22.27
  216. 26.51 s [gammaloop-workspace-check] Checking radium v0.7.0
  217. 26.54 s [gammaloop-workspace-check] Checking similar v2.7.0
  218. 26.73 s [gammaloop-workspace-check] Checking typeid v1.0.3
  219. 26.82 s [gammaloop-workspace-check] Checking tinytemplate v1.2.1
  220. 26.83 s [gammaloop-workspace-check] Checking ansitok v0.3.0
  221. 26.84 s [gammaloop-workspace-check] Checking criterion-plot v0.5.0
  222. 26.95 s [gammaloop-workspace-check] Checking is-terminal v0.4.17
  223. 27.02 s [gammaloop-workspace-check] Checking oorandom v11.1.5
  224. 27.03 s [gammaloop-workspace-check] Checking sha2 v0.10.9
  225. 27.06 s [gammaloop-workspace-check] Checking funty v2.0.0
  226. 27.08 s [gammaloop-workspace-check] Checking bytecount v0.6.9
  227. 27.13 s [gammaloop-workspace-check] Checking anes v0.1.6
  228. 27.28 s [gammaloop-workspace-check] Checking ron v0.12.1
  229. 27.29 s [gammaloop-workspace-check] Checking rust-embed-utils v8.11.0
  230. 27.38 s [gammaloop-workspace-check] Checking criterion v0.5.1
  231. 27.51 s [gammaloop-workspace-check] Checking rand v0.8.6
  232. 27.56 s [gammaloop-workspace-check] Checking ansi-str v0.9.0
  233. 27.58 s [gammaloop-workspace-check] Checking bitvec v1.0.1
  234. 27.73 s [gammaloop-workspace-check] Checking symjit v2.21.0
  235. 27.75 s [gammaloop-workspace-check] Checking papergrid v0.17.0
  236. 27.88 s [gammaloop-workspace-check] Compiling pyo3-macros-backend v0.28.3
  237. 27.93 s [gammaloop-workspace-check] Compiling pyo3-ffi v0.28.3
  238. 28.04 s [gammaloop-workspace-check] Compiling pyo3 v0.28.3
  239. 28.09 s [gammaloop-workspace-check] Checking xprec v0.2.2
  240. 28.21 s [gammaloop-workspace-check] Compiling numpy v0.28.0
  241. 28.48 s [gammaloop-workspace-check] Checking testing_table v0.3.0
  242. 28.53 s [gammaloop-workspace-check] Checking env_filter v1.0.1
  243. 28.59 s [gammaloop-workspace-check] Checking toml_edit v0.25.11+spec-1.1.0
  244. 28.65 s [gammaloop-workspace-check] Checking uncased v0.9.10
  245. 28.66 s [gammaloop-workspace-check] Checking jiff v0.2.24
  246. 28.76 s [gammaloop-workspace-check] Checking ptr_meta v0.1.4
  247. 28.79 s [gammaloop-workspace-check] Checking simdutf8 v0.1.5
  248. 28.86 s [gammaloop-workspace-check] Checking ucd-trie v0.1.7
  249. 28.90 s [gammaloop-workspace-check] Checking ahash v0.7.8
  250. 29.05 s [gammaloop-workspace-check] Checking pest v2.8.6
  251. 29.08 s [gammaloop-workspace-check] Checking bytecheck v0.6.12
  252. 29.11 s [gammaloop-workspace-check] Checking approx v0.4.0
  253. 29.17 s [gammaloop-workspace-check] Checking hashbrown v0.12.3
  254. 29.28 s [gammaloop-workspace-check] Checking seahash v4.1.0
  255. 29.44 s [gammaloop-workspace-check] Checking cgmath v0.18.0
  256. 29.63 s [gammaloop-workspace-check] Checking rend v0.4.2
  257. 29.89 s [gammaloop-workspace-check] Checking num-rational v0.4.2
  258. 30.01 s [gammaloop-workspace-check] Checking dot-parser v0.5.1
  259. 30.48 s [gammaloop-workspace-check] Checking num-iter v0.1.45
  260. 30.52 s [gammaloop-workspace-check] Checking ref-ops v0.2.5
  261. 30.55 s [gammaloop-workspace-check] Checking rand_xoshiro v0.6.0
  262. 30.62 s [gammaloop-workspace-check] Checking num v0.4.3
  263. 30.67 s [gammaloop-workspace-check] Checking features v0.10.0
  264. 30.73 s [gammaloop-workspace-check] Checking constcat v0.5.1
  265. 30.76 s [gammaloop-workspace-check] Checking gat-lending-iterator v0.1.8
  266. 30.78 s [gammaloop-workspace-check] Checking colored v2.2.0
  267. 30.93 s [gammaloop-workspace-check] Checking constant_time_eq v0.4.2
  268. 31.01 s [gammaloop-workspace-check] Checking tabled v0.20.0
  269. 31.04 s [gammaloop-workspace-check] Checking insta v1.47.2
  270. 31.06 s [gammaloop-workspace-check] Checking arrayref v0.3.9
  271. 31.14 s [gammaloop-workspace-check] Checking cpufeatures v0.3.0
  272. 31.18 s [gammaloop-workspace-check] Checking base64 v0.22.1
  273. 31.18 s [gammaloop-workspace-check] Checking siphasher v1.0.2
  274. 31.23 s [gammaloop-workspace-check] Checking joinery v2.1.0
  275. 31.26 s [gammaloop-workspace-check] Checking blake3 v1.8.5
  276. 31.34 s [gammaloop-workspace-check] Checking phf_shared v0.13.1
  277. 31.44 s [gammaloop-workspace-check] Checking titlecase v2.2.1
  278. 31.53 s [gammaloop-workspace-check] Checking subprocess v0.2.15
  279. 31.56 s [gammaloop-workspace-check] Checking rust_lisp v0.18.0
  280. 31.62 s [gammaloop-workspace-check] Compiling vakint v0.1.2 (/build/source/crates/vakint)
  281. 31.71 s [gammaloop-workspace-check] Checking version-compare v0.2.1
  282. 31.78 s [gammaloop-workspace-check] Checking toml v0.8.23
  283. 31.86 s [gammaloop-workspace-check] Checking xpct v0.5.1
  284. 31.92 s [gammaloop-workspace-check] Checking ryu v1.0.23
  285. 31.98 s [gammaloop-workspace-check] Checking castaway v0.2.4
  286. 32.00 s [gammaloop-workspace-check] Checking phf v0.13.1
  287. 32.06 s [gammaloop-workspace-check] Checking toml_datetime v0.7.5+spec-1.1.0
  288. 32.15 s [gammaloop-workspace-check] Checking strum v0.27.2
  289. 32.18 s [gammaloop-workspace-check] Checking compact_str v0.9.0
  290. 32.28 s [gammaloop-workspace-check] Checking toml v0.9.12+spec-1.1.0
  291. 32.29 s [gammaloop-workspace-check] Checking unicode-truncate v2.0.1
  292. 32.36 s [gammaloop-workspace-check] Checking kasuari v0.4.12
  293. 32.39 s [gammaloop-workspace-check] Checking lru v0.16.4
  294. 32.53 s [gammaloop-workspace-check] Checking vte v0.15.0
  295. 32.56 s [gammaloop-workspace-check] Checking figment v0.10.19
  296. 32.67 s [gammaloop-workspace-check] Checking string-template-plus v0.4.3
  297. 32.70 s [gammaloop-workspace-check] Checking vt100 v0.16.2
  298. 32.98 s [gammaloop-workspace-check] Checking portable-atomic v1.13.1
  299. 33.16 s [gammaloop-workspace-check] Checking unit-prefix v0.5.2
  300. 33.30 s [gammaloop-workspace-check] Checking rand_distr v0.4.3
  301. 33.54 s [gammaloop-workspace-check] Compiling rustpython-parser-core v0.4.0
  302. 33.55 s [gammaloop-workspace-check] Checking simba v0.6.0
  303. 33.58 s [gammaloop-workspace-check] Checking line-clipping v0.3.7
  304. 33.70 s [gammaloop-workspace-check] Compiling rustpython-ast v0.4.0
  305. 33.75 s [gammaloop-workspace-check] Checking adler2 v2.0.1
  306. 33.78 s [gammaloop-workspace-check] Checking indicatif v0.18.4
  307. 33.87 s [gammaloop-workspace-check] Compiling three-dimensional-reps v0.1.0 (/build/source/crates/three-dimensional-reps)
  308. 33.87 s [gammaloop-workspace-check] Checking gimli v0.32.3
  309. 33.95 s [gammaloop-workspace-check] Checking ratatui-core v0.1.0
  310. 34.09 s [gammaloop-workspace-check] Checking miniz_oxide v0.8.9
  311. 34.13 s [gammaloop-workspace-check] Checking thiserror v1.0.69
  312. 34.22 s [gammaloop-workspace-check] Checking derive_builder v0.11.2
  313. 34.29 s [gammaloop-workspace-check] Checking crossterm v0.29.0
  314. 34.32 s [gammaloop-workspace-check] Checking object v0.37.3
  315. 34.34 s [gammaloop-workspace-check] Checking owo-colors v4.3.0
  316. 34.76 s [gammaloop-workspace-check] Checking tracing-error v0.2.1
  317. 34.96 s [gammaloop-workspace-check] Checking typed-index-collections v3.5.0
  318. 35.07 s [gammaloop-workspace-check] Checking serde-big-array v0.5.1
  319. 35.30 s [gammaloop-workspace-check] Checking amd v0.2.2
  320. 35.36 s [gammaloop-workspace-check] Checking itertools v0.11.0
  321. 35.43 s [gammaloop-workspace-check] Compiling gammaloop-tracing-filter-macros v0.1.0 (/build/source/crates/gammaloop-tracing-filter-macros)
  322. 35.66 s [gammaloop-workspace-check] Checking ratatui-widgets v0.3.0
  323. 35.67 s [gammaloop-workspace-check] Checking rustc-demangle v0.1.27
  324. 35.75 s [gammaloop-workspace-check] Checking option-ext v0.2.0
  325. 35.84 s [gammaloop-workspace-check] Checking env_logger v0.11.10
  326. 35.85 s [gammaloop-workspace-check] Checking dirs-sys v0.5.0
  327. 36.17 s [gammaloop-workspace-check] Checking color-spantrace v0.3.0
  328. 36.18 s [gammaloop-workspace-check] Checking ref-cast v1.0.25
  329. 36.21 s [gammaloop-workspace-check] Checking nix v0.31.2
  330. 36.25 s [gammaloop-workspace-check] Checking integer-sqrt v0.1.5
  331. 36.27 s [gammaloop-workspace-check] Checking brotli-decompressor v4.0.3
  332. 36.30 s [gammaloop-workspace-check] Checking crossbeam-channel v0.5.15
  333. 36.33 s [gammaloop-workspace-check] Checking itertools v0.12.1
  334. 36.36 s [gammaloop-workspace-check] Compiling gammalooprs v0.3.4 (/build/source/crates/gammalooprs)
  335. 36.39 s [gammaloop-workspace-check] Checking ratatui-crossterm v0.1.0
  336. 36.65 s [gammaloop-workspace-check] Checking unsafe-libyaml v0.2.11
  337. 36.85 s [gammaloop-workspace-check] Checking rkyv v0.7.46
  338. 36.90 s [gammaloop-workspace-check] Checking symlink v0.1.0
  339. 36.95 s [gammaloop-workspace-check] Checking tracing-appender v0.2.5
  340. 36.99 s [gammaloop-workspace-check] Checking ratatui-macros v0.7.0
  341. 36.99 s [gammaloop-workspace-check] Checking clarabel v0.11.1
  342. 37.02 s [gammaloop-workspace-check] Checking include_dir v0.7.4
  343. 37.09 s [gammaloop-workspace-check] Checking ratatui v0.30.0
  344. 37.14 s [gammaloop-workspace-check] Checking ctrlc v3.5.2
  345. 37.28 s [gammaloop-workspace-check] Checking pathfinding v4.15.0
  346. 37.31 s [gammaloop-workspace-check] Checking schemars v1.2.1
  347. 37.34 s [gammaloop-workspace-check] Checking slotmap v1.1.1
  348. 37.49 s [gammaloop-workspace-check] Checking brotli v7.0.0
  349. 37.74 s [gammaloop-workspace-check] Checking dirs v6.0.0
  350. 37.88 s [gammaloop-workspace-check] Checking tracing-indicatif v0.3.14
  351. 38.06 s [gammaloop-workspace-check] Checking serde_yaml v0.9.34+deprecated
  352. 38.19 s [gammaloop-workspace-check] Checking json5 v0.4.1
  353. 38.45 s [gammaloop-workspace-check] Checking addr2line v0.25.1
  354. 38.48 s [gammaloop-workspace-check] Checking vectorize v0.2.0
  355. 38.58 s [gammaloop-workspace-check] Checking ringbuffer v0.16.0
  356. 38.77 s [gammaloop-workspace-check] Checking base62 v2.2.4
  357. 38.88 s [gammaloop-workspace-check] Checking rust-embed v8.11.0
  358. 38.90 s [gammaloop-workspace-check] Checking clap_complete v4.6.3
  359. 38.94 s [gammaloop-workspace-check] Checking strip-ansi-escapes v0.2.1
  360. 39.00 s [gammaloop-workspace-check] Compiling gammaloop-api v0.1.0 (/build/source/crates/gammaloop-api)
  361. 39.16 s [gammaloop-workspace-check] Checking fd-lock v4.0.4
  362. 39.17 s [gammaloop-workspace-check] Checking itertools v0.13.0
  363. 39.20 s [gammaloop-workspace-check] Checking strum v0.26.3
  364. 39.25 s [gammaloop-workspace-check] Checking clap_complete_nushell v4.6.0
  365. 39.28 s [gammaloop-workspace-check] Checking sysinfo v0.33.1
  366. 39.36 s [gammaloop-workspace-check] Checking shlex v1.3.0
  367. 39.36 s [gammaloop-workspace-check] Checking futures-core v0.3.32
  368. 39.50 s [gammaloop-workspace-check] Checking futures-task v0.3.32
  369. 39.52 s [gammaloop-workspace-check] Checking slab v0.4.12
  370. 39.70 s [gammaloop-workspace-check] Checking futures-util v0.3.32
  371. 39.80 s [gammaloop-workspace-check] Checking sdd v3.0.10
  372. 40.03 s [gammaloop-workspace-check] Compiling gammaloop-integration-tests v0.1.0 (/build/source/tests)
  373. 40.13 s [gammaloop-workspace-check] Checking scc v2.4.0
  374. 40.43 s [gammaloop-workspace-check] Compiling test-log-core v0.2.20
  375. 40.52 s [gammaloop-workspace-check] Compiling rustc_version v0.4.1
  376. 40.61 s [gammaloop-workspace-check] Checking which v8.0.2
  377. 40.68 s [gammaloop-workspace-check] Checking bincode v1.3.3
  378. 40.97 s [gammaloop-workspace-check] Compiling gungraun-runner v0.18.2
  379. 41.90 s [gammaloop-workspace-check] Compiling gungraun-macros v0.8.0
  380. 42.25 s [gammaloop-workspace-check] Checking proc-macro2 v1.0.106
  381. 42.72 s [gammaloop-workspace-check] Checking reedline v0.42.0
  382. 42.79 s [gammaloop-workspace-check] Checking maplit v1.0.2
  383. 42.88 s [gammaloop-workspace-check] Checking base64 v0.21.7
  384. 43.17 s [gammaloop-workspace-check] Checking quote v1.0.45
  385. 43.20 s [gammaloop-workspace-check] Checking backtrace v0.3.76
  386. 43.42 s [gammaloop-workspace-check] Compiling iai-callgrind-runner v0.14.2
  387. 43.53 s [gammaloop-workspace-check] Checking ron v0.8.1
  388. 43.83 s [gammaloop-workspace-check] Compiling numerica v2.2.0 (https://github.com/alphal00p/symbolica?rev=a277a8dadbaae5a8d6605f2f381991a601e1f345#a277a8da)
  389. 44.07 s [gammaloop-workspace-check] Checking nalgebra v0.29.0
  390. 44.85 s [gammaloop-workspace-check] Checking color-eyre v0.6.5
  391. 45.18 s [gammaloop-workspace-check] Checking futures-executor v0.3.32
  392. 45.40 s [gammaloop-workspace-check] Checking kurbo v0.13.0
  393. 45.50 s [gammaloop-workspace-check] Checking serial_test v3.4.0
  394. 45.72 s [gammaloop-workspace-check] Compiling test-log-macros v0.2.20
  395. 45.93 s [gammaloop-workspace-check] Checking wait-timeout v0.2.1
  396. 46.02 s [gammaloop-workspace-check] Compiling iai-callgrind v0.14.2
  397. 46.17 s [gammaloop-workspace-check] Checking bit-vec v0.8.0
  398. 46.18 s [gammaloop-workspace-check] Checking quick-error v1.2.3
  399. 46.27 s [gammaloop-workspace-check] Checking rusty-fork v0.3.1
  400. 46.60 s [gammaloop-workspace-check] Checking syn v2.0.117
  401. 46.88 s [gammaloop-workspace-check] Compiling iai-callgrind-macros v0.5.1
  402. 47.35 s [gammaloop-workspace-check] Checking rand_xorshift v0.4.0
  403. 47.51 s [gammaloop-workspace-check] Checking bit-set v0.8.0
  404. 47.58 s [gammaloop-workspace-check] Checking console v0.15.11
  405. 47.66 s [gammaloop-workspace-check] Checking pathdiff v0.2.3
  406. 47.78 s [gammaloop-workspace-check] Checking unarray v0.1.4
  407. 47.92 s [gammaloop-workspace-check] Checking proptest v1.11.0
  408. 49.60 s [gammaloop-workspace-check] Checking similar-asserts v1.7.0
  409. 49.88 s [gammaloop-workspace-check] Checking kurvst v0.1.0 (/build/source/crates/kurvst)
  410. 50.24 s [gammaloop-workspace-check] Checking clinnet v0.1.8 (/build/source/crates/clinnet)
  411. 53.01 s [gammaloop-workspace-check] Checking test-log v0.2.20
  412. 59.78 s [gammaloop-workspace-check] Compiling graphica v2.1.0 (https://github.com/alphal00p/symbolica?rev=a277a8dadbaae5a8d6605f2f381991a601e1f345#a277a8da)
  413. 66.02 s [gammaloop-workspace-check] Checking gungraun v0.18.2
  414. 66.16 s [gammaloop-workspace-check] Checking statrs v0.16.1
  415. 67.98 s [gammaloop-workspace-check] Checking momtrop v0.3.0
  416. 71.79 s [gammaloop-workspace-check] Compiling pyo3-macros v0.28.3
  417. 72.33 s [gammaloop-workspace-check] Compiling pyo3-stub-gen-derive v0.17.2
  418. 83.08 s [gammaloop-workspace-check] Checking pyo3-stub-gen v0.17.2
  419. 92.90 s [gammaloop-workspace-check] Checking symbolica-utils v0.1.0 (/build/source/crates/symbolica-utils)
  420. 92.90 s [gammaloop-workspace-check] Checking spenso-macros v0.3.2 (/build/source/crates/spenso-macros)
  421. 361.36 s [gammaloop-workspace-check] Compiling gammaloop-workspace-hack v0.1.0 (/build/source/crates/gammaloop-workspace-hack)
  422. 361.63 s [gammaloop-workspace-check] Checking linnet v0.17.0 (/build/source/crates/linnet)
  423. 366.70 s [gammaloop-workspace-check] Checking spenso v0.6.0 (/build/source/crates/spenso)
  424. 366.91 s [gammaloop-workspace-check] Checking linnet-py v0.1.0 (/build/source/crates/linnet-py)
  425. 366.91 s [gammaloop-workspace-check] Checking linnest v0.1.0 (/build/source/crates/linnest)
  426. 374.88 s [gammaloop-workspace-check] Checking idenso v0.3.0 (/build/source/crates/idenso)
  427. 374.89 s [gammaloop-workspace-check] Checking gammaloop-tracing-filter v0.1.0 (/build/source/crates/gammaloop-tracing-filter)
  428. 378.16 s [gammaloop-workspace-check] Checking spenso-hep-lib v0.1.7 (/build/source/crates/spenso-hep-lib)
  429. 378.64 s [gammaloop-workspace-check] Checking spynso3 v0.1.2 (/build/source/crates/spynso3)
  430. 420.33 s [gammaloop-workspace-check] error[E0560]: struct `CutInfo` has no field named `lmb_channel_id`
  431. 420.33 s [gammaloop-workspace-check] --> tests/tests/test_differential.rs:86:13
  432. 420.33 s [gammaloop-workspace-check] |
  433. 420.33 s [gammaloop-workspace-check] 86 | lmb_channel_id: None,
  434. 420.33 s [gammaloop-workspace-check] | ^^^^^^^^^^^^^^ `CutInfo` does not have this field
  435. 420.33 s [gammaloop-workspace-check] |
  436. 420.33 s [gammaloop-workspace-check] = note: available fields are: `sampling_channel_id`, `sampling_channel_edge_ids`
  437. 420.33 s [gammaloop-workspace-check]
  438. 420.33 s [gammaloop-workspace-check] error[E0560]: struct `CutInfo` has no field named `lmb_channel_edge_ids`
  439. 420.33 s [gammaloop-workspace-check] --> tests/tests/test_differential.rs:87:13
  440. 420.33 s [gammaloop-workspace-check] |
  441. 420.33 s [gammaloop-workspace-check] 87 | lmb_channel_edge_ids: None,
  442. 420.33 s [gammaloop-workspace-check] | ^^^^^^^^^^^^^^^^^^^^ `CutInfo` does not have this field
  443. 420.33 s [gammaloop-workspace-check] |
  444. 420.33 s [gammaloop-workspace-check] = note: available fields are: `sampling_channel_id`, `sampling_channel_edge_ids`
  445. 420.33 s [gammaloop-workspace-check]
  446. 420.36 s [gammaloop-workspace-check] error[E0063]: missing field `reference_moments` in initializer of `GraphEvaluationResult<_>`
  447. 420.36 s [gammaloop-workspace-check] --> tests/tests/test_differential.rs:532:19
  448. 420.36 s [gammaloop-workspace-check] |
  449. 420.36 s [gammaloop-workspace-check] 532 | let mut lhs = GraphEvaluationResult {
  450. 420.36 s [gammaloop-workspace-check] | ^^^^^^^^^^^^^^^^^^^^^ missing `reference_moments`
  451. 420.36 s [gammaloop-workspace-check]
  452. 420.36 s [gammaloop-workspace-check] error[E0063]: missing field `reference_moments` in initializer of `GraphEvaluationResult<_>`
  453. 420.36 s [gammaloop-workspace-check] --> tests/tests/test_differential.rs:539:15
  454. 420.36 s [gammaloop-workspace-check] |
  455. 420.36 s [gammaloop-workspace-check] 539 | let rhs = GraphEvaluationResult {
  456. 420.36 s [gammaloop-workspace-check] | ^^^^^^^^^^^^^^^^^^^^^ missing `reference_moments`
  457. 420.36 s [gammaloop-workspace-check]
  458. 420.45 s [gammaloop-workspace-check] error[E0609]: no field `lmb_channel_edge_ids` on type `CutInfo`
  459. 420.45 s [gammaloop-workspace-check] --> tests/tests/test_evaluation_api.rs:311:10
  460. 420.45 s [gammaloop-workspace-check] |
  461. 420.45 s [gammaloop-workspace-check] 311 | .lmb_channel_edge_ids
  462. 420.45 s [gammaloop-workspace-check] | ^^^^^^^^^^^^^^^^^^^^ unknown field
  463. 420.45 s [gammaloop-workspace-check] |
  464. 420.45 s [gammaloop-workspace-check] = note: available fields are: `particle_pdgs`, `cut_id`, `graph_id`, `graph_group_id`, `orientation_id` ... and 2 others
  465. 420.45 s [gammaloop-workspace-check]
  466. 420.55 s [gammaloop-workspace-check] error[E0609]: no field `lmb_channel_edge_ids` on type `CutInfo`
  467. 420.55 s [gammaloop-workspace-check] --> tests/tests/test_evaluation_api.rs:591:26
  468. 420.55 s [gammaloop-workspace-check] |
  469. 420.55 s [gammaloop-workspace-check] 591 | .lmb_channel_edge_ids
  470. 420.55 s [gammaloop-workspace-check] | ^^^^^^^^^^^^^^^^^^^^ unknown field
  471. 420.55 s [gammaloop-workspace-check] |
  472. 420.55 s [gammaloop-workspace-check] = note: available fields are: `particle_pdgs`, `cut_id`, `graph_id`, `graph_group_id`, `orientation_id` ... and 2 others
  473. 420.55 s [gammaloop-workspace-check]
  474. 420.57 s [gammaloop-workspace-check] Some errors have detailed explanations: E0063, E0560.
  475. 420.57 s [gammaloop-workspace-check] For more information about an error, try `rustc --explain E0063`.
  476. 420.61 s [gammaloop-workspace-check] error: could not compile `gammaloop-integration-tests` (test "test_differential") due to 4 previous errors
  477. 420.61 s [gammaloop-workspace-check] warning: build failed, waiting for other jobs to finish...
  478. 420.67 s [gammaloop-workspace-check] error[E0609]: no field `lmb_channel_edge_ids` on type `CutInfo`
  479. 420.67 s [gammaloop-workspace-check] --> tests/tests/test_evaluation_api.rs:1177:18
  480. 420.67 s [gammaloop-workspace-check] |
  481. 420.67 s [gammaloop-workspace-check] 1177 | .lmb_channel_edge_ids
  482. 420.67 s [gammaloop-workspace-check] | ^^^^^^^^^^^^^^^^^^^^ unknown field
  483. 420.67 s [gammaloop-workspace-check] |
  484. 420.67 s [gammaloop-workspace-check] = note: available fields are: `particle_pdgs`, `cut_id`, `graph_id`, `graph_group_id`, `orientation_id` ... and 2 others
  485. 420.67 s [gammaloop-workspace-check]
  486. 420.84 s [gammaloop-workspace-check] error[E0609]: no field `lmb_channel_edge_ids` on type `CutInfo`
  487. 420.84 s [gammaloop-workspace-check] --> tests/tests/test_evaluation_api.rs:1222:22
  488. 420.84 s [gammaloop-workspace-check] |
  489. 420.84 s [gammaloop-workspace-check] 1222 | .lmb_channel_edge_ids
  490. 420.84 s [gammaloop-workspace-check] | ^^^^^^^^^^^^^^^^^^^^ unknown field
  491. 420.84 s [gammaloop-workspace-check] |
  492. 420.84 s [gammaloop-workspace-check] = note: available fields are: `particle_pdgs`, `cut_id`, `graph_id`, `graph_group_id`, `orientation_id` ... and 2 others
  493. 420.84 s [gammaloop-workspace-check]
  494. 420.84 s [gammaloop-workspace-check] error[E0609]: no field `lmb_channel_edge_ids` on type `CutInfo`
  495. 420.84 s [gammaloop-workspace-check] --> tests/tests/test_evaluation_api.rs:1281:14
  496. 420.84 s [gammaloop-workspace-check] |
  497. 420.84 s [gammaloop-workspace-check] 1281 | .lmb_channel_edge_ids
  498. 420.84 s [gammaloop-workspace-check] | ^^^^^^^^^^^^^^^^^^^^ unknown field
  499. 420.84 s [gammaloop-workspace-check] |
  500. 420.84 s [gammaloop-workspace-check] = note: available fields are: `particle_pdgs`, `cut_id`, `graph_id`, `graph_group_id`, `orientation_id` ... and 2 others
  501. 420.84 s [gammaloop-workspace-check]
  502. 420.92 s [gammaloop-workspace-check] error[E0609]: no field `lmb_channel_edge_ids` on type `CutInfo`
  503. 420.92 s [gammaloop-workspace-check] --> tests/tests/test_evaluation_api.rs:1428:18
  504. 420.92 s [gammaloop-workspace-check] |
  505. 420.92 s [gammaloop-workspace-check] 1428 | .lmb_channel_edge_ids
  506. 420.92 s [gammaloop-workspace-check] | ^^^^^^^^^^^^^^^^^^^^ unknown field
  507. 420.92 s [gammaloop-workspace-check] |
  508. 420.92 s [gammaloop-workspace-check] = note: available fields are: `particle_pdgs`, `cut_id`, `graph_id`, `graph_group_id`, `orientation_id` ... and 2 others
  509. 420.92 s [gammaloop-workspace-check]
  510. 421.07 s [gammaloop-workspace-check] For more information about this error, try `rustc --explain E0609`.
  511. 421.10 s [gammaloop-workspace-check] error: could not compile `gammaloop-integration-tests` (test "test_evaluation_api") due to 6 previous errors
  512. 421.80 s [gammaloop-workspace-check] error[E0609]: no field `lmb_channel_id` on type `CutInfo`
  513. 421.80 s [gammaloop-workspace-check] --> tests/tests/test_runs/utils.rs:568:36
  514. 421.80 s [gammaloop-workspace-check] |
  515. 421.80 s [gammaloop-workspace-check] 568 | event.cut_info.lmb_channel_id,
  516. 421.80 s [gammaloop-workspace-check] | ^^^^^^^^^^^^^^ unknown field
  517. 421.80 s [gammaloop-workspace-check] |
  518. 421.80 s [gammaloop-workspace-check] = note: available fields are: `particle_pdgs`, `cut_id`, `graph_id`, `graph_group_id`, `orientation_id` ... and 2 others
  519. 421.80 s [gammaloop-workspace-check]
  520. 421.80 s [gammaloop-workspace-check] error[E0609]: no field `lmb_channel_id` on type `CutInfo`
  521. 421.80 s [gammaloop-workspace-check] --> tests/tests/test_runs/utils.rs:580:36
  522. 421.80 s [gammaloop-workspace-check] |
  523. 421.80 s [gammaloop-workspace-check] 580 | event.cut_info.lmb_channel_id,
  524. 421.80 s [gammaloop-workspace-check] | ^^^^^^^^^^^^^^ unknown field
  525. 421.80 s [gammaloop-workspace-check] |
  526. 421.80 s [gammaloop-workspace-check] = note: available fields are: `particle_pdgs`, `cut_id`, `graph_id`, `graph_group_id`, `orientation_id` ... and 2 others
  527. 421.80 s [gammaloop-workspace-check]
  528. 422.68 s [gammaloop-workspace-check] error: could not compile `gammaloop-integration-tests` (test "test_runs") due to 2 previous errors
  529. 423.71 s Progress: 0 of 1 built (1 failed)
  530. 423.71 s Failed to build gammaloop-workspace-check after 6m59s
  531. 423.71 s Cannot build '/nix/store/axwybdrvnz6g31i8j22ivzmz2ysf3s4g-gammaloop-workspace-check-0.1.0.drv'.
  532. 423.71 s Reason: builder failed with exit code 101.
  533. 423.71 s Output paths:
  534. 423.71 s /nix/store/9cxf174qbl62vd8h78aazfzs3igfpdff-gammaloop-workspace-check-0.1.0
  535. 423.71 s Last 524 log lines:
  536. 423.71 s > Running phase: unpackPhase
  537. 423.71 s > unpacking source archive /nix/store/z5pb9ly08pscbnc755wvrwn7ad3dvc0j-source
  538. 423.71 s > source root is source
  539. 423.71 s > Running phase: patchPhase
  540. 423.71 s > Executing configureCargoCommonVars
  541. 423.71 s > decompressing cargo artifacts from /nix/store/50vpxlcgfxf2d57i27v3d10zjwxxbm2r-gammaloop-workspace-deps-deps-0.1.0/target.tar.zst to target
  542. 423.71 s > Running phase: updateAutotoolsGnuConfigScriptsPhase
  543. 423.71 s > Running phase: configurePhase
  544. 423.71 s > will append /build/source/.cargo-home/config.toml with contents of /nix/store/5drf77x6km4ky7gwlrzdx9bbd6fz09g3-vendor-cargo-deps/config.toml
  545. 423.71 s > default configurePhase, nothing to do
  546. 423.71 s > Running phase: buildPhase
  547. 423.71 s > +++ command cargo --version
  548. 423.71 s > cargo 1.97.0 (c980f4866 2026-06-30)
  549. 423.71 s > +++ command cargo check --profile ci-optim --locked --workspace --features gammaloop-tracing-filter/clap,gammaloop-tracing-filter/symbolica,idenso/bincode,idenso/reference-cases,linnet/bincode,linnet/drawing,linnet/rkyv,linnet/serde,linnet/symbolica,spenso-macros/shadowing,spenso/shadowing,symbolica/tracing_max_level_info,three-dimensional-reps/display,three-dimensional-reps/eval,three-dimensional-reps/serde --all-targets
  550. 423.71 s > Checking serde_core v1.0.228
  551. 423.71 s > Checking libc v0.2.186
  552. 423.71 s > Checking cfg-if v1.0.4
  553. 423.71 s > Checking memchr v2.8.0
  554. 423.71 s > Checking once_cell v1.21.4
  555. 423.71 s > Checking either v1.15.0
  556. 423.71 s > Checking libm v0.2.16
  557. 423.71 s > Checking itoa v1.0.18
  558. 423.71 s > Checking log v0.4.29
  559. 423.71 s > Checking zerocopy v0.8.48
  560. 423.71 s > Checking regex-syntax v0.8.10
  561. 423.71 s > Checking crossbeam-utils v0.8.21
  562. 423.71 s > Checking equivalent v1.0.2
  563. 423.71 s > Checking zmij v1.0.21
  564. 423.71 s > Checking lazy_static v1.5.0
  565. 423.71 s > Checking bytemuck v1.25.0
  566. 423.71 s > Compiling target-lexicon v0.13.5
  567. 423.71 s > Checking arrayvec v0.7.6
  568. 423.71 s > Checking powerfmt v0.2.0
  569. 423.71 s > Checking pin-project-lite v0.2.17
  570. 423.71 s > Checking time-core v0.1.8
  571. 423.71 s > Checking num_threads v0.1.7
  572. 423.71 s > Checking safe_arch v0.7.4
  573. 423.71 s > Checking num-conv v0.2.1
  574. 423.71 s > Checking foldhash v0.2.0
  575. 423.71 s > Checking deranged v0.5.8
  576. 423.71 s > Checking allocator-api2 v0.2.21
  577. 423.71 s > Checking const-random v0.1.18
  578. 423.71 s > Checking unty v0.0.4
  579. 423.71 s > Checking nu-ansi-term v0.50.3
  580. 423.71 s > Checking static_assertions v1.1.0
  581. 423.71 s > Checking winnow v1.0.2
  582. 423.71 s > Checking safe_arch v1.0.0
  583. 423.71 s > Checking tracing-core v0.1.36
  584. 423.71 s > Checking itertools v0.14.0
  585. 423.71 s > Checking hashbrown v0.16.1
  586. 423.71 s > Checking thread_local v1.1.9
  587. 423.71 s > Checking sharded-slab v0.1.7
  588. 423.71 s > Checking toml_writer v1.1.1+spec-1.1.0
  589. 423.71 s > Checking crossbeam-epoch v0.9.18
  590. 423.71 s > Checking aho-corasick v1.1.4
  591. 423.71 s > Checking wide v0.7.33
  592. 423.71 s > Checking az v1.3.0
  593. 423.71 s > Checking crossbeam-deque v0.8.6
  594. 423.71 s > Checking tracing-log v0.2.0
  595. 423.71 s > Checking tracing v0.1.44
  596. 423.71 s > Checking rayon-core v1.13.0
  597. 423.71 s > Checking indenter v0.3.4
  598. 423.71 s > Checking wide v1.3.0
  599. 423.71 s > Compiling phf_shared v0.11.3
  600. 423.71 s > Checking anyhow v1.0.102
  601. 423.71 s > Checking rawpointer v0.2.1
  602. 423.71 s > Checking utf8parse v0.2.2
  603. 423.71 s > Checking dyn-clone v1.0.20
  604. 423.71 s > Checking alloc-no-stdlib v2.0.4
  605. 423.71 s > Checking rayon v1.12.0
  606. 423.71 s > Checking anstyle-parse v1.0.0
  607. 423.71 s > Checking alloc-stdlib v0.2.2
  608. 423.71 s > Checking matrixmultiply v0.3.10
  609. 423.71 s > Checking anstyle-query v1.1.5
  610. 423.71 s > Checking anstyle v1.0.14
  611. 423.71 s > Checking colorchoice v1.0.5
  612. 423.71 s > Checking colored v3.1.1
  613. 423.71 s > Checking is_terminal_polyfill v1.70.2
  614. 423.71 s > Checking anstream v1.0.0
  615. 423.71 s > Checking num-traits v0.2.19
  616. 423.71 s > Compiling phf_generator v0.11.3
  617. 423.71 s > Checking toml_parser v1.1.2+spec-1.1.0
  618. 423.71 s > Checking eyre v0.6.12
  619. 423.71 s > Checking bitflags v1.3.2
  620. 423.71 s > Checking unicode-width v0.2.2
  621. 423.71 s > Compiling phf_codegen v0.11.3
  622. 423.71 s > Checking brotli-decompressor v5.0.0
  623. 423.71 s > Checking inventory v0.3.24
  624. 423.71 s > Checking spec_math v0.1.6
  625. 423.71 s > Checking thiserror v2.0.18
  626. 423.71 s > Checking libloading v0.9.0
  627. 423.71 s > Compiling getopts v0.2.24
  628. 423.71 s > Checking self_cell v1.2.2
  629. 423.71 s > Checking byteorder v1.5.0
  630. 423.71 s > Compiling pyo3-build-config v0.28.3
  631. 423.71 s > Checking serde v1.0.228
  632. 423.71 s > Checking serde_json v1.0.149
  633. 423.71 s > Checking approx v0.5.1
  634. 423.71 s > Checking getrandom v0.3.4
  635. 423.71 s > Checking bitflags v2.11.1
  636. 423.71 s > Checking time v0.3.47
  637. 423.71 s > Checking num-integer v0.1.46
  638. 423.71 s > Checking gmp-mpfr-sys v1.7.1
  639. 423.71 s > Checking rand_core v0.9.5
  640. 423.71 s > Checking regex-automata v0.4.14
  641. 423.71 s > Checking serde_spanned v1.1.1
  642. 423.71 s > Checking toml_datetime v1.1.1+spec-1.1.0
  643. 423.71 s > Checking region v3.0.2
  644. 423.71 s > Checking hugepage-rs v0.1.1
  645. 423.71 s > Checking wasmtime-jit-icache-coherence v34.0.2
  646. 423.71 s > Checking append-only-vec v0.1.8
  647. 423.71 s > Checking bytes v1.11.1
  648. 423.71 s > Checking tinyjson v2.5.1
  649. 423.71 s > Checking toml v1.1.2+spec-1.1.0
  650. 423.71 s > Compiling unicode_names2_generator v1.3.0
  651. 423.71 s > Compiling unic-char-range v0.9.0
  652. 423.71 s > Compiling unic-common v0.9.0
  653. 423.71 s > Checking linux-raw-sys v0.12.1
  654. 423.71 s > Compiling unic-char-property v0.9.0
  655. 423.71 s > Compiling unic-ucd-version v0.9.0
  656. 423.71 s > Compiling is-macro v0.3.7
  657. 423.71 s > Compiling rustpython-parser-vendored v0.4.0
  658. 423.71 s > Checking rustix v1.1.4
  659. 423.71 s > Checking brotli v8.0.2
  660. 423.71 s > Checking iana-time-zone v0.1.65
  661. 423.71 s > Checking smallvec v1.15.1
  662. 423.71 s > Checking num-complex v0.4.6
  663. 423.71 s > Checking tracing-serde v0.2.0
  664. 423.71 s > Checking bincode v2.0.1
  665. 423.71 s > Checking smartstring v1.0.1
  666. 423.71 s > Checking chrono v0.4.44
  667. 423.71 s > Compiling rustpython-parser v0.4.0
  668. 423.71 s > Compiling phf v0.11.3
  669. 423.71 s > Checking simba v0.9.1
  670. 423.71 s > Checking rustc-hash v2.1.2
  671. 423.71 s > Checking ndarray v0.17.2
  672. 423.71 s > Compiling unic-ucd-ident v0.9.0
  673. 423.71 s > Compiling unic-emoji-char v0.9.0
  674. 423.71 s > Compiling lalrpop-util v0.20.2
  675. 423.71 s > Compiling rustc-hash v1.1.0
  676. 423.71 s > Checking rug v1.30.0
  677. 423.71 s > Compiling symbolica v2.2.0 (https://github.com/alphal00p/symbolica?rev=a277a8dadbaae5a8d6605f2f381991a601e1f345#a277a8da)
  678. 423.71 s > Checking unicode-segmentation v1.13.2
  679. 423.71 s > Checking typenum v1.20.0
  680. 423.71 s > Checking getrandom v0.2.17
  681. 423.71 s > Checking scopeguard v1.2.0
  682. 423.71 s > Checking lock_api v0.4.14
  683. 423.71 s > Checking parking_lot_core v0.9.12
  684. 423.71 s > Checking unicode-ident v1.0.24
  685. 423.71 s > Checking hashbrown v0.17.0
  686. 423.71 s > Checking parking_lot v0.12.5
  687. 423.71 s > Checking terminal_size v0.4.4
  688. 423.71 s > Checking errno v0.3.14
  689. 423.71 s > Checking clap_lex v1.1.0
  690. 423.71 s > Checking strsim v0.11.1
  691. 423.71 s > Checking unicase v2.9.0
  692. 423.71 s > Checking signal-hook-registry v1.4.8
  693. 423.71 s > Checking vte v0.14.1
  694. 423.71 s > Checking same-file v1.0.6
  695. 423.71 s > Checking walkdir v2.5.0
  696. 423.71 s > Checking signal-hook v0.3.18
  697. 423.71 s > Checking mio v1.2.0
  698. 423.71 s > Checking indexmap v2.14.0
  699. 423.71 s > Checking minimal-lexical v0.2.1
  700. 423.71 s > Checking ciborium-io v0.2.2
  701. 423.71 s > Checking derive_more v2.1.1
  702. 423.71 s > Checking num-bigint v0.4.6
  703. 423.71 s > Checking nom v7.1.3
  704. 423.71 s > Checking clap_builder v4.6.0
  705. 423.71 s > Checking signal-hook-mio v0.2.5
  706. 423.71 s > Checking console v0.16.3
  707. 423.71 s > Checking ppv-lite86 v0.2.21
  708. 423.71 s > Checking ahash v0.8.12
  709. 423.71 s > Checking half v2.7.1
  710. 423.71 s > Checking bstr v1.12.1
  711. 423.71 s > Checking matchers v0.2.0
  712. 423.71 s > Checking tracing-subscriber v0.3.23
  713. 423.71 s > Checking regex v1.12.3
  714. 423.71 s > Checking ciborium-ll v0.2.2
  715. 423.71 s > Checking linux-raw-sys v0.4.15
  716. 423.71 s > Compiling unicode_names2 v1.3.0
  717. 423.71 s > Checking winnow v0.7.15
  718. 423.71 s > Checking cpufeatures v0.2.17
  719. 423.71 s > Checking rustix v0.38.44
  720. 423.71 s > Checking ciborium v0.2.2
  721. 423.71 s > Checking globset v0.4.18
  722. 423.71 s > Checking rand_chacha v0.9.0
  723. 423.71 s > Checking generic-array v0.14.7
  724. 423.71 s > Checking rand_core v0.6.4
  725. 423.71 s > Checking rand v0.9.4
  726. 423.71 s > Checking getrandom v0.4.2
  727. 423.71 s > Checking fastrand v2.4.1
  728. 423.71 s > Checking plotters-backend v0.3.7
  729. 423.71 s > Checking fnv v1.0.7
  730. 423.71 s > Checking toml_datetime v0.6.11
  731. 423.71 s > Checking plotters-svg v0.3.7
  732. 423.71 s > Checking tempfile v3.27.0
  733. 423.71 s > Checking crossterm v0.28.1
  734. 423.71 s > Checking serde_spanned v0.6.9
  735. 423.71 s > Checking itertools v0.10.5
  736. 423.71 s > Checking clap v4.6.1
  737. 423.71 s > Checking tap v1.0.1
  738. 423.71 s > Checking cast v0.3.0
  739. 423.71 s > Checking toml_write v0.1.2
  740. 423.71 s > Checking wyz v0.5.1
  741. 423.71 s > Checking plotters v0.3.7
  742. 423.71 s > Checking rand_chacha v0.3.1
  743. 423.71 s > Checking crypto-common v0.1.7
  744. 423.71 s > Checking block-buffer v0.10.4
  745. 423.71 s > Checking digest v0.10.7
  746. 423.71 s > Checking toml_edit v0.22.27
  747. 423.71 s > Checking radium v0.7.0
  748. 423.71 s > Checking similar v2.7.0
  749. 423.71 s > Checking typeid v1.0.3
  750. 423.71 s > Checking tinytemplate v1.2.1
  751. 423.71 s > Checking ansitok v0.3.0
  752. 423.71 s > Checking criterion-plot v0.5.0
  753. 423.71 s > Checking is-terminal v0.4.17
  754. 423.71 s > Checking oorandom v11.1.5
  755. 423.71 s > Checking sha2 v0.10.9
  756. 423.71 s > Checking funty v2.0.0
  757. 423.71 s > Checking bytecount v0.6.9
  758. 423.71 s > Checking anes v0.1.6
  759. 423.71 s > Checking ron v0.12.1
  760. 423.71 s > Checking rust-embed-utils v8.11.0
  761. 423.71 s > Checking criterion v0.5.1
  762. 423.71 s > Checking rand v0.8.6
  763. 423.71 s > Checking ansi-str v0.9.0
  764. 423.71 s > Checking bitvec v1.0.1
  765. 423.71 s > Checking symjit v2.21.0
  766. 423.71 s > Checking papergrid v0.17.0
  767. 423.71 s > Compiling pyo3-macros-backend v0.28.3
  768. 423.71 s > Compiling pyo3-ffi v0.28.3
  769. 423.71 s > Compiling pyo3 v0.28.3
  770. 423.71 s > Checking xprec v0.2.2
  771. 423.71 s > Compiling numpy v0.28.0
  772. 423.71 s > Checking testing_table v0.3.0
  773. 423.71 s > Checking env_filter v1.0.1
  774. 423.71 s > Checking toml_edit v0.25.11+spec-1.1.0
  775. 423.71 s > Checking uncased v0.9.10
  776. 423.71 s > Checking jiff v0.2.24
  777. 423.71 s > Checking ptr_meta v0.1.4
  778. 423.71 s > Checking simdutf8 v0.1.5
  779. 423.71 s > Checking ucd-trie v0.1.7
  780. 423.71 s > Checking ahash v0.7.8
  781. 423.71 s > Checking pest v2.8.6
  782. 423.71 s > Checking bytecheck v0.6.12
  783. 423.71 s > Checking approx v0.4.0
  784. 423.71 s > Checking hashbrown v0.12.3
  785. 423.71 s > Checking seahash v4.1.0
  786. 423.71 s > Checking cgmath v0.18.0
  787. 423.71 s > Checking rend v0.4.2
  788. 423.71 s > Checking num-rational v0.4.2
  789. 423.71 s > Checking dot-parser v0.5.1
  790. 423.71 s > Checking num-iter v0.1.45
  791. 423.71 s > Checking ref-ops v0.2.5
  792. 423.71 s > Checking rand_xoshiro v0.6.0
  793. 423.71 s > Checking num v0.4.3
  794. 423.71 s > Checking features v0.10.0
  795. 423.71 s > Checking constcat v0.5.1
  796. 423.71 s > Checking gat-lending-iterator v0.1.8
  797. 423.71 s > Checking colored v2.2.0
  798. 423.71 s > Checking constant_time_eq v0.4.2
  799. 423.71 s > Checking tabled v0.20.0
  800. 423.71 s > Checking insta v1.47.2
  801. 423.71 s > Checking arrayref v0.3.9
  802. 423.71 s > Checking cpufeatures v0.3.0
  803. 423.71 s > Checking base64 v0.22.1
  804. 423.71 s > Checking siphasher v1.0.2
  805. 423.71 s > Checking joinery v2.1.0
  806. 423.71 s > Checking blake3 v1.8.5
  807. 423.71 s > Checking phf_shared v0.13.1
  808. 423.71 s > Checking titlecase v2.2.1
  809. 423.71 s > Checking subprocess v0.2.15
  810. 423.71 s > Checking rust_lisp v0.18.0
  811. 423.71 s > Compiling vakint v0.1.2 (/build/source/crates/vakint)
  812. 423.71 s > Checking version-compare v0.2.1
  813. 423.71 s > Checking toml v0.8.23
  814. 423.71 s > Checking xpct v0.5.1
  815. 423.71 s > Checking ryu v1.0.23
  816. 423.71 s > Checking castaway v0.2.4
  817. 423.71 s > Checking phf v0.13.1
  818. 423.71 s > Checking toml_datetime v0.7.5+spec-1.1.0
  819. 423.71 s > Checking strum v0.27.2
  820. 423.71 s > Checking compact_str v0.9.0
  821. 423.71 s > Checking toml v0.9.12+spec-1.1.0
  822. 423.71 s > Checking unicode-truncate v2.0.1
  823. 423.71 s > Checking kasuari v0.4.12
  824. 423.71 s > Checking lru v0.16.4
  825. 423.71 s > Checking vte v0.15.0
  826. 423.71 s > Checking figment v0.10.19
  827. 423.71 s > Checking string-template-plus v0.4.3
  828. 423.71 s > Checking vt100 v0.16.2
  829. 423.71 s > Checking portable-atomic v1.13.1
  830. 423.71 s > Checking unit-prefix v0.5.2
  831. 423.71 s > Checking rand_distr v0.4.3
  832. 423.71 s > Compiling rustpython-parser-core v0.4.0
  833. 423.71 s > Checking simba v0.6.0
  834. 423.71 s > Checking line-clipping v0.3.7
  835. 423.71 s > Compiling rustpython-ast v0.4.0
  836. 423.71 s > Checking adler2 v2.0.1
  837. 423.71 s > Checking indicatif v0.18.4
  838. 423.71 s > Compiling three-dimensional-reps v0.1.0 (/build/source/crates/three-dimensional-reps)
  839. 423.71 s > Checking gimli v0.32.3
  840. 423.71 s > Checking ratatui-core v0.1.0
  841. 423.71 s > Checking miniz_oxide v0.8.9
  842. 423.71 s > Checking thiserror v1.0.69
  843. 423.71 s > Checking derive_builder v0.11.2
  844. 423.71 s > Checking crossterm v0.29.0
  845. 423.71 s > Checking object v0.37.3
  846. 423.71 s > Checking owo-colors v4.3.0
  847. 423.71 s > Checking tracing-error v0.2.1
  848. 423.71 s > Checking typed-index-collections v3.5.0
  849. 423.71 s > Checking serde-big-array v0.5.1
  850. 423.71 s > Checking amd v0.2.2
  851. 423.71 s > Checking itertools v0.11.0
  852. 423.71 s > Compiling gammaloop-tracing-filter-macros v0.1.0 (/build/source/crates/gammaloop-tracing-filter-macros)
  853. 423.71 s > Checking ratatui-widgets v0.3.0
  854. 423.71 s > Checking rustc-demangle v0.1.27
  855. 423.71 s > Checking option-ext v0.2.0
  856. 423.71 s > Checking env_logger v0.11.10
  857. 423.71 s > Checking dirs-sys v0.5.0
  858. 423.71 s > Checking color-spantrace v0.3.0
  859. 423.71 s > Checking ref-cast v1.0.25
  860. 423.71 s > Checking nix v0.31.2
  861. 423.71 s > Checking integer-sqrt v0.1.5
  862. 423.71 s > Checking brotli-decompressor v4.0.3
  863. 423.71 s > Checking crossbeam-channel v0.5.15
  864. 423.71 s > Checking itertools v0.12.1
  865. 423.71 s > Compiling gammalooprs v0.3.4 (/build/source/crates/gammalooprs)
  866. 423.71 s > Checking ratatui-crossterm v0.1.0
  867. 423.71 s > Checking unsafe-libyaml v0.2.11
  868. 423.71 s > Checking rkyv v0.7.46
  869. 423.71 s > Checking symlink v0.1.0
  870. 423.71 s > Checking tracing-appender v0.2.5
  871. 423.71 s > Checking ratatui-macros v0.7.0
  872. 423.71 s > Checking clarabel v0.11.1
  873. 423.71 s > Checking include_dir v0.7.4
  874. 423.71 s > Checking ratatui v0.30.0
  875. 423.71 s > Checking ctrlc v3.5.2
  876. 423.71 s > Checking pathfinding v4.15.0
  877. 423.71 s > Checking schemars v1.2.1
  878. 423.71 s > Checking slotmap v1.1.1
  879. 423.71 s > Checking brotli v7.0.0
  880. 423.71 s > Checking dirs v6.0.0
  881. 423.71 s > Checking tracing-indicatif v0.3.14
  882. 423.71 s > Checking serde_yaml v0.9.34+deprecated
  883. 423.71 s > Checking json5 v0.4.1
  884. 423.71 s > Checking addr2line v0.25.1
  885. 423.71 s > Checking vectorize v0.2.0
  886. 423.71 s > Checking ringbuffer v0.16.0
  887. 423.71 s > Checking base62 v2.2.4
  888. 423.71 s > Checking rust-embed v8.11.0
  889. 423.71 s > Checking clap_complete v4.6.3
  890. 423.71 s > Checking strip-ansi-escapes v0.2.1
  891. 423.71 s > Compiling gammaloop-api v0.1.0 (/build/source/crates/gammaloop-api)
  892. 423.71 s > Checking fd-lock v4.0.4
  893. 423.71 s > Checking itertools v0.13.0
  894. 423.71 s > Checking strum v0.26.3
  895. 423.71 s > Checking clap_complete_nushell v4.6.0
  896. 423.71 s > Checking sysinfo v0.33.1
  897. 423.71 s > Checking shlex v1.3.0
  898. 423.71 s > Checking futures-core v0.3.32
  899. 423.71 s > Checking futures-task v0.3.32
  900. 423.71 s > Checking slab v0.4.12
  901. 423.71 s > Checking futures-util v0.3.32
  902. 423.71 s > Checking sdd v3.0.10
  903. 423.71 s > Compiling gammaloop-integration-tests v0.1.0 (/build/source/tests)
  904. 423.71 s > Checking scc v2.4.0
  905. 423.71 s > Compiling test-log-core v0.2.20
  906. 423.71 s > Compiling rustc_version v0.4.1
  907. 423.71 s > Checking which v8.0.2
  908. 423.71 s > Checking bincode v1.3.3
  909. 423.71 s > Compiling gungraun-runner v0.18.2
  910. 423.71 s > Compiling gungraun-macros v0.8.0
  911. 423.71 s > Checking proc-macro2 v1.0.106
  912. 423.71 s > Checking reedline v0.42.0
  913. 423.71 s > Checking maplit v1.0.2
  914. 423.71 s > Checking base64 v0.21.7
  915. 423.71 s > Checking quote v1.0.45
  916. 423.71 s > Checking backtrace v0.3.76
  917. 423.71 s > Compiling iai-callgrind-runner v0.14.2
  918. 423.71 s > Checking ron v0.8.1
  919. 423.71 s > Compiling numerica v2.2.0 (https://github.com/alphal00p/symbolica?rev=a277a8dadbaae5a8d6605f2f381991a601e1f345#a277a8da)
  920. 423.71 s > Checking nalgebra v0.29.0
  921. 423.71 s > Checking color-eyre v0.6.5
  922. 423.71 s > Checking futures-executor v0.3.32
  923. 423.71 s > Checking kurbo v0.13.0
  924. 423.71 s > Checking serial_test v3.4.0
  925. 423.71 s > Compiling test-log-macros v0.2.20
  926. 423.71 s > Checking wait-timeout v0.2.1
  927. 423.71 s > Compiling iai-callgrind v0.14.2
  928. 423.71 s > Checking bit-vec v0.8.0
  929. 423.71 s > Checking quick-error v1.2.3
  930. 423.71 s > Checking rusty-fork v0.3.1
  931. 423.71 s > Checking syn v2.0.117
  932. 423.71 s > Compiling iai-callgrind-macros v0.5.1
  933. 423.71 s > Checking rand_xorshift v0.4.0
  934. 423.71 s > Checking bit-set v0.8.0
  935. 423.71 s > Checking console v0.15.11
  936. 423.71 s > Checking pathdiff v0.2.3
  937. 423.71 s > Checking unarray v0.1.4
  938. 423.71 s > Checking proptest v1.11.0
  939. 423.71 s > Checking similar-asserts v1.7.0
  940. 423.71 s > Checking kurvst v0.1.0 (/build/source/crates/kurvst)
  941. 423.71 s > Checking clinnet v0.1.8 (/build/source/crates/clinnet)
  942. 423.71 s > Checking test-log v0.2.20
  943. 423.71 s > Compiling graphica v2.1.0 (https://github.com/alphal00p/symbolica?rev=a277a8dadbaae5a8d6605f2f381991a601e1f345#a277a8da)
  944. 423.71 s > Checking gungraun v0.18.2
  945. 423.71 s > Checking statrs v0.16.1
  946. 423.71 s > Checking momtrop v0.3.0
  947. 423.71 s > Compiling pyo3-macros v0.28.3
  948. 423.71 s > Compiling pyo3-stub-gen-derive v0.17.2
  949. 423.71 s > Checking pyo3-stub-gen v0.17.2
  950. 423.71 s > Checking symbolica-utils v0.1.0 (/build/source/crates/symbolica-utils)
  951. 423.71 s > Checking spenso-macros v0.3.2 (/build/source/crates/spenso-macros)
  952. 423.71 s > Compiling gammaloop-workspace-hack v0.1.0 (/build/source/crates/gammaloop-workspace-hack)
  953. 423.71 s > Checking linnet v0.17.0 (/build/source/crates/linnet)
  954. 423.71 s > Checking spenso v0.6.0 (/build/source/crates/spenso)
  955. 423.71 s > Checking linnet-py v0.1.0 (/build/source/crates/linnet-py)
  956. 423.71 s > Checking linnest v0.1.0 (/build/source/crates/linnest)
  957. 423.71 s > Checking idenso v0.3.0 (/build/source/crates/idenso)
  958. 423.71 s > Checking gammaloop-tracing-filter v0.1.0 (/build/source/crates/gammaloop-tracing-filter)
  959. 423.71 s > Checking spenso-hep-lib v0.1.7 (/build/source/crates/spenso-hep-lib)
  960. 423.71 s > Checking spynso3 v0.1.2 (/build/source/crates/spynso3)
  961. 423.71 s > error[E0560]: struct `CutInfo` has no field named `lmb_channel_id`
  962. 423.71 s > --> tests/tests/test_differential.rs:86:13
  963. 423.71 s > |
  964. 423.71 s > 86 | lmb_channel_id: None,
  965. 423.71 s > | ^^^^^^^^^^^^^^ `CutInfo` does not have this field
  966. 423.71 s > |
  967. 423.71 s > = note: available fields are: `sampling_channel_id`, `sampling_channel_edge_ids`
  968. 423.71 s >
  969. 423.71 s > error[E0560]: struct `CutInfo` has no field named `lmb_channel_edge_ids`
  970. 423.71 s > --> tests/tests/test_differential.rs:87:13
  971. 423.71 s > |
  972. 423.71 s > 87 | lmb_channel_edge_ids: None,
  973. 423.71 s > | ^^^^^^^^^^^^^^^^^^^^ `CutInfo` does not have this field
  974. 423.71 s > |
  975. 423.71 s > = note: available fields are: `sampling_channel_id`, `sampling_channel_edge_ids`
  976. 423.71 s >
  977. 423.71 s > error[E0063]: missing field `reference_moments` in initializer of `GraphEvaluationResult<_>`
  978. 423.71 s > --> tests/tests/test_differential.rs:532:19
  979. 423.71 s > |
  980. 423.71 s > 532 | let mut lhs = GraphEvaluationResult {
  981. 423.71 s > | ^^^^^^^^^^^^^^^^^^^^^ missing `reference_moments`
  982. 423.71 s >
  983. 423.71 s > error[E0063]: missing field `reference_moments` in initializer of `GraphEvaluationResult<_>`
  984. 423.71 s > --> tests/tests/test_differential.rs:539:15
  985. 423.71 s > |
  986. 423.71 s > 539 | let rhs = GraphEvaluationResult {
  987. 423.71 s > | ^^^^^^^^^^^^^^^^^^^^^ missing `reference_moments`
  988. 423.71 s >
  989. 423.71 s > error[E0609]: no field `lmb_channel_edge_ids` on type `CutInfo`
  990. 423.71 s > --> tests/tests/test_evaluation_api.rs:311:10
  991. 423.71 s > |
  992. 423.71 s > 311 | .lmb_channel_edge_ids
  993. 423.71 s > | ^^^^^^^^^^^^^^^^^^^^ unknown field
  994. 423.71 s > |
  995. 423.71 s > = note: available fields are: `particle_pdgs`, `cut_id`, `graph_id`, `graph_group_id`, `orientation_id` ... and 2 others
  996. 423.71 s >
  997. 423.71 s > error[E0609]: no field `lmb_channel_edge_ids` on type `CutInfo`
  998. 423.71 s > --> tests/tests/test_evaluation_api.rs:591:26
  999. 423.71 s > |
  1000. 423.71 s > 591 | .lmb_channel_edge_ids
  1001. 423.71 s > | ^^^^^^^^^^^^^^^^^^^^ unknown field
  1002. 423.71 s > |
  1003. 423.71 s > = note: available fields are: `particle_pdgs`, `cut_id`, `graph_id`, `graph_group_id`, `orientation_id` ... and 2 others
  1004. 423.71 s >
  1005. 423.71 s > Some errors have detailed explanations: E0063, E0560.
  1006. 423.71 s > For more information about an error, try `rustc --explain E0063`.
  1007. 423.71 s > error: could not compile `gammaloop-integration-tests` (test "test_differential") due to 4 previous errors
  1008. 423.71 s > warning: build failed, waiting for other jobs to finish...
  1009. 423.71 s > error[E0609]: no field `lmb_channel_edge_ids` on type `CutInfo`
  1010. 423.71 s > --> tests/tests/test_evaluation_api.rs:1177:18
  1011. 423.71 s > |
  1012. 423.71 s > 1177 | .lmb_channel_edge_ids
  1013. 423.71 s > | ^^^^^^^^^^^^^^^^^^^^ unknown field
  1014. 423.71 s > |
  1015. 423.71 s > = note: available fields are: `particle_pdgs`, `cut_id`, `graph_id`, `graph_group_id`, `orientation_id` ... and 2 others
  1016. 423.71 s >
  1017. 423.71 s > error[E0609]: no field `lmb_channel_edge_ids` on type `CutInfo`
  1018. 423.71 s > --> tests/tests/test_evaluation_api.rs:1222:22
  1019. 423.71 s > |
  1020. 423.71 s > 1222 | .lmb_channel_edge_ids
  1021. 423.71 s > | ^^^^^^^^^^^^^^^^^^^^ unknown field
  1022. 423.71 s > |
  1023. 423.71 s > = note: available fields are: `particle_pdgs`, `cut_id`, `graph_id`, `graph_group_id`, `orientation_id` ... and 2 others
  1024. 423.71 s >
  1025. 423.71 s > error[E0609]: no field `lmb_channel_edge_ids` on type `CutInfo`
  1026. 423.71 s > --> tests/tests/test_evaluation_api.rs:1281:14
  1027. 423.71 s > |
  1028. 423.71 s > 1281 | .lmb_channel_edge_ids
  1029. 423.71 s > | ^^^^^^^^^^^^^^^^^^^^ unknown field
  1030. 423.71 s > |
  1031. 423.71 s > = note: available fields are: `particle_pdgs`, `cut_id`, `graph_id`, `graph_group_id`, `orientation_id` ... and 2 others
  1032. 423.71 s >
  1033. 423.71 s > error[E0609]: no field `lmb_channel_edge_ids` on type `CutInfo`
  1034. 423.71 s > --> tests/tests/test_evaluation_api.rs:1428:18
  1035. 423.71 s > |
  1036. 423.71 s > 1428 | .lmb_channel_edge_ids
  1037. 423.71 s > | ^^^^^^^^^^^^^^^^^^^^ unknown field
  1038. 423.71 s > |
  1039. 423.71 s > = note: available fields are: `particle_pdgs`, `cut_id`, `graph_id`, `graph_group_id`, `orientation_id` ... and 2 others
  1040. 423.71 s >
  1041. 423.71 s > For more information about this error, try `rustc --explain E0609`.
  1042. 423.71 s > error: could not compile `gammaloop-integration-tests` (test "test_evaluation_api") due to 6 previous errors
  1043. 423.71 s > error[E0609]: no field `lmb_channel_id` on type `CutInfo`
  1044. 423.71 s > --> tests/tests/test_runs/utils.rs:568:36
  1045. 423.71 s > |
  1046. 423.71 s > 568 | event.cut_info.lmb_channel_id,
  1047. 423.71 s > | ^^^^^^^^^^^^^^ unknown field
  1048. 423.71 s > |
  1049. 423.71 s > = note: available fields are: `particle_pdgs`, `cut_id`, `graph_id`, `graph_group_id`, `orientation_id` ... and 2 others
  1050. 423.71 s >
  1051. 423.71 s > error[E0609]: no field `lmb_channel_id` on type `CutInfo`
  1052. 423.71 s > --> tests/tests/test_runs/utils.rs:580:36
  1053. 423.71 s > |
  1054. 423.71 s > 580 | event.cut_info.lmb_channel_id,
  1055. 423.71 s > | ^^^^^^^^^^^^^^ unknown field
  1056. 423.71 s > |
  1057. 423.71 s > = note: available fields are: `particle_pdgs`, `cut_id`, `graph_id`, `graph_group_id`, `orientation_id` ... and 2 others
  1058. 423.71 s >
  1059. 423.71 s > error: could not compile `gammaloop-integration-tests` (test "test_runs") due to 2 previous errors
  1060. 423.71 s For full logs, run:
  1061. 423.71 s nix log /nix/store/axwybdrvnz6g31i8j22ivzmz2ysf3s4g-gammaloop-workspace-check-0.1.0.drv
  1062. 423.81 s Build failed.