build checks.x86_64-linux.gammaloop-check
0.01 s
$ /nix/store/9ypz3flqsrl5xl495mm8h645gadjsxi1-coreutils-9.11/bin/timeout --kill-after=15s 7200s /nix/store/23zk8sgzamrbmj1fday15szf7f2279s8-nix-2.34.7/bin/nix --extra-experimental-features nix-command --extra-experimental-features flakes --log-format internal-json build --no-link --print-out-paths git+https://github.com/alphal00p/gammaloop?ref=advanced_sampling&rev=1df7aa38b6fd28fa9cd50ca94e59c90067ab0bb7&shallow=1#checks.x86_64-linux.gammaloop-check --print-build-logs
0.56 s
error (ignored): SQLite database '/var/cache/nix-ci-worker/eval-cache-v6/7db5b3ee960e117db536bb846779e7633d150451926acbd99d708a335ef61e1a.sqlite ' is busy
3.55 s
4.19 s
Building /nix/store/axwybdrvnz6g31i8j22ivzmz2ysf3s4g-gammaloop-workspace-check-0.1.0.drv
4.29 s
[gammaloop-workspace-check] Phase: unpackPhase
4.29 s
[gammaloop-workspace-check] unpacking source archive /nix/store/z5pb9ly08pscbnc755wvrwn7ad3dvc0j-source
4.49 s
[gammaloop-workspace-check] source root is source
4.53 s
[gammaloop-workspace-check] Phase: patchPhase
4.54 s
[gammaloop-workspace-check] Executing configureCargoCommonVars
4.54 s
[gammaloop-workspace-check] decompressing cargo artifacts from /nix/store/50vpxlcgfxf2d57i27v3d10zjwxxbm2r-gammaloop-workspace-deps-deps-0.1.0/target.tar.zst to target
6.85 s
[gammaloop-workspace-check] Phase: updateAutotoolsGnuConfigScriptsPhase
6.89 s
[gammaloop-workspace-check] Phase: configurePhase
6.90 s
[gammaloop-workspace-check] will append /build/source/.cargo-home/config.toml with contents of /nix/store/5drf77x6km4ky7gwlrzdx9bbd6fz09g3-vendor-cargo-deps/config.toml
6.90 s
[gammaloop-workspace-check] default configurePhase, nothing to do
6.91 s
[gammaloop-workspace-check] Phase: buildPhase
6.91 s
[gammaloop-workspace-check] +++ command cargo --version
6.92 s
[gammaloop-workspace-check] cargo 1.97.0 (c980f4866 2026-06-30)
6.96 s
[gammaloop-workspace-check] +++ command cargo check --profile ci-optim --locked --workspace --features gammaloop-tracing-filter/clap,gammaloop-tracing-filter/symbolica,idenso/bincode,idenso/reference-cases,linnet/bincode,linnet/drawing,linnet/rkyv,linnet/serde,linnet/symbolica,spenso-macros/shadowing,spenso/shadowing,symbolica/tracing_max_level_info,three-dimensional-reps/display,three-dimensional-reps/eval,three-dimensional-reps/serde --all-targets
8.74 s
[gammaloop-workspace-check] Checking serde_core v1.0.228
8.74 s
[gammaloop-workspace-check] Checking libc v0.2.186
8.74 s
[gammaloop-workspace-check] Checking cfg-if v1.0.4
8.74 s
[gammaloop-workspace-check] Checking memchr v2.8.0
8.75 s
[gammaloop-workspace-check] Checking once_cell v1.21.4
8.75 s
[gammaloop-workspace-check] Checking either v1.15.0
8.75 s
[gammaloop-workspace-check] Checking libm v0.2.16
8.75 s
[gammaloop-workspace-check] Checking itoa v1.0.18
8.78 s
[gammaloop-workspace-check] Checking log v0.4.29
8.78 s
[gammaloop-workspace-check] Checking zerocopy v0.8.48
8.78 s
[gammaloop-workspace-check] Checking regex-syntax v0.8.10
8.82 s
[gammaloop-workspace-check] Checking crossbeam-utils v0.8.21
8.82 s
[gammaloop-workspace-check] Checking equivalent v1.0.2
8.82 s
[gammaloop-workspace-check] Checking zmij v1.0.21
8.84 s
[gammaloop-workspace-check] Checking lazy_static v1.5.0
8.86 s
[gammaloop-workspace-check] Checking bytemuck v1.25.0
8.99 s
[gammaloop-workspace-check] Compiling target-lexicon v0.13.5
9.04 s
[gammaloop-workspace-check] Checking arrayvec v0.7.6
9.06 s
[gammaloop-workspace-check] Checking powerfmt v0.2.0
9.08 s
[gammaloop-workspace-check] Checking pin-project-lite v0.2.17
9.15 s
[gammaloop-workspace-check] Checking time-core v0.1.8
9.22 s
[gammaloop-workspace-check] Checking num_threads v0.1.7
9.27 s
[gammaloop-workspace-check] Checking safe_arch v0.7.4
9.31 s
[gammaloop-workspace-check] Checking num-conv v0.2.1
9.31 s
[gammaloop-workspace-check] Checking foldhash v0.2.0
9.33 s
[gammaloop-workspace-check] Checking deranged v0.5.8
9.33 s
[gammaloop-workspace-check] Checking allocator-api2 v0.2.21
9.42 s
[gammaloop-workspace-check] Checking const-random v0.1.18
9.47 s
[gammaloop-workspace-check] Checking unty v0.0.4
9.49 s
[gammaloop-workspace-check] Checking nu-ansi-term v0.50.3
9.51 s
[gammaloop-workspace-check] Checking static_assertions v1.1.0
9.55 s
[gammaloop-workspace-check] Checking winnow v1.0.2
9.57 s
[gammaloop-workspace-check] Checking safe_arch v1.0.0
9.60 s
[gammaloop-workspace-check] Checking tracing-core v0.1.36
9.63 s
[gammaloop-workspace-check] Checking itertools v0.14.0
9.79 s
[gammaloop-workspace-check] Checking hashbrown v0.16.1
9.88 s
[gammaloop-workspace-check] Checking thread_local v1.1.9
10.04 s
[gammaloop-workspace-check] Checking sharded-slab v0.1.7
10.09 s
[gammaloop-workspace-check] Checking toml_writer v1.1.1+spec-1.1.0
10.12 s
[gammaloop-workspace-check] Checking crossbeam-epoch v0.9.18
10.20 s
[gammaloop-workspace-check] Checking aho-corasick v1.1.4
10.30 s
[gammaloop-workspace-check] Checking wide v0.7.33
10.42 s
[gammaloop-workspace-check] Checking az v1.3.0
10.43 s
[gammaloop-workspace-check] Checking crossbeam-deque v0.8.6
11.20 s
[gammaloop-workspace-check] Checking tracing-log v0.2.0
11.20 s
[gammaloop-workspace-check] Checking tracing v0.1.44
11.20 s
[gammaloop-workspace-check] Checking rayon-core v1.13.0
11.20 s
[gammaloop-workspace-check] Checking indenter v0.3.4
11.20 s
[gammaloop-workspace-check] Checking wide v1.3.0
11.37 s
[gammaloop-workspace-check] Compiling phf_shared v0.11.3
11.53 s
[gammaloop-workspace-check] Checking anyhow v1.0.102
11.61 s
[gammaloop-workspace-check] Checking rawpointer v0.2.1
11.66 s
[gammaloop-workspace-check] Checking utf8parse v0.2.2
11.81 s
[gammaloop-workspace-check] Checking dyn-clone v1.0.20
11.93 s
[gammaloop-workspace-check] Checking alloc-no-stdlib v2.0.4
11.95 s
[gammaloop-workspace-check] Checking rayon v1.12.0
11.96 s
[gammaloop-workspace-check] Checking anstyle-parse v1.0.0
12.06 s
[gammaloop-workspace-check] Checking alloc-stdlib v0.2.2
12.12 s
[gammaloop-workspace-check] Checking matrixmultiply v0.3.10
12.13 s
[gammaloop-workspace-check] Checking anstyle-query v1.1.5
12.18 s
[gammaloop-workspace-check] Checking anstyle v1.0.14
12.21 s
[gammaloop-workspace-check] Checking colorchoice v1.0.5
12.30 s
[gammaloop-workspace-check] Checking colored v3.1.1
12.41 s
[gammaloop-workspace-check] Checking is_terminal_polyfill v1.70.2
12.50 s
[gammaloop-workspace-check] Checking anstream v1.0.0
12.54 s
[gammaloop-workspace-check] Checking num-traits v0.2.19
12.54 s
[gammaloop-workspace-check] Compiling phf_generator v0.11.3
12.56 s
[gammaloop-workspace-check] Checking toml_parser v1.1.2+spec-1.1.0
12.67 s
[gammaloop-workspace-check] Checking eyre v0.6.12
12.73 s
[gammaloop-workspace-check] Checking bitflags v1.3.2
12.79 s
[gammaloop-workspace-check] Checking unicode-width v0.2.2
12.80 s
[gammaloop-workspace-check] Compiling phf_codegen v0.11.3
12.89 s
[gammaloop-workspace-check] Checking brotli-decompressor v5.0.0
12.98 s
[gammaloop-workspace-check] Checking inventory v0.3.24
13.06 s
[gammaloop-workspace-check] Checking spec_math v0.1.6
13.16 s
[gammaloop-workspace-check] Checking thiserror v2.0.18
13.22 s
[gammaloop-workspace-check] Checking libloading v0.9.0
13.27 s
[gammaloop-workspace-check] Compiling getopts v0.2.24
13.36 s
[gammaloop-workspace-check] Checking self_cell v1.2.2
13.37 s
[gammaloop-workspace-check] Checking byteorder v1.5.0
13.39 s
[gammaloop-workspace-check] Compiling pyo3-build-config v0.28.3
13.50 s
[gammaloop-workspace-check] Checking serde v1.0.228
13.51 s
[gammaloop-workspace-check] Checking serde_json v1.0.149
13.52 s
[gammaloop-workspace-check] Checking approx v0.5.1
13.57 s
[gammaloop-workspace-check] Checking getrandom v0.3.4
13.65 s
[gammaloop-workspace-check] Checking bitflags v2.11.1
13.67 s
[gammaloop-workspace-check] Checking time v0.3.47
13.94 s
[gammaloop-workspace-check] Checking num-integer v0.1.46
14.00 s
[gammaloop-workspace-check] Checking gmp-mpfr-sys v1.7.1
14.19 s
[gammaloop-workspace-check] Checking rand_core v0.9.5
14.40 s
[gammaloop-workspace-check] Checking regex-automata v0.4.14
14.59 s
[gammaloop-workspace-check] Checking serde_spanned v1.1.1
14.63 s
[gammaloop-workspace-check] Checking toml_datetime v1.1.1+spec-1.1.0
14.73 s
[gammaloop-workspace-check] Checking region v3.0.2
14.79 s
[gammaloop-workspace-check] Checking hugepage-rs v0.1.1
15.04 s
[gammaloop-workspace-check] Checking wasmtime-jit-icache-coherence v34.0.2
15.14 s
[gammaloop-workspace-check] Checking append-only-vec v0.1.8
15.16 s
[gammaloop-workspace-check] Checking bytes v1.11.1
15.26 s
[gammaloop-workspace-check] Checking tinyjson v2.5.1
15.30 s
[gammaloop-workspace-check] Checking toml v1.1.2+spec-1.1.0
15.41 s
[gammaloop-workspace-check] Compiling unicode_names2_generator v1.3.0
15.49 s
[gammaloop-workspace-check] Compiling unic-char-range v0.9.0
15.53 s
[gammaloop-workspace-check] Compiling unic-common v0.9.0
15.72 s
[gammaloop-workspace-check] Checking linux-raw-sys v0.12.1
15.90 s
[gammaloop-workspace-check] Compiling unic-char-property v0.9.0
15.98 s
[gammaloop-workspace-check] Compiling unic-ucd-version v0.9.0
16.03 s
[gammaloop-workspace-check] Compiling is-macro v0.3.7
16.14 s
[gammaloop-workspace-check] Compiling rustpython-parser-vendored v0.4.0
16.38 s
[gammaloop-workspace-check] Checking rustix v1.1.4
16.67 s
[gammaloop-workspace-check] Checking brotli v8.0.2
16.93 s
[gammaloop-workspace-check] Checking iana-time-zone v0.1.65
17.06 s
[gammaloop-workspace-check] Checking smallvec v1.15.1
17.17 s
[gammaloop-workspace-check] Checking num-complex v0.4.6
17.25 s
[gammaloop-workspace-check] Checking tracing-serde v0.2.0
17.34 s
[gammaloop-workspace-check] Checking bincode v2.0.1
17.39 s
[gammaloop-workspace-check] Checking smartstring v1.0.1
17.53 s
[gammaloop-workspace-check] Checking chrono v0.4.44
17.69 s
[gammaloop-workspace-check] Compiling rustpython-parser v0.4.0
17.97 s
[gammaloop-workspace-check] Compiling phf v0.11.3
18.03 s
[gammaloop-workspace-check] Checking simba v0.9.1
18.29 s
[gammaloop-workspace-check] Checking rustc-hash v2.1.2
18.38 s
[gammaloop-workspace-check] Checking ndarray v0.17.2
18.79 s
[gammaloop-workspace-check] Compiling unic-ucd-ident v0.9.0
19.23 s
[gammaloop-workspace-check] Compiling unic-emoji-char v0.9.0
19.35 s
[gammaloop-workspace-check] Compiling lalrpop-util v0.20.2
19.60 s
[gammaloop-workspace-check] Compiling rustc-hash v1.1.0
19.73 s
[gammaloop-workspace-check] Checking rug v1.30.0
19.75 s
[gammaloop-workspace-check] Compiling symbolica v2.2.0 (https://github.com/alphal00p/symbolica?rev=a277a8dadbaae5a8d6605f2f381991a601e1f345#a277a8da)
20.57 s
[gammaloop-workspace-check] Checking unicode-segmentation v1.13.2
20.68 s
[gammaloop-workspace-check] Checking typenum v1.20.0
20.68 s
[gammaloop-workspace-check] Checking getrandom v0.2.17
20.80 s
[gammaloop-workspace-check] Checking scopeguard v1.2.0
20.86 s
[gammaloop-workspace-check] Checking lock_api v0.4.14
20.93 s
[gammaloop-workspace-check] Checking parking_lot_core v0.9.12
21.05 s
[gammaloop-workspace-check] Checking unicode-ident v1.0.24
21.09 s
[gammaloop-workspace-check] Checking hashbrown v0.17.0
21.11 s
[gammaloop-workspace-check] Checking parking_lot v0.12.5
21.14 s
[gammaloop-workspace-check] Checking terminal_size v0.4.4
21.16 s
[gammaloop-workspace-check] Checking errno v0.3.14
21.21 s
[gammaloop-workspace-check] Checking clap_lex v1.1.0
21.28 s
[gammaloop-workspace-check] Checking strsim v0.11.1
21.40 s
[gammaloop-workspace-check] Checking unicase v2.9.0
21.49 s
[gammaloop-workspace-check] Checking signal-hook-registry v1.4.8
21.53 s
[gammaloop-workspace-check] Checking vte v0.14.1
21.53 s
[gammaloop-workspace-check] Checking same-file v1.0.6
21.70 s
[gammaloop-workspace-check] Checking walkdir v2.5.0
21.77 s
[gammaloop-workspace-check] Checking signal-hook v0.3.18
21.82 s
[gammaloop-workspace-check] Checking mio v1.2.0
21.94 s
[gammaloop-workspace-check] Checking indexmap v2.14.0
22.00 s
[gammaloop-workspace-check] Checking minimal-lexical v0.2.1
22.07 s
[gammaloop-workspace-check] Checking ciborium-io v0.2.2
22.16 s
[gammaloop-workspace-check] Checking derive_more v2.1.1
22.26 s
[gammaloop-workspace-check] Checking num-bigint v0.4.6
22.27 s
[gammaloop-workspace-check] Checking nom v7.1.3
22.33 s
[gammaloop-workspace-check] Checking clap_builder v4.6.0
22.45 s
[gammaloop-workspace-check] Checking signal-hook-mio v0.2.5
22.53 s
[gammaloop-workspace-check] Checking console v0.16.3
22.57 s
[gammaloop-workspace-check] Checking ppv-lite86 v0.2.21
22.80 s
[gammaloop-workspace-check] Checking ahash v0.8.12
23.00 s
[gammaloop-workspace-check] Checking half v2.7.1
23.10 s
[gammaloop-workspace-check] Checking bstr v1.12.1
23.21 s
[gammaloop-workspace-check] Checking matchers v0.2.0
23.27 s
[gammaloop-workspace-check] Checking tracing-subscriber v0.3.23
23.38 s
[gammaloop-workspace-check] Checking regex v1.12.3
23.48 s
[gammaloop-workspace-check] Checking ciborium-ll v0.2.2
23.63 s
[gammaloop-workspace-check] Checking linux-raw-sys v0.4.15
23.64 s
[gammaloop-workspace-check] Compiling unicode_names2 v1.3.0
23.81 s
[gammaloop-workspace-check] Checking winnow v0.7.15
23.98 s
[gammaloop-workspace-check] Checking cpufeatures v0.2.17
23.99 s
[gammaloop-workspace-check] Checking rustix v0.38.44
24.03 s
[gammaloop-workspace-check] Checking ciborium v0.2.2
24.59 s
[gammaloop-workspace-check] Checking globset v0.4.18
24.71 s
[gammaloop-workspace-check] Checking rand_chacha v0.9.0
24.95 s
[gammaloop-workspace-check] Checking generic-array v0.14.7
24.97 s
[gammaloop-workspace-check] Checking rand_core v0.6.4
25.00 s
[gammaloop-workspace-check] Checking rand v0.9.4
25.16 s
[gammaloop-workspace-check] Checking getrandom v0.4.2
25.35 s
[gammaloop-workspace-check] Checking fastrand v2.4.1
25.35 s
[gammaloop-workspace-check] Checking plotters-backend v0.3.7
25.45 s
[gammaloop-workspace-check] Checking fnv v1.0.7
25.51 s
[gammaloop-workspace-check] Checking toml_datetime v0.6.11
25.52 s
[gammaloop-workspace-check] Checking plotters-svg v0.3.7
25.54 s
[gammaloop-workspace-check] Checking tempfile v3.27.0
25.58 s
[gammaloop-workspace-check] Checking crossterm v0.28.1
25.63 s
[gammaloop-workspace-check] Checking serde_spanned v0.6.9
25.69 s
[gammaloop-workspace-check] Checking itertools v0.10.5
25.80 s
[gammaloop-workspace-check] Checking clap v4.6.1
25.86 s
[gammaloop-workspace-check] Checking tap v1.0.1
25.90 s
[gammaloop-workspace-check] Checking cast v0.3.0
25.93 s
[gammaloop-workspace-check] Checking toml_write v0.1.2
26.00 s
[gammaloop-workspace-check] Checking wyz v0.5.1
26.09 s
[gammaloop-workspace-check] Checking plotters v0.3.7
26.22 s
[gammaloop-workspace-check] Checking rand_chacha v0.3.1
26.24 s
[gammaloop-workspace-check] Checking crypto-common v0.1.7
26.35 s
[gammaloop-workspace-check] Checking block-buffer v0.10.4
26.47 s
[gammaloop-workspace-check] Checking digest v0.10.7
26.49 s
[gammaloop-workspace-check] Checking toml_edit v0.22.27
26.51 s
[gammaloop-workspace-check] Checking radium v0.7.0
26.54 s
[gammaloop-workspace-check] Checking similar v2.7.0
26.73 s
[gammaloop-workspace-check] Checking typeid v1.0.3
26.82 s
[gammaloop-workspace-check] Checking tinytemplate v1.2.1
26.83 s
[gammaloop-workspace-check] Checking ansitok v0.3.0
26.84 s
[gammaloop-workspace-check] Checking criterion-plot v0.5.0
26.95 s
[gammaloop-workspace-check] Checking is-terminal v0.4.17
27.02 s
[gammaloop-workspace-check] Checking oorandom v11.1.5
27.03 s
[gammaloop-workspace-check] Checking sha2 v0.10.9
27.06 s
[gammaloop-workspace-check] Checking funty v2.0.0
27.08 s
[gammaloop-workspace-check] Checking bytecount v0.6.9
27.13 s
[gammaloop-workspace-check] Checking anes v0.1.6
27.28 s
[gammaloop-workspace-check] Checking ron v0.12.1
27.29 s
[gammaloop-workspace-check] Checking rust-embed-utils v8.11.0
27.38 s
[gammaloop-workspace-check] Checking criterion v0.5.1
27.51 s
[gammaloop-workspace-check] Checking rand v0.8.6
27.56 s
[gammaloop-workspace-check] Checking ansi-str v0.9.0
27.58 s
[gammaloop-workspace-check] Checking bitvec v1.0.1
27.73 s
[gammaloop-workspace-check] Checking symjit v2.21.0
27.75 s
[gammaloop-workspace-check] Checking papergrid v0.17.0
27.88 s
[gammaloop-workspace-check] Compiling pyo3-macros-backend v0.28.3
27.93 s
[gammaloop-workspace-check] Compiling pyo3-ffi v0.28.3
28.04 s
[gammaloop-workspace-check] Compiling pyo3 v0.28.3
28.09 s
[gammaloop-workspace-check] Checking xprec v0.2.2
28.21 s
[gammaloop-workspace-check] Compiling numpy v0.28.0
28.48 s
[gammaloop-workspace-check] Checking testing_table v0.3.0
28.53 s
[gammaloop-workspace-check] Checking env_filter v1.0.1
28.59 s
[gammaloop-workspace-check] Checking toml_edit v0.25.11+spec-1.1.0
28.65 s
[gammaloop-workspace-check] Checking uncased v0.9.10
28.66 s
[gammaloop-workspace-check] Checking jiff v0.2.24
28.76 s
[gammaloop-workspace-check] Checking ptr_meta v0.1.4
28.79 s
[gammaloop-workspace-check] Checking simdutf8 v0.1.5
28.86 s
[gammaloop-workspace-check] Checking ucd-trie v0.1.7
28.90 s
[gammaloop-workspace-check] Checking ahash v0.7.8
29.05 s
[gammaloop-workspace-check] Checking pest v2.8.6
29.08 s
[gammaloop-workspace-check] Checking bytecheck v0.6.12
29.11 s
[gammaloop-workspace-check] Checking approx v0.4.0
29.17 s
[gammaloop-workspace-check] Checking hashbrown v0.12.3
29.28 s
[gammaloop-workspace-check] Checking seahash v4.1.0
29.44 s
[gammaloop-workspace-check] Checking cgmath v0.18.0
29.63 s
[gammaloop-workspace-check] Checking rend v0.4.2
29.89 s
[gammaloop-workspace-check] Checking num-rational v0.4.2
30.01 s
[gammaloop-workspace-check] Checking dot-parser v0.5.1
30.48 s
[gammaloop-workspace-check] Checking num-iter v0.1.45
30.52 s
[gammaloop-workspace-check] Checking ref-ops v0.2.5
30.55 s
[gammaloop-workspace-check] Checking rand_xoshiro v0.6.0
30.62 s
[gammaloop-workspace-check] Checking num v0.4.3
30.67 s
[gammaloop-workspace-check] Checking features v0.10.0
30.73 s
[gammaloop-workspace-check] Checking constcat v0.5.1
30.76 s
[gammaloop-workspace-check] Checking gat-lending-iterator v0.1.8
30.78 s
[gammaloop-workspace-check] Checking colored v2.2.0
30.93 s
[gammaloop-workspace-check] Checking constant_time_eq v0.4.2
31.01 s
[gammaloop-workspace-check] Checking tabled v0.20.0
31.04 s
[gammaloop-workspace-check] Checking insta v1.47.2
31.06 s
[gammaloop-workspace-check] Checking arrayref v0.3.9
31.14 s
[gammaloop-workspace-check] Checking cpufeatures v0.3.0
31.18 s
[gammaloop-workspace-check] Checking base64 v0.22.1
31.18 s
[gammaloop-workspace-check] Checking siphasher v1.0.2
31.23 s
[gammaloop-workspace-check] Checking joinery v2.1.0
31.26 s
[gammaloop-workspace-check] Checking blake3 v1.8.5
31.34 s
[gammaloop-workspace-check] Checking phf_shared v0.13.1
31.44 s
[gammaloop-workspace-check] Checking titlecase v2.2.1
31.53 s
[gammaloop-workspace-check] Checking subprocess v0.2.15
31.56 s
[gammaloop-workspace-check] Checking rust_lisp v0.18.0
31.62 s
[gammaloop-workspace-check] Compiling vakint v0.1.2 (/build/source/crates/vakint)
31.71 s
[gammaloop-workspace-check] Checking version-compare v0.2.1
31.78 s
[gammaloop-workspace-check] Checking toml v0.8.23
31.86 s
[gammaloop-workspace-check] Checking xpct v0.5.1
31.92 s
[gammaloop-workspace-check] Checking ryu v1.0.23
31.98 s
[gammaloop-workspace-check] Checking castaway v0.2.4
32.00 s
[gammaloop-workspace-check] Checking phf v0.13.1
32.06 s
[gammaloop-workspace-check] Checking toml_datetime v0.7.5+spec-1.1.0
32.15 s
[gammaloop-workspace-check] Checking strum v0.27.2
32.18 s
[gammaloop-workspace-check] Checking compact_str v0.9.0
32.28 s
[gammaloop-workspace-check] Checking toml v0.9.12+spec-1.1.0
32.29 s
[gammaloop-workspace-check] Checking unicode-truncate v2.0.1
32.36 s
[gammaloop-workspace-check] Checking kasuari v0.4.12
32.39 s
[gammaloop-workspace-check] Checking lru v0.16.4
32.53 s
[gammaloop-workspace-check] Checking vte v0.15.0
32.56 s
[gammaloop-workspace-check] Checking figment v0.10.19
32.67 s
[gammaloop-workspace-check] Checking string-template-plus v0.4.3
32.70 s
[gammaloop-workspace-check] Checking vt100 v0.16.2
32.98 s
[gammaloop-workspace-check] Checking portable-atomic v1.13.1
33.16 s
[gammaloop-workspace-check] Checking unit-prefix v0.5.2
33.30 s
[gammaloop-workspace-check] Checking rand_distr v0.4.3
33.54 s
[gammaloop-workspace-check] Compiling rustpython-parser-core v0.4.0
33.55 s
[gammaloop-workspace-check] Checking simba v0.6.0
33.58 s
[gammaloop-workspace-check] Checking line-clipping v0.3.7
33.70 s
[gammaloop-workspace-check] Compiling rustpython-ast v0.4.0
33.75 s
[gammaloop-workspace-check] Checking adler2 v2.0.1
33.78 s
[gammaloop-workspace-check] Checking indicatif v0.18.4
33.87 s
[gammaloop-workspace-check] Compiling three-dimensional-reps v0.1.0 (/build/source/crates/three-dimensional-reps)
33.87 s
[gammaloop-workspace-check] Checking gimli v0.32.3
33.95 s
[gammaloop-workspace-check] Checking ratatui-core v0.1.0
34.09 s
[gammaloop-workspace-check] Checking miniz_oxide v0.8.9
34.13 s
[gammaloop-workspace-check] Checking thiserror v1.0.69
34.22 s
[gammaloop-workspace-check] Checking derive_builder v0.11.2
34.29 s
[gammaloop-workspace-check] Checking crossterm v0.29.0
34.32 s
[gammaloop-workspace-check] Checking object v0.37.3
34.34 s
[gammaloop-workspace-check] Checking owo-colors v4.3.0
34.76 s
[gammaloop-workspace-check] Checking tracing-error v0.2.1
34.96 s
[gammaloop-workspace-check] Checking typed-index-collections v3.5.0
35.07 s
[gammaloop-workspace-check] Checking serde-big-array v0.5.1
35.30 s
[gammaloop-workspace-check] Checking amd v0.2.2
35.36 s
[gammaloop-workspace-check] Checking itertools v0.11.0
35.43 s
[gammaloop-workspace-check] Compiling gammaloop-tracing-filter-macros v0.1.0 (/build/source/crates/gammaloop-tracing-filter-macros)
35.66 s
[gammaloop-workspace-check] Checking ratatui-widgets v0.3.0
35.67 s
[gammaloop-workspace-check] Checking rustc-demangle v0.1.27
35.75 s
[gammaloop-workspace-check] Checking option-ext v0.2.0
35.84 s
[gammaloop-workspace-check] Checking env_logger v0.11.10
35.85 s
[gammaloop-workspace-check] Checking dirs-sys v0.5.0
36.17 s
[gammaloop-workspace-check] Checking color-spantrace v0.3.0
36.18 s
[gammaloop-workspace-check] Checking ref-cast v1.0.25
36.21 s
[gammaloop-workspace-check] Checking nix v0.31.2
36.25 s
[gammaloop-workspace-check] Checking integer-sqrt v0.1.5
36.27 s
[gammaloop-workspace-check] Checking brotli-decompressor v4.0.3
36.30 s
[gammaloop-workspace-check] Checking crossbeam-channel v0.5.15
36.33 s
[gammaloop-workspace-check] Checking itertools v0.12.1
36.36 s
[gammaloop-workspace-check] Compiling gammalooprs v0.3.4 (/build/source/crates/gammalooprs)
36.39 s
[gammaloop-workspace-check] Checking ratatui-crossterm v0.1.0
36.65 s
[gammaloop-workspace-check] Checking unsafe-libyaml v0.2.11
36.85 s
[gammaloop-workspace-check] Checking rkyv v0.7.46
36.90 s
[gammaloop-workspace-check] Checking symlink v0.1.0
36.95 s
[gammaloop-workspace-check] Checking tracing-appender v0.2.5
36.99 s
[gammaloop-workspace-check] Checking ratatui-macros v0.7.0
36.99 s
[gammaloop-workspace-check] Checking clarabel v0.11.1
37.02 s
[gammaloop-workspace-check] Checking include_dir v0.7.4
37.09 s
[gammaloop-workspace-check] Checking ratatui v0.30.0
37.14 s
[gammaloop-workspace-check] Checking ctrlc v3.5.2
37.28 s
[gammaloop-workspace-check] Checking pathfinding v4.15.0
37.31 s
[gammaloop-workspace-check] Checking schemars v1.2.1
37.34 s
[gammaloop-workspace-check] Checking slotmap v1.1.1
37.49 s
[gammaloop-workspace-check] Checking brotli v7.0.0
37.74 s
[gammaloop-workspace-check] Checking dirs v6.0.0
37.88 s
[gammaloop-workspace-check] Checking tracing-indicatif v0.3.14
38.06 s
[gammaloop-workspace-check] Checking serde_yaml v0.9.34+deprecated
38.19 s
[gammaloop-workspace-check] Checking json5 v0.4.1
38.45 s
[gammaloop-workspace-check] Checking addr2line v0.25.1
38.48 s
[gammaloop-workspace-check] Checking vectorize v0.2.0
38.58 s
[gammaloop-workspace-check] Checking ringbuffer v0.16.0
38.77 s
[gammaloop-workspace-check] Checking base62 v2.2.4
38.88 s
[gammaloop-workspace-check] Checking rust-embed v8.11.0
38.90 s
[gammaloop-workspace-check] Checking clap_complete v4.6.3
38.94 s
[gammaloop-workspace-check] Checking strip-ansi-escapes v0.2.1
39.00 s
[gammaloop-workspace-check] Compiling gammaloop-api v0.1.0 (/build/source/crates/gammaloop-api)
39.16 s
[gammaloop-workspace-check] Checking fd-lock v4.0.4
39.17 s
[gammaloop-workspace-check] Checking itertools v0.13.0
39.20 s
[gammaloop-workspace-check] Checking strum v0.26.3
39.25 s
[gammaloop-workspace-check] Checking clap_complete_nushell v4.6.0
39.28 s
[gammaloop-workspace-check] Checking sysinfo v0.33.1
39.36 s
[gammaloop-workspace-check] Checking shlex v1.3.0
39.36 s
[gammaloop-workspace-check] Checking futures-core v0.3.32
39.50 s
[gammaloop-workspace-check] Checking futures-task v0.3.32
39.52 s
[gammaloop-workspace-check] Checking slab v0.4.12
39.70 s
[gammaloop-workspace-check] Checking futures-util v0.3.32
39.80 s
[gammaloop-workspace-check] Checking sdd v3.0.10
40.03 s
[gammaloop-workspace-check] Compiling gammaloop-integration-tests v0.1.0 (/build/source/tests)
40.13 s
[gammaloop-workspace-check] Checking scc v2.4.0
40.43 s
[gammaloop-workspace-check] Compiling test-log-core v0.2.20
40.52 s
[gammaloop-workspace-check] Compiling rustc_version v0.4.1
40.61 s
[gammaloop-workspace-check] Checking which v8.0.2
40.68 s
[gammaloop-workspace-check] Checking bincode v1.3.3
40.97 s
[gammaloop-workspace-check] Compiling gungraun-runner v0.18.2
41.90 s
[gammaloop-workspace-check] Compiling gungraun-macros v0.8.0
42.25 s
[gammaloop-workspace-check] Checking proc-macro2 v1.0.106
42.72 s
[gammaloop-workspace-check] Checking reedline v0.42.0
42.79 s
[gammaloop-workspace-check] Checking maplit v1.0.2
42.88 s
[gammaloop-workspace-check] Checking base64 v0.21.7
43.17 s
[gammaloop-workspace-check] Checking quote v1.0.45
43.20 s
[gammaloop-workspace-check] Checking backtrace v0.3.76
43.42 s
[gammaloop-workspace-check] Compiling iai-callgrind-runner v0.14.2
43.53 s
[gammaloop-workspace-check] Checking ron v0.8.1
43.83 s
[gammaloop-workspace-check] Compiling numerica v2.2.0 (https://github.com/alphal00p/symbolica?rev=a277a8dadbaae5a8d6605f2f381991a601e1f345#a277a8da)
44.07 s
[gammaloop-workspace-check] Checking nalgebra v0.29.0
44.85 s
[gammaloop-workspace-check] Checking color-eyre v0.6.5
45.18 s
[gammaloop-workspace-check] Checking futures-executor v0.3.32
45.40 s
[gammaloop-workspace-check] Checking kurbo v0.13.0
45.50 s
[gammaloop-workspace-check] Checking serial_test v3.4.0
45.72 s
[gammaloop-workspace-check] Compiling test-log-macros v0.2.20
45.93 s
[gammaloop-workspace-check] Checking wait-timeout v0.2.1
46.02 s
[gammaloop-workspace-check] Compiling iai-callgrind v0.14.2
46.17 s
[gammaloop-workspace-check] Checking bit-vec v0.8.0
46.18 s
[gammaloop-workspace-check] Checking quick-error v1.2.3
46.27 s
[gammaloop-workspace-check] Checking rusty-fork v0.3.1
46.60 s
[gammaloop-workspace-check] Checking syn v2.0.117
46.88 s
[gammaloop-workspace-check] Compiling iai-callgrind-macros v0.5.1
47.35 s
[gammaloop-workspace-check] Checking rand_xorshift v0.4.0
47.51 s
[gammaloop-workspace-check] Checking bit-set v0.8.0
47.58 s
[gammaloop-workspace-check] Checking console v0.15.11
47.66 s
[gammaloop-workspace-check] Checking pathdiff v0.2.3
47.78 s
[gammaloop-workspace-check] Checking unarray v0.1.4
47.92 s
[gammaloop-workspace-check] Checking proptest v1.11.0
49.60 s
[gammaloop-workspace-check] Checking similar-asserts v1.7.0
49.88 s
[gammaloop-workspace-check] Checking kurvst v0.1.0 (/build/source/crates/kurvst)
50.24 s
[gammaloop-workspace-check] Checking clinnet v0.1.8 (/build/source/crates/clinnet)
53.01 s
[gammaloop-workspace-check] Checking test-log v0.2.20
59.78 s
[gammaloop-workspace-check] Compiling graphica v2.1.0 (https://github.com/alphal00p/symbolica?rev=a277a8dadbaae5a8d6605f2f381991a601e1f345#a277a8da)
66.02 s
[gammaloop-workspace-check] Checking gungraun v0.18.2
66.16 s
[gammaloop-workspace-check] Checking statrs v0.16.1
67.98 s
[gammaloop-workspace-check] Checking momtrop v0.3.0
71.79 s
[gammaloop-workspace-check] Compiling pyo3-macros v0.28.3
72.33 s
[gammaloop-workspace-check] Compiling pyo3-stub-gen-derive v0.17.2
83.08 s
[gammaloop-workspace-check] Checking pyo3-stub-gen v0.17.2
92.90 s
[gammaloop-workspace-check] Checking symbolica-utils v0.1.0 (/build/source/crates/symbolica-utils)
92.90 s
[gammaloop-workspace-check] Checking spenso-macros v0.3.2 (/build/source/crates/spenso-macros)
361.36 s
[gammaloop-workspace-check] Compiling gammaloop-workspace-hack v0.1.0 (/build/source/crates/gammaloop-workspace-hack)
361.63 s
[gammaloop-workspace-check] Checking linnet v0.17.0 (/build/source/crates/linnet)
366.70 s
[gammaloop-workspace-check] Checking spenso v0.6.0 (/build/source/crates/spenso)
366.91 s
[gammaloop-workspace-check] Checking linnet-py v0.1.0 (/build/source/crates/linnet-py)
366.91 s
[gammaloop-workspace-check] Checking linnest v0.1.0 (/build/source/crates/linnest)
374.88 s
[gammaloop-workspace-check] Checking idenso v0.3.0 (/build/source/crates/idenso)
374.89 s
[gammaloop-workspace-check] Checking gammaloop-tracing-filter v0.1.0 (/build/source/crates/gammaloop-tracing-filter)
378.16 s
[gammaloop-workspace-check] Checking spenso-hep-lib v0.1.7 (/build/source/crates/spenso-hep-lib)
378.64 s
[gammaloop-workspace-check] Checking spynso3 v0.1.2 (/build/source/crates/spynso3)
420.33 s
[gammaloop-workspace-check] error[E0560] : struct `CutInfo` has no field named `lmb_channel_id`
420.33 s
[gammaloop-workspace-check] --> tests/tests/test_differential.rs:86:13
420.33 s
[gammaloop-workspace-check] |
420.33 s
[gammaloop-workspace-check] 86 | lmb_channel_id: None,
420.33 s
[gammaloop-workspace-check] | ^^^^^^^^^^^^^^ `CutInfo` does not have this field
420.33 s
[gammaloop-workspace-check] |
420.33 s
[gammaloop-workspace-check] = note : available fields are: `sampling_channel_id`, `sampling_channel_edge_ids`
420.33 s
[gammaloop-workspace-check]
420.33 s
[gammaloop-workspace-check] error[E0560] : struct `CutInfo` has no field named `lmb_channel_edge_ids`
420.33 s
[gammaloop-workspace-check] --> tests/tests/test_differential.rs:87:13
420.33 s
[gammaloop-workspace-check] |
420.33 s
[gammaloop-workspace-check] 87 | lmb_channel_edge_ids: None,
420.33 s
[gammaloop-workspace-check] | ^^^^^^^^^^^^^^^^^^^^ `CutInfo` does not have this field
420.33 s
[gammaloop-workspace-check] |
420.33 s
[gammaloop-workspace-check] = note : available fields are: `sampling_channel_id`, `sampling_channel_edge_ids`
420.33 s
[gammaloop-workspace-check]
420.36 s
[gammaloop-workspace-check] error[E0063] : missing field `reference_moments` in initializer of `GraphEvaluationResult<_>`
420.36 s
[gammaloop-workspace-check] --> tests/tests/test_differential.rs:532:19
420.36 s
[gammaloop-workspace-check] |
420.36 s
[gammaloop-workspace-check] 532 | let mut lhs = GraphEvaluationResult {
420.36 s
[gammaloop-workspace-check] | ^^^^^^^^^^^^^^^^^^^^^ missing `reference_moments`
420.36 s
[gammaloop-workspace-check]
420.36 s
[gammaloop-workspace-check] error[E0063] : missing field `reference_moments` in initializer of `GraphEvaluationResult<_>`
420.36 s
[gammaloop-workspace-check] --> tests/tests/test_differential.rs:539:15
420.36 s
[gammaloop-workspace-check] |
420.36 s
[gammaloop-workspace-check] 539 | let rhs = GraphEvaluationResult {
420.36 s
[gammaloop-workspace-check] | ^^^^^^^^^^^^^^^^^^^^^ missing `reference_moments`
420.36 s
[gammaloop-workspace-check]
420.45 s
[gammaloop-workspace-check] error[E0609] : no field `lmb_channel_edge_ids` on type `CutInfo`
420.45 s
[gammaloop-workspace-check] --> tests/tests/test_evaluation_api.rs:311:10
420.45 s
[gammaloop-workspace-check] |
420.45 s
[gammaloop-workspace-check] 311 | .lmb_channel_edge_ids
420.45 s
[gammaloop-workspace-check] | ^^^^^^^^^^^^^^^^^^^^ unknown field
420.45 s
[gammaloop-workspace-check] |
420.45 s
[gammaloop-workspace-check] = note : available fields are: `particle_pdgs`, `cut_id`, `graph_id`, `graph_group_id`, `orientation_id` ... and 2 others
420.45 s
[gammaloop-workspace-check]
420.55 s
[gammaloop-workspace-check] error[E0609] : no field `lmb_channel_edge_ids` on type `CutInfo`
420.55 s
[gammaloop-workspace-check] --> tests/tests/test_evaluation_api.rs:591:26
420.55 s
[gammaloop-workspace-check] |
420.55 s
[gammaloop-workspace-check] 591 | .lmb_channel_edge_ids
420.55 s
[gammaloop-workspace-check] | ^^^^^^^^^^^^^^^^^^^^ unknown field
420.55 s
[gammaloop-workspace-check] |
420.55 s
[gammaloop-workspace-check] = note : available fields are: `particle_pdgs`, `cut_id`, `graph_id`, `graph_group_id`, `orientation_id` ... and 2 others
420.55 s
[gammaloop-workspace-check]
420.57 s
[gammaloop-workspace-check] Some errors have detailed explanations: E0063, E0560.
420.57 s
[gammaloop-workspace-check] For more information about an error, try `rustc --explain E0063`.
420.61 s
[gammaloop-workspace-check] error : could not compile `gammaloop-integration-tests` (test "test_differential") due to 4 previous errors
420.61 s
[gammaloop-workspace-check] warning : build failed, waiting for other jobs to finish...
420.67 s
[gammaloop-workspace-check] error[E0609] : no field `lmb_channel_edge_ids` on type `CutInfo`
420.67 s
[gammaloop-workspace-check] --> tests/tests/test_evaluation_api.rs:1177:18
420.67 s
[gammaloop-workspace-check] |
420.67 s
[gammaloop-workspace-check] 1177 | .lmb_channel_edge_ids
420.67 s
[gammaloop-workspace-check] | ^^^^^^^^^^^^^^^^^^^^ unknown field
420.67 s
[gammaloop-workspace-check] |
420.67 s
[gammaloop-workspace-check] = note : available fields are: `particle_pdgs`, `cut_id`, `graph_id`, `graph_group_id`, `orientation_id` ... and 2 others
420.67 s
[gammaloop-workspace-check]
420.84 s
[gammaloop-workspace-check] error[E0609] : no field `lmb_channel_edge_ids` on type `CutInfo`
420.84 s
[gammaloop-workspace-check] --> tests/tests/test_evaluation_api.rs:1222:22
420.84 s
[gammaloop-workspace-check] |
420.84 s
[gammaloop-workspace-check] 1222 | .lmb_channel_edge_ids
420.84 s
[gammaloop-workspace-check] | ^^^^^^^^^^^^^^^^^^^^ unknown field
420.84 s
[gammaloop-workspace-check] |
420.84 s
[gammaloop-workspace-check] = note : available fields are: `particle_pdgs`, `cut_id`, `graph_id`, `graph_group_id`, `orientation_id` ... and 2 others
420.84 s
[gammaloop-workspace-check]
420.84 s
[gammaloop-workspace-check] error[E0609] : no field `lmb_channel_edge_ids` on type `CutInfo`
420.84 s
[gammaloop-workspace-check] --> tests/tests/test_evaluation_api.rs:1281:14
420.84 s
[gammaloop-workspace-check] |
420.84 s
[gammaloop-workspace-check] 1281 | .lmb_channel_edge_ids
420.84 s
[gammaloop-workspace-check] | ^^^^^^^^^^^^^^^^^^^^ unknown field
420.84 s
[gammaloop-workspace-check] |
420.84 s
[gammaloop-workspace-check] = note : available fields are: `particle_pdgs`, `cut_id`, `graph_id`, `graph_group_id`, `orientation_id` ... and 2 others
420.84 s
[gammaloop-workspace-check]
420.92 s
[gammaloop-workspace-check] error[E0609] : no field `lmb_channel_edge_ids` on type `CutInfo`
420.92 s
[gammaloop-workspace-check] --> tests/tests/test_evaluation_api.rs:1428:18
420.92 s
[gammaloop-workspace-check] |
420.92 s
[gammaloop-workspace-check] 1428 | .lmb_channel_edge_ids
420.92 s
[gammaloop-workspace-check] | ^^^^^^^^^^^^^^^^^^^^ unknown field
420.92 s
[gammaloop-workspace-check] |
420.92 s
[gammaloop-workspace-check] = note : available fields are: `particle_pdgs`, `cut_id`, `graph_id`, `graph_group_id`, `orientation_id` ... and 2 others
420.92 s
[gammaloop-workspace-check]
421.07 s
[gammaloop-workspace-check] For more information about this error, try `rustc --explain E0609`.
421.10 s
[gammaloop-workspace-check] error : could not compile `gammaloop-integration-tests` (test "test_evaluation_api") due to 6 previous errors
421.80 s
[gammaloop-workspace-check] error[E0609] : no field `lmb_channel_id` on type `CutInfo`
421.80 s
[gammaloop-workspace-check] --> tests/tests/test_runs/utils.rs:568:36
421.80 s
[gammaloop-workspace-check] |
421.80 s
[gammaloop-workspace-check] 568 | event.cut_info.lmb_channel_id,
421.80 s
[gammaloop-workspace-check] | ^^^^^^^^^^^^^^ unknown field
421.80 s
[gammaloop-workspace-check] |
421.80 s
[gammaloop-workspace-check] = note : available fields are: `particle_pdgs`, `cut_id`, `graph_id`, `graph_group_id`, `orientation_id` ... and 2 others
421.80 s
[gammaloop-workspace-check]
421.80 s
[gammaloop-workspace-check] error[E0609] : no field `lmb_channel_id` on type `CutInfo`
421.80 s
[gammaloop-workspace-check] --> tests/tests/test_runs/utils.rs:580:36
421.80 s
[gammaloop-workspace-check] |
421.80 s
[gammaloop-workspace-check] 580 | event.cut_info.lmb_channel_id,
421.80 s
[gammaloop-workspace-check] | ^^^^^^^^^^^^^^ unknown field
421.80 s
[gammaloop-workspace-check] |
421.80 s
[gammaloop-workspace-check] = note : available fields are: `particle_pdgs`, `cut_id`, `graph_id`, `graph_group_id`, `orientation_id` ... and 2 others
421.80 s
[gammaloop-workspace-check]
422.68 s
[gammaloop-workspace-check] error : could not compile `gammaloop-integration-tests` (test "test_runs") due to 2 previous errors
423.71 s
Progress: 0 of 1 built (1 failed)
423.71 s
Failed to build gammaloop-workspace-check after 6m59s
423.71 s
Cannot build ' /nix/store/axwybdrvnz6g31i8j22ivzmz2ysf3s4g-gammaloop-workspace-check-0.1.0.drv '.
423.71 s
Reason: builder failed with exit code 101 .
423.71 s
Output paths:
423.71 s
/nix/store/9cxf174qbl62vd8h78aazfzs3igfpdff-gammaloop-workspace-check-0.1.0
423.71 s
Last 524 log lines:
423.71 s
> Running phase: unpackPhase
423.71 s
> unpacking source archive /nix/store/z5pb9ly08pscbnc755wvrwn7ad3dvc0j-source
423.71 s
> source root is source
423.71 s
> Running phase: patchPhase
423.71 s
> Executing configureCargoCommonVars
423.71 s
> decompressing cargo artifacts from /nix/store/50vpxlcgfxf2d57i27v3d10zjwxxbm2r-gammaloop-workspace-deps-deps-0.1.0/target.tar.zst to target
423.71 s
> Running phase: updateAutotoolsGnuConfigScriptsPhase
423.71 s
> Running phase: configurePhase
423.71 s
> will append /build/source/.cargo-home/config.toml with contents of /nix/store/5drf77x6km4ky7gwlrzdx9bbd6fz09g3-vendor-cargo-deps/config.toml
423.71 s
> default configurePhase, nothing to do
423.71 s
> Running phase: buildPhase
423.71 s
> +++ command cargo --version
423.71 s
> cargo 1.97.0 (c980f4866 2026-06-30)
423.71 s
> +++ command cargo check --profile ci-optim --locked --workspace --features gammaloop-tracing-filter/clap,gammaloop-tracing-filter/symbolica,idenso/bincode,idenso/reference-cases,linnet/bincode,linnet/drawing,linnet/rkyv,linnet/serde,linnet/symbolica,spenso-macros/shadowing,spenso/shadowing,symbolica/tracing_max_level_info,three-dimensional-reps/display,three-dimensional-reps/eval,three-dimensional-reps/serde --all-targets
423.71 s
> Checking serde_core v1.0.228
423.71 s
> Checking libc v0.2.186
423.71 s
> Checking cfg-if v1.0.4
423.71 s
> Checking memchr v2.8.0
423.71 s
> Checking once_cell v1.21.4
423.71 s
> Checking either v1.15.0
423.71 s
> Checking libm v0.2.16
423.71 s
> Checking itoa v1.0.18
423.71 s
> Checking log v0.4.29
423.71 s
> Checking zerocopy v0.8.48
423.71 s
> Checking regex-syntax v0.8.10
423.71 s
> Checking crossbeam-utils v0.8.21
423.71 s
> Checking equivalent v1.0.2
423.71 s
> Checking zmij v1.0.21
423.71 s
> Checking lazy_static v1.5.0
423.71 s
> Checking bytemuck v1.25.0
423.71 s
> Compiling target-lexicon v0.13.5
423.71 s
> Checking arrayvec v0.7.6
423.71 s
> Checking powerfmt v0.2.0
423.71 s
> Checking pin-project-lite v0.2.17
423.71 s
> Checking time-core v0.1.8
423.71 s
> Checking num_threads v0.1.7
423.71 s
> Checking safe_arch v0.7.4
423.71 s
> Checking num-conv v0.2.1
423.71 s
> Checking foldhash v0.2.0
423.71 s
> Checking deranged v0.5.8
423.71 s
> Checking allocator-api2 v0.2.21
423.71 s
> Checking const-random v0.1.18
423.71 s
> Checking unty v0.0.4
423.71 s
> Checking nu-ansi-term v0.50.3
423.71 s
> Checking static_assertions v1.1.0
423.71 s
> Checking winnow v1.0.2
423.71 s
> Checking safe_arch v1.0.0
423.71 s
> Checking tracing-core v0.1.36
423.71 s
> Checking itertools v0.14.0
423.71 s
> Checking hashbrown v0.16.1
423.71 s
> Checking thread_local v1.1.9
423.71 s
> Checking sharded-slab v0.1.7
423.71 s
> Checking toml_writer v1.1.1+spec-1.1.0
423.71 s
> Checking crossbeam-epoch v0.9.18
423.71 s
> Checking aho-corasick v1.1.4
423.71 s
> Checking wide v0.7.33
423.71 s
> Checking az v1.3.0
423.71 s
> Checking crossbeam-deque v0.8.6
423.71 s
> Checking tracing-log v0.2.0
423.71 s
> Checking tracing v0.1.44
423.71 s
> Checking rayon-core v1.13.0
423.71 s
> Checking indenter v0.3.4
423.71 s
> Checking wide v1.3.0
423.71 s
> Compiling phf_shared v0.11.3
423.71 s
> Checking anyhow v1.0.102
423.71 s
> Checking rawpointer v0.2.1
423.71 s
> Checking utf8parse v0.2.2
423.71 s
> Checking dyn-clone v1.0.20
423.71 s
> Checking alloc-no-stdlib v2.0.4
423.71 s
> Checking rayon v1.12.0
423.71 s
> Checking anstyle-parse v1.0.0
423.71 s
> Checking alloc-stdlib v0.2.2
423.71 s
> Checking matrixmultiply v0.3.10
423.71 s
> Checking anstyle-query v1.1.5
423.71 s
> Checking anstyle v1.0.14
423.71 s
> Checking colorchoice v1.0.5
423.71 s
> Checking colored v3.1.1
423.71 s
> Checking is_terminal_polyfill v1.70.2
423.71 s
> Checking anstream v1.0.0
423.71 s
> Checking num-traits v0.2.19
423.71 s
> Compiling phf_generator v0.11.3
423.71 s
> Checking toml_parser v1.1.2+spec-1.1.0
423.71 s
> Checking eyre v0.6.12
423.71 s
> Checking bitflags v1.3.2
423.71 s
> Checking unicode-width v0.2.2
423.71 s
> Compiling phf_codegen v0.11.3
423.71 s
> Checking brotli-decompressor v5.0.0
423.71 s
> Checking inventory v0.3.24
423.71 s
> Checking spec_math v0.1.6
423.71 s
> Checking thiserror v2.0.18
423.71 s
> Checking libloading v0.9.0
423.71 s
> Compiling getopts v0.2.24
423.71 s
> Checking self_cell v1.2.2
423.71 s
> Checking byteorder v1.5.0
423.71 s
> Compiling pyo3-build-config v0.28.3
423.71 s
> Checking serde v1.0.228
423.71 s
> Checking serde_json v1.0.149
423.71 s
> Checking approx v0.5.1
423.71 s
> Checking getrandom v0.3.4
423.71 s
> Checking bitflags v2.11.1
423.71 s
> Checking time v0.3.47
423.71 s
> Checking num-integer v0.1.46
423.71 s
> Checking gmp-mpfr-sys v1.7.1
423.71 s
> Checking rand_core v0.9.5
423.71 s
> Checking regex-automata v0.4.14
423.71 s
> Checking serde_spanned v1.1.1
423.71 s
> Checking toml_datetime v1.1.1+spec-1.1.0
423.71 s
> Checking region v3.0.2
423.71 s
> Checking hugepage-rs v0.1.1
423.71 s
> Checking wasmtime-jit-icache-coherence v34.0.2
423.71 s
> Checking append-only-vec v0.1.8
423.71 s
> Checking bytes v1.11.1
423.71 s
> Checking tinyjson v2.5.1
423.71 s
> Checking toml v1.1.2+spec-1.1.0
423.71 s
> Compiling unicode_names2_generator v1.3.0
423.71 s
> Compiling unic-char-range v0.9.0
423.71 s
> Compiling unic-common v0.9.0
423.71 s
> Checking linux-raw-sys v0.12.1
423.71 s
> Compiling unic-char-property v0.9.0
423.71 s
> Compiling unic-ucd-version v0.9.0
423.71 s
> Compiling is-macro v0.3.7
423.71 s
> Compiling rustpython-parser-vendored v0.4.0
423.71 s
> Checking rustix v1.1.4
423.71 s
> Checking brotli v8.0.2
423.71 s
> Checking iana-time-zone v0.1.65
423.71 s
> Checking smallvec v1.15.1
423.71 s
> Checking num-complex v0.4.6
423.71 s
> Checking tracing-serde v0.2.0
423.71 s
> Checking bincode v2.0.1
423.71 s
> Checking smartstring v1.0.1
423.71 s
> Checking chrono v0.4.44
423.71 s
> Compiling rustpython-parser v0.4.0
423.71 s
> Compiling phf v0.11.3
423.71 s
> Checking simba v0.9.1
423.71 s
> Checking rustc-hash v2.1.2
423.71 s
> Checking ndarray v0.17.2
423.71 s
> Compiling unic-ucd-ident v0.9.0
423.71 s
> Compiling unic-emoji-char v0.9.0
423.71 s
> Compiling lalrpop-util v0.20.2
423.71 s
> Compiling rustc-hash v1.1.0
423.71 s
> Checking rug v1.30.0
423.71 s
> Compiling symbolica v2.2.0 (https://github.com/alphal00p/symbolica?rev=a277a8dadbaae5a8d6605f2f381991a601e1f345#a277a8da)
423.71 s
> Checking unicode-segmentation v1.13.2
423.71 s
> Checking typenum v1.20.0
423.71 s
> Checking getrandom v0.2.17
423.71 s
> Checking scopeguard v1.2.0
423.71 s
> Checking lock_api v0.4.14
423.71 s
> Checking parking_lot_core v0.9.12
423.71 s
> Checking unicode-ident v1.0.24
423.71 s
> Checking hashbrown v0.17.0
423.71 s
> Checking parking_lot v0.12.5
423.71 s
> Checking terminal_size v0.4.4
423.71 s
> Checking errno v0.3.14
423.71 s
> Checking clap_lex v1.1.0
423.71 s
> Checking strsim v0.11.1
423.71 s
> Checking unicase v2.9.0
423.71 s
> Checking signal-hook-registry v1.4.8
423.71 s
> Checking vte v0.14.1
423.71 s
> Checking same-file v1.0.6
423.71 s
> Checking walkdir v2.5.0
423.71 s
> Checking signal-hook v0.3.18
423.71 s
> Checking mio v1.2.0
423.71 s
> Checking indexmap v2.14.0
423.71 s
> Checking minimal-lexical v0.2.1
423.71 s
> Checking ciborium-io v0.2.2
423.71 s
> Checking derive_more v2.1.1
423.71 s
> Checking num-bigint v0.4.6
423.71 s
> Checking nom v7.1.3
423.71 s
> Checking clap_builder v4.6.0
423.71 s
> Checking signal-hook-mio v0.2.5
423.71 s
> Checking console v0.16.3
423.71 s
> Checking ppv-lite86 v0.2.21
423.71 s
> Checking ahash v0.8.12
423.71 s
> Checking half v2.7.1
423.71 s
> Checking bstr v1.12.1
423.71 s
> Checking matchers v0.2.0
423.71 s
> Checking tracing-subscriber v0.3.23
423.71 s
> Checking regex v1.12.3
423.71 s
> Checking ciborium-ll v0.2.2
423.71 s
> Checking linux-raw-sys v0.4.15
423.71 s
> Compiling unicode_names2 v1.3.0
423.71 s
> Checking winnow v0.7.15
423.71 s
> Checking cpufeatures v0.2.17
423.71 s
> Checking rustix v0.38.44
423.71 s
> Checking ciborium v0.2.2
423.71 s
> Checking globset v0.4.18
423.71 s
> Checking rand_chacha v0.9.0
423.71 s
> Checking generic-array v0.14.7
423.71 s
> Checking rand_core v0.6.4
423.71 s
> Checking rand v0.9.4
423.71 s
> Checking getrandom v0.4.2
423.71 s
> Checking fastrand v2.4.1
423.71 s
> Checking plotters-backend v0.3.7
423.71 s
> Checking fnv v1.0.7
423.71 s
> Checking toml_datetime v0.6.11
423.71 s
> Checking plotters-svg v0.3.7
423.71 s
> Checking tempfile v3.27.0
423.71 s
> Checking crossterm v0.28.1
423.71 s
> Checking serde_spanned v0.6.9
423.71 s
> Checking itertools v0.10.5
423.71 s
> Checking clap v4.6.1
423.71 s
> Checking tap v1.0.1
423.71 s
> Checking cast v0.3.0
423.71 s
> Checking toml_write v0.1.2
423.71 s
> Checking wyz v0.5.1
423.71 s
> Checking plotters v0.3.7
423.71 s
> Checking rand_chacha v0.3.1
423.71 s
> Checking crypto-common v0.1.7
423.71 s
> Checking block-buffer v0.10.4
423.71 s
> Checking digest v0.10.7
423.71 s
> Checking toml_edit v0.22.27
423.71 s
> Checking radium v0.7.0
423.71 s
> Checking similar v2.7.0
423.71 s
> Checking typeid v1.0.3
423.71 s
> Checking tinytemplate v1.2.1
423.71 s
> Checking ansitok v0.3.0
423.71 s
> Checking criterion-plot v0.5.0
423.71 s
> Checking is-terminal v0.4.17
423.71 s
> Checking oorandom v11.1.5
423.71 s
> Checking sha2 v0.10.9
423.71 s
> Checking funty v2.0.0
423.71 s
> Checking bytecount v0.6.9
423.71 s
> Checking anes v0.1.6
423.71 s
> Checking ron v0.12.1
423.71 s
> Checking rust-embed-utils v8.11.0
423.71 s
> Checking criterion v0.5.1
423.71 s
> Checking rand v0.8.6
423.71 s
> Checking ansi-str v0.9.0
423.71 s
> Checking bitvec v1.0.1
423.71 s
> Checking symjit v2.21.0
423.71 s
> Checking papergrid v0.17.0
423.71 s
> Compiling pyo3-macros-backend v0.28.3
423.71 s
> Compiling pyo3-ffi v0.28.3
423.71 s
> Compiling pyo3 v0.28.3
423.71 s
> Checking xprec v0.2.2
423.71 s
> Compiling numpy v0.28.0
423.71 s
> Checking testing_table v0.3.0
423.71 s
> Checking env_filter v1.0.1
423.71 s
> Checking toml_edit v0.25.11+spec-1.1.0
423.71 s
> Checking uncased v0.9.10
423.71 s
> Checking jiff v0.2.24
423.71 s
> Checking ptr_meta v0.1.4
423.71 s
> Checking simdutf8 v0.1.5
423.71 s
> Checking ucd-trie v0.1.7
423.71 s
> Checking ahash v0.7.8
423.71 s
> Checking pest v2.8.6
423.71 s
> Checking bytecheck v0.6.12
423.71 s
> Checking approx v0.4.0
423.71 s
> Checking hashbrown v0.12.3
423.71 s
> Checking seahash v4.1.0
423.71 s
> Checking cgmath v0.18.0
423.71 s
> Checking rend v0.4.2
423.71 s
> Checking num-rational v0.4.2
423.71 s
> Checking dot-parser v0.5.1
423.71 s
> Checking num-iter v0.1.45
423.71 s
> Checking ref-ops v0.2.5
423.71 s
> Checking rand_xoshiro v0.6.0
423.71 s
> Checking num v0.4.3
423.71 s
> Checking features v0.10.0
423.71 s
> Checking constcat v0.5.1
423.71 s
> Checking gat-lending-iterator v0.1.8
423.71 s
> Checking colored v2.2.0
423.71 s
> Checking constant_time_eq v0.4.2
423.71 s
> Checking tabled v0.20.0
423.71 s
> Checking insta v1.47.2
423.71 s
> Checking arrayref v0.3.9
423.71 s
> Checking cpufeatures v0.3.0
423.71 s
> Checking base64 v0.22.1
423.71 s
> Checking siphasher v1.0.2
423.71 s
> Checking joinery v2.1.0
423.71 s
> Checking blake3 v1.8.5
423.71 s
> Checking phf_shared v0.13.1
423.71 s
> Checking titlecase v2.2.1
423.71 s
> Checking subprocess v0.2.15
423.71 s
> Checking rust_lisp v0.18.0
423.71 s
> Compiling vakint v0.1.2 (/build/source/crates/vakint)
423.71 s
> Checking version-compare v0.2.1
423.71 s
> Checking toml v0.8.23
423.71 s
> Checking xpct v0.5.1
423.71 s
> Checking ryu v1.0.23
423.71 s
> Checking castaway v0.2.4
423.71 s
> Checking phf v0.13.1
423.71 s
> Checking toml_datetime v0.7.5+spec-1.1.0
423.71 s
> Checking strum v0.27.2
423.71 s
> Checking compact_str v0.9.0
423.71 s
> Checking toml v0.9.12+spec-1.1.0
423.71 s
> Checking unicode-truncate v2.0.1
423.71 s
> Checking kasuari v0.4.12
423.71 s
> Checking lru v0.16.4
423.71 s
> Checking vte v0.15.0
423.71 s
> Checking figment v0.10.19
423.71 s
> Checking string-template-plus v0.4.3
423.71 s
> Checking vt100 v0.16.2
423.71 s
> Checking portable-atomic v1.13.1
423.71 s
> Checking unit-prefix v0.5.2
423.71 s
> Checking rand_distr v0.4.3
423.71 s
> Compiling rustpython-parser-core v0.4.0
423.71 s
> Checking simba v0.6.0
423.71 s
> Checking line-clipping v0.3.7
423.71 s
> Compiling rustpython-ast v0.4.0
423.71 s
> Checking adler2 v2.0.1
423.71 s
> Checking indicatif v0.18.4
423.71 s
> Compiling three-dimensional-reps v0.1.0 (/build/source/crates/three-dimensional-reps)
423.71 s
> Checking gimli v0.32.3
423.71 s
> Checking ratatui-core v0.1.0
423.71 s
> Checking miniz_oxide v0.8.9
423.71 s
> Checking thiserror v1.0.69
423.71 s
> Checking derive_builder v0.11.2
423.71 s
> Checking crossterm v0.29.0
423.71 s
> Checking object v0.37.3
423.71 s
> Checking owo-colors v4.3.0
423.71 s
> Checking tracing-error v0.2.1
423.71 s
> Checking typed-index-collections v3.5.0
423.71 s
> Checking serde-big-array v0.5.1
423.71 s
> Checking amd v0.2.2
423.71 s
> Checking itertools v0.11.0
423.71 s
> Compiling gammaloop-tracing-filter-macros v0.1.0 (/build/source/crates/gammaloop-tracing-filter-macros)
423.71 s
> Checking ratatui-widgets v0.3.0
423.71 s
> Checking rustc-demangle v0.1.27
423.71 s
> Checking option-ext v0.2.0
423.71 s
> Checking env_logger v0.11.10
423.71 s
> Checking dirs-sys v0.5.0
423.71 s
> Checking color-spantrace v0.3.0
423.71 s
> Checking ref-cast v1.0.25
423.71 s
> Checking nix v0.31.2
423.71 s
> Checking integer-sqrt v0.1.5
423.71 s
> Checking brotli-decompressor v4.0.3
423.71 s
> Checking crossbeam-channel v0.5.15
423.71 s
> Checking itertools v0.12.1
423.71 s
> Compiling gammalooprs v0.3.4 (/build/source/crates/gammalooprs)
423.71 s
> Checking ratatui-crossterm v0.1.0
423.71 s
> Checking unsafe-libyaml v0.2.11
423.71 s
> Checking rkyv v0.7.46
423.71 s
> Checking symlink v0.1.0
423.71 s
> Checking tracing-appender v0.2.5
423.71 s
> Checking ratatui-macros v0.7.0
423.71 s
> Checking clarabel v0.11.1
423.71 s
> Checking include_dir v0.7.4
423.71 s
> Checking ratatui v0.30.0
423.71 s
> Checking ctrlc v3.5.2
423.71 s
> Checking pathfinding v4.15.0
423.71 s
> Checking schemars v1.2.1
423.71 s
> Checking slotmap v1.1.1
423.71 s
> Checking brotli v7.0.0
423.71 s
> Checking dirs v6.0.0
423.71 s
> Checking tracing-indicatif v0.3.14
423.71 s
> Checking serde_yaml v0.9.34+deprecated
423.71 s
> Checking json5 v0.4.1
423.71 s
> Checking addr2line v0.25.1
423.71 s
> Checking vectorize v0.2.0
423.71 s
> Checking ringbuffer v0.16.0
423.71 s
> Checking base62 v2.2.4
423.71 s
> Checking rust-embed v8.11.0
423.71 s
> Checking clap_complete v4.6.3
423.71 s
> Checking strip-ansi-escapes v0.2.1
423.71 s
> Compiling gammaloop-api v0.1.0 (/build/source/crates/gammaloop-api)
423.71 s
> Checking fd-lock v4.0.4
423.71 s
> Checking itertools v0.13.0
423.71 s
> Checking strum v0.26.3
423.71 s
> Checking clap_complete_nushell v4.6.0
423.71 s
> Checking sysinfo v0.33.1
423.71 s
> Checking shlex v1.3.0
423.71 s
> Checking futures-core v0.3.32
423.71 s
> Checking futures-task v0.3.32
423.71 s
> Checking slab v0.4.12
423.71 s
> Checking futures-util v0.3.32
423.71 s
> Checking sdd v3.0.10
423.71 s
> Compiling gammaloop-integration-tests v0.1.0 (/build/source/tests)
423.71 s
> Checking scc v2.4.0
423.71 s
> Compiling test-log-core v0.2.20
423.71 s
> Compiling rustc_version v0.4.1
423.71 s
> Checking which v8.0.2
423.71 s
> Checking bincode v1.3.3
423.71 s
> Compiling gungraun-runner v0.18.2
423.71 s
> Compiling gungraun-macros v0.8.0
423.71 s
> Checking proc-macro2 v1.0.106
423.71 s
> Checking reedline v0.42.0
423.71 s
> Checking maplit v1.0.2
423.71 s
> Checking base64 v0.21.7
423.71 s
> Checking quote v1.0.45
423.71 s
> Checking backtrace v0.3.76
423.71 s
> Compiling iai-callgrind-runner v0.14.2
423.71 s
> Checking ron v0.8.1
423.71 s
> Compiling numerica v2.2.0 (https://github.com/alphal00p/symbolica?rev=a277a8dadbaae5a8d6605f2f381991a601e1f345#a277a8da)
423.71 s
> Checking nalgebra v0.29.0
423.71 s
> Checking color-eyre v0.6.5
423.71 s
> Checking futures-executor v0.3.32
423.71 s
> Checking kurbo v0.13.0
423.71 s
> Checking serial_test v3.4.0
423.71 s
> Compiling test-log-macros v0.2.20
423.71 s
> Checking wait-timeout v0.2.1
423.71 s
> Compiling iai-callgrind v0.14.2
423.71 s
> Checking bit-vec v0.8.0
423.71 s
> Checking quick-error v1.2.3
423.71 s
> Checking rusty-fork v0.3.1
423.71 s
> Checking syn v2.0.117
423.71 s
> Compiling iai-callgrind-macros v0.5.1
423.71 s
> Checking rand_xorshift v0.4.0
423.71 s
> Checking bit-set v0.8.0
423.71 s
> Checking console v0.15.11
423.71 s
> Checking pathdiff v0.2.3
423.71 s
> Checking unarray v0.1.4
423.71 s
> Checking proptest v1.11.0
423.71 s
> Checking similar-asserts v1.7.0
423.71 s
> Checking kurvst v0.1.0 (/build/source/crates/kurvst)
423.71 s
> Checking clinnet v0.1.8 (/build/source/crates/clinnet)
423.71 s
> Checking test-log v0.2.20
423.71 s
> Compiling graphica v2.1.0 (https://github.com/alphal00p/symbolica?rev=a277a8dadbaae5a8d6605f2f381991a601e1f345#a277a8da)
423.71 s
> Checking gungraun v0.18.2
423.71 s
> Checking statrs v0.16.1
423.71 s
> Checking momtrop v0.3.0
423.71 s
> Compiling pyo3-macros v0.28.3
423.71 s
> Compiling pyo3-stub-gen-derive v0.17.2
423.71 s
> Checking pyo3-stub-gen v0.17.2
423.71 s
> Checking symbolica-utils v0.1.0 (/build/source/crates/symbolica-utils)
423.71 s
> Checking spenso-macros v0.3.2 (/build/source/crates/spenso-macros)
423.71 s
> Compiling gammaloop-workspace-hack v0.1.0 (/build/source/crates/gammaloop-workspace-hack)
423.71 s
> Checking linnet v0.17.0 (/build/source/crates/linnet)
423.71 s
> Checking spenso v0.6.0 (/build/source/crates/spenso)
423.71 s
> Checking linnet-py v0.1.0 (/build/source/crates/linnet-py)
423.71 s
> Checking linnest v0.1.0 (/build/source/crates/linnest)
423.71 s
> Checking idenso v0.3.0 (/build/source/crates/idenso)
423.71 s
> Checking gammaloop-tracing-filter v0.1.0 (/build/source/crates/gammaloop-tracing-filter)
423.71 s
> Checking spenso-hep-lib v0.1.7 (/build/source/crates/spenso-hep-lib)
423.71 s
> Checking spynso3 v0.1.2 (/build/source/crates/spynso3)
423.71 s
> error[E0560] : struct `CutInfo` has no field named `lmb_channel_id`
423.71 s
> --> tests/tests/test_differential.rs:86:13
423.71 s
> |
423.71 s
> 86 | lmb_channel_id: None,
423.71 s
> | ^^^^^^^^^^^^^^ `CutInfo` does not have this field
423.71 s
> |
423.71 s
> = note : available fields are: `sampling_channel_id`, `sampling_channel_edge_ids`
423.71 s
>
423.71 s
> error[E0560] : struct `CutInfo` has no field named `lmb_channel_edge_ids`
423.71 s
> --> tests/tests/test_differential.rs:87:13
423.71 s
> |
423.71 s
> 87 | lmb_channel_edge_ids: None,
423.71 s
> | ^^^^^^^^^^^^^^^^^^^^ `CutInfo` does not have this field
423.71 s
> |
423.71 s
> = note : available fields are: `sampling_channel_id`, `sampling_channel_edge_ids`
423.71 s
>
423.71 s
> error[E0063] : missing field `reference_moments` in initializer of `GraphEvaluationResult<_>`
423.71 s
> --> tests/tests/test_differential.rs:532:19
423.71 s
> |
423.71 s
> 532 | let mut lhs = GraphEvaluationResult {
423.71 s
> | ^^^^^^^^^^^^^^^^^^^^^ missing `reference_moments`
423.71 s
>
423.71 s
> error[E0063] : missing field `reference_moments` in initializer of `GraphEvaluationResult<_>`
423.71 s
> --> tests/tests/test_differential.rs:539:15
423.71 s
> |
423.71 s
> 539 | let rhs = GraphEvaluationResult {
423.71 s
> | ^^^^^^^^^^^^^^^^^^^^^ missing `reference_moments`
423.71 s
>
423.71 s
> error[E0609] : no field `lmb_channel_edge_ids` on type `CutInfo`
423.71 s
> --> tests/tests/test_evaluation_api.rs:311:10
423.71 s
> |
423.71 s
> 311 | .lmb_channel_edge_ids
423.71 s
> | ^^^^^^^^^^^^^^^^^^^^ unknown field
423.71 s
> |
423.71 s
> = note : available fields are: `particle_pdgs`, `cut_id`, `graph_id`, `graph_group_id`, `orientation_id` ... and 2 others
423.71 s
>
423.71 s
> error[E0609] : no field `lmb_channel_edge_ids` on type `CutInfo`
423.71 s
> --> tests/tests/test_evaluation_api.rs:591:26
423.71 s
> |
423.71 s
> 591 | .lmb_channel_edge_ids
423.71 s
> | ^^^^^^^^^^^^^^^^^^^^ unknown field
423.71 s
> |
423.71 s
> = note : available fields are: `particle_pdgs`, `cut_id`, `graph_id`, `graph_group_id`, `orientation_id` ... and 2 others
423.71 s
>
423.71 s
> Some errors have detailed explanations: E0063, E0560.
423.71 s
> For more information about an error, try `rustc --explain E0063`.
423.71 s
> error : could not compile `gammaloop-integration-tests` (test "test_differential") due to 4 previous errors
423.71 s
> warning : build failed, waiting for other jobs to finish...
423.71 s
> error[E0609] : no field `lmb_channel_edge_ids` on type `CutInfo`
423.71 s
> --> tests/tests/test_evaluation_api.rs:1177:18
423.71 s
> |
423.71 s
> 1177 | .lmb_channel_edge_ids
423.71 s
> | ^^^^^^^^^^^^^^^^^^^^ unknown field
423.71 s
> |
423.71 s
> = note : available fields are: `particle_pdgs`, `cut_id`, `graph_id`, `graph_group_id`, `orientation_id` ... and 2 others
423.71 s
>
423.71 s
> error[E0609] : no field `lmb_channel_edge_ids` on type `CutInfo`
423.71 s
> --> tests/tests/test_evaluation_api.rs:1222:22
423.71 s
> |
423.71 s
> 1222 | .lmb_channel_edge_ids
423.71 s
> | ^^^^^^^^^^^^^^^^^^^^ unknown field
423.71 s
> |
423.71 s
> = note : available fields are: `particle_pdgs`, `cut_id`, `graph_id`, `graph_group_id`, `orientation_id` ... and 2 others
423.71 s
>
423.71 s
> error[E0609] : no field `lmb_channel_edge_ids` on type `CutInfo`
423.71 s
> --> tests/tests/test_evaluation_api.rs:1281:14
423.71 s
> |
423.71 s
> 1281 | .lmb_channel_edge_ids
423.71 s
> | ^^^^^^^^^^^^^^^^^^^^ unknown field
423.71 s
> |
423.71 s
> = note : available fields are: `particle_pdgs`, `cut_id`, `graph_id`, `graph_group_id`, `orientation_id` ... and 2 others
423.71 s
>
423.71 s
> error[E0609] : no field `lmb_channel_edge_ids` on type `CutInfo`
423.71 s
> --> tests/tests/test_evaluation_api.rs:1428:18
423.71 s
> |
423.71 s
> 1428 | .lmb_channel_edge_ids
423.71 s
> | ^^^^^^^^^^^^^^^^^^^^ unknown field
423.71 s
> |
423.71 s
> = note : available fields are: `particle_pdgs`, `cut_id`, `graph_id`, `graph_group_id`, `orientation_id` ... and 2 others
423.71 s
>
423.71 s
> For more information about this error, try `rustc --explain E0609`.
423.71 s
> error : could not compile `gammaloop-integration-tests` (test "test_evaluation_api") due to 6 previous errors
423.71 s
> error[E0609] : no field `lmb_channel_id` on type `CutInfo`
423.71 s
> --> tests/tests/test_runs/utils.rs:568:36
423.71 s
> |
423.71 s
> 568 | event.cut_info.lmb_channel_id,
423.71 s
> | ^^^^^^^^^^^^^^ unknown field
423.71 s
> |
423.71 s
> = note : available fields are: `particle_pdgs`, `cut_id`, `graph_id`, `graph_group_id`, `orientation_id` ... and 2 others
423.71 s
>
423.71 s
> error[E0609] : no field `lmb_channel_id` on type `CutInfo`
423.71 s
> --> tests/tests/test_runs/utils.rs:580:36
423.71 s
> |
423.71 s
> 580 | event.cut_info.lmb_channel_id,
423.71 s
> | ^^^^^^^^^^^^^^ unknown field
423.71 s
> |
423.71 s
> = note : available fields are: `particle_pdgs`, `cut_id`, `graph_id`, `graph_group_id`, `orientation_id` ... and 2 others
423.71 s
>
423.71 s
> error : could not compile `gammaloop-integration-tests` (test "test_runs") due to 2 previous errors
423.71 s
For full logs, run:
423.71 s
nix log /nix/store/axwybdrvnz6g31i8j22ivzmz2ysf3s4g-gammaloop-workspace-check-0.1.0.drv
423.81 s
Build failed.