1. 0.00 s $ /nix/store/9ypz3flqsrl5xl495mm8h645gadjsxi1-coreutils-9.11/bin/timeout --kill-after=15s 7200s /nix/store/23zk8sgzamrbmj1fday15szf7f2279s8-nix-2.34.7/bin/nix --extra-experimental-features nix-command --extra-experimental-features flakes --log-format internal-json build --no-link --print-out-paths git+https://github.com/alphal00p/gammaloop?ref=advanced_sampling&rev=1df7aa38b6fd28fa9cd50ca94e59c90067ab0bb7&shallow=1#checks.x86_64-linux.gammaloop-check --print-build-logs
  2. 0.10 s error (ignored): SQLite database '/var/cache/nix-ci-worker/eval-cache-v6/7db5b3ee960e117db536bb846779e7633d150451926acbd99d708a335ef61e1a.sqlite' is busy
  3. 2.22 s
  4. 2.44 s Building /nix/store/axwybdrvnz6g31i8j22ivzmz2ysf3s4g-gammaloop-workspace-check-0.1.0.drv
  5. 2.51 s [gammaloop-workspace-check] Phase: unpackPhase
  6. 2.52 s [gammaloop-workspace-check] unpacking source archive /nix/store/z5pb9ly08pscbnc755wvrwn7ad3dvc0j-source
  7. 2.65 s [gammaloop-workspace-check] source root is source
  8. 2.69 s [gammaloop-workspace-check] Phase: patchPhase
  9. 2.69 s [gammaloop-workspace-check] Executing configureCargoCommonVars
  10. 2.70 s [gammaloop-workspace-check] decompressing cargo artifacts from /nix/store/50vpxlcgfxf2d57i27v3d10zjwxxbm2r-gammaloop-workspace-deps-deps-0.1.0/target.tar.zst to target
  11. 3.79 s [gammaloop-workspace-check] Phase: updateAutotoolsGnuConfigScriptsPhase
  12. 3.83 s [gammaloop-workspace-check] Phase: configurePhase
  13. 3.84 s [gammaloop-workspace-check] will append /build/source/.cargo-home/config.toml with contents of /nix/store/5drf77x6km4ky7gwlrzdx9bbd6fz09g3-vendor-cargo-deps/config.toml
  14. 3.84 s [gammaloop-workspace-check] default configurePhase, nothing to do
  15. 3.84 s [gammaloop-workspace-check] Phase: buildPhase
  16. 3.84 s [gammaloop-workspace-check] +++ command cargo --version
  17. 3.85 s [gammaloop-workspace-check] cargo 1.97.0 (c980f4866 2026-06-30)
  18. 3.88 s [gammaloop-workspace-check] +++ command cargo check --profile ci-optim --locked --workspace --features gammaloop-tracing-filter/clap,gammaloop-tracing-filter/symbolica,idenso/bincode,idenso/reference-cases,linnet/bincode,linnet/drawing,linnet/rkyv,linnet/serde,linnet/symbolica,spenso-macros/shadowing,spenso/shadowing,symbolica/tracing_max_level_info,three-dimensional-reps/display,three-dimensional-reps/eval,three-dimensional-reps/serde --all-targets
  19. 4.32 s [gammaloop-workspace-check] Checking cfg-if v1.0.4
  20. 4.32 s [gammaloop-workspace-check] Checking memchr v2.8.0
  21. 4.32 s [gammaloop-workspace-check] Checking once_cell v1.21.4
  22. 4.33 s [gammaloop-workspace-check] Checking either v1.15.0
  23. 4.33 s [gammaloop-workspace-check] Checking serde_core v1.0.228
  24. 4.33 s [gammaloop-workspace-check] Checking libc v0.2.186
  25. 4.34 s [gammaloop-workspace-check] Checking libm v0.2.16
  26. 4.34 s [gammaloop-workspace-check] Checking itoa v1.0.18
  27. 4.34 s [gammaloop-workspace-check] Checking log v0.4.29
  28. 4.34 s [gammaloop-workspace-check] Checking regex-syntax v0.8.10
  29. 4.36 s [gammaloop-workspace-check] Checking zerocopy v0.8.48
  30. 4.36 s [gammaloop-workspace-check] Checking crossbeam-utils v0.8.21
  31. 4.36 s [gammaloop-workspace-check] Checking equivalent v1.0.2
  32. 4.37 s [gammaloop-workspace-check] Checking zmij v1.0.21
  33. 4.37 s [gammaloop-workspace-check] Checking lazy_static v1.5.0
  34. 4.37 s [gammaloop-workspace-check] Checking bytemuck v1.25.0
  35. 4.38 s [gammaloop-workspace-check] Compiling target-lexicon v0.13.5
  36. 4.41 s [gammaloop-workspace-check] Checking arrayvec v0.7.6
  37. 4.43 s [gammaloop-workspace-check] Checking powerfmt v0.2.0
  38. 4.44 s [gammaloop-workspace-check] Checking pin-project-lite v0.2.17
  39. 4.44 s [gammaloop-workspace-check] Checking itertools v0.14.0
  40. 4.46 s [gammaloop-workspace-check] Checking time-core v0.1.8
  41. 4.46 s [gammaloop-workspace-check] Checking num-conv v0.2.1
  42. 4.49 s [gammaloop-workspace-check] Checking num_threads v0.1.7
  43. 4.51 s [gammaloop-workspace-check] Checking safe_arch v0.7.4
  44. 4.56 s [gammaloop-workspace-check] Checking tracing-core v0.1.36
  45. 4.56 s [gammaloop-workspace-check] Checking foldhash v0.2.0
  46. 4.57 s [gammaloop-workspace-check] Checking allocator-api2 v0.2.21
  47. 4.57 s [gammaloop-workspace-check] Checking deranged v0.5.8
  48. 4.62 s [gammaloop-workspace-check] Checking const-random v0.1.18
  49. 4.64 s [gammaloop-workspace-check] Checking nu-ansi-term v0.50.3
  50. 4.67 s [gammaloop-workspace-check] Checking winnow v1.0.2
  51. 4.69 s [gammaloop-workspace-check] Checking unty v0.0.4
  52. 4.69 s [gammaloop-workspace-check] Checking crossbeam-epoch v0.9.18
  53. 4.71 s [gammaloop-workspace-check] Checking aho-corasick v1.1.4
  54. 4.75 s [gammaloop-workspace-check] Checking static_assertions v1.1.0
  55. 4.81 s [gammaloop-workspace-check] Checking safe_arch v1.0.0
  56. 4.83 s [gammaloop-workspace-check] Checking wide v0.7.33
  57. 4.84 s [gammaloop-workspace-check] Checking hashbrown v0.16.1
  58. 4.85 s [gammaloop-workspace-check] Checking sharded-slab v0.1.7
  59. 4.89 s [gammaloop-workspace-check] Checking crossbeam-deque v0.8.6
  60. 4.91 s [gammaloop-workspace-check] Checking tracing v0.1.44
  61. 5.02 s [gammaloop-workspace-check] Checking rayon-core v1.13.0
  62. 5.10 s [gammaloop-workspace-check] Checking tracing-log v0.2.0
  63. 5.23 s [gammaloop-workspace-check] Checking num-traits v0.2.19
  64. 5.26 s [gammaloop-workspace-check] Checking thread_local v1.1.9
  65. 5.30 s [gammaloop-workspace-check] Checking az v1.3.0
  66. 5.31 s [gammaloop-workspace-check] Checking rayon v1.12.0
  67. 5.37 s [gammaloop-workspace-check] Checking indenter v0.3.4
  68. 5.39 s [gammaloop-workspace-check] Checking toml_writer v1.1.1+spec-1.1.0
  69. 5.43 s [gammaloop-workspace-check] Checking wide v1.3.0
  70. 5.49 s [gammaloop-workspace-check] Compiling phf_shared v0.11.3
  71. 5.53 s [gammaloop-workspace-check] Checking anyhow v1.0.102
  72. 5.54 s [gammaloop-workspace-check] Checking alloc-no-stdlib v2.0.4
  73. 5.58 s [gammaloop-workspace-check] Checking rawpointer v0.2.1
  74. 5.62 s [gammaloop-workspace-check] Checking dyn-clone v1.0.20
  75. 5.64 s [gammaloop-workspace-check] Checking utf8parse v0.2.2
  76. 5.65 s [gammaloop-workspace-check] Checking toml_parser v1.1.2+spec-1.1.0
  77. 5.66 s [gammaloop-workspace-check] Checking alloc-stdlib v0.2.2
  78. 5.71 s [gammaloop-workspace-check] Checking matrixmultiply v0.3.10
  79. 5.74 s [gammaloop-workspace-check] Checking getrandom v0.3.4
  80. 5.75 s [gammaloop-workspace-check] Checking time v0.3.47
  81. 5.75 s [gammaloop-workspace-check] Checking gmp-mpfr-sys v1.7.1
  82. 5.77 s [gammaloop-workspace-check] Checking anstyle-parse v1.0.0
  83. 5.78 s [gammaloop-workspace-check] Checking colored v3.1.1
  84. 5.82 s [gammaloop-workspace-check] Checking regex-automata v0.4.14
  85. 5.84 s [gammaloop-workspace-check] Checking approx v0.5.1
  86. 5.87 s [gammaloop-workspace-check] Checking rand_core v0.9.5
  87. 5.92 s [gammaloop-workspace-check] Checking num-integer v0.1.46
  88. 6.00 s [gammaloop-workspace-check] Checking anstyle-query v1.1.5
  89. 6.01 s [gammaloop-workspace-check] Checking anstyle v1.0.14
  90. 6.02 s [gammaloop-workspace-check] Checking is_terminal_polyfill v1.70.2
  91. 6.04 s [gammaloop-workspace-check] Checking colorchoice v1.0.5
  92. 6.04 s [gammaloop-workspace-check] Compiling phf_generator v0.11.3
  93. 6.06 s [gammaloop-workspace-check] Checking eyre v0.6.12
  94. 6.08 s [gammaloop-workspace-check] Checking unicode-width v0.2.2
  95. 6.10 s [gammaloop-workspace-check] Compiling pyo3-build-config v0.28.3
  96. 6.11 s [gammaloop-workspace-check] Checking bitflags v1.3.2
  97. 6.13 s [gammaloop-workspace-check] Checking wasmtime-jit-icache-coherence v34.0.2
  98. 6.14 s [gammaloop-workspace-check] Checking brotli-decompressor v5.0.0
  99. 6.16 s [gammaloop-workspace-check] Checking anstream v1.0.0
  100. 6.16 s [gammaloop-workspace-check] Checking hugepage-rs v0.1.1
  101. 6.18 s [gammaloop-workspace-check] Checking region v3.0.2
  102. 6.19 s [gammaloop-workspace-check] Checking spec_math v0.1.6
  103. 6.23 s [gammaloop-workspace-check] Checking inventory v0.3.24
  104. 6.28 s [gammaloop-workspace-check] Checking serde v1.0.228
  105. 6.29 s [gammaloop-workspace-check] Checking serde_json v1.0.149
  106. 6.31 s [gammaloop-workspace-check] Checking bitflags v2.11.1
  107. 6.33 s [gammaloop-workspace-check] Checking serde_spanned v1.1.1
  108. 6.34 s [gammaloop-workspace-check] Checking toml_datetime v1.1.1+spec-1.1.0
  109. 6.36 s [gammaloop-workspace-check] Compiling phf_codegen v0.11.3
  110. 6.41 s [gammaloop-workspace-check] Checking thiserror v2.0.18
  111. 6.45 s [gammaloop-workspace-check] Compiling getopts v0.2.24
  112. 6.47 s [gammaloop-workspace-check] Checking libloading v0.9.0
  113. 6.49 s [gammaloop-workspace-check] Checking append-only-vec v0.1.8
  114. 6.51 s [gammaloop-workspace-check] Checking self_cell v1.2.2
  115. 6.62 s [gammaloop-workspace-check] Checking byteorder v1.5.0
  116. 6.67 s [gammaloop-workspace-check] Checking tinyjson v2.5.1
  117. 6.68 s [gammaloop-workspace-check] Checking bytes v1.11.1
  118. 6.71 s [gammaloop-workspace-check] Checking toml v1.1.2+spec-1.1.0
  119. 6.73 s [gammaloop-workspace-check] Compiling unicode_names2_generator v1.3.0
  120. 6.75 s [gammaloop-workspace-check] Checking smallvec v1.15.1
  121. 6.76 s [gammaloop-workspace-check] Checking num-complex v0.4.6
  122. 6.83 s [gammaloop-workspace-check] Checking tracing-serde v0.2.0
  123. 6.89 s [gammaloop-workspace-check] Checking bincode v2.0.1
  124. 6.95 s [gammaloop-workspace-check] Checking smartstring v1.0.1
  125. 6.97 s [gammaloop-workspace-check] Checking linux-raw-sys v0.12.1
  126. 7.03 s [gammaloop-workspace-check] Checking brotli v8.0.2
  127. 7.10 s [gammaloop-workspace-check] Checking simba v0.9.1
  128. 7.18 s [gammaloop-workspace-check] Compiling unic-char-range v0.9.0
  129. 7.19 s [gammaloop-workspace-check] Compiling unic-common v0.9.0
  130. 7.30 s [gammaloop-workspace-check] Compiling unic-ucd-version v0.9.0
  131. 7.31 s [gammaloop-workspace-check] Compiling unic-char-property v0.9.0
  132. 7.35 s [gammaloop-workspace-check] Compiling is-macro v0.3.7
  133. 7.35 s [gammaloop-workspace-check] Compiling rustpython-parser-vendored v0.4.0
  134. 7.39 s [gammaloop-workspace-check] Checking iana-time-zone v0.1.65
  135. 7.41 s [gammaloop-workspace-check] Compiling rustpython-parser v0.4.0
  136. 7.46 s [gammaloop-workspace-check] Compiling phf v0.11.3
  137. 7.47 s [gammaloop-workspace-check] Checking rustc-hash v2.1.2
  138. 7.50 s [gammaloop-workspace-check] Checking chrono v0.4.44
  139. 7.51 s [gammaloop-workspace-check] Compiling unic-ucd-ident v0.9.0
  140. 7.53 s [gammaloop-workspace-check] Checking rustix v1.1.4
  141. 7.57 s [gammaloop-workspace-check] Compiling unic-emoji-char v0.9.0
  142. 7.60 s [gammaloop-workspace-check] Checking ndarray v0.17.2
  143. 7.63 s [gammaloop-workspace-check] Compiling lalrpop-util v0.20.2
  144. 7.82 s [gammaloop-workspace-check] Compiling rustc-hash v1.1.0
  145. 7.85 s [gammaloop-workspace-check] Checking rug v1.30.0
  146. 7.87 s [gammaloop-workspace-check] Checking unicode-segmentation v1.13.2
  147. 7.92 s [gammaloop-workspace-check] Compiling symbolica v2.2.0 (https://github.com/alphal00p/symbolica?rev=a277a8dadbaae5a8d6605f2f381991a601e1f345#a277a8da)
  148. 7.97 s [gammaloop-workspace-check] Checking typenum v1.20.0
  149. 7.99 s [gammaloop-workspace-check] Checking ppv-lite86 v0.2.21
  150. 8.05 s [gammaloop-workspace-check] Checking ahash v0.8.12
  151. 8.26 s [gammaloop-workspace-check] Checking getrandom v0.2.17
  152. 8.37 s [gammaloop-workspace-check] Checking scopeguard v1.2.0
  153. 8.44 s [gammaloop-workspace-check] Checking lock_api v0.4.14
  154. 8.45 s [gammaloop-workspace-check] Checking parking_lot_core v0.9.12
  155. 8.46 s [gammaloop-workspace-check] Checking rand_chacha v0.9.0
  156. 8.61 s [gammaloop-workspace-check] Checking hashbrown v0.17.0
  157. 8.63 s [gammaloop-workspace-check] Checking unicode-ident v1.0.24
  158. 8.66 s [gammaloop-workspace-check] Checking rand v0.9.4
  159. 8.68 s [gammaloop-workspace-check] Checking parking_lot v0.12.5
  160. 8.69 s [gammaloop-workspace-check] Checking errno v0.3.14
  161. 8.81 s [gammaloop-workspace-check] Checking clap_lex v1.1.0
  162. 8.83 s [gammaloop-workspace-check] Checking generic-array v0.14.7
  163. 8.85 s [gammaloop-workspace-check] Checking unicase v2.9.0
  164. 8.85 s [gammaloop-workspace-check] Checking strsim v0.11.1
  165. 8.86 s [gammaloop-workspace-check] Checking matchers v0.2.0
  166. 8.92 s [gammaloop-workspace-check] Checking regex v1.12.3
  167. 8.97 s [gammaloop-workspace-check] Checking tracing-subscriber v0.3.23
  168. 9.01 s [gammaloop-workspace-check] Checking signal-hook-registry v1.4.8
  169. 9.07 s [gammaloop-workspace-check] Checking vte v0.14.1
  170. 9.19 s [gammaloop-workspace-check] Checking same-file v1.0.6
  171. 9.25 s [gammaloop-workspace-check] Checking signal-hook v0.3.18
  172. 9.30 s [gammaloop-workspace-check] Checking half v2.7.1
  173. 9.34 s [gammaloop-workspace-check] Checking symjit v2.21.0
  174. 9.43 s [gammaloop-workspace-check] Checking indexmap v2.14.0
  175. 9.45 s [gammaloop-workspace-check] Checking crypto-common v0.1.7
  176. 9.46 s [gammaloop-workspace-check] Checking walkdir v2.5.0
  177. 9.56 s [gammaloop-workspace-check] Checking block-buffer v0.10.4
  178. 9.69 s [gammaloop-workspace-check] Checking mio v1.2.0
  179. 9.72 s [gammaloop-workspace-check] Checking terminal_size v0.4.4
  180. 9.73 s [gammaloop-workspace-check] Checking minimal-lexical v0.2.1
  181. 9.87 s [gammaloop-workspace-check] Checking clap_builder v4.6.0
  182. 9.93 s [gammaloop-workspace-check] Checking ciborium-io v0.2.2
  183. 9.96 s [gammaloop-workspace-check] Checking digest v0.10.7
  184. 9.99 s [gammaloop-workspace-check] Checking ciborium-ll v0.2.2
  185. 10.03 s [gammaloop-workspace-check] Checking nom v7.1.3
  186. 10.24 s [gammaloop-workspace-check] Checking derive_more v2.1.1
  187. 10.33 s [gammaloop-workspace-check] Checking num-bigint v0.4.6
  188. 10.34 s [gammaloop-workspace-check] Checking console v0.16.3
  189. 10.61 s [gammaloop-workspace-check] Checking signal-hook-mio v0.2.5
  190. 10.83 s [gammaloop-workspace-check] Checking bstr v1.12.1
  191. 10.97 s [gammaloop-workspace-check] Checking linux-raw-sys v0.4.15
  192. 11.36 s [gammaloop-workspace-check] Checking winnow v0.7.15
  193. 11.39 s [gammaloop-workspace-check] Checking cpufeatures v0.2.17
  194. 11.47 s [gammaloop-workspace-check] Checking sha2 v0.10.9
  195. 11.76 s [gammaloop-workspace-check] Checking rustix v0.38.44
  196. 12.06 s [gammaloop-workspace-check] Checking ciborium v0.2.2
  197. 12.12 s [gammaloop-workspace-check] Checking globset v0.4.18
  198. 12.25 s [gammaloop-workspace-check] Checking rand_core v0.6.4
  199. 12.28 s [gammaloop-workspace-check] Compiling unicode_names2 v1.3.0
  200. 12.75 s [gammaloop-workspace-check] Checking getrandom v0.4.2
  201. 12.96 s [gammaloop-workspace-check] Checking plotters-backend v0.3.7
  202. 13.02 s [gammaloop-workspace-check] Checking fnv v1.0.7
  203. 13.13 s [gammaloop-workspace-check] Checking fastrand v2.4.1
  204. 13.14 s [gammaloop-workspace-check] Checking rust-embed-utils v8.11.0
  205. 13.43 s [gammaloop-workspace-check] Checking xprec v0.2.2
  206. 13.46 s [gammaloop-workspace-check] Checking plotters-svg v0.3.7
  207. 13.49 s [gammaloop-workspace-check] Checking toml_datetime v0.6.11
  208. 13.52 s [gammaloop-workspace-check] Checking tempfile v3.27.0
  209. 13.55 s [gammaloop-workspace-check] Checking serde_spanned v0.6.9
  210. 13.83 s [gammaloop-workspace-check] Checking itertools v0.10.5
  211. 13.85 s [gammaloop-workspace-check] Checking toml_write v0.1.2
  212. 13.85 s [gammaloop-workspace-check] Checking tap v1.0.1
  213. 14.04 s [gammaloop-workspace-check] Checking ansitok v0.3.0
  214. 14.20 s [gammaloop-workspace-check] Checking crossterm v0.28.1
  215. 14.51 s [gammaloop-workspace-check] Checking cast v0.3.0
  216. 14.66 s [gammaloop-workspace-check] Checking plotters v0.3.7
  217. 14.66 s [gammaloop-workspace-check] Checking wyz v0.5.1
  218. 14.81 s [gammaloop-workspace-check] Checking rand_chacha v0.3.1
  219. 15.15 s [gammaloop-workspace-check] Checking radium v0.7.0
  220. 15.20 s [gammaloop-workspace-check] Checking typeid v1.0.3
  221. 15.24 s [gammaloop-workspace-check] Checking similar v2.7.0
  222. 15.29 s [gammaloop-workspace-check] Checking tinytemplate v1.2.1
  223. 15.40 s [gammaloop-workspace-check] Checking ansi-str v0.9.0
  224. 15.52 s [gammaloop-workspace-check] Checking is-terminal v0.4.17
  225. 15.60 s [gammaloop-workspace-check] Checking oorandom v11.1.5
  226. 15.69 s [gammaloop-workspace-check] Checking bytecount v0.6.9
  227. 15.77 s [gammaloop-workspace-check] Checking toml_edit v0.22.27
  228. 15.78 s [gammaloop-workspace-check] Checking funty v2.0.0
  229. 15.87 s [gammaloop-workspace-check] Checking clap v4.6.1
  230. 15.95 s [gammaloop-workspace-check] Checking anes v0.1.6
  231. 16.05 s [gammaloop-workspace-check] Checking testing_table v0.3.0
  232. 16.10 s [gammaloop-workspace-check] Checking ron v0.12.1
  233. 16.13 s [gammaloop-workspace-check] Checking papergrid v0.17.0
  234. 16.27 s [gammaloop-workspace-check] Checking rand v0.8.6
  235. 16.37 s [gammaloop-workspace-check] Checking toml_edit v0.25.11+spec-1.1.0
  236. 16.63 s [gammaloop-workspace-check] Checking uncased v0.9.10
  237. 16.95 s [gammaloop-workspace-check] Checking env_filter v1.0.1
  238. 17.30 s [gammaloop-workspace-check] Checking bitvec v1.0.1
  239. 17.37 s [gammaloop-workspace-check] Checking criterion-plot v0.5.0
  240. 17.49 s [gammaloop-workspace-check] Checking jiff v0.2.24
  241. 17.66 s [gammaloop-workspace-check] Checking ptr_meta v0.1.4
  242. 17.66 s [gammaloop-workspace-check] Checking ucd-trie v0.1.7
  243. 17.80 s [gammaloop-workspace-check] Checking simdutf8 v0.1.5
  244. 17.90 s [gammaloop-workspace-check] Checking pest v2.8.6
  245. 17.96 s [gammaloop-workspace-check] Checking ahash v0.7.8
  246. 18.17 s [gammaloop-workspace-check] Checking approx v0.4.0
  247. 18.42 s [gammaloop-workspace-check] Checking seahash v4.1.0
  248. 18.47 s [gammaloop-workspace-check] Checking hashbrown v0.12.3
  249. 18.48 s [gammaloop-workspace-check] Checking bytecheck v0.6.12
  250. 18.55 s [gammaloop-workspace-check] Checking cgmath v0.18.0
  251. 18.68 s [gammaloop-workspace-check] Checking num-rational v0.4.2
  252. 18.98 s [gammaloop-workspace-check] Checking rend v0.4.2
  253. 19.22 s [gammaloop-workspace-check] Checking criterion v0.5.1
  254. 19.24 s [gammaloop-workspace-check] Checking num-iter v0.1.45
  255. 19.31 s [gammaloop-workspace-check] Checking ref-ops v0.2.5
  256. 19.33 s [gammaloop-workspace-check] Checking rand_xoshiro v0.6.0
  257. 19.42 s [gammaloop-workspace-check] Checking num v0.4.3
  258. 19.48 s [gammaloop-workspace-check] Checking features v0.10.0
  259. 19.52 s [gammaloop-workspace-check] Checking gat-lending-iterator v0.1.8
  260. 19.57 s [gammaloop-workspace-check] Checking insta v1.47.2
  261. 19.64 s [gammaloop-workspace-check] Checking constcat v0.5.1
  262. 19.98 s [gammaloop-workspace-check] Checking colored v2.2.0
  263. 20.02 s [gammaloop-workspace-check] Checking cpufeatures v0.3.0
  264. 20.10 s [gammaloop-workspace-check] Checking constant_time_eq v0.4.2
  265. 20.33 s [gammaloop-workspace-check] Checking arrayref v0.3.9
  266. 20.35 s [gammaloop-workspace-check] Checking base64 v0.22.1
  267. 20.41 s [gammaloop-workspace-check] Checking blake3 v1.8.5
  268. 20.52 s [gammaloop-workspace-check] Checking tabled v0.20.0
  269. 20.80 s [gammaloop-workspace-check] Checking joinery v2.1.0
  270. 20.83 s [gammaloop-workspace-check] Checking siphasher v1.0.2
  271. 21.10 s [gammaloop-workspace-check] Checking titlecase v2.2.1
  272. 21.25 s [gammaloop-workspace-check] Checking phf_shared v0.13.1
  273. 21.31 s [gammaloop-workspace-check] Checking subprocess v0.2.15
  274. 21.37 s [gammaloop-workspace-check] Compiling pyo3-ffi v0.28.3
  275. 21.44 s [gammaloop-workspace-check] Compiling pyo3-macros-backend v0.28.3
  276. 21.54 s [gammaloop-workspace-check] Compiling pyo3 v0.28.3
  277. 21.58 s [gammaloop-workspace-check] Compiling numpy v0.28.0
  278. 21.77 s [gammaloop-workspace-check] Checking toml v0.8.23
  279. 22.39 s [gammaloop-workspace-check] Checking dot-parser v0.5.1
  280. 22.41 s [gammaloop-workspace-check] Checking rust_lisp v0.18.0
  281. 22.42 s [gammaloop-workspace-check] Compiling vakint v0.1.2 (/build/source/crates/vakint)
  282. 22.96 s [gammaloop-workspace-check] Checking figment v0.10.19
  283. 22.97 s [gammaloop-workspace-check] Checking phf v0.13.1
  284. 23.53 s [gammaloop-workspace-check] Checking version-compare v0.2.1
  285. 23.53 s [gammaloop-workspace-check] Checking xpct v0.5.1
  286. 23.57 s [gammaloop-workspace-check] Checking ryu v1.0.23
  287. 24.07 s [gammaloop-workspace-check] Checking string-template-plus v0.4.3
  288. 24.07 s [gammaloop-workspace-check] Checking castaway v0.2.4
  289. 24.17 s [gammaloop-workspace-check] Checking toml_datetime v0.7.5+spec-1.1.0
  290. 24.25 s [gammaloop-workspace-check] Checking strum v0.27.2
  291. 24.37 s [gammaloop-workspace-check] Checking compact_str v0.9.0
  292. 24.44 s [gammaloop-workspace-check] Checking unicode-truncate v2.0.1
  293. 24.55 s [gammaloop-workspace-check] Checking toml v0.9.12+spec-1.1.0
  294. 24.57 s [gammaloop-workspace-check] Checking kasuari v0.4.12
  295. 24.78 s [gammaloop-workspace-check] Checking lru v0.16.4
  296. 25.41 s [gammaloop-workspace-check] Checking vte v0.15.0
  297. 25.41 s [gammaloop-workspace-check] Checking portable-atomic v1.13.1
  298. 25.66 s [gammaloop-workspace-check] Checking unit-prefix v0.5.2
  299. 25.67 s [gammaloop-workspace-check] Checking rand_distr v0.4.3
  300. 25.86 s [gammaloop-workspace-check] Checking simba v0.6.0
  301. 25.91 s [gammaloop-workspace-check] Checking line-clipping v0.3.7
  302. 25.97 s [gammaloop-workspace-check] Compiling three-dimensional-reps v0.1.0 (/build/source/crates/three-dimensional-reps)
  303. 26.04 s [gammaloop-workspace-check] Checking vt100 v0.16.2
  304. 26.14 s [gammaloop-workspace-check] Checking adler2 v2.0.1
  305. 26.26 s [gammaloop-workspace-check] Checking ratatui-core v0.1.0
  306. 26.26 s [gammaloop-workspace-check] Checking gimli v0.32.3
  307. 26.30 s [gammaloop-workspace-check] Checking thiserror v1.0.69
  308. 26.36 s [gammaloop-workspace-check] Checking miniz_oxide v0.8.9
  309. 26.42 s [gammaloop-workspace-check] Checking derive_builder v0.11.2
  310. 26.47 s [gammaloop-workspace-check] Checking crossterm v0.29.0
  311. 26.62 s [gammaloop-workspace-check] Checking owo-colors v4.3.0
  312. 26.76 s [gammaloop-workspace-check] Checking object v0.37.3
  313. 26.89 s [gammaloop-workspace-check] Checking env_logger v0.11.10
  314. 26.90 s [gammaloop-workspace-check] Checking tracing-error v0.2.1
  315. 27.06 s [gammaloop-workspace-check] Checking indicatif v0.18.4
  316. 27.37 s [gammaloop-workspace-check] Checking typed-index-collections v3.5.0
  317. 27.45 s [gammaloop-workspace-check] Checking serde-big-array v0.5.1
  318. 27.59 s [gammaloop-workspace-check] Checking amd v0.2.2
  319. 27.75 s [gammaloop-workspace-check] Checking itertools v0.11.0
  320. 27.80 s [gammaloop-workspace-check] Compiling gammaloop-tracing-filter-macros v0.1.0 (/build/source/crates/gammaloop-tracing-filter-macros)
  321. 28.01 s [gammaloop-workspace-check] Checking rustc-demangle v0.1.27
  322. 28.13 s [gammaloop-workspace-check] Checking option-ext v0.2.0
  323. 28.24 s [gammaloop-workspace-check] Checking dirs-sys v0.5.0
  324. 28.37 s [gammaloop-workspace-check] Checking ref-cast v1.0.25
  325. 28.49 s [gammaloop-workspace-check] Checking nix v0.31.2
  326. 28.50 s [gammaloop-workspace-check] Checking integer-sqrt v0.1.5
  327. 28.62 s [gammaloop-workspace-check] Checking brotli-decompressor v4.0.3
  328. 28.66 s [gammaloop-workspace-check] Checking crossbeam-channel v0.5.15
  329. 28.75 s [gammaloop-workspace-check] Checking rkyv v0.7.46
  330. 28.98 s [gammaloop-workspace-check] Checking itertools v0.12.1
  331. 28.99 s [gammaloop-workspace-check] Checking symlink v0.1.0
  332. 29.16 s [gammaloop-workspace-check] Compiling gammalooprs v0.3.4 (/build/source/crates/gammalooprs)
  333. 29.22 s [gammaloop-workspace-check] Checking ratatui-widgets v0.3.0
  334. 29.62 s [gammaloop-workspace-check] Checking color-spantrace v0.3.0
  335. 29.91 s [gammaloop-workspace-check] Checking ratatui-crossterm v0.1.0
  336. 29.94 s [gammaloop-workspace-check] Checking unsafe-libyaml v0.2.11
  337. 30.11 s [gammaloop-workspace-check] Checking tracing-appender v0.2.5
  338. 30.16 s [gammaloop-workspace-check] Checking brotli v7.0.0
  339. 30.18 s [gammaloop-workspace-check] Checking include_dir v0.7.4
  340. 30.38 s [gammaloop-workspace-check] Checking tracing-indicatif v0.3.14
  341. 30.58 s [gammaloop-workspace-check] Checking dirs v6.0.0
  342. 30.75 s [gammaloop-workspace-check] Checking pathfinding v4.15.0
  343. 30.78 s [gammaloop-workspace-check] Checking schemars v1.2.1
  344. 30.80 s [gammaloop-workspace-check] Checking slotmap v1.1.1
  345. 30.93 s [gammaloop-workspace-check] Checking ratatui-macros v0.7.0
  346. 31.05 s [gammaloop-workspace-check] Checking ratatui v0.30.0
  347. 31.41 s [gammaloop-workspace-check] Checking json5 v0.4.1
  348. 31.56 s [gammaloop-workspace-check] Checking vectorize v0.2.0
  349. 31.73 s [gammaloop-workspace-check] Checking ctrlc v3.5.2
  350. 31.79 s [gammaloop-workspace-check] Checking base62 v2.2.4
  351. 32.04 s [gammaloop-workspace-check] Checking clarabel v0.11.1
  352. 32.07 s [gammaloop-workspace-check] Checking ringbuffer v0.16.0
  353. 32.14 s [gammaloop-workspace-check] Checking rust-embed v8.11.0
  354. 32.18 s [gammaloop-workspace-check] Compiling rustpython-parser-core v0.4.0
  355. 32.26 s [gammaloop-workspace-check] Checking clap_complete v4.6.3
  356. 32.32 s [gammaloop-workspace-check] Checking addr2line v0.25.1
  357. 32.33 s [gammaloop-workspace-check] Checking fd-lock v4.0.4
  358. 32.65 s [gammaloop-workspace-check] Checking strip-ansi-escapes v0.2.1
  359. 32.85 s [gammaloop-workspace-check] Compiling rustpython-ast v0.4.0
  360. 32.92 s [gammaloop-workspace-check] Compiling gammaloop-api v0.1.0 (/build/source/crates/gammaloop-api)
  361. 33.15 s [gammaloop-workspace-check] Checking itertools v0.13.0
  362. 33.19 s [gammaloop-workspace-check] Checking serde_yaml v0.9.34+deprecated
  363. 33.27 s [gammaloop-workspace-check] Checking strum v0.26.3
  364. 33.48 s [gammaloop-workspace-check] Checking sysinfo v0.33.1
  365. 33.48 s [gammaloop-workspace-check] Checking shlex v1.3.0
  366. 33.71 s [gammaloop-workspace-check] Checking futures-task v0.3.32
  367. 33.79 s [gammaloop-workspace-check] Checking futures-core v0.3.32
  368. 33.79 s [gammaloop-workspace-check] Checking slab v0.4.12
  369. 33.92 s [gammaloop-workspace-check] Checking sdd v3.0.10
  370. 34.03 s [gammaloop-workspace-check] Compiling gammaloop-integration-tests v0.1.0 (/build/source/tests)
  371. 34.10 s [gammaloop-workspace-check] Compiling test-log-core v0.2.20
  372. 34.14 s [gammaloop-workspace-check] Compiling rustc_version v0.4.1
  373. 34.18 s [gammaloop-workspace-check] Checking futures-util v0.3.32
  374. 34.25 s [gammaloop-workspace-check] Checking clap_complete_nushell v4.6.0
  375. 34.32 s [gammaloop-workspace-check] Checking scc v2.4.0
  376. 34.53 s [gammaloop-workspace-check] Checking which v8.0.2
  377. 35.18 s [gammaloop-workspace-check] Checking bincode v1.3.3
  378. 36.13 s [gammaloop-workspace-check] Compiling gungraun-macros v0.8.0
  379. 36.15 s [gammaloop-workspace-check] Compiling gungraun-runner v0.18.2
  380. 36.32 s [gammaloop-workspace-check] Checking proc-macro2 v1.0.106
  381. 36.89 s [gammaloop-workspace-check] Checking quote v1.0.45
  382. 37.39 s [gammaloop-workspace-check] Checking base64 v0.21.7
  383. 37.50 s [gammaloop-workspace-check] Checking backtrace v0.3.76
  384. 37.59 s [gammaloop-workspace-check] Checking maplit v1.0.2
  385. 37.81 s [gammaloop-workspace-check] Checking nalgebra v0.29.0
  386. 37.81 s [gammaloop-workspace-check] Compiling iai-callgrind-runner v0.14.2
  387. 38.17 s [gammaloop-workspace-check] Checking color-eyre v0.6.5
  388. 38.30 s [gammaloop-workspace-check] Checking reedline v0.42.0
  389. 38.55 s [gammaloop-workspace-check] Checking ron v0.8.1
  390. 38.98 s [gammaloop-workspace-check] Checking kurbo v0.13.0
  391. 39.00 s [gammaloop-workspace-check] Checking wait-timeout v0.2.1
  392. 39.26 s [gammaloop-workspace-check] Checking quick-error v1.2.3
  393. 39.44 s [gammaloop-workspace-check] Compiling iai-callgrind v0.14.2
  394. 40.17 s [gammaloop-workspace-check] Checking futures-executor v0.3.32
  395. 40.17 s [gammaloop-workspace-check] Checking bit-vec v0.8.0
  396. 40.47 s [gammaloop-workspace-check] Compiling numerica v2.2.0 (https://github.com/alphal00p/symbolica?rev=a277a8dadbaae5a8d6605f2f381991a601e1f345#a277a8da)
  397. 40.61 s [gammaloop-workspace-check] Checking serial_test v3.4.0
  398. 40.82 s [gammaloop-workspace-check] Checking bit-set v0.8.0
  399. 41.07 s [gammaloop-workspace-check] Checking rusty-fork v0.3.1
  400. 41.22 s [gammaloop-workspace-check] Checking syn v2.0.117
  401. 41.27 s [gammaloop-workspace-check] Compiling iai-callgrind-macros v0.5.1
  402. 41.40 s [gammaloop-workspace-check] Checking rand_xorshift v0.4.0
  403. 41.48 s [gammaloop-workspace-check] Compiling test-log-macros v0.2.20
  404. 41.71 s [gammaloop-workspace-check] Checking console v0.15.11
  405. 42.03 s [gammaloop-workspace-check] Checking pathdiff v0.2.3
  406. 42.17 s [gammaloop-workspace-check] Checking unarray v0.1.4
  407. 42.31 s [gammaloop-workspace-check] Checking proptest v1.11.0
  408. 42.40 s [gammaloop-workspace-check] Checking similar-asserts v1.7.0
  409. 43.11 s [gammaloop-workspace-check] Checking clinnet v0.1.8 (/build/source/crates/clinnet)
  410. 44.83 s [gammaloop-workspace-check] Checking kurvst v0.1.0 (/build/source/crates/kurvst)
  411. 48.70 s [gammaloop-workspace-check] Checking test-log v0.2.20
  412. 52.00 s [gammaloop-workspace-check] Compiling graphica v2.1.0 (https://github.com/alphal00p/symbolica?rev=a277a8dadbaae5a8d6605f2f381991a601e1f345#a277a8da)
  413. 56.00 s [gammaloop-workspace-check] Checking statrs v0.16.1
  414. 58.32 s [gammaloop-workspace-check] Checking momtrop v0.3.0
  415. 61.24 s [gammaloop-workspace-check] Checking gungraun v0.18.2
  416. 72.29 s [gammaloop-workspace-check] Compiling pyo3-macros v0.28.3
  417. 72.68 s [gammaloop-workspace-check] Compiling pyo3-stub-gen-derive v0.17.2
  418. 88.51 s [gammaloop-workspace-check] Checking pyo3-stub-gen v0.17.2
  419. 98.45 s [gammaloop-workspace-check] Checking symbolica-utils v0.1.0 (/build/source/crates/symbolica-utils)
  420. 98.46 s [gammaloop-workspace-check] Checking spenso-macros v0.3.2 (/build/source/crates/spenso-macros)
  421. 305.69 s [gammaloop-workspace-check] Compiling gammaloop-workspace-hack v0.1.0 (/build/source/crates/gammaloop-workspace-hack)
  422. 305.91 s [gammaloop-workspace-check] Checking linnet v0.17.0 (/build/source/crates/linnet)
  423. 309.00 s [gammaloop-workspace-check] Checking spenso v0.6.0 (/build/source/crates/spenso)
  424. 309.29 s [gammaloop-workspace-check] Checking linnet-py v0.1.0 (/build/source/crates/linnet-py)
  425. 309.29 s [gammaloop-workspace-check] Checking linnest v0.1.0 (/build/source/crates/linnest)
  426. 316.66 s [gammaloop-workspace-check] Checking idenso v0.3.0 (/build/source/crates/idenso)
  427. 316.66 s [gammaloop-workspace-check] Checking gammaloop-tracing-filter v0.1.0 (/build/source/crates/gammaloop-tracing-filter)
  428. 319.06 s [gammaloop-workspace-check] Checking spenso-hep-lib v0.1.7 (/build/source/crates/spenso-hep-lib)
  429. 319.36 s [gammaloop-workspace-check] Checking spynso3 v0.1.2 (/build/source/crates/spynso3)
  430. 363.06 s [gammaloop-workspace-check] error[E0560]: struct `CutInfo` has no field named `lmb_channel_id`
  431. 363.06 s [gammaloop-workspace-check] --> tests/tests/test_differential.rs:86:13
  432. 363.06 s [gammaloop-workspace-check] |
  433. 363.06 s [gammaloop-workspace-check] 86 | lmb_channel_id: None,
  434. 363.06 s [gammaloop-workspace-check] | ^^^^^^^^^^^^^^ `CutInfo` does not have this field
  435. 363.06 s [gammaloop-workspace-check] |
  436. 363.06 s [gammaloop-workspace-check] = note: available fields are: `sampling_channel_id`, `sampling_channel_edge_ids`
  437. 363.06 s [gammaloop-workspace-check]
  438. 363.06 s [gammaloop-workspace-check] error[E0560]: struct `CutInfo` has no field named `lmb_channel_edge_ids`
  439. 363.06 s [gammaloop-workspace-check] --> tests/tests/test_differential.rs:87:13
  440. 363.06 s [gammaloop-workspace-check] |
  441. 363.06 s [gammaloop-workspace-check] 87 | lmb_channel_edge_ids: None,
  442. 363.06 s [gammaloop-workspace-check] | ^^^^^^^^^^^^^^^^^^^^ `CutInfo` does not have this field
  443. 363.06 s [gammaloop-workspace-check] |
  444. 363.06 s [gammaloop-workspace-check] = note: available fields are: `sampling_channel_id`, `sampling_channel_edge_ids`
  445. 363.06 s [gammaloop-workspace-check]
  446. 363.08 s [gammaloop-workspace-check] error[E0063]: missing field `reference_moments` in initializer of `GraphEvaluationResult<_>`
  447. 363.08 s [gammaloop-workspace-check] --> tests/tests/test_differential.rs:532:19
  448. 363.08 s [gammaloop-workspace-check] |
  449. 363.08 s [gammaloop-workspace-check] 532 | let mut lhs = GraphEvaluationResult {
  450. 363.08 s [gammaloop-workspace-check] | ^^^^^^^^^^^^^^^^^^^^^ missing `reference_moments`
  451. 363.08 s [gammaloop-workspace-check]
  452. 363.08 s [gammaloop-workspace-check] error[E0063]: missing field `reference_moments` in initializer of `GraphEvaluationResult<_>`
  453. 363.08 s [gammaloop-workspace-check] --> tests/tests/test_differential.rs:539:15
  454. 363.08 s [gammaloop-workspace-check] |
  455. 363.08 s [gammaloop-workspace-check] 539 | let rhs = GraphEvaluationResult {
  456. 363.08 s [gammaloop-workspace-check] | ^^^^^^^^^^^^^^^^^^^^^ missing `reference_moments`
  457. 363.08 s [gammaloop-workspace-check]
  458. 363.15 s [gammaloop-workspace-check] Some errors have detailed explanations: E0063, E0560.
  459. 363.15 s [gammaloop-workspace-check] For more information about an error, try `rustc --explain E0063`.
  460. 363.17 s [gammaloop-workspace-check] error: could not compile `gammaloop-integration-tests` (test "test_differential") due to 4 previous errors
  461. 363.17 s [gammaloop-workspace-check] warning: build failed, waiting for other jobs to finish...
  462. 363.51 s [gammaloop-workspace-check] error[E0609]: no field `lmb_channel_edge_ids` on type `CutInfo`
  463. 363.51 s [gammaloop-workspace-check] --> tests/tests/test_evaluation_api.rs:311:10
  464. 363.51 s [gammaloop-workspace-check] |
  465. 363.51 s [gammaloop-workspace-check] 311 | .lmb_channel_edge_ids
  466. 363.51 s [gammaloop-workspace-check] | ^^^^^^^^^^^^^^^^^^^^ unknown field
  467. 363.51 s [gammaloop-workspace-check] |
  468. 363.51 s [gammaloop-workspace-check] = note: available fields are: `particle_pdgs`, `cut_id`, `graph_id`, `graph_group_id`, `orientation_id` ... and 2 others
  469. 363.51 s [gammaloop-workspace-check]
  470. 363.54 s [gammaloop-workspace-check] error[E0609]: no field `lmb_channel_edge_ids` on type `CutInfo`
  471. 363.54 s [gammaloop-workspace-check] --> tests/tests/test_evaluation_api.rs:591:26
  472. 363.54 s [gammaloop-workspace-check] |
  473. 363.54 s [gammaloop-workspace-check] 591 | .lmb_channel_edge_ids
  474. 363.54 s [gammaloop-workspace-check] | ^^^^^^^^^^^^^^^^^^^^ unknown field
  475. 363.54 s [gammaloop-workspace-check] |
  476. 363.54 s [gammaloop-workspace-check] = note: available fields are: `particle_pdgs`, `cut_id`, `graph_id`, `graph_group_id`, `orientation_id` ... and 2 others
  477. 363.54 s [gammaloop-workspace-check]
  478. 363.59 s [gammaloop-workspace-check] error[E0609]: no field `lmb_channel_edge_ids` on type `CutInfo`
  479. 363.59 s [gammaloop-workspace-check] --> tests/tests/test_evaluation_api.rs:1177:18
  480. 363.59 s [gammaloop-workspace-check] |
  481. 363.59 s [gammaloop-workspace-check] 1177 | .lmb_channel_edge_ids
  482. 363.59 s [gammaloop-workspace-check] | ^^^^^^^^^^^^^^^^^^^^ unknown field
  483. 363.59 s [gammaloop-workspace-check] |
  484. 363.59 s [gammaloop-workspace-check] = note: available fields are: `particle_pdgs`, `cut_id`, `graph_id`, `graph_group_id`, `orientation_id` ... and 2 others
  485. 363.59 s [gammaloop-workspace-check]
  486. 363.75 s [gammaloop-workspace-check] error[E0609]: no field `lmb_channel_edge_ids` on type `CutInfo`
  487. 363.75 s [gammaloop-workspace-check] --> tests/tests/test_evaluation_api.rs:1222:22
  488. 363.75 s [gammaloop-workspace-check] |
  489. 363.75 s [gammaloop-workspace-check] 1222 | .lmb_channel_edge_ids
  490. 363.75 s [gammaloop-workspace-check] | ^^^^^^^^^^^^^^^^^^^^ unknown field
  491. 363.75 s [gammaloop-workspace-check] |
  492. 363.76 s [gammaloop-workspace-check] = note: available fields are: `particle_pdgs`, `cut_id`, `graph_id`, `graph_group_id`, `orientation_id` ... and 2 others
  493. 363.76 s [gammaloop-workspace-check]
  494. 363.76 s [gammaloop-workspace-check] error[E0609]: no field `lmb_channel_edge_ids` on type `CutInfo`
  495. 363.76 s [gammaloop-workspace-check] --> tests/tests/test_evaluation_api.rs:1281:14
  496. 363.76 s [gammaloop-workspace-check] |
  497. 363.76 s [gammaloop-workspace-check] 1281 | .lmb_channel_edge_ids
  498. 363.76 s [gammaloop-workspace-check] | ^^^^^^^^^^^^^^^^^^^^ unknown field
  499. 363.76 s [gammaloop-workspace-check] |
  500. 363.76 s [gammaloop-workspace-check] = note: available fields are: `particle_pdgs`, `cut_id`, `graph_id`, `graph_group_id`, `orientation_id` ... and 2 others
  501. 363.76 s [gammaloop-workspace-check]
  502. 363.81 s [gammaloop-workspace-check] error[E0609]: no field `lmb_channel_edge_ids` on type `CutInfo`
  503. 363.81 s [gammaloop-workspace-check] --> tests/tests/test_evaluation_api.rs:1428:18
  504. 363.81 s [gammaloop-workspace-check] |
  505. 363.81 s [gammaloop-workspace-check] 1428 | .lmb_channel_edge_ids
  506. 363.81 s [gammaloop-workspace-check] | ^^^^^^^^^^^^^^^^^^^^ unknown field
  507. 363.81 s [gammaloop-workspace-check] |
  508. 363.81 s [gammaloop-workspace-check] = note: available fields are: `particle_pdgs`, `cut_id`, `graph_id`, `graph_group_id`, `orientation_id` ... and 2 others
  509. 363.81 s [gammaloop-workspace-check]
  510. 363.92 s [gammaloop-workspace-check] For more information about this error, try `rustc --explain E0609`.
  511. 363.94 s [gammaloop-workspace-check] error: could not compile `gammaloop-integration-tests` (test "test_evaluation_api") due to 6 previous errors
  512. 364.41 s [gammaloop-workspace-check] error[E0609]: no field `lmb_channel_id` on type `CutInfo`
  513. 364.41 s [gammaloop-workspace-check] --> tests/tests/test_runs/utils.rs:568:36
  514. 364.41 s [gammaloop-workspace-check] |
  515. 364.41 s [gammaloop-workspace-check] 568 | event.cut_info.lmb_channel_id,
  516. 364.41 s [gammaloop-workspace-check] | ^^^^^^^^^^^^^^ unknown field
  517. 364.41 s [gammaloop-workspace-check] |
  518. 364.41 s [gammaloop-workspace-check] = note: available fields are: `particle_pdgs`, `cut_id`, `graph_id`, `graph_group_id`, `orientation_id` ... and 2 others
  519. 364.41 s [gammaloop-workspace-check]
  520. 364.41 s [gammaloop-workspace-check] error[E0609]: no field `lmb_channel_id` on type `CutInfo`
  521. 364.41 s [gammaloop-workspace-check] --> tests/tests/test_runs/utils.rs:580:36
  522. 364.41 s [gammaloop-workspace-check] |
  523. 364.41 s [gammaloop-workspace-check] 580 | event.cut_info.lmb_channel_id,
  524. 364.41 s [gammaloop-workspace-check] | ^^^^^^^^^^^^^^ unknown field
  525. 364.41 s [gammaloop-workspace-check] |
  526. 364.41 s [gammaloop-workspace-check] = note: available fields are: `particle_pdgs`, `cut_id`, `graph_id`, `graph_group_id`, `orientation_id` ... and 2 others
  527. 364.41 s [gammaloop-workspace-check]
  528. 365.10 s [gammaloop-workspace-check] error: could not compile `gammaloop-integration-tests` (test "test_runs") due to 2 previous errors
  529. 365.66 s Progress: 0 of 1 built (1 failed)
  530. 365.66 s Failed to build gammaloop-workspace-check after 6m03s
  531. 365.67 s Cannot build '/nix/store/axwybdrvnz6g31i8j22ivzmz2ysf3s4g-gammaloop-workspace-check-0.1.0.drv'.
  532. 365.67 s Reason: builder failed with exit code 101.
  533. 365.67 s Output paths:
  534. 365.67 s /nix/store/9cxf174qbl62vd8h78aazfzs3igfpdff-gammaloop-workspace-check-0.1.0
  535. 365.67 s Last 524 log lines:
  536. 365.67 s > Running phase: unpackPhase
  537. 365.67 s > unpacking source archive /nix/store/z5pb9ly08pscbnc755wvrwn7ad3dvc0j-source
  538. 365.67 s > source root is source
  539. 365.67 s > Running phase: patchPhase
  540. 365.67 s > Executing configureCargoCommonVars
  541. 365.67 s > decompressing cargo artifacts from /nix/store/50vpxlcgfxf2d57i27v3d10zjwxxbm2r-gammaloop-workspace-deps-deps-0.1.0/target.tar.zst to target
  542. 365.67 s > Running phase: updateAutotoolsGnuConfigScriptsPhase
  543. 365.67 s > Running phase: configurePhase
  544. 365.67 s > will append /build/source/.cargo-home/config.toml with contents of /nix/store/5drf77x6km4ky7gwlrzdx9bbd6fz09g3-vendor-cargo-deps/config.toml
  545. 365.67 s > default configurePhase, nothing to do
  546. 365.67 s > Running phase: buildPhase
  547. 365.67 s > +++ command cargo --version
  548. 365.67 s > cargo 1.97.0 (c980f4866 2026-06-30)
  549. 365.67 s > +++ command cargo check --profile ci-optim --locked --workspace --features gammaloop-tracing-filter/clap,gammaloop-tracing-filter/symbolica,idenso/bincode,idenso/reference-cases,linnet/bincode,linnet/drawing,linnet/rkyv,linnet/serde,linnet/symbolica,spenso-macros/shadowing,spenso/shadowing,symbolica/tracing_max_level_info,three-dimensional-reps/display,three-dimensional-reps/eval,three-dimensional-reps/serde --all-targets
  550. 365.67 s > Checking cfg-if v1.0.4
  551. 365.67 s > Checking memchr v2.8.0
  552. 365.67 s > Checking once_cell v1.21.4
  553. 365.67 s > Checking either v1.15.0
  554. 365.67 s > Checking serde_core v1.0.228
  555. 365.67 s > Checking libc v0.2.186
  556. 365.67 s > Checking libm v0.2.16
  557. 365.67 s > Checking itoa v1.0.18
  558. 365.67 s > Checking log v0.4.29
  559. 365.67 s > Checking regex-syntax v0.8.10
  560. 365.67 s > Checking zerocopy v0.8.48
  561. 365.67 s > Checking crossbeam-utils v0.8.21
  562. 365.67 s > Checking equivalent v1.0.2
  563. 365.67 s > Checking zmij v1.0.21
  564. 365.67 s > Checking lazy_static v1.5.0
  565. 365.67 s > Checking bytemuck v1.25.0
  566. 365.67 s > Compiling target-lexicon v0.13.5
  567. 365.67 s > Checking arrayvec v0.7.6
  568. 365.67 s > Checking powerfmt v0.2.0
  569. 365.67 s > Checking pin-project-lite v0.2.17
  570. 365.67 s > Checking itertools v0.14.0
  571. 365.67 s > Checking time-core v0.1.8
  572. 365.67 s > Checking num-conv v0.2.1
  573. 365.67 s > Checking num_threads v0.1.7
  574. 365.67 s > Checking safe_arch v0.7.4
  575. 365.67 s > Checking tracing-core v0.1.36
  576. 365.67 s > Checking foldhash v0.2.0
  577. 365.67 s > Checking allocator-api2 v0.2.21
  578. 365.67 s > Checking deranged v0.5.8
  579. 365.67 s > Checking const-random v0.1.18
  580. 365.67 s > Checking nu-ansi-term v0.50.3
  581. 365.67 s > Checking winnow v1.0.2
  582. 365.67 s > Checking unty v0.0.4
  583. 365.67 s > Checking crossbeam-epoch v0.9.18
  584. 365.67 s > Checking aho-corasick v1.1.4
  585. 365.67 s > Checking static_assertions v1.1.0
  586. 365.67 s > Checking safe_arch v1.0.0
  587. 365.67 s > Checking wide v0.7.33
  588. 365.67 s > Checking hashbrown v0.16.1
  589. 365.67 s > Checking sharded-slab v0.1.7
  590. 365.67 s > Checking crossbeam-deque v0.8.6
  591. 365.67 s > Checking tracing v0.1.44
  592. 365.67 s > Checking rayon-core v1.13.0
  593. 365.67 s > Checking tracing-log v0.2.0
  594. 365.67 s > Checking num-traits v0.2.19
  595. 365.67 s > Checking thread_local v1.1.9
  596. 365.67 s > Checking az v1.3.0
  597. 365.67 s > Checking rayon v1.12.0
  598. 365.67 s > Checking indenter v0.3.4
  599. 365.67 s > Checking toml_writer v1.1.1+spec-1.1.0
  600. 365.67 s > Checking wide v1.3.0
  601. 365.67 s > Compiling phf_shared v0.11.3
  602. 365.67 s > Checking anyhow v1.0.102
  603. 365.67 s > Checking alloc-no-stdlib v2.0.4
  604. 365.67 s > Checking rawpointer v0.2.1
  605. 365.67 s > Checking dyn-clone v1.0.20
  606. 365.67 s > Checking utf8parse v0.2.2
  607. 365.67 s > Checking toml_parser v1.1.2+spec-1.1.0
  608. 365.67 s > Checking alloc-stdlib v0.2.2
  609. 365.67 s > Checking matrixmultiply v0.3.10
  610. 365.67 s > Checking getrandom v0.3.4
  611. 365.67 s > Checking time v0.3.47
  612. 365.67 s > Checking gmp-mpfr-sys v1.7.1
  613. 365.67 s > Checking anstyle-parse v1.0.0
  614. 365.67 s > Checking colored v3.1.1
  615. 365.67 s > Checking regex-automata v0.4.14
  616. 365.67 s > Checking approx v0.5.1
  617. 365.67 s > Checking rand_core v0.9.5
  618. 365.67 s > Checking num-integer v0.1.46
  619. 365.67 s > Checking anstyle-query v1.1.5
  620. 365.67 s > Checking anstyle v1.0.14
  621. 365.67 s > Checking is_terminal_polyfill v1.70.2
  622. 365.67 s > Checking colorchoice v1.0.5
  623. 365.67 s > Compiling phf_generator v0.11.3
  624. 365.67 s > Checking eyre v0.6.12
  625. 365.67 s > Checking unicode-width v0.2.2
  626. 365.67 s > Compiling pyo3-build-config v0.28.3
  627. 365.67 s > Checking bitflags v1.3.2
  628. 365.67 s > Checking wasmtime-jit-icache-coherence v34.0.2
  629. 365.67 s > Checking brotli-decompressor v5.0.0
  630. 365.67 s > Checking anstream v1.0.0
  631. 365.67 s > Checking hugepage-rs v0.1.1
  632. 365.67 s > Checking region v3.0.2
  633. 365.67 s > Checking spec_math v0.1.6
  634. 365.67 s > Checking inventory v0.3.24
  635. 365.67 s > Checking serde v1.0.228
  636. 365.67 s > Checking serde_json v1.0.149
  637. 365.67 s > Checking bitflags v2.11.1
  638. 365.67 s > Checking serde_spanned v1.1.1
  639. 365.67 s > Checking toml_datetime v1.1.1+spec-1.1.0
  640. 365.67 s > Compiling phf_codegen v0.11.3
  641. 365.67 s > Checking thiserror v2.0.18
  642. 365.67 s > Compiling getopts v0.2.24
  643. 365.67 s > Checking libloading v0.9.0
  644. 365.67 s > Checking append-only-vec v0.1.8
  645. 365.67 s > Checking self_cell v1.2.2
  646. 365.67 s > Checking byteorder v1.5.0
  647. 365.67 s > Checking tinyjson v2.5.1
  648. 365.67 s > Checking bytes v1.11.1
  649. 365.67 s > Checking toml v1.1.2+spec-1.1.0
  650. 365.67 s > Compiling unicode_names2_generator v1.3.0
  651. 365.67 s > Checking smallvec v1.15.1
  652. 365.67 s > Checking num-complex v0.4.6
  653. 365.67 s > Checking tracing-serde v0.2.0
  654. 365.67 s > Checking bincode v2.0.1
  655. 365.67 s > Checking smartstring v1.0.1
  656. 365.67 s > Checking linux-raw-sys v0.12.1
  657. 365.67 s > Checking brotli v8.0.2
  658. 365.67 s > Checking simba v0.9.1
  659. 365.67 s > Compiling unic-char-range v0.9.0
  660. 365.67 s > Compiling unic-common v0.9.0
  661. 365.67 s > Compiling unic-ucd-version v0.9.0
  662. 365.67 s > Compiling unic-char-property v0.9.0
  663. 365.67 s > Compiling is-macro v0.3.7
  664. 365.67 s > Compiling rustpython-parser-vendored v0.4.0
  665. 365.67 s > Checking iana-time-zone v0.1.65
  666. 365.67 s > Compiling rustpython-parser v0.4.0
  667. 365.67 s > Compiling phf v0.11.3
  668. 365.67 s > Checking rustc-hash v2.1.2
  669. 365.67 s > Checking chrono v0.4.44
  670. 365.67 s > Compiling unic-ucd-ident v0.9.0
  671. 365.67 s > Checking rustix v1.1.4
  672. 365.67 s > Compiling unic-emoji-char v0.9.0
  673. 365.67 s > Checking ndarray v0.17.2
  674. 365.67 s > Compiling lalrpop-util v0.20.2
  675. 365.67 s > Compiling rustc-hash v1.1.0
  676. 365.67 s > Checking rug v1.30.0
  677. 365.67 s > Checking unicode-segmentation v1.13.2
  678. 365.67 s > Compiling symbolica v2.2.0 (https://github.com/alphal00p/symbolica?rev=a277a8dadbaae5a8d6605f2f381991a601e1f345#a277a8da)
  679. 365.67 s > Checking typenum v1.20.0
  680. 365.67 s > Checking ppv-lite86 v0.2.21
  681. 365.67 s > Checking ahash v0.8.12
  682. 365.67 s > Checking getrandom v0.2.17
  683. 365.67 s > Checking scopeguard v1.2.0
  684. 365.67 s > Checking lock_api v0.4.14
  685. 365.67 s > Checking parking_lot_core v0.9.12
  686. 365.67 s > Checking rand_chacha v0.9.0
  687. 365.67 s > Checking hashbrown v0.17.0
  688. 365.67 s > Checking unicode-ident v1.0.24
  689. 365.67 s > Checking rand v0.9.4
  690. 365.67 s > Checking parking_lot v0.12.5
  691. 365.67 s > Checking errno v0.3.14
  692. 365.67 s > Checking clap_lex v1.1.0
  693. 365.67 s > Checking generic-array v0.14.7
  694. 365.67 s > Checking unicase v2.9.0
  695. 365.67 s > Checking strsim v0.11.1
  696. 365.67 s > Checking matchers v0.2.0
  697. 365.67 s > Checking regex v1.12.3
  698. 365.67 s > Checking tracing-subscriber v0.3.23
  699. 365.67 s > Checking signal-hook-registry v1.4.8
  700. 365.67 s > Checking vte v0.14.1
  701. 365.67 s > Checking same-file v1.0.6
  702. 365.67 s > Checking signal-hook v0.3.18
  703. 365.67 s > Checking half v2.7.1
  704. 365.67 s > Checking symjit v2.21.0
  705. 365.67 s > Checking indexmap v2.14.0
  706. 365.67 s > Checking crypto-common v0.1.7
  707. 365.67 s > Checking walkdir v2.5.0
  708. 365.67 s > Checking block-buffer v0.10.4
  709. 365.67 s > Checking mio v1.2.0
  710. 365.67 s > Checking terminal_size v0.4.4
  711. 365.67 s > Checking minimal-lexical v0.2.1
  712. 365.67 s > Checking clap_builder v4.6.0
  713. 365.67 s > Checking ciborium-io v0.2.2
  714. 365.67 s > Checking digest v0.10.7
  715. 365.67 s > Checking ciborium-ll v0.2.2
  716. 365.67 s > Checking nom v7.1.3
  717. 365.67 s > Checking derive_more v2.1.1
  718. 365.67 s > Checking num-bigint v0.4.6
  719. 365.67 s > Checking console v0.16.3
  720. 365.67 s > Checking signal-hook-mio v0.2.5
  721. 365.67 s > Checking bstr v1.12.1
  722. 365.67 s > Checking linux-raw-sys v0.4.15
  723. 365.67 s > Checking winnow v0.7.15
  724. 365.67 s > Checking cpufeatures v0.2.17
  725. 365.67 s > Checking sha2 v0.10.9
  726. 365.67 s > Checking rustix v0.38.44
  727. 365.67 s > Checking ciborium v0.2.2
  728. 365.67 s > Checking globset v0.4.18
  729. 365.67 s > Checking rand_core v0.6.4
  730. 365.67 s > Compiling unicode_names2 v1.3.0
  731. 365.67 s > Checking getrandom v0.4.2
  732. 365.67 s > Checking plotters-backend v0.3.7
  733. 365.67 s > Checking fnv v1.0.7
  734. 365.67 s > Checking fastrand v2.4.1
  735. 365.67 s > Checking rust-embed-utils v8.11.0
  736. 365.67 s > Checking xprec v0.2.2
  737. 365.67 s > Checking plotters-svg v0.3.7
  738. 365.67 s > Checking toml_datetime v0.6.11
  739. 365.67 s > Checking tempfile v3.27.0
  740. 365.67 s > Checking serde_spanned v0.6.9
  741. 365.67 s > Checking itertools v0.10.5
  742. 365.67 s > Checking toml_write v0.1.2
  743. 365.67 s > Checking tap v1.0.1
  744. 365.67 s > Checking ansitok v0.3.0
  745. 365.67 s > Checking crossterm v0.28.1
  746. 365.67 s > Checking cast v0.3.0
  747. 365.67 s > Checking plotters v0.3.7
  748. 365.67 s > Checking wyz v0.5.1
  749. 365.67 s > Checking rand_chacha v0.3.1
  750. 365.67 s > Checking radium v0.7.0
  751. 365.67 s > Checking typeid v1.0.3
  752. 365.67 s > Checking similar v2.7.0
  753. 365.67 s > Checking tinytemplate v1.2.1
  754. 365.67 s > Checking ansi-str v0.9.0
  755. 365.67 s > Checking is-terminal v0.4.17
  756. 365.67 s > Checking oorandom v11.1.5
  757. 365.67 s > Checking bytecount v0.6.9
  758. 365.67 s > Checking toml_edit v0.22.27
  759. 365.67 s > Checking funty v2.0.0
  760. 365.67 s > Checking clap v4.6.1
  761. 365.67 s > Checking anes v0.1.6
  762. 365.67 s > Checking testing_table v0.3.0
  763. 365.67 s > Checking ron v0.12.1
  764. 365.67 s > Checking papergrid v0.17.0
  765. 365.67 s > Checking rand v0.8.6
  766. 365.67 s > Checking toml_edit v0.25.11+spec-1.1.0
  767. 365.67 s > Checking uncased v0.9.10
  768. 365.67 s > Checking env_filter v1.0.1
  769. 365.67 s > Checking bitvec v1.0.1
  770. 365.67 s > Checking criterion-plot v0.5.0
  771. 365.67 s > Checking jiff v0.2.24
  772. 365.67 s > Checking ptr_meta v0.1.4
  773. 365.67 s > Checking ucd-trie v0.1.7
  774. 365.67 s > Checking simdutf8 v0.1.5
  775. 365.67 s > Checking pest v2.8.6
  776. 365.67 s > Checking ahash v0.7.8
  777. 365.67 s > Checking approx v0.4.0
  778. 365.67 s > Checking seahash v4.1.0
  779. 365.67 s > Checking hashbrown v0.12.3
  780. 365.67 s > Checking bytecheck v0.6.12
  781. 365.67 s > Checking cgmath v0.18.0
  782. 365.67 s > Checking num-rational v0.4.2
  783. 365.67 s > Checking rend v0.4.2
  784. 365.67 s > Checking criterion v0.5.1
  785. 365.67 s > Checking num-iter v0.1.45
  786. 365.67 s > Checking ref-ops v0.2.5
  787. 365.67 s > Checking rand_xoshiro v0.6.0
  788. 365.67 s > Checking num v0.4.3
  789. 365.67 s > Checking features v0.10.0
  790. 365.67 s > Checking gat-lending-iterator v0.1.8
  791. 365.67 s > Checking insta v1.47.2
  792. 365.67 s > Checking constcat v0.5.1
  793. 365.67 s > Checking colored v2.2.0
  794. 365.67 s > Checking cpufeatures v0.3.0
  795. 365.67 s > Checking constant_time_eq v0.4.2
  796. 365.67 s > Checking arrayref v0.3.9
  797. 365.67 s > Checking base64 v0.22.1
  798. 365.67 s > Checking blake3 v1.8.5
  799. 365.67 s > Checking tabled v0.20.0
  800. 365.67 s > Checking joinery v2.1.0
  801. 365.67 s > Checking siphasher v1.0.2
  802. 365.67 s > Checking titlecase v2.2.1
  803. 365.67 s > Checking phf_shared v0.13.1
  804. 365.67 s > Checking subprocess v0.2.15
  805. 365.67 s > Compiling pyo3-ffi v0.28.3
  806. 365.67 s > Compiling pyo3-macros-backend v0.28.3
  807. 365.67 s > Compiling pyo3 v0.28.3
  808. 365.67 s > Compiling numpy v0.28.0
  809. 365.67 s > Checking toml v0.8.23
  810. 365.67 s > Checking dot-parser v0.5.1
  811. 365.67 s > Checking rust_lisp v0.18.0
  812. 365.67 s > Compiling vakint v0.1.2 (/build/source/crates/vakint)
  813. 365.67 s > Checking figment v0.10.19
  814. 365.67 s > Checking phf v0.13.1
  815. 365.67 s > Checking version-compare v0.2.1
  816. 365.67 s > Checking xpct v0.5.1
  817. 365.67 s > Checking ryu v1.0.23
  818. 365.67 s > Checking string-template-plus v0.4.3
  819. 365.67 s > Checking castaway v0.2.4
  820. 365.67 s > Checking toml_datetime v0.7.5+spec-1.1.0
  821. 365.67 s > Checking strum v0.27.2
  822. 365.67 s > Checking compact_str v0.9.0
  823. 365.67 s > Checking unicode-truncate v2.0.1
  824. 365.67 s > Checking toml v0.9.12+spec-1.1.0
  825. 365.67 s > Checking kasuari v0.4.12
  826. 365.67 s > Checking lru v0.16.4
  827. 365.67 s > Checking vte v0.15.0
  828. 365.67 s > Checking portable-atomic v1.13.1
  829. 365.67 s > Checking unit-prefix v0.5.2
  830. 365.67 s > Checking rand_distr v0.4.3
  831. 365.67 s > Checking simba v0.6.0
  832. 365.67 s > Checking line-clipping v0.3.7
  833. 365.67 s > Compiling three-dimensional-reps v0.1.0 (/build/source/crates/three-dimensional-reps)
  834. 365.67 s > Checking vt100 v0.16.2
  835. 365.67 s > Checking adler2 v2.0.1
  836. 365.67 s > Checking ratatui-core v0.1.0
  837. 365.67 s > Checking gimli v0.32.3
  838. 365.67 s > Checking thiserror v1.0.69
  839. 365.67 s > Checking miniz_oxide v0.8.9
  840. 365.67 s > Checking derive_builder v0.11.2
  841. 365.67 s > Checking crossterm v0.29.0
  842. 365.67 s > Checking owo-colors v4.3.0
  843. 365.67 s > Checking object v0.37.3
  844. 365.67 s > Checking env_logger v0.11.10
  845. 365.67 s > Checking tracing-error v0.2.1
  846. 365.67 s > Checking indicatif v0.18.4
  847. 365.67 s > Checking typed-index-collections v3.5.0
  848. 365.67 s > Checking serde-big-array v0.5.1
  849. 365.67 s > Checking amd v0.2.2
  850. 365.67 s > Checking itertools v0.11.0
  851. 365.67 s > Compiling gammaloop-tracing-filter-macros v0.1.0 (/build/source/crates/gammaloop-tracing-filter-macros)
  852. 365.67 s > Checking rustc-demangle v0.1.27
  853. 365.67 s > Checking option-ext v0.2.0
  854. 365.67 s > Checking dirs-sys v0.5.0
  855. 365.67 s > Checking ref-cast v1.0.25
  856. 365.67 s > Checking nix v0.31.2
  857. 365.67 s > Checking integer-sqrt v0.1.5
  858. 365.67 s > Checking brotli-decompressor v4.0.3
  859. 365.67 s > Checking crossbeam-channel v0.5.15
  860. 365.67 s > Checking rkyv v0.7.46
  861. 365.67 s > Checking itertools v0.12.1
  862. 365.67 s > Checking symlink v0.1.0
  863. 365.67 s > Compiling gammalooprs v0.3.4 (/build/source/crates/gammalooprs)
  864. 365.67 s > Checking ratatui-widgets v0.3.0
  865. 365.67 s > Checking color-spantrace v0.3.0
  866. 365.67 s > Checking ratatui-crossterm v0.1.0
  867. 365.67 s > Checking unsafe-libyaml v0.2.11
  868. 365.67 s > Checking tracing-appender v0.2.5
  869. 365.67 s > Checking brotli v7.0.0
  870. 365.67 s > Checking include_dir v0.7.4
  871. 365.67 s > Checking tracing-indicatif v0.3.14
  872. 365.67 s > Checking dirs v6.0.0
  873. 365.67 s > Checking pathfinding v4.15.0
  874. 365.67 s > Checking schemars v1.2.1
  875. 365.67 s > Checking slotmap v1.1.1
  876. 365.67 s > Checking ratatui-macros v0.7.0
  877. 365.67 s > Checking ratatui v0.30.0
  878. 365.67 s > Checking json5 v0.4.1
  879. 365.67 s > Checking vectorize v0.2.0
  880. 365.67 s > Checking ctrlc v3.5.2
  881. 365.67 s > Checking base62 v2.2.4
  882. 365.67 s > Checking clarabel v0.11.1
  883. 365.67 s > Checking ringbuffer v0.16.0
  884. 365.67 s > Checking rust-embed v8.11.0
  885. 365.67 s > Compiling rustpython-parser-core v0.4.0
  886. 365.67 s > Checking clap_complete v4.6.3
  887. 365.67 s > Checking addr2line v0.25.1
  888. 365.67 s > Checking fd-lock v4.0.4
  889. 365.67 s > Checking strip-ansi-escapes v0.2.1
  890. 365.67 s > Compiling rustpython-ast v0.4.0
  891. 365.67 s > Compiling gammaloop-api v0.1.0 (/build/source/crates/gammaloop-api)
  892. 365.67 s > Checking itertools v0.13.0
  893. 365.67 s > Checking serde_yaml v0.9.34+deprecated
  894. 365.67 s > Checking strum v0.26.3
  895. 365.67 s > Checking sysinfo v0.33.1
  896. 365.67 s > Checking shlex v1.3.0
  897. 365.67 s > Checking futures-task v0.3.32
  898. 365.67 s > Checking futures-core v0.3.32
  899. 365.67 s > Checking slab v0.4.12
  900. 365.67 s > Checking sdd v3.0.10
  901. 365.67 s > Compiling gammaloop-integration-tests v0.1.0 (/build/source/tests)
  902. 365.67 s > Compiling test-log-core v0.2.20
  903. 365.67 s > Compiling rustc_version v0.4.1
  904. 365.67 s > Checking futures-util v0.3.32
  905. 365.67 s > Checking clap_complete_nushell v4.6.0
  906. 365.67 s > Checking scc v2.4.0
  907. 365.67 s > Checking which v8.0.2
  908. 365.67 s > Checking bincode v1.3.3
  909. 365.67 s > Compiling gungraun-macros v0.8.0
  910. 365.67 s > Compiling gungraun-runner v0.18.2
  911. 365.67 s > Checking proc-macro2 v1.0.106
  912. 365.67 s > Checking quote v1.0.45
  913. 365.67 s > Checking base64 v0.21.7
  914. 365.67 s > Checking backtrace v0.3.76
  915. 365.67 s > Checking maplit v1.0.2
  916. 365.67 s > Checking nalgebra v0.29.0
  917. 365.67 s > Compiling iai-callgrind-runner v0.14.2
  918. 365.67 s > Checking color-eyre v0.6.5
  919. 365.67 s > Checking reedline v0.42.0
  920. 365.67 s > Checking ron v0.8.1
  921. 365.67 s > Checking kurbo v0.13.0
  922. 365.67 s > Checking wait-timeout v0.2.1
  923. 365.67 s > Checking quick-error v1.2.3
  924. 365.67 s > Compiling iai-callgrind v0.14.2
  925. 365.67 s > Checking futures-executor v0.3.32
  926. 365.67 s > Checking bit-vec v0.8.0
  927. 365.67 s > Compiling numerica v2.2.0 (https://github.com/alphal00p/symbolica?rev=a277a8dadbaae5a8d6605f2f381991a601e1f345#a277a8da)
  928. 365.67 s > Checking serial_test v3.4.0
  929. 365.67 s > Checking bit-set v0.8.0
  930. 365.67 s > Checking rusty-fork v0.3.1
  931. 365.67 s > Checking syn v2.0.117
  932. 365.67 s > Compiling iai-callgrind-macros v0.5.1
  933. 365.67 s > Checking rand_xorshift v0.4.0
  934. 365.67 s > Compiling test-log-macros v0.2.20
  935. 365.67 s > Checking console v0.15.11
  936. 365.67 s > Checking pathdiff v0.2.3
  937. 365.67 s > Checking unarray v0.1.4
  938. 365.67 s > Checking proptest v1.11.0
  939. 365.67 s > Checking similar-asserts v1.7.0
  940. 365.67 s > Checking clinnet v0.1.8 (/build/source/crates/clinnet)
  941. 365.67 s > Checking kurvst v0.1.0 (/build/source/crates/kurvst)
  942. 365.67 s > Checking test-log v0.2.20
  943. 365.67 s > Compiling graphica v2.1.0 (https://github.com/alphal00p/symbolica?rev=a277a8dadbaae5a8d6605f2f381991a601e1f345#a277a8da)
  944. 365.67 s > Checking statrs v0.16.1
  945. 365.67 s > Checking momtrop v0.3.0
  946. 365.67 s > Checking gungraun v0.18.2
  947. 365.67 s > Compiling pyo3-macros v0.28.3
  948. 365.67 s > Compiling pyo3-stub-gen-derive v0.17.2
  949. 365.67 s > Checking pyo3-stub-gen v0.17.2
  950. 365.67 s > Checking symbolica-utils v0.1.0 (/build/source/crates/symbolica-utils)
  951. 365.67 s > Checking spenso-macros v0.3.2 (/build/source/crates/spenso-macros)
  952. 365.67 s > Compiling gammaloop-workspace-hack v0.1.0 (/build/source/crates/gammaloop-workspace-hack)
  953. 365.67 s > Checking linnet v0.17.0 (/build/source/crates/linnet)
  954. 365.67 s > Checking spenso v0.6.0 (/build/source/crates/spenso)
  955. 365.67 s > Checking linnet-py v0.1.0 (/build/source/crates/linnet-py)
  956. 365.67 s > Checking linnest v0.1.0 (/build/source/crates/linnest)
  957. 365.67 s > Checking idenso v0.3.0 (/build/source/crates/idenso)
  958. 365.67 s > Checking gammaloop-tracing-filter v0.1.0 (/build/source/crates/gammaloop-tracing-filter)
  959. 365.67 s > Checking spenso-hep-lib v0.1.7 (/build/source/crates/spenso-hep-lib)
  960. 365.67 s > Checking spynso3 v0.1.2 (/build/source/crates/spynso3)
  961. 365.67 s > error[E0560]: struct `CutInfo` has no field named `lmb_channel_id`
  962. 365.67 s > --> tests/tests/test_differential.rs:86:13
  963. 365.67 s > |
  964. 365.67 s > 86 | lmb_channel_id: None,
  965. 365.67 s > | ^^^^^^^^^^^^^^ `CutInfo` does not have this field
  966. 365.67 s > |
  967. 365.67 s > = note: available fields are: `sampling_channel_id`, `sampling_channel_edge_ids`
  968. 365.67 s >
  969. 365.67 s > error[E0560]: struct `CutInfo` has no field named `lmb_channel_edge_ids`
  970. 365.67 s > --> tests/tests/test_differential.rs:87:13
  971. 365.67 s > |
  972. 365.67 s > 87 | lmb_channel_edge_ids: None,
  973. 365.67 s > | ^^^^^^^^^^^^^^^^^^^^ `CutInfo` does not have this field
  974. 365.67 s > |
  975. 365.67 s > = note: available fields are: `sampling_channel_id`, `sampling_channel_edge_ids`
  976. 365.67 s >
  977. 365.67 s > error[E0063]: missing field `reference_moments` in initializer of `GraphEvaluationResult<_>`
  978. 365.67 s > --> tests/tests/test_differential.rs:532:19
  979. 365.67 s > |
  980. 365.67 s > 532 | let mut lhs = GraphEvaluationResult {
  981. 365.67 s > | ^^^^^^^^^^^^^^^^^^^^^ missing `reference_moments`
  982. 365.67 s >
  983. 365.67 s > error[E0063]: missing field `reference_moments` in initializer of `GraphEvaluationResult<_>`
  984. 365.67 s > --> tests/tests/test_differential.rs:539:15
  985. 365.67 s > |
  986. 365.67 s > 539 | let rhs = GraphEvaluationResult {
  987. 365.67 s > | ^^^^^^^^^^^^^^^^^^^^^ missing `reference_moments`
  988. 365.67 s >
  989. 365.67 s > Some errors have detailed explanations: E0063, E0560.
  990. 365.67 s > For more information about an error, try `rustc --explain E0063`.
  991. 365.67 s > error: could not compile `gammaloop-integration-tests` (test "test_differential") due to 4 previous errors
  992. 365.67 s > warning: build failed, waiting for other jobs to finish...
  993. 365.67 s > error[E0609]: no field `lmb_channel_edge_ids` on type `CutInfo`
  994. 365.67 s > --> tests/tests/test_evaluation_api.rs:311:10
  995. 365.67 s > |
  996. 365.67 s > 311 | .lmb_channel_edge_ids
  997. 365.67 s > | ^^^^^^^^^^^^^^^^^^^^ unknown field
  998. 365.67 s > |
  999. 365.67 s > = note: available fields are: `particle_pdgs`, `cut_id`, `graph_id`, `graph_group_id`, `orientation_id` ... and 2 others
  1000. 365.67 s >
  1001. 365.67 s > error[E0609]: no field `lmb_channel_edge_ids` on type `CutInfo`
  1002. 365.67 s > --> tests/tests/test_evaluation_api.rs:591:26
  1003. 365.67 s > |
  1004. 365.67 s > 591 | .lmb_channel_edge_ids
  1005. 365.67 s > | ^^^^^^^^^^^^^^^^^^^^ unknown field
  1006. 365.67 s > |
  1007. 365.67 s > = note: available fields are: `particle_pdgs`, `cut_id`, `graph_id`, `graph_group_id`, `orientation_id` ... and 2 others
  1008. 365.67 s >
  1009. 365.67 s > error[E0609]: no field `lmb_channel_edge_ids` on type `CutInfo`
  1010. 365.67 s > --> tests/tests/test_evaluation_api.rs:1177:18
  1011. 365.67 s > |
  1012. 365.67 s > 1177 | .lmb_channel_edge_ids
  1013. 365.67 s > | ^^^^^^^^^^^^^^^^^^^^ unknown field
  1014. 365.67 s > |
  1015. 365.67 s > = note: available fields are: `particle_pdgs`, `cut_id`, `graph_id`, `graph_group_id`, `orientation_id` ... and 2 others
  1016. 365.67 s >
  1017. 365.67 s > error[E0609]: no field `lmb_channel_edge_ids` on type `CutInfo`
  1018. 365.67 s > --> tests/tests/test_evaluation_api.rs:1222:22
  1019. 365.67 s > |
  1020. 365.67 s > 1222 | .lmb_channel_edge_ids
  1021. 365.67 s > | ^^^^^^^^^^^^^^^^^^^^ unknown field
  1022. 365.67 s > |
  1023. 365.67 s > = note: available fields are: `particle_pdgs`, `cut_id`, `graph_id`, `graph_group_id`, `orientation_id` ... and 2 others
  1024. 365.67 s >
  1025. 365.67 s > error[E0609]: no field `lmb_channel_edge_ids` on type `CutInfo`
  1026. 365.67 s > --> tests/tests/test_evaluation_api.rs:1281:14
  1027. 365.67 s > |
  1028. 365.67 s > 1281 | .lmb_channel_edge_ids
  1029. 365.67 s > | ^^^^^^^^^^^^^^^^^^^^ unknown field
  1030. 365.67 s > |
  1031. 365.67 s > = note: available fields are: `particle_pdgs`, `cut_id`, `graph_id`, `graph_group_id`, `orientation_id` ... and 2 others
  1032. 365.67 s >
  1033. 365.67 s > error[E0609]: no field `lmb_channel_edge_ids` on type `CutInfo`
  1034. 365.67 s > --> tests/tests/test_evaluation_api.rs:1428:18
  1035. 365.67 s > |
  1036. 365.67 s > 1428 | .lmb_channel_edge_ids
  1037. 365.67 s > | ^^^^^^^^^^^^^^^^^^^^ unknown field
  1038. 365.67 s > |
  1039. 365.67 s > = note: available fields are: `particle_pdgs`, `cut_id`, `graph_id`, `graph_group_id`, `orientation_id` ... and 2 others
  1040. 365.67 s >
  1041. 365.67 s > For more information about this error, try `rustc --explain E0609`.
  1042. 365.67 s > error: could not compile `gammaloop-integration-tests` (test "test_evaluation_api") due to 6 previous errors
  1043. 365.67 s > error[E0609]: no field `lmb_channel_id` on type `CutInfo`
  1044. 365.67 s > --> tests/tests/test_runs/utils.rs:568:36
  1045. 365.67 s > |
  1046. 365.67 s > 568 | event.cut_info.lmb_channel_id,
  1047. 365.67 s > | ^^^^^^^^^^^^^^ unknown field
  1048. 365.67 s > |
  1049. 365.67 s > = note: available fields are: `particle_pdgs`, `cut_id`, `graph_id`, `graph_group_id`, `orientation_id` ... and 2 others
  1050. 365.67 s >
  1051. 365.67 s > error[E0609]: no field `lmb_channel_id` on type `CutInfo`
  1052. 365.67 s > --> tests/tests/test_runs/utils.rs:580:36
  1053. 365.67 s > |
  1054. 365.67 s > 580 | event.cut_info.lmb_channel_id,
  1055. 365.67 s > | ^^^^^^^^^^^^^^ unknown field
  1056. 365.67 s > |
  1057. 365.67 s > = note: available fields are: `particle_pdgs`, `cut_id`, `graph_id`, `graph_group_id`, `orientation_id` ... and 2 others
  1058. 365.67 s >
  1059. 365.67 s > error: could not compile `gammaloop-integration-tests` (test "test_runs") due to 2 previous errors
  1060. 365.67 s For full logs, run:
  1061. 365.67 s nix log /nix/store/axwybdrvnz6g31i8j22ivzmz2ysf3s4g-gammaloop-workspace-check-0.1.0.drv
  1062. 365.73 s Build failed.