build checks.x86_64-linux.gammaloop-check
0.00 s
$ /nix/store/9ypz3flqsrl5xl495mm8h645gadjsxi1-coreutils-9.11/bin/timeout --kill-after=15s 7200s /nix/store/23zk8sgzamrbmj1fday15szf7f2279s8-nix-2.34.7/bin/nix --extra-experimental-features nix-command --extra-experimental-features flakes --log-format internal-json build --no-link --print-out-paths git+https://github.com/alphal00p/gammaloop?ref=advanced_sampling&rev=1df7aa38b6fd28fa9cd50ca94e59c90067ab0bb7&shallow=1#checks.x86_64-linux.gammaloop-check --print-build-logs
0.10 s
error (ignored): SQLite database '/var/cache/nix-ci-worker/eval-cache-v6/7db5b3ee960e117db536bb846779e7633d150451926acbd99d708a335ef61e1a.sqlite ' is busy
2.22 s
2.44 s
Building /nix/store/axwybdrvnz6g31i8j22ivzmz2ysf3s4g-gammaloop-workspace-check-0.1.0.drv
2.51 s
[gammaloop-workspace-check] Phase: unpackPhase
2.52 s
[gammaloop-workspace-check] unpacking source archive /nix/store/z5pb9ly08pscbnc755wvrwn7ad3dvc0j-source
2.65 s
[gammaloop-workspace-check] source root is source
2.69 s
[gammaloop-workspace-check] Phase: patchPhase
2.69 s
[gammaloop-workspace-check] Executing configureCargoCommonVars
2.70 s
[gammaloop-workspace-check] decompressing cargo artifacts from /nix/store/50vpxlcgfxf2d57i27v3d10zjwxxbm2r-gammaloop-workspace-deps-deps-0.1.0/target.tar.zst to target
3.79 s
[gammaloop-workspace-check] Phase: updateAutotoolsGnuConfigScriptsPhase
3.83 s
[gammaloop-workspace-check] Phase: configurePhase
3.84 s
[gammaloop-workspace-check] will append /build/source/.cargo-home/config.toml with contents of /nix/store/5drf77x6km4ky7gwlrzdx9bbd6fz09g3-vendor-cargo-deps/config.toml
3.84 s
[gammaloop-workspace-check] default configurePhase, nothing to do
3.84 s
[gammaloop-workspace-check] Phase: buildPhase
3.84 s
[gammaloop-workspace-check] +++ command cargo --version
3.85 s
[gammaloop-workspace-check] cargo 1.97.0 (c980f4866 2026-06-30)
3.88 s
[gammaloop-workspace-check] +++ command cargo check --profile ci-optim --locked --workspace --features gammaloop-tracing-filter/clap,gammaloop-tracing-filter/symbolica,idenso/bincode,idenso/reference-cases,linnet/bincode,linnet/drawing,linnet/rkyv,linnet/serde,linnet/symbolica,spenso-macros/shadowing,spenso/shadowing,symbolica/tracing_max_level_info,three-dimensional-reps/display,three-dimensional-reps/eval,three-dimensional-reps/serde --all-targets
4.32 s
[gammaloop-workspace-check] Checking cfg-if v1.0.4
4.32 s
[gammaloop-workspace-check] Checking memchr v2.8.0
4.32 s
[gammaloop-workspace-check] Checking once_cell v1.21.4
4.33 s
[gammaloop-workspace-check] Checking either v1.15.0
4.33 s
[gammaloop-workspace-check] Checking serde_core v1.0.228
4.33 s
[gammaloop-workspace-check] Checking libc v0.2.186
4.34 s
[gammaloop-workspace-check] Checking libm v0.2.16
4.34 s
[gammaloop-workspace-check] Checking itoa v1.0.18
4.34 s
[gammaloop-workspace-check] Checking log v0.4.29
4.34 s
[gammaloop-workspace-check] Checking regex-syntax v0.8.10
4.36 s
[gammaloop-workspace-check] Checking zerocopy v0.8.48
4.36 s
[gammaloop-workspace-check] Checking crossbeam-utils v0.8.21
4.36 s
[gammaloop-workspace-check] Checking equivalent v1.0.2
4.37 s
[gammaloop-workspace-check] Checking zmij v1.0.21
4.37 s
[gammaloop-workspace-check] Checking lazy_static v1.5.0
4.37 s
[gammaloop-workspace-check] Checking bytemuck v1.25.0
4.38 s
[gammaloop-workspace-check] Compiling target-lexicon v0.13.5
4.41 s
[gammaloop-workspace-check] Checking arrayvec v0.7.6
4.43 s
[gammaloop-workspace-check] Checking powerfmt v0.2.0
4.44 s
[gammaloop-workspace-check] Checking pin-project-lite v0.2.17
4.44 s
[gammaloop-workspace-check] Checking itertools v0.14.0
4.46 s
[gammaloop-workspace-check] Checking time-core v0.1.8
4.46 s
[gammaloop-workspace-check] Checking num-conv v0.2.1
4.49 s
[gammaloop-workspace-check] Checking num_threads v0.1.7
4.51 s
[gammaloop-workspace-check] Checking safe_arch v0.7.4
4.56 s
[gammaloop-workspace-check] Checking tracing-core v0.1.36
4.56 s
[gammaloop-workspace-check] Checking foldhash v0.2.0
4.57 s
[gammaloop-workspace-check] Checking allocator-api2 v0.2.21
4.57 s
[gammaloop-workspace-check] Checking deranged v0.5.8
4.62 s
[gammaloop-workspace-check] Checking const-random v0.1.18
4.64 s
[gammaloop-workspace-check] Checking nu-ansi-term v0.50.3
4.67 s
[gammaloop-workspace-check] Checking winnow v1.0.2
4.69 s
[gammaloop-workspace-check] Checking unty v0.0.4
4.69 s
[gammaloop-workspace-check] Checking crossbeam-epoch v0.9.18
4.71 s
[gammaloop-workspace-check] Checking aho-corasick v1.1.4
4.75 s
[gammaloop-workspace-check] Checking static_assertions v1.1.0
4.81 s
[gammaloop-workspace-check] Checking safe_arch v1.0.0
4.83 s
[gammaloop-workspace-check] Checking wide v0.7.33
4.84 s
[gammaloop-workspace-check] Checking hashbrown v0.16.1
4.85 s
[gammaloop-workspace-check] Checking sharded-slab v0.1.7
4.89 s
[gammaloop-workspace-check] Checking crossbeam-deque v0.8.6
4.91 s
[gammaloop-workspace-check] Checking tracing v0.1.44
5.02 s
[gammaloop-workspace-check] Checking rayon-core v1.13.0
5.10 s
[gammaloop-workspace-check] Checking tracing-log v0.2.0
5.23 s
[gammaloop-workspace-check] Checking num-traits v0.2.19
5.26 s
[gammaloop-workspace-check] Checking thread_local v1.1.9
5.30 s
[gammaloop-workspace-check] Checking az v1.3.0
5.31 s
[gammaloop-workspace-check] Checking rayon v1.12.0
5.37 s
[gammaloop-workspace-check] Checking indenter v0.3.4
5.39 s
[gammaloop-workspace-check] Checking toml_writer v1.1.1+spec-1.1.0
5.43 s
[gammaloop-workspace-check] Checking wide v1.3.0
5.49 s
[gammaloop-workspace-check] Compiling phf_shared v0.11.3
5.53 s
[gammaloop-workspace-check] Checking anyhow v1.0.102
5.54 s
[gammaloop-workspace-check] Checking alloc-no-stdlib v2.0.4
5.58 s
[gammaloop-workspace-check] Checking rawpointer v0.2.1
5.62 s
[gammaloop-workspace-check] Checking dyn-clone v1.0.20
5.64 s
[gammaloop-workspace-check] Checking utf8parse v0.2.2
5.65 s
[gammaloop-workspace-check] Checking toml_parser v1.1.2+spec-1.1.0
5.66 s
[gammaloop-workspace-check] Checking alloc-stdlib v0.2.2
5.71 s
[gammaloop-workspace-check] Checking matrixmultiply v0.3.10
5.74 s
[gammaloop-workspace-check] Checking getrandom v0.3.4
5.75 s
[gammaloop-workspace-check] Checking time v0.3.47
5.75 s
[gammaloop-workspace-check] Checking gmp-mpfr-sys v1.7.1
5.77 s
[gammaloop-workspace-check] Checking anstyle-parse v1.0.0
5.78 s
[gammaloop-workspace-check] Checking colored v3.1.1
5.82 s
[gammaloop-workspace-check] Checking regex-automata v0.4.14
5.84 s
[gammaloop-workspace-check] Checking approx v0.5.1
5.87 s
[gammaloop-workspace-check] Checking rand_core v0.9.5
5.92 s
[gammaloop-workspace-check] Checking num-integer v0.1.46
6.00 s
[gammaloop-workspace-check] Checking anstyle-query v1.1.5
6.01 s
[gammaloop-workspace-check] Checking anstyle v1.0.14
6.02 s
[gammaloop-workspace-check] Checking is_terminal_polyfill v1.70.2
6.04 s
[gammaloop-workspace-check] Checking colorchoice v1.0.5
6.04 s
[gammaloop-workspace-check] Compiling phf_generator v0.11.3
6.06 s
[gammaloop-workspace-check] Checking eyre v0.6.12
6.08 s
[gammaloop-workspace-check] Checking unicode-width v0.2.2
6.10 s
[gammaloop-workspace-check] Compiling pyo3-build-config v0.28.3
6.11 s
[gammaloop-workspace-check] Checking bitflags v1.3.2
6.13 s
[gammaloop-workspace-check] Checking wasmtime-jit-icache-coherence v34.0.2
6.14 s
[gammaloop-workspace-check] Checking brotli-decompressor v5.0.0
6.16 s
[gammaloop-workspace-check] Checking anstream v1.0.0
6.16 s
[gammaloop-workspace-check] Checking hugepage-rs v0.1.1
6.18 s
[gammaloop-workspace-check] Checking region v3.0.2
6.19 s
[gammaloop-workspace-check] Checking spec_math v0.1.6
6.23 s
[gammaloop-workspace-check] Checking inventory v0.3.24
6.28 s
[gammaloop-workspace-check] Checking serde v1.0.228
6.29 s
[gammaloop-workspace-check] Checking serde_json v1.0.149
6.31 s
[gammaloop-workspace-check] Checking bitflags v2.11.1
6.33 s
[gammaloop-workspace-check] Checking serde_spanned v1.1.1
6.34 s
[gammaloop-workspace-check] Checking toml_datetime v1.1.1+spec-1.1.0
6.36 s
[gammaloop-workspace-check] Compiling phf_codegen v0.11.3
6.41 s
[gammaloop-workspace-check] Checking thiserror v2.0.18
6.45 s
[gammaloop-workspace-check] Compiling getopts v0.2.24
6.47 s
[gammaloop-workspace-check] Checking libloading v0.9.0
6.49 s
[gammaloop-workspace-check] Checking append-only-vec v0.1.8
6.51 s
[gammaloop-workspace-check] Checking self_cell v1.2.2
6.62 s
[gammaloop-workspace-check] Checking byteorder v1.5.0
6.67 s
[gammaloop-workspace-check] Checking tinyjson v2.5.1
6.68 s
[gammaloop-workspace-check] Checking bytes v1.11.1
6.71 s
[gammaloop-workspace-check] Checking toml v1.1.2+spec-1.1.0
6.73 s
[gammaloop-workspace-check] Compiling unicode_names2_generator v1.3.0
6.75 s
[gammaloop-workspace-check] Checking smallvec v1.15.1
6.76 s
[gammaloop-workspace-check] Checking num-complex v0.4.6
6.83 s
[gammaloop-workspace-check] Checking tracing-serde v0.2.0
6.89 s
[gammaloop-workspace-check] Checking bincode v2.0.1
6.95 s
[gammaloop-workspace-check] Checking smartstring v1.0.1
6.97 s
[gammaloop-workspace-check] Checking linux-raw-sys v0.12.1
7.03 s
[gammaloop-workspace-check] Checking brotli v8.0.2
7.10 s
[gammaloop-workspace-check] Checking simba v0.9.1
7.18 s
[gammaloop-workspace-check] Compiling unic-char-range v0.9.0
7.19 s
[gammaloop-workspace-check] Compiling unic-common v0.9.0
7.30 s
[gammaloop-workspace-check] Compiling unic-ucd-version v0.9.0
7.31 s
[gammaloop-workspace-check] Compiling unic-char-property v0.9.0
7.35 s
[gammaloop-workspace-check] Compiling is-macro v0.3.7
7.35 s
[gammaloop-workspace-check] Compiling rustpython-parser-vendored v0.4.0
7.39 s
[gammaloop-workspace-check] Checking iana-time-zone v0.1.65
7.41 s
[gammaloop-workspace-check] Compiling rustpython-parser v0.4.0
7.46 s
[gammaloop-workspace-check] Compiling phf v0.11.3
7.47 s
[gammaloop-workspace-check] Checking rustc-hash v2.1.2
7.50 s
[gammaloop-workspace-check] Checking chrono v0.4.44
7.51 s
[gammaloop-workspace-check] Compiling unic-ucd-ident v0.9.0
7.53 s
[gammaloop-workspace-check] Checking rustix v1.1.4
7.57 s
[gammaloop-workspace-check] Compiling unic-emoji-char v0.9.0
7.60 s
[gammaloop-workspace-check] Checking ndarray v0.17.2
7.63 s
[gammaloop-workspace-check] Compiling lalrpop-util v0.20.2
7.82 s
[gammaloop-workspace-check] Compiling rustc-hash v1.1.0
7.85 s
[gammaloop-workspace-check] Checking rug v1.30.0
7.87 s
[gammaloop-workspace-check] Checking unicode-segmentation v1.13.2
7.92 s
[gammaloop-workspace-check] Compiling symbolica v2.2.0 (https://github.com/alphal00p/symbolica?rev=a277a8dadbaae5a8d6605f2f381991a601e1f345#a277a8da)
7.97 s
[gammaloop-workspace-check] Checking typenum v1.20.0
7.99 s
[gammaloop-workspace-check] Checking ppv-lite86 v0.2.21
8.05 s
[gammaloop-workspace-check] Checking ahash v0.8.12
8.26 s
[gammaloop-workspace-check] Checking getrandom v0.2.17
8.37 s
[gammaloop-workspace-check] Checking scopeguard v1.2.0
8.44 s
[gammaloop-workspace-check] Checking lock_api v0.4.14
8.45 s
[gammaloop-workspace-check] Checking parking_lot_core v0.9.12
8.46 s
[gammaloop-workspace-check] Checking rand_chacha v0.9.0
8.61 s
[gammaloop-workspace-check] Checking hashbrown v0.17.0
8.63 s
[gammaloop-workspace-check] Checking unicode-ident v1.0.24
8.66 s
[gammaloop-workspace-check] Checking rand v0.9.4
8.68 s
[gammaloop-workspace-check] Checking parking_lot v0.12.5
8.69 s
[gammaloop-workspace-check] Checking errno v0.3.14
8.81 s
[gammaloop-workspace-check] Checking clap_lex v1.1.0
8.83 s
[gammaloop-workspace-check] Checking generic-array v0.14.7
8.85 s
[gammaloop-workspace-check] Checking unicase v2.9.0
8.85 s
[gammaloop-workspace-check] Checking strsim v0.11.1
8.86 s
[gammaloop-workspace-check] Checking matchers v0.2.0
8.92 s
[gammaloop-workspace-check] Checking regex v1.12.3
8.97 s
[gammaloop-workspace-check] Checking tracing-subscriber v0.3.23
9.01 s
[gammaloop-workspace-check] Checking signal-hook-registry v1.4.8
9.07 s
[gammaloop-workspace-check] Checking vte v0.14.1
9.19 s
[gammaloop-workspace-check] Checking same-file v1.0.6
9.25 s
[gammaloop-workspace-check] Checking signal-hook v0.3.18
9.30 s
[gammaloop-workspace-check] Checking half v2.7.1
9.34 s
[gammaloop-workspace-check] Checking symjit v2.21.0
9.43 s
[gammaloop-workspace-check] Checking indexmap v2.14.0
9.45 s
[gammaloop-workspace-check] Checking crypto-common v0.1.7
9.46 s
[gammaloop-workspace-check] Checking walkdir v2.5.0
9.56 s
[gammaloop-workspace-check] Checking block-buffer v0.10.4
9.69 s
[gammaloop-workspace-check] Checking mio v1.2.0
9.72 s
[gammaloop-workspace-check] Checking terminal_size v0.4.4
9.73 s
[gammaloop-workspace-check] Checking minimal-lexical v0.2.1
9.87 s
[gammaloop-workspace-check] Checking clap_builder v4.6.0
9.93 s
[gammaloop-workspace-check] Checking ciborium-io v0.2.2
9.96 s
[gammaloop-workspace-check] Checking digest v0.10.7
9.99 s
[gammaloop-workspace-check] Checking ciborium-ll v0.2.2
10.03 s
[gammaloop-workspace-check] Checking nom v7.1.3
10.24 s
[gammaloop-workspace-check] Checking derive_more v2.1.1
10.33 s
[gammaloop-workspace-check] Checking num-bigint v0.4.6
10.34 s
[gammaloop-workspace-check] Checking console v0.16.3
10.61 s
[gammaloop-workspace-check] Checking signal-hook-mio v0.2.5
10.83 s
[gammaloop-workspace-check] Checking bstr v1.12.1
10.97 s
[gammaloop-workspace-check] Checking linux-raw-sys v0.4.15
11.36 s
[gammaloop-workspace-check] Checking winnow v0.7.15
11.39 s
[gammaloop-workspace-check] Checking cpufeatures v0.2.17
11.47 s
[gammaloop-workspace-check] Checking sha2 v0.10.9
11.76 s
[gammaloop-workspace-check] Checking rustix v0.38.44
12.06 s
[gammaloop-workspace-check] Checking ciborium v0.2.2
12.12 s
[gammaloop-workspace-check] Checking globset v0.4.18
12.25 s
[gammaloop-workspace-check] Checking rand_core v0.6.4
12.28 s
[gammaloop-workspace-check] Compiling unicode_names2 v1.3.0
12.75 s
[gammaloop-workspace-check] Checking getrandom v0.4.2
12.96 s
[gammaloop-workspace-check] Checking plotters-backend v0.3.7
13.02 s
[gammaloop-workspace-check] Checking fnv v1.0.7
13.13 s
[gammaloop-workspace-check] Checking fastrand v2.4.1
13.14 s
[gammaloop-workspace-check] Checking rust-embed-utils v8.11.0
13.43 s
[gammaloop-workspace-check] Checking xprec v0.2.2
13.46 s
[gammaloop-workspace-check] Checking plotters-svg v0.3.7
13.49 s
[gammaloop-workspace-check] Checking toml_datetime v0.6.11
13.52 s
[gammaloop-workspace-check] Checking tempfile v3.27.0
13.55 s
[gammaloop-workspace-check] Checking serde_spanned v0.6.9
13.83 s
[gammaloop-workspace-check] Checking itertools v0.10.5
13.85 s
[gammaloop-workspace-check] Checking toml_write v0.1.2
13.85 s
[gammaloop-workspace-check] Checking tap v1.0.1
14.04 s
[gammaloop-workspace-check] Checking ansitok v0.3.0
14.20 s
[gammaloop-workspace-check] Checking crossterm v0.28.1
14.51 s
[gammaloop-workspace-check] Checking cast v0.3.0
14.66 s
[gammaloop-workspace-check] Checking plotters v0.3.7
14.66 s
[gammaloop-workspace-check] Checking wyz v0.5.1
14.81 s
[gammaloop-workspace-check] Checking rand_chacha v0.3.1
15.15 s
[gammaloop-workspace-check] Checking radium v0.7.0
15.20 s
[gammaloop-workspace-check] Checking typeid v1.0.3
15.24 s
[gammaloop-workspace-check] Checking similar v2.7.0
15.29 s
[gammaloop-workspace-check] Checking tinytemplate v1.2.1
15.40 s
[gammaloop-workspace-check] Checking ansi-str v0.9.0
15.52 s
[gammaloop-workspace-check] Checking is-terminal v0.4.17
15.60 s
[gammaloop-workspace-check] Checking oorandom v11.1.5
15.69 s
[gammaloop-workspace-check] Checking bytecount v0.6.9
15.77 s
[gammaloop-workspace-check] Checking toml_edit v0.22.27
15.78 s
[gammaloop-workspace-check] Checking funty v2.0.0
15.87 s
[gammaloop-workspace-check] Checking clap v4.6.1
15.95 s
[gammaloop-workspace-check] Checking anes v0.1.6
16.05 s
[gammaloop-workspace-check] Checking testing_table v0.3.0
16.10 s
[gammaloop-workspace-check] Checking ron v0.12.1
16.13 s
[gammaloop-workspace-check] Checking papergrid v0.17.0
16.27 s
[gammaloop-workspace-check] Checking rand v0.8.6
16.37 s
[gammaloop-workspace-check] Checking toml_edit v0.25.11+spec-1.1.0
16.63 s
[gammaloop-workspace-check] Checking uncased v0.9.10
16.95 s
[gammaloop-workspace-check] Checking env_filter v1.0.1
17.30 s
[gammaloop-workspace-check] Checking bitvec v1.0.1
17.37 s
[gammaloop-workspace-check] Checking criterion-plot v0.5.0
17.49 s
[gammaloop-workspace-check] Checking jiff v0.2.24
17.66 s
[gammaloop-workspace-check] Checking ptr_meta v0.1.4
17.66 s
[gammaloop-workspace-check] Checking ucd-trie v0.1.7
17.80 s
[gammaloop-workspace-check] Checking simdutf8 v0.1.5
17.90 s
[gammaloop-workspace-check] Checking pest v2.8.6
17.96 s
[gammaloop-workspace-check] Checking ahash v0.7.8
18.17 s
[gammaloop-workspace-check] Checking approx v0.4.0
18.42 s
[gammaloop-workspace-check] Checking seahash v4.1.0
18.47 s
[gammaloop-workspace-check] Checking hashbrown v0.12.3
18.48 s
[gammaloop-workspace-check] Checking bytecheck v0.6.12
18.55 s
[gammaloop-workspace-check] Checking cgmath v0.18.0
18.68 s
[gammaloop-workspace-check] Checking num-rational v0.4.2
18.98 s
[gammaloop-workspace-check] Checking rend v0.4.2
19.22 s
[gammaloop-workspace-check] Checking criterion v0.5.1
19.24 s
[gammaloop-workspace-check] Checking num-iter v0.1.45
19.31 s
[gammaloop-workspace-check] Checking ref-ops v0.2.5
19.33 s
[gammaloop-workspace-check] Checking rand_xoshiro v0.6.0
19.42 s
[gammaloop-workspace-check] Checking num v0.4.3
19.48 s
[gammaloop-workspace-check] Checking features v0.10.0
19.52 s
[gammaloop-workspace-check] Checking gat-lending-iterator v0.1.8
19.57 s
[gammaloop-workspace-check] Checking insta v1.47.2
19.64 s
[gammaloop-workspace-check] Checking constcat v0.5.1
19.98 s
[gammaloop-workspace-check] Checking colored v2.2.0
20.02 s
[gammaloop-workspace-check] Checking cpufeatures v0.3.0
20.10 s
[gammaloop-workspace-check] Checking constant_time_eq v0.4.2
20.33 s
[gammaloop-workspace-check] Checking arrayref v0.3.9
20.35 s
[gammaloop-workspace-check] Checking base64 v0.22.1
20.41 s
[gammaloop-workspace-check] Checking blake3 v1.8.5
20.52 s
[gammaloop-workspace-check] Checking tabled v0.20.0
20.80 s
[gammaloop-workspace-check] Checking joinery v2.1.0
20.83 s
[gammaloop-workspace-check] Checking siphasher v1.0.2
21.10 s
[gammaloop-workspace-check] Checking titlecase v2.2.1
21.25 s
[gammaloop-workspace-check] Checking phf_shared v0.13.1
21.31 s
[gammaloop-workspace-check] Checking subprocess v0.2.15
21.37 s
[gammaloop-workspace-check] Compiling pyo3-ffi v0.28.3
21.44 s
[gammaloop-workspace-check] Compiling pyo3-macros-backend v0.28.3
21.54 s
[gammaloop-workspace-check] Compiling pyo3 v0.28.3
21.58 s
[gammaloop-workspace-check] Compiling numpy v0.28.0
21.77 s
[gammaloop-workspace-check] Checking toml v0.8.23
22.39 s
[gammaloop-workspace-check] Checking dot-parser v0.5.1
22.41 s
[gammaloop-workspace-check] Checking rust_lisp v0.18.0
22.42 s
[gammaloop-workspace-check] Compiling vakint v0.1.2 (/build/source/crates/vakint)
22.96 s
[gammaloop-workspace-check] Checking figment v0.10.19
22.97 s
[gammaloop-workspace-check] Checking phf v0.13.1
23.53 s
[gammaloop-workspace-check] Checking version-compare v0.2.1
23.53 s
[gammaloop-workspace-check] Checking xpct v0.5.1
23.57 s
[gammaloop-workspace-check] Checking ryu v1.0.23
24.07 s
[gammaloop-workspace-check] Checking string-template-plus v0.4.3
24.07 s
[gammaloop-workspace-check] Checking castaway v0.2.4
24.17 s
[gammaloop-workspace-check] Checking toml_datetime v0.7.5+spec-1.1.0
24.25 s
[gammaloop-workspace-check] Checking strum v0.27.2
24.37 s
[gammaloop-workspace-check] Checking compact_str v0.9.0
24.44 s
[gammaloop-workspace-check] Checking unicode-truncate v2.0.1
24.55 s
[gammaloop-workspace-check] Checking toml v0.9.12+spec-1.1.0
24.57 s
[gammaloop-workspace-check] Checking kasuari v0.4.12
24.78 s
[gammaloop-workspace-check] Checking lru v0.16.4
25.41 s
[gammaloop-workspace-check] Checking vte v0.15.0
25.41 s
[gammaloop-workspace-check] Checking portable-atomic v1.13.1
25.66 s
[gammaloop-workspace-check] Checking unit-prefix v0.5.2
25.67 s
[gammaloop-workspace-check] Checking rand_distr v0.4.3
25.86 s
[gammaloop-workspace-check] Checking simba v0.6.0
25.91 s
[gammaloop-workspace-check] Checking line-clipping v0.3.7
25.97 s
[gammaloop-workspace-check] Compiling three-dimensional-reps v0.1.0 (/build/source/crates/three-dimensional-reps)
26.04 s
[gammaloop-workspace-check] Checking vt100 v0.16.2
26.14 s
[gammaloop-workspace-check] Checking adler2 v2.0.1
26.26 s
[gammaloop-workspace-check] Checking ratatui-core v0.1.0
26.26 s
[gammaloop-workspace-check] Checking gimli v0.32.3
26.30 s
[gammaloop-workspace-check] Checking thiserror v1.0.69
26.36 s
[gammaloop-workspace-check] Checking miniz_oxide v0.8.9
26.42 s
[gammaloop-workspace-check] Checking derive_builder v0.11.2
26.47 s
[gammaloop-workspace-check] Checking crossterm v0.29.0
26.62 s
[gammaloop-workspace-check] Checking owo-colors v4.3.0
26.76 s
[gammaloop-workspace-check] Checking object v0.37.3
26.89 s
[gammaloop-workspace-check] Checking env_logger v0.11.10
26.90 s
[gammaloop-workspace-check] Checking tracing-error v0.2.1
27.06 s
[gammaloop-workspace-check] Checking indicatif v0.18.4
27.37 s
[gammaloop-workspace-check] Checking typed-index-collections v3.5.0
27.45 s
[gammaloop-workspace-check] Checking serde-big-array v0.5.1
27.59 s
[gammaloop-workspace-check] Checking amd v0.2.2
27.75 s
[gammaloop-workspace-check] Checking itertools v0.11.0
27.80 s
[gammaloop-workspace-check] Compiling gammaloop-tracing-filter-macros v0.1.0 (/build/source/crates/gammaloop-tracing-filter-macros)
28.01 s
[gammaloop-workspace-check] Checking rustc-demangle v0.1.27
28.13 s
[gammaloop-workspace-check] Checking option-ext v0.2.0
28.24 s
[gammaloop-workspace-check] Checking dirs-sys v0.5.0
28.37 s
[gammaloop-workspace-check] Checking ref-cast v1.0.25
28.49 s
[gammaloop-workspace-check] Checking nix v0.31.2
28.50 s
[gammaloop-workspace-check] Checking integer-sqrt v0.1.5
28.62 s
[gammaloop-workspace-check] Checking brotli-decompressor v4.0.3
28.66 s
[gammaloop-workspace-check] Checking crossbeam-channel v0.5.15
28.75 s
[gammaloop-workspace-check] Checking rkyv v0.7.46
28.98 s
[gammaloop-workspace-check] Checking itertools v0.12.1
28.99 s
[gammaloop-workspace-check] Checking symlink v0.1.0
29.16 s
[gammaloop-workspace-check] Compiling gammalooprs v0.3.4 (/build/source/crates/gammalooprs)
29.22 s
[gammaloop-workspace-check] Checking ratatui-widgets v0.3.0
29.62 s
[gammaloop-workspace-check] Checking color-spantrace v0.3.0
29.91 s
[gammaloop-workspace-check] Checking ratatui-crossterm v0.1.0
29.94 s
[gammaloop-workspace-check] Checking unsafe-libyaml v0.2.11
30.11 s
[gammaloop-workspace-check] Checking tracing-appender v0.2.5
30.16 s
[gammaloop-workspace-check] Checking brotli v7.0.0
30.18 s
[gammaloop-workspace-check] Checking include_dir v0.7.4
30.38 s
[gammaloop-workspace-check] Checking tracing-indicatif v0.3.14
30.58 s
[gammaloop-workspace-check] Checking dirs v6.0.0
30.75 s
[gammaloop-workspace-check] Checking pathfinding v4.15.0
30.78 s
[gammaloop-workspace-check] Checking schemars v1.2.1
30.80 s
[gammaloop-workspace-check] Checking slotmap v1.1.1
30.93 s
[gammaloop-workspace-check] Checking ratatui-macros v0.7.0
31.05 s
[gammaloop-workspace-check] Checking ratatui v0.30.0
31.41 s
[gammaloop-workspace-check] Checking json5 v0.4.1
31.56 s
[gammaloop-workspace-check] Checking vectorize v0.2.0
31.73 s
[gammaloop-workspace-check] Checking ctrlc v3.5.2
31.79 s
[gammaloop-workspace-check] Checking base62 v2.2.4
32.04 s
[gammaloop-workspace-check] Checking clarabel v0.11.1
32.07 s
[gammaloop-workspace-check] Checking ringbuffer v0.16.0
32.14 s
[gammaloop-workspace-check] Checking rust-embed v8.11.0
32.18 s
[gammaloop-workspace-check] Compiling rustpython-parser-core v0.4.0
32.26 s
[gammaloop-workspace-check] Checking clap_complete v4.6.3
32.32 s
[gammaloop-workspace-check] Checking addr2line v0.25.1
32.33 s
[gammaloop-workspace-check] Checking fd-lock v4.0.4
32.65 s
[gammaloop-workspace-check] Checking strip-ansi-escapes v0.2.1
32.85 s
[gammaloop-workspace-check] Compiling rustpython-ast v0.4.0
32.92 s
[gammaloop-workspace-check] Compiling gammaloop-api v0.1.0 (/build/source/crates/gammaloop-api)
33.15 s
[gammaloop-workspace-check] Checking itertools v0.13.0
33.19 s
[gammaloop-workspace-check] Checking serde_yaml v0.9.34+deprecated
33.27 s
[gammaloop-workspace-check] Checking strum v0.26.3
33.48 s
[gammaloop-workspace-check] Checking sysinfo v0.33.1
33.48 s
[gammaloop-workspace-check] Checking shlex v1.3.0
33.71 s
[gammaloop-workspace-check] Checking futures-task v0.3.32
33.79 s
[gammaloop-workspace-check] Checking futures-core v0.3.32
33.79 s
[gammaloop-workspace-check] Checking slab v0.4.12
33.92 s
[gammaloop-workspace-check] Checking sdd v3.0.10
34.03 s
[gammaloop-workspace-check] Compiling gammaloop-integration-tests v0.1.0 (/build/source/tests)
34.10 s
[gammaloop-workspace-check] Compiling test-log-core v0.2.20
34.14 s
[gammaloop-workspace-check] Compiling rustc_version v0.4.1
34.18 s
[gammaloop-workspace-check] Checking futures-util v0.3.32
34.25 s
[gammaloop-workspace-check] Checking clap_complete_nushell v4.6.0
34.32 s
[gammaloop-workspace-check] Checking scc v2.4.0
34.53 s
[gammaloop-workspace-check] Checking which v8.0.2
35.18 s
[gammaloop-workspace-check] Checking bincode v1.3.3
36.13 s
[gammaloop-workspace-check] Compiling gungraun-macros v0.8.0
36.15 s
[gammaloop-workspace-check] Compiling gungraun-runner v0.18.2
36.32 s
[gammaloop-workspace-check] Checking proc-macro2 v1.0.106
36.89 s
[gammaloop-workspace-check] Checking quote v1.0.45
37.39 s
[gammaloop-workspace-check] Checking base64 v0.21.7
37.50 s
[gammaloop-workspace-check] Checking backtrace v0.3.76
37.59 s
[gammaloop-workspace-check] Checking maplit v1.0.2
37.81 s
[gammaloop-workspace-check] Checking nalgebra v0.29.0
37.81 s
[gammaloop-workspace-check] Compiling iai-callgrind-runner v0.14.2
38.17 s
[gammaloop-workspace-check] Checking color-eyre v0.6.5
38.30 s
[gammaloop-workspace-check] Checking reedline v0.42.0
38.55 s
[gammaloop-workspace-check] Checking ron v0.8.1
38.98 s
[gammaloop-workspace-check] Checking kurbo v0.13.0
39.00 s
[gammaloop-workspace-check] Checking wait-timeout v0.2.1
39.26 s
[gammaloop-workspace-check] Checking quick-error v1.2.3
39.44 s
[gammaloop-workspace-check] Compiling iai-callgrind v0.14.2
40.17 s
[gammaloop-workspace-check] Checking futures-executor v0.3.32
40.17 s
[gammaloop-workspace-check] Checking bit-vec v0.8.0
40.47 s
[gammaloop-workspace-check] Compiling numerica v2.2.0 (https://github.com/alphal00p/symbolica?rev=a277a8dadbaae5a8d6605f2f381991a601e1f345#a277a8da)
40.61 s
[gammaloop-workspace-check] Checking serial_test v3.4.0
40.82 s
[gammaloop-workspace-check] Checking bit-set v0.8.0
41.07 s
[gammaloop-workspace-check] Checking rusty-fork v0.3.1
41.22 s
[gammaloop-workspace-check] Checking syn v2.0.117
41.27 s
[gammaloop-workspace-check] Compiling iai-callgrind-macros v0.5.1
41.40 s
[gammaloop-workspace-check] Checking rand_xorshift v0.4.0
41.48 s
[gammaloop-workspace-check] Compiling test-log-macros v0.2.20
41.71 s
[gammaloop-workspace-check] Checking console v0.15.11
42.03 s
[gammaloop-workspace-check] Checking pathdiff v0.2.3
42.17 s
[gammaloop-workspace-check] Checking unarray v0.1.4
42.31 s
[gammaloop-workspace-check] Checking proptest v1.11.0
42.40 s
[gammaloop-workspace-check] Checking similar-asserts v1.7.0
43.11 s
[gammaloop-workspace-check] Checking clinnet v0.1.8 (/build/source/crates/clinnet)
44.83 s
[gammaloop-workspace-check] Checking kurvst v0.1.0 (/build/source/crates/kurvst)
48.70 s
[gammaloop-workspace-check] Checking test-log v0.2.20
52.00 s
[gammaloop-workspace-check] Compiling graphica v2.1.0 (https://github.com/alphal00p/symbolica?rev=a277a8dadbaae5a8d6605f2f381991a601e1f345#a277a8da)
56.00 s
[gammaloop-workspace-check] Checking statrs v0.16.1
58.32 s
[gammaloop-workspace-check] Checking momtrop v0.3.0
61.24 s
[gammaloop-workspace-check] Checking gungraun v0.18.2
72.29 s
[gammaloop-workspace-check] Compiling pyo3-macros v0.28.3
72.68 s
[gammaloop-workspace-check] Compiling pyo3-stub-gen-derive v0.17.2
88.51 s
[gammaloop-workspace-check] Checking pyo3-stub-gen v0.17.2
98.45 s
[gammaloop-workspace-check] Checking symbolica-utils v0.1.0 (/build/source/crates/symbolica-utils)
98.46 s
[gammaloop-workspace-check] Checking spenso-macros v0.3.2 (/build/source/crates/spenso-macros)
305.69 s
[gammaloop-workspace-check] Compiling gammaloop-workspace-hack v0.1.0 (/build/source/crates/gammaloop-workspace-hack)
305.91 s
[gammaloop-workspace-check] Checking linnet v0.17.0 (/build/source/crates/linnet)
309.00 s
[gammaloop-workspace-check] Checking spenso v0.6.0 (/build/source/crates/spenso)
309.29 s
[gammaloop-workspace-check] Checking linnet-py v0.1.0 (/build/source/crates/linnet-py)
309.29 s
[gammaloop-workspace-check] Checking linnest v0.1.0 (/build/source/crates/linnest)
316.66 s
[gammaloop-workspace-check] Checking idenso v0.3.0 (/build/source/crates/idenso)
316.66 s
[gammaloop-workspace-check] Checking gammaloop-tracing-filter v0.1.0 (/build/source/crates/gammaloop-tracing-filter)
319.06 s
[gammaloop-workspace-check] Checking spenso-hep-lib v0.1.7 (/build/source/crates/spenso-hep-lib)
319.36 s
[gammaloop-workspace-check] Checking spynso3 v0.1.2 (/build/source/crates/spynso3)
363.06 s
[gammaloop-workspace-check] error[E0560] : struct `CutInfo` has no field named `lmb_channel_id`
363.06 s
[gammaloop-workspace-check] --> tests/tests/test_differential.rs:86:13
363.06 s
[gammaloop-workspace-check] |
363.06 s
[gammaloop-workspace-check] 86 | lmb_channel_id: None,
363.06 s
[gammaloop-workspace-check] | ^^^^^^^^^^^^^^ `CutInfo` does not have this field
363.06 s
[gammaloop-workspace-check] |
363.06 s
[gammaloop-workspace-check] = note : available fields are: `sampling_channel_id`, `sampling_channel_edge_ids`
363.06 s
[gammaloop-workspace-check]
363.06 s
[gammaloop-workspace-check] error[E0560] : struct `CutInfo` has no field named `lmb_channel_edge_ids`
363.06 s
[gammaloop-workspace-check] --> tests/tests/test_differential.rs:87:13
363.06 s
[gammaloop-workspace-check] |
363.06 s
[gammaloop-workspace-check] 87 | lmb_channel_edge_ids: None,
363.06 s
[gammaloop-workspace-check] | ^^^^^^^^^^^^^^^^^^^^ `CutInfo` does not have this field
363.06 s
[gammaloop-workspace-check] |
363.06 s
[gammaloop-workspace-check] = note : available fields are: `sampling_channel_id`, `sampling_channel_edge_ids`
363.06 s
[gammaloop-workspace-check]
363.08 s
[gammaloop-workspace-check] error[E0063] : missing field `reference_moments` in initializer of `GraphEvaluationResult<_>`
363.08 s
[gammaloop-workspace-check] --> tests/tests/test_differential.rs:532:19
363.08 s
[gammaloop-workspace-check] |
363.08 s
[gammaloop-workspace-check] 532 | let mut lhs = GraphEvaluationResult {
363.08 s
[gammaloop-workspace-check] | ^^^^^^^^^^^^^^^^^^^^^ missing `reference_moments`
363.08 s
[gammaloop-workspace-check]
363.08 s
[gammaloop-workspace-check] error[E0063] : missing field `reference_moments` in initializer of `GraphEvaluationResult<_>`
363.08 s
[gammaloop-workspace-check] --> tests/tests/test_differential.rs:539:15
363.08 s
[gammaloop-workspace-check] |
363.08 s
[gammaloop-workspace-check] 539 | let rhs = GraphEvaluationResult {
363.08 s
[gammaloop-workspace-check] | ^^^^^^^^^^^^^^^^^^^^^ missing `reference_moments`
363.08 s
[gammaloop-workspace-check]
363.15 s
[gammaloop-workspace-check] Some errors have detailed explanations: E0063, E0560.
363.15 s
[gammaloop-workspace-check] For more information about an error, try `rustc --explain E0063`.
363.17 s
[gammaloop-workspace-check] error : could not compile `gammaloop-integration-tests` (test "test_differential") due to 4 previous errors
363.17 s
[gammaloop-workspace-check] warning : build failed, waiting for other jobs to finish...
363.51 s
[gammaloop-workspace-check] error[E0609] : no field `lmb_channel_edge_ids` on type `CutInfo`
363.51 s
[gammaloop-workspace-check] --> tests/tests/test_evaluation_api.rs:311:10
363.51 s
[gammaloop-workspace-check] |
363.51 s
[gammaloop-workspace-check] 311 | .lmb_channel_edge_ids
363.51 s
[gammaloop-workspace-check] | ^^^^^^^^^^^^^^^^^^^^ unknown field
363.51 s
[gammaloop-workspace-check] |
363.51 s
[gammaloop-workspace-check] = note : available fields are: `particle_pdgs`, `cut_id`, `graph_id`, `graph_group_id`, `orientation_id` ... and 2 others
363.51 s
[gammaloop-workspace-check]
363.54 s
[gammaloop-workspace-check] error[E0609] : no field `lmb_channel_edge_ids` on type `CutInfo`
363.54 s
[gammaloop-workspace-check] --> tests/tests/test_evaluation_api.rs:591:26
363.54 s
[gammaloop-workspace-check] |
363.54 s
[gammaloop-workspace-check] 591 | .lmb_channel_edge_ids
363.54 s
[gammaloop-workspace-check] | ^^^^^^^^^^^^^^^^^^^^ unknown field
363.54 s
[gammaloop-workspace-check] |
363.54 s
[gammaloop-workspace-check] = note : available fields are: `particle_pdgs`, `cut_id`, `graph_id`, `graph_group_id`, `orientation_id` ... and 2 others
363.54 s
[gammaloop-workspace-check]
363.59 s
[gammaloop-workspace-check] error[E0609] : no field `lmb_channel_edge_ids` on type `CutInfo`
363.59 s
[gammaloop-workspace-check] --> tests/tests/test_evaluation_api.rs:1177:18
363.59 s
[gammaloop-workspace-check] |
363.59 s
[gammaloop-workspace-check] 1177 | .lmb_channel_edge_ids
363.59 s
[gammaloop-workspace-check] | ^^^^^^^^^^^^^^^^^^^^ unknown field
363.59 s
[gammaloop-workspace-check] |
363.59 s
[gammaloop-workspace-check] = note : available fields are: `particle_pdgs`, `cut_id`, `graph_id`, `graph_group_id`, `orientation_id` ... and 2 others
363.59 s
[gammaloop-workspace-check]
363.75 s
[gammaloop-workspace-check] error[E0609] : no field `lmb_channel_edge_ids` on type `CutInfo`
363.75 s
[gammaloop-workspace-check] --> tests/tests/test_evaluation_api.rs:1222:22
363.75 s
[gammaloop-workspace-check] |
363.75 s
[gammaloop-workspace-check] 1222 | .lmb_channel_edge_ids
363.75 s
[gammaloop-workspace-check] | ^^^^^^^^^^^^^^^^^^^^ unknown field
363.75 s
[gammaloop-workspace-check] |
363.76 s
[gammaloop-workspace-check] = note : available fields are: `particle_pdgs`, `cut_id`, `graph_id`, `graph_group_id`, `orientation_id` ... and 2 others
363.76 s
[gammaloop-workspace-check]
363.76 s
[gammaloop-workspace-check] error[E0609] : no field `lmb_channel_edge_ids` on type `CutInfo`
363.76 s
[gammaloop-workspace-check] --> tests/tests/test_evaluation_api.rs:1281:14
363.76 s
[gammaloop-workspace-check] |
363.76 s
[gammaloop-workspace-check] 1281 | .lmb_channel_edge_ids
363.76 s
[gammaloop-workspace-check] | ^^^^^^^^^^^^^^^^^^^^ unknown field
363.76 s
[gammaloop-workspace-check] |
363.76 s
[gammaloop-workspace-check] = note : available fields are: `particle_pdgs`, `cut_id`, `graph_id`, `graph_group_id`, `orientation_id` ... and 2 others
363.76 s
[gammaloop-workspace-check]
363.81 s
[gammaloop-workspace-check] error[E0609] : no field `lmb_channel_edge_ids` on type `CutInfo`
363.81 s
[gammaloop-workspace-check] --> tests/tests/test_evaluation_api.rs:1428:18
363.81 s
[gammaloop-workspace-check] |
363.81 s
[gammaloop-workspace-check] 1428 | .lmb_channel_edge_ids
363.81 s
[gammaloop-workspace-check] | ^^^^^^^^^^^^^^^^^^^^ unknown field
363.81 s
[gammaloop-workspace-check] |
363.81 s
[gammaloop-workspace-check] = note : available fields are: `particle_pdgs`, `cut_id`, `graph_id`, `graph_group_id`, `orientation_id` ... and 2 others
363.81 s
[gammaloop-workspace-check]
363.92 s
[gammaloop-workspace-check] For more information about this error, try `rustc --explain E0609`.
363.94 s
[gammaloop-workspace-check] error : could not compile `gammaloop-integration-tests` (test "test_evaluation_api") due to 6 previous errors
364.41 s
[gammaloop-workspace-check] error[E0609] : no field `lmb_channel_id` on type `CutInfo`
364.41 s
[gammaloop-workspace-check] --> tests/tests/test_runs/utils.rs:568:36
364.41 s
[gammaloop-workspace-check] |
364.41 s
[gammaloop-workspace-check] 568 | event.cut_info.lmb_channel_id,
364.41 s
[gammaloop-workspace-check] | ^^^^^^^^^^^^^^ unknown field
364.41 s
[gammaloop-workspace-check] |
364.41 s
[gammaloop-workspace-check] = note : available fields are: `particle_pdgs`, `cut_id`, `graph_id`, `graph_group_id`, `orientation_id` ... and 2 others
364.41 s
[gammaloop-workspace-check]
364.41 s
[gammaloop-workspace-check] error[E0609] : no field `lmb_channel_id` on type `CutInfo`
364.41 s
[gammaloop-workspace-check] --> tests/tests/test_runs/utils.rs:580:36
364.41 s
[gammaloop-workspace-check] |
364.41 s
[gammaloop-workspace-check] 580 | event.cut_info.lmb_channel_id,
364.41 s
[gammaloop-workspace-check] | ^^^^^^^^^^^^^^ unknown field
364.41 s
[gammaloop-workspace-check] |
364.41 s
[gammaloop-workspace-check] = note : available fields are: `particle_pdgs`, `cut_id`, `graph_id`, `graph_group_id`, `orientation_id` ... and 2 others
364.41 s
[gammaloop-workspace-check]
365.10 s
[gammaloop-workspace-check] error : could not compile `gammaloop-integration-tests` (test "test_runs") due to 2 previous errors
365.66 s
Progress: 0 of 1 built (1 failed)
365.66 s
Failed to build gammaloop-workspace-check after 6m03s
365.67 s
Cannot build ' /nix/store/axwybdrvnz6g31i8j22ivzmz2ysf3s4g-gammaloop-workspace-check-0.1.0.drv '.
365.67 s
Reason: builder failed with exit code 101 .
365.67 s
Output paths:
365.67 s
/nix/store/9cxf174qbl62vd8h78aazfzs3igfpdff-gammaloop-workspace-check-0.1.0
365.67 s
Last 524 log lines:
365.67 s
> Running phase: unpackPhase
365.67 s
> unpacking source archive /nix/store/z5pb9ly08pscbnc755wvrwn7ad3dvc0j-source
365.67 s
> source root is source
365.67 s
> Running phase: patchPhase
365.67 s
> Executing configureCargoCommonVars
365.67 s
> decompressing cargo artifacts from /nix/store/50vpxlcgfxf2d57i27v3d10zjwxxbm2r-gammaloop-workspace-deps-deps-0.1.0/target.tar.zst to target
365.67 s
> Running phase: updateAutotoolsGnuConfigScriptsPhase
365.67 s
> Running phase: configurePhase
365.67 s
> will append /build/source/.cargo-home/config.toml with contents of /nix/store/5drf77x6km4ky7gwlrzdx9bbd6fz09g3-vendor-cargo-deps/config.toml
365.67 s
> default configurePhase, nothing to do
365.67 s
> Running phase: buildPhase
365.67 s
> +++ command cargo --version
365.67 s
> cargo 1.97.0 (c980f4866 2026-06-30)
365.67 s
> +++ command cargo check --profile ci-optim --locked --workspace --features gammaloop-tracing-filter/clap,gammaloop-tracing-filter/symbolica,idenso/bincode,idenso/reference-cases,linnet/bincode,linnet/drawing,linnet/rkyv,linnet/serde,linnet/symbolica,spenso-macros/shadowing,spenso/shadowing,symbolica/tracing_max_level_info,three-dimensional-reps/display,three-dimensional-reps/eval,three-dimensional-reps/serde --all-targets
365.67 s
> Checking cfg-if v1.0.4
365.67 s
> Checking memchr v2.8.0
365.67 s
> Checking once_cell v1.21.4
365.67 s
> Checking either v1.15.0
365.67 s
> Checking serde_core v1.0.228
365.67 s
> Checking libc v0.2.186
365.67 s
> Checking libm v0.2.16
365.67 s
> Checking itoa v1.0.18
365.67 s
> Checking log v0.4.29
365.67 s
> Checking regex-syntax v0.8.10
365.67 s
> Checking zerocopy v0.8.48
365.67 s
> Checking crossbeam-utils v0.8.21
365.67 s
> Checking equivalent v1.0.2
365.67 s
> Checking zmij v1.0.21
365.67 s
> Checking lazy_static v1.5.0
365.67 s
> Checking bytemuck v1.25.0
365.67 s
> Compiling target-lexicon v0.13.5
365.67 s
> Checking arrayvec v0.7.6
365.67 s
> Checking powerfmt v0.2.0
365.67 s
> Checking pin-project-lite v0.2.17
365.67 s
> Checking itertools v0.14.0
365.67 s
> Checking time-core v0.1.8
365.67 s
> Checking num-conv v0.2.1
365.67 s
> Checking num_threads v0.1.7
365.67 s
> Checking safe_arch v0.7.4
365.67 s
> Checking tracing-core v0.1.36
365.67 s
> Checking foldhash v0.2.0
365.67 s
> Checking allocator-api2 v0.2.21
365.67 s
> Checking deranged v0.5.8
365.67 s
> Checking const-random v0.1.18
365.67 s
> Checking nu-ansi-term v0.50.3
365.67 s
> Checking winnow v1.0.2
365.67 s
> Checking unty v0.0.4
365.67 s
> Checking crossbeam-epoch v0.9.18
365.67 s
> Checking aho-corasick v1.1.4
365.67 s
> Checking static_assertions v1.1.0
365.67 s
> Checking safe_arch v1.0.0
365.67 s
> Checking wide v0.7.33
365.67 s
> Checking hashbrown v0.16.1
365.67 s
> Checking sharded-slab v0.1.7
365.67 s
> Checking crossbeam-deque v0.8.6
365.67 s
> Checking tracing v0.1.44
365.67 s
> Checking rayon-core v1.13.0
365.67 s
> Checking tracing-log v0.2.0
365.67 s
> Checking num-traits v0.2.19
365.67 s
> Checking thread_local v1.1.9
365.67 s
> Checking az v1.3.0
365.67 s
> Checking rayon v1.12.0
365.67 s
> Checking indenter v0.3.4
365.67 s
> Checking toml_writer v1.1.1+spec-1.1.0
365.67 s
> Checking wide v1.3.0
365.67 s
> Compiling phf_shared v0.11.3
365.67 s
> Checking anyhow v1.0.102
365.67 s
> Checking alloc-no-stdlib v2.0.4
365.67 s
> Checking rawpointer v0.2.1
365.67 s
> Checking dyn-clone v1.0.20
365.67 s
> Checking utf8parse v0.2.2
365.67 s
> Checking toml_parser v1.1.2+spec-1.1.0
365.67 s
> Checking alloc-stdlib v0.2.2
365.67 s
> Checking matrixmultiply v0.3.10
365.67 s
> Checking getrandom v0.3.4
365.67 s
> Checking time v0.3.47
365.67 s
> Checking gmp-mpfr-sys v1.7.1
365.67 s
> Checking anstyle-parse v1.0.0
365.67 s
> Checking colored v3.1.1
365.67 s
> Checking regex-automata v0.4.14
365.67 s
> Checking approx v0.5.1
365.67 s
> Checking rand_core v0.9.5
365.67 s
> Checking num-integer v0.1.46
365.67 s
> Checking anstyle-query v1.1.5
365.67 s
> Checking anstyle v1.0.14
365.67 s
> Checking is_terminal_polyfill v1.70.2
365.67 s
> Checking colorchoice v1.0.5
365.67 s
> Compiling phf_generator v0.11.3
365.67 s
> Checking eyre v0.6.12
365.67 s
> Checking unicode-width v0.2.2
365.67 s
> Compiling pyo3-build-config v0.28.3
365.67 s
> Checking bitflags v1.3.2
365.67 s
> Checking wasmtime-jit-icache-coherence v34.0.2
365.67 s
> Checking brotli-decompressor v5.0.0
365.67 s
> Checking anstream v1.0.0
365.67 s
> Checking hugepage-rs v0.1.1
365.67 s
> Checking region v3.0.2
365.67 s
> Checking spec_math v0.1.6
365.67 s
> Checking inventory v0.3.24
365.67 s
> Checking serde v1.0.228
365.67 s
> Checking serde_json v1.0.149
365.67 s
> Checking bitflags v2.11.1
365.67 s
> Checking serde_spanned v1.1.1
365.67 s
> Checking toml_datetime v1.1.1+spec-1.1.0
365.67 s
> Compiling phf_codegen v0.11.3
365.67 s
> Checking thiserror v2.0.18
365.67 s
> Compiling getopts v0.2.24
365.67 s
> Checking libloading v0.9.0
365.67 s
> Checking append-only-vec v0.1.8
365.67 s
> Checking self_cell v1.2.2
365.67 s
> Checking byteorder v1.5.0
365.67 s
> Checking tinyjson v2.5.1
365.67 s
> Checking bytes v1.11.1
365.67 s
> Checking toml v1.1.2+spec-1.1.0
365.67 s
> Compiling unicode_names2_generator v1.3.0
365.67 s
> Checking smallvec v1.15.1
365.67 s
> Checking num-complex v0.4.6
365.67 s
> Checking tracing-serde v0.2.0
365.67 s
> Checking bincode v2.0.1
365.67 s
> Checking smartstring v1.0.1
365.67 s
> Checking linux-raw-sys v0.12.1
365.67 s
> Checking brotli v8.0.2
365.67 s
> Checking simba v0.9.1
365.67 s
> Compiling unic-char-range v0.9.0
365.67 s
> Compiling unic-common v0.9.0
365.67 s
> Compiling unic-ucd-version v0.9.0
365.67 s
> Compiling unic-char-property v0.9.0
365.67 s
> Compiling is-macro v0.3.7
365.67 s
> Compiling rustpython-parser-vendored v0.4.0
365.67 s
> Checking iana-time-zone v0.1.65
365.67 s
> Compiling rustpython-parser v0.4.0
365.67 s
> Compiling phf v0.11.3
365.67 s
> Checking rustc-hash v2.1.2
365.67 s
> Checking chrono v0.4.44
365.67 s
> Compiling unic-ucd-ident v0.9.0
365.67 s
> Checking rustix v1.1.4
365.67 s
> Compiling unic-emoji-char v0.9.0
365.67 s
> Checking ndarray v0.17.2
365.67 s
> Compiling lalrpop-util v0.20.2
365.67 s
> Compiling rustc-hash v1.1.0
365.67 s
> Checking rug v1.30.0
365.67 s
> Checking unicode-segmentation v1.13.2
365.67 s
> Compiling symbolica v2.2.0 (https://github.com/alphal00p/symbolica?rev=a277a8dadbaae5a8d6605f2f381991a601e1f345#a277a8da)
365.67 s
> Checking typenum v1.20.0
365.67 s
> Checking ppv-lite86 v0.2.21
365.67 s
> Checking ahash v0.8.12
365.67 s
> Checking getrandom v0.2.17
365.67 s
> Checking scopeguard v1.2.0
365.67 s
> Checking lock_api v0.4.14
365.67 s
> Checking parking_lot_core v0.9.12
365.67 s
> Checking rand_chacha v0.9.0
365.67 s
> Checking hashbrown v0.17.0
365.67 s
> Checking unicode-ident v1.0.24
365.67 s
> Checking rand v0.9.4
365.67 s
> Checking parking_lot v0.12.5
365.67 s
> Checking errno v0.3.14
365.67 s
> Checking clap_lex v1.1.0
365.67 s
> Checking generic-array v0.14.7
365.67 s
> Checking unicase v2.9.0
365.67 s
> Checking strsim v0.11.1
365.67 s
> Checking matchers v0.2.0
365.67 s
> Checking regex v1.12.3
365.67 s
> Checking tracing-subscriber v0.3.23
365.67 s
> Checking signal-hook-registry v1.4.8
365.67 s
> Checking vte v0.14.1
365.67 s
> Checking same-file v1.0.6
365.67 s
> Checking signal-hook v0.3.18
365.67 s
> Checking half v2.7.1
365.67 s
> Checking symjit v2.21.0
365.67 s
> Checking indexmap v2.14.0
365.67 s
> Checking crypto-common v0.1.7
365.67 s
> Checking walkdir v2.5.0
365.67 s
> Checking block-buffer v0.10.4
365.67 s
> Checking mio v1.2.0
365.67 s
> Checking terminal_size v0.4.4
365.67 s
> Checking minimal-lexical v0.2.1
365.67 s
> Checking clap_builder v4.6.0
365.67 s
> Checking ciborium-io v0.2.2
365.67 s
> Checking digest v0.10.7
365.67 s
> Checking ciborium-ll v0.2.2
365.67 s
> Checking nom v7.1.3
365.67 s
> Checking derive_more v2.1.1
365.67 s
> Checking num-bigint v0.4.6
365.67 s
> Checking console v0.16.3
365.67 s
> Checking signal-hook-mio v0.2.5
365.67 s
> Checking bstr v1.12.1
365.67 s
> Checking linux-raw-sys v0.4.15
365.67 s
> Checking winnow v0.7.15
365.67 s
> Checking cpufeatures v0.2.17
365.67 s
> Checking sha2 v0.10.9
365.67 s
> Checking rustix v0.38.44
365.67 s
> Checking ciborium v0.2.2
365.67 s
> Checking globset v0.4.18
365.67 s
> Checking rand_core v0.6.4
365.67 s
> Compiling unicode_names2 v1.3.0
365.67 s
> Checking getrandom v0.4.2
365.67 s
> Checking plotters-backend v0.3.7
365.67 s
> Checking fnv v1.0.7
365.67 s
> Checking fastrand v2.4.1
365.67 s
> Checking rust-embed-utils v8.11.0
365.67 s
> Checking xprec v0.2.2
365.67 s
> Checking plotters-svg v0.3.7
365.67 s
> Checking toml_datetime v0.6.11
365.67 s
> Checking tempfile v3.27.0
365.67 s
> Checking serde_spanned v0.6.9
365.67 s
> Checking itertools v0.10.5
365.67 s
> Checking toml_write v0.1.2
365.67 s
> Checking tap v1.0.1
365.67 s
> Checking ansitok v0.3.0
365.67 s
> Checking crossterm v0.28.1
365.67 s
> Checking cast v0.3.0
365.67 s
> Checking plotters v0.3.7
365.67 s
> Checking wyz v0.5.1
365.67 s
> Checking rand_chacha v0.3.1
365.67 s
> Checking radium v0.7.0
365.67 s
> Checking typeid v1.0.3
365.67 s
> Checking similar v2.7.0
365.67 s
> Checking tinytemplate v1.2.1
365.67 s
> Checking ansi-str v0.9.0
365.67 s
> Checking is-terminal v0.4.17
365.67 s
> Checking oorandom v11.1.5
365.67 s
> Checking bytecount v0.6.9
365.67 s
> Checking toml_edit v0.22.27
365.67 s
> Checking funty v2.0.0
365.67 s
> Checking clap v4.6.1
365.67 s
> Checking anes v0.1.6
365.67 s
> Checking testing_table v0.3.0
365.67 s
> Checking ron v0.12.1
365.67 s
> Checking papergrid v0.17.0
365.67 s
> Checking rand v0.8.6
365.67 s
> Checking toml_edit v0.25.11+spec-1.1.0
365.67 s
> Checking uncased v0.9.10
365.67 s
> Checking env_filter v1.0.1
365.67 s
> Checking bitvec v1.0.1
365.67 s
> Checking criterion-plot v0.5.0
365.67 s
> Checking jiff v0.2.24
365.67 s
> Checking ptr_meta v0.1.4
365.67 s
> Checking ucd-trie v0.1.7
365.67 s
> Checking simdutf8 v0.1.5
365.67 s
> Checking pest v2.8.6
365.67 s
> Checking ahash v0.7.8
365.67 s
> Checking approx v0.4.0
365.67 s
> Checking seahash v4.1.0
365.67 s
> Checking hashbrown v0.12.3
365.67 s
> Checking bytecheck v0.6.12
365.67 s
> Checking cgmath v0.18.0
365.67 s
> Checking num-rational v0.4.2
365.67 s
> Checking rend v0.4.2
365.67 s
> Checking criterion v0.5.1
365.67 s
> Checking num-iter v0.1.45
365.67 s
> Checking ref-ops v0.2.5
365.67 s
> Checking rand_xoshiro v0.6.0
365.67 s
> Checking num v0.4.3
365.67 s
> Checking features v0.10.0
365.67 s
> Checking gat-lending-iterator v0.1.8
365.67 s
> Checking insta v1.47.2
365.67 s
> Checking constcat v0.5.1
365.67 s
> Checking colored v2.2.0
365.67 s
> Checking cpufeatures v0.3.0
365.67 s
> Checking constant_time_eq v0.4.2
365.67 s
> Checking arrayref v0.3.9
365.67 s
> Checking base64 v0.22.1
365.67 s
> Checking blake3 v1.8.5
365.67 s
> Checking tabled v0.20.0
365.67 s
> Checking joinery v2.1.0
365.67 s
> Checking siphasher v1.0.2
365.67 s
> Checking titlecase v2.2.1
365.67 s
> Checking phf_shared v0.13.1
365.67 s
> Checking subprocess v0.2.15
365.67 s
> Compiling pyo3-ffi v0.28.3
365.67 s
> Compiling pyo3-macros-backend v0.28.3
365.67 s
> Compiling pyo3 v0.28.3
365.67 s
> Compiling numpy v0.28.0
365.67 s
> Checking toml v0.8.23
365.67 s
> Checking dot-parser v0.5.1
365.67 s
> Checking rust_lisp v0.18.0
365.67 s
> Compiling vakint v0.1.2 (/build/source/crates/vakint)
365.67 s
> Checking figment v0.10.19
365.67 s
> Checking phf v0.13.1
365.67 s
> Checking version-compare v0.2.1
365.67 s
> Checking xpct v0.5.1
365.67 s
> Checking ryu v1.0.23
365.67 s
> Checking string-template-plus v0.4.3
365.67 s
> Checking castaway v0.2.4
365.67 s
> Checking toml_datetime v0.7.5+spec-1.1.0
365.67 s
> Checking strum v0.27.2
365.67 s
> Checking compact_str v0.9.0
365.67 s
> Checking unicode-truncate v2.0.1
365.67 s
> Checking toml v0.9.12+spec-1.1.0
365.67 s
> Checking kasuari v0.4.12
365.67 s
> Checking lru v0.16.4
365.67 s
> Checking vte v0.15.0
365.67 s
> Checking portable-atomic v1.13.1
365.67 s
> Checking unit-prefix v0.5.2
365.67 s
> Checking rand_distr v0.4.3
365.67 s
> Checking simba v0.6.0
365.67 s
> Checking line-clipping v0.3.7
365.67 s
> Compiling three-dimensional-reps v0.1.0 (/build/source/crates/three-dimensional-reps)
365.67 s
> Checking vt100 v0.16.2
365.67 s
> Checking adler2 v2.0.1
365.67 s
> Checking ratatui-core v0.1.0
365.67 s
> Checking gimli v0.32.3
365.67 s
> Checking thiserror v1.0.69
365.67 s
> Checking miniz_oxide v0.8.9
365.67 s
> Checking derive_builder v0.11.2
365.67 s
> Checking crossterm v0.29.0
365.67 s
> Checking owo-colors v4.3.0
365.67 s
> Checking object v0.37.3
365.67 s
> Checking env_logger v0.11.10
365.67 s
> Checking tracing-error v0.2.1
365.67 s
> Checking indicatif v0.18.4
365.67 s
> Checking typed-index-collections v3.5.0
365.67 s
> Checking serde-big-array v0.5.1
365.67 s
> Checking amd v0.2.2
365.67 s
> Checking itertools v0.11.0
365.67 s
> Compiling gammaloop-tracing-filter-macros v0.1.0 (/build/source/crates/gammaloop-tracing-filter-macros)
365.67 s
> Checking rustc-demangle v0.1.27
365.67 s
> Checking option-ext v0.2.0
365.67 s
> Checking dirs-sys v0.5.0
365.67 s
> Checking ref-cast v1.0.25
365.67 s
> Checking nix v0.31.2
365.67 s
> Checking integer-sqrt v0.1.5
365.67 s
> Checking brotli-decompressor v4.0.3
365.67 s
> Checking crossbeam-channel v0.5.15
365.67 s
> Checking rkyv v0.7.46
365.67 s
> Checking itertools v0.12.1
365.67 s
> Checking symlink v0.1.0
365.67 s
> Compiling gammalooprs v0.3.4 (/build/source/crates/gammalooprs)
365.67 s
> Checking ratatui-widgets v0.3.0
365.67 s
> Checking color-spantrace v0.3.0
365.67 s
> Checking ratatui-crossterm v0.1.0
365.67 s
> Checking unsafe-libyaml v0.2.11
365.67 s
> Checking tracing-appender v0.2.5
365.67 s
> Checking brotli v7.0.0
365.67 s
> Checking include_dir v0.7.4
365.67 s
> Checking tracing-indicatif v0.3.14
365.67 s
> Checking dirs v6.0.0
365.67 s
> Checking pathfinding v4.15.0
365.67 s
> Checking schemars v1.2.1
365.67 s
> Checking slotmap v1.1.1
365.67 s
> Checking ratatui-macros v0.7.0
365.67 s
> Checking ratatui v0.30.0
365.67 s
> Checking json5 v0.4.1
365.67 s
> Checking vectorize v0.2.0
365.67 s
> Checking ctrlc v3.5.2
365.67 s
> Checking base62 v2.2.4
365.67 s
> Checking clarabel v0.11.1
365.67 s
> Checking ringbuffer v0.16.0
365.67 s
> Checking rust-embed v8.11.0
365.67 s
> Compiling rustpython-parser-core v0.4.0
365.67 s
> Checking clap_complete v4.6.3
365.67 s
> Checking addr2line v0.25.1
365.67 s
> Checking fd-lock v4.0.4
365.67 s
> Checking strip-ansi-escapes v0.2.1
365.67 s
> Compiling rustpython-ast v0.4.0
365.67 s
> Compiling gammaloop-api v0.1.0 (/build/source/crates/gammaloop-api)
365.67 s
> Checking itertools v0.13.0
365.67 s
> Checking serde_yaml v0.9.34+deprecated
365.67 s
> Checking strum v0.26.3
365.67 s
> Checking sysinfo v0.33.1
365.67 s
> Checking shlex v1.3.0
365.67 s
> Checking futures-task v0.3.32
365.67 s
> Checking futures-core v0.3.32
365.67 s
> Checking slab v0.4.12
365.67 s
> Checking sdd v3.0.10
365.67 s
> Compiling gammaloop-integration-tests v0.1.0 (/build/source/tests)
365.67 s
> Compiling test-log-core v0.2.20
365.67 s
> Compiling rustc_version v0.4.1
365.67 s
> Checking futures-util v0.3.32
365.67 s
> Checking clap_complete_nushell v4.6.0
365.67 s
> Checking scc v2.4.0
365.67 s
> Checking which v8.0.2
365.67 s
> Checking bincode v1.3.3
365.67 s
> Compiling gungraun-macros v0.8.0
365.67 s
> Compiling gungraun-runner v0.18.2
365.67 s
> Checking proc-macro2 v1.0.106
365.67 s
> Checking quote v1.0.45
365.67 s
> Checking base64 v0.21.7
365.67 s
> Checking backtrace v0.3.76
365.67 s
> Checking maplit v1.0.2
365.67 s
> Checking nalgebra v0.29.0
365.67 s
> Compiling iai-callgrind-runner v0.14.2
365.67 s
> Checking color-eyre v0.6.5
365.67 s
> Checking reedline v0.42.0
365.67 s
> Checking ron v0.8.1
365.67 s
> Checking kurbo v0.13.0
365.67 s
> Checking wait-timeout v0.2.1
365.67 s
> Checking quick-error v1.2.3
365.67 s
> Compiling iai-callgrind v0.14.2
365.67 s
> Checking futures-executor v0.3.32
365.67 s
> Checking bit-vec v0.8.0
365.67 s
> Compiling numerica v2.2.0 (https://github.com/alphal00p/symbolica?rev=a277a8dadbaae5a8d6605f2f381991a601e1f345#a277a8da)
365.67 s
> Checking serial_test v3.4.0
365.67 s
> Checking bit-set v0.8.0
365.67 s
> Checking rusty-fork v0.3.1
365.67 s
> Checking syn v2.0.117
365.67 s
> Compiling iai-callgrind-macros v0.5.1
365.67 s
> Checking rand_xorshift v0.4.0
365.67 s
> Compiling test-log-macros v0.2.20
365.67 s
> Checking console v0.15.11
365.67 s
> Checking pathdiff v0.2.3
365.67 s
> Checking unarray v0.1.4
365.67 s
> Checking proptest v1.11.0
365.67 s
> Checking similar-asserts v1.7.0
365.67 s
> Checking clinnet v0.1.8 (/build/source/crates/clinnet)
365.67 s
> Checking kurvst v0.1.0 (/build/source/crates/kurvst)
365.67 s
> Checking test-log v0.2.20
365.67 s
> Compiling graphica v2.1.0 (https://github.com/alphal00p/symbolica?rev=a277a8dadbaae5a8d6605f2f381991a601e1f345#a277a8da)
365.67 s
> Checking statrs v0.16.1
365.67 s
> Checking momtrop v0.3.0
365.67 s
> Checking gungraun v0.18.2
365.67 s
> Compiling pyo3-macros v0.28.3
365.67 s
> Compiling pyo3-stub-gen-derive v0.17.2
365.67 s
> Checking pyo3-stub-gen v0.17.2
365.67 s
> Checking symbolica-utils v0.1.0 (/build/source/crates/symbolica-utils)
365.67 s
> Checking spenso-macros v0.3.2 (/build/source/crates/spenso-macros)
365.67 s
> Compiling gammaloop-workspace-hack v0.1.0 (/build/source/crates/gammaloop-workspace-hack)
365.67 s
> Checking linnet v0.17.0 (/build/source/crates/linnet)
365.67 s
> Checking spenso v0.6.0 (/build/source/crates/spenso)
365.67 s
> Checking linnet-py v0.1.0 (/build/source/crates/linnet-py)
365.67 s
> Checking linnest v0.1.0 (/build/source/crates/linnest)
365.67 s
> Checking idenso v0.3.0 (/build/source/crates/idenso)
365.67 s
> Checking gammaloop-tracing-filter v0.1.0 (/build/source/crates/gammaloop-tracing-filter)
365.67 s
> Checking spenso-hep-lib v0.1.7 (/build/source/crates/spenso-hep-lib)
365.67 s
> Checking spynso3 v0.1.2 (/build/source/crates/spynso3)
365.67 s
> error[E0560] : struct `CutInfo` has no field named `lmb_channel_id`
365.67 s
> --> tests/tests/test_differential.rs:86:13
365.67 s
> |
365.67 s
> 86 | lmb_channel_id: None,
365.67 s
> | ^^^^^^^^^^^^^^ `CutInfo` does not have this field
365.67 s
> |
365.67 s
> = note : available fields are: `sampling_channel_id`, `sampling_channel_edge_ids`
365.67 s
>
365.67 s
> error[E0560] : struct `CutInfo` has no field named `lmb_channel_edge_ids`
365.67 s
> --> tests/tests/test_differential.rs:87:13
365.67 s
> |
365.67 s
> 87 | lmb_channel_edge_ids: None,
365.67 s
> | ^^^^^^^^^^^^^^^^^^^^ `CutInfo` does not have this field
365.67 s
> |
365.67 s
> = note : available fields are: `sampling_channel_id`, `sampling_channel_edge_ids`
365.67 s
>
365.67 s
> error[E0063] : missing field `reference_moments` in initializer of `GraphEvaluationResult<_>`
365.67 s
> --> tests/tests/test_differential.rs:532:19
365.67 s
> |
365.67 s
> 532 | let mut lhs = GraphEvaluationResult {
365.67 s
> | ^^^^^^^^^^^^^^^^^^^^^ missing `reference_moments`
365.67 s
>
365.67 s
> error[E0063] : missing field `reference_moments` in initializer of `GraphEvaluationResult<_>`
365.67 s
> --> tests/tests/test_differential.rs:539:15
365.67 s
> |
365.67 s
> 539 | let rhs = GraphEvaluationResult {
365.67 s
> | ^^^^^^^^^^^^^^^^^^^^^ missing `reference_moments`
365.67 s
>
365.67 s
> Some errors have detailed explanations: E0063, E0560.
365.67 s
> For more information about an error, try `rustc --explain E0063`.
365.67 s
> error : could not compile `gammaloop-integration-tests` (test "test_differential") due to 4 previous errors
365.67 s
> warning : build failed, waiting for other jobs to finish...
365.67 s
> error[E0609] : no field `lmb_channel_edge_ids` on type `CutInfo`
365.67 s
> --> tests/tests/test_evaluation_api.rs:311:10
365.67 s
> |
365.67 s
> 311 | .lmb_channel_edge_ids
365.67 s
> | ^^^^^^^^^^^^^^^^^^^^ unknown field
365.67 s
> |
365.67 s
> = note : available fields are: `particle_pdgs`, `cut_id`, `graph_id`, `graph_group_id`, `orientation_id` ... and 2 others
365.67 s
>
365.67 s
> error[E0609] : no field `lmb_channel_edge_ids` on type `CutInfo`
365.67 s
> --> tests/tests/test_evaluation_api.rs:591:26
365.67 s
> |
365.67 s
> 591 | .lmb_channel_edge_ids
365.67 s
> | ^^^^^^^^^^^^^^^^^^^^ unknown field
365.67 s
> |
365.67 s
> = note : available fields are: `particle_pdgs`, `cut_id`, `graph_id`, `graph_group_id`, `orientation_id` ... and 2 others
365.67 s
>
365.67 s
> error[E0609] : no field `lmb_channel_edge_ids` on type `CutInfo`
365.67 s
> --> tests/tests/test_evaluation_api.rs:1177:18
365.67 s
> |
365.67 s
> 1177 | .lmb_channel_edge_ids
365.67 s
> | ^^^^^^^^^^^^^^^^^^^^ unknown field
365.67 s
> |
365.67 s
> = note : available fields are: `particle_pdgs`, `cut_id`, `graph_id`, `graph_group_id`, `orientation_id` ... and 2 others
365.67 s
>
365.67 s
> error[E0609] : no field `lmb_channel_edge_ids` on type `CutInfo`
365.67 s
> --> tests/tests/test_evaluation_api.rs:1222:22
365.67 s
> |
365.67 s
> 1222 | .lmb_channel_edge_ids
365.67 s
> | ^^^^^^^^^^^^^^^^^^^^ unknown field
365.67 s
> |
365.67 s
> = note : available fields are: `particle_pdgs`, `cut_id`, `graph_id`, `graph_group_id`, `orientation_id` ... and 2 others
365.67 s
>
365.67 s
> error[E0609] : no field `lmb_channel_edge_ids` on type `CutInfo`
365.67 s
> --> tests/tests/test_evaluation_api.rs:1281:14
365.67 s
> |
365.67 s
> 1281 | .lmb_channel_edge_ids
365.67 s
> | ^^^^^^^^^^^^^^^^^^^^ unknown field
365.67 s
> |
365.67 s
> = note : available fields are: `particle_pdgs`, `cut_id`, `graph_id`, `graph_group_id`, `orientation_id` ... and 2 others
365.67 s
>
365.67 s
> error[E0609] : no field `lmb_channel_edge_ids` on type `CutInfo`
365.67 s
> --> tests/tests/test_evaluation_api.rs:1428:18
365.67 s
> |
365.67 s
> 1428 | .lmb_channel_edge_ids
365.67 s
> | ^^^^^^^^^^^^^^^^^^^^ unknown field
365.67 s
> |
365.67 s
> = note : available fields are: `particle_pdgs`, `cut_id`, `graph_id`, `graph_group_id`, `orientation_id` ... and 2 others
365.67 s
>
365.67 s
> For more information about this error, try `rustc --explain E0609`.
365.67 s
> error : could not compile `gammaloop-integration-tests` (test "test_evaluation_api") due to 6 previous errors
365.67 s
> error[E0609] : no field `lmb_channel_id` on type `CutInfo`
365.67 s
> --> tests/tests/test_runs/utils.rs:568:36
365.67 s
> |
365.67 s
> 568 | event.cut_info.lmb_channel_id,
365.67 s
> | ^^^^^^^^^^^^^^ unknown field
365.67 s
> |
365.67 s
> = note : available fields are: `particle_pdgs`, `cut_id`, `graph_id`, `graph_group_id`, `orientation_id` ... and 2 others
365.67 s
>
365.67 s
> error[E0609] : no field `lmb_channel_id` on type `CutInfo`
365.67 s
> --> tests/tests/test_runs/utils.rs:580:36
365.67 s
> |
365.67 s
> 580 | event.cut_info.lmb_channel_id,
365.67 s
> | ^^^^^^^^^^^^^^ unknown field
365.67 s
> |
365.67 s
> = note : available fields are: `particle_pdgs`, `cut_id`, `graph_id`, `graph_group_id`, `orientation_id` ... and 2 others
365.67 s
>
365.67 s
> error : could not compile `gammaloop-integration-tests` (test "test_runs") due to 2 previous errors
365.67 s
For full logs, run:
365.67 s
nix log /nix/store/axwybdrvnz6g31i8j22ivzmz2ysf3s4g-gammaloop-workspace-check-0.1.0.drv
365.73 s
Build failed.