build packages.x86_64-linux.crate-test-binaries-python-api-gammaloop-integration-tests

Reproduce this run
Original Run
  1. 0.00 s $ /nix/store/9ypz3flqsrl5xl495mm8h645gadjsxi1-coreutils-9.11/bin/timeout --kill-after=15s 7200s /nix/store/23zk8sgzamrbmj1fday15szf7f2279s8-nix-2.34.7/bin/nix --extra-experimental-features nix-command --extra-experimental-features flakes --log-format internal-json build --no-link --print-out-paths git+https://github.com/alphal00p/gammaloop?ref=advanced_sampling&rev=2ca19f40f736965c54ac582014fbcfa827cf7c6f&shallow=1#packages.x86_64-linux.crate-test-binaries-python-api-gammaloop-integration-tests --print-build-logs
  2. 9.77 s
  3. 10.57 s Downloading cached gammaloop-crate-test-dependencies-d6e55b48f8214f9c-inputs from https://cache.nix-ci.com
  4. 38.52 s Downloaded cached gammaloop-crate-test-dependencies-d6e55b48f8214f9c-inputs (3.1 GiB) in 27.9s
  5. 38.52 s Progress: 0 of 3 built, 1 of 3 downloaded from cache
  6. 38.52 s Downloading cached gammaloop-crate-test-dependencies-d6e55b48f8214f9c-deps from https://cache.nix-ci.com
  7. 38.84 s Downloaded cached gammaloop-crate-test-dependencies-d6e55b48f8214f9c-deps (30 MiB) in 320ms
  8. 38.84 s Progress: 0 of 3 built, 2 of 3 downloaded from cache
  9. 38.84 s Downloading cached gammaloop-crate-test-binaries-gammaloop-integration-tests-d6e55b48f8214f9c-inputs from https://cache.nix-ci.com
  10. 65.01 s Downloaded cached gammaloop-crate-test-binaries-gammaloop-integration-tests-d6e55b48f8214f9c-inputs (3.2 GiB) in 26.1s
  11. 65.01 s Progress: 0 of 3 built, 3 of 3 downloaded from cache
  12. 66.10 s Building /nix/store/m7mdjihf4jw96zxzkr76zsn3871igrdi-gammaloop-crate-test-binaries-gammaloop-integration-tests-d6e55b48f8214f9c-deps-0.1.0.drv
  13. 66.19 s [gammaloop-crate-test-binaries-gammaloop-integration-tests-d6e55b48f8214f9c-deps] Phase: unpackPhase
  14. 66.21 s [gammaloop-crate-test-binaries-gammaloop-integration-tests-d6e55b48f8214f9c-deps] unpacking source archive /nix/store/a8nx1wypjvxw84bsqigc8dbv41rngy1k-source
  15. 67.56 s [gammaloop-crate-test-binaries-gammaloop-integration-tests-d6e55b48f8214f9c-deps] source root is source
  16. 67.60 s [gammaloop-crate-test-binaries-gammaloop-integration-tests-d6e55b48f8214f9c-deps] Phase: patchPhase
  17. 67.91 s [gammaloop-crate-test-binaries-gammaloop-integration-tests-d6e55b48f8214f9c-deps] Executing configureCargoCommonVars
  18. 67.91 s [gammaloop-crate-test-binaries-gammaloop-integration-tests-d6e55b48f8214f9c-deps] copying cargo artifacts from /nix/store/2wi4pvlxmvkipfdd2ff64zxslbq2mr1w-gammaloop-crate-test-binaries-gammaloop-integration-tests-d6e55b48f8214f9c-inputs/target to target
  19. 67.91 s [gammaloop-crate-test-binaries-gammaloop-integration-tests-d6e55b48f8214f9c-deps] will deep copy artifacts (instead of symlinking) as requested
  20. 70.42 s [gammaloop-crate-test-binaries-gammaloop-integration-tests-d6e55b48f8214f9c-deps] Phase: updateAutotoolsGnuConfigScriptsPhase
  21. 70.48 s [gammaloop-crate-test-binaries-gammaloop-integration-tests-d6e55b48f8214f9c-deps] Phase: configurePhase
  22. 70.49 s [gammaloop-crate-test-binaries-gammaloop-integration-tests-d6e55b48f8214f9c-deps] will append /build/source/.cargo-home/config.toml with contents of /nix/store/5drf77x6km4ky7gwlrzdx9bbd6fz09g3-vendor-cargo-deps/config.toml
  23. 70.50 s [gammaloop-crate-test-binaries-gammaloop-integration-tests-d6e55b48f8214f9c-deps] default configurePhase, nothing to do
  24. 70.51 s [gammaloop-crate-test-binaries-gammaloop-integration-tests-d6e55b48f8214f9c-deps] Phase: buildPhase
  25. 70.53 s [gammaloop-crate-test-binaries-gammaloop-integration-tests-d6e55b48f8214f9c-deps] +++ command cargo --version
  26. 70.54 s [gammaloop-crate-test-binaries-gammaloop-integration-tests-d6e55b48f8214f9c-deps] cargo 1.97.0 (c980f4866 2026-06-30)
  27. 70.54 s [gammaloop-crate-test-binaries-gammaloop-integration-tests-d6e55b48f8214f9c-deps] +++ command cargo test --profile ci-optim --no-run --offline -p gammaloop-integration-tests --features gammaloop-integration-tests/python-api-tests
  28. 71.51 s [gammaloop-crate-test-binaries-gammaloop-integration-tests-d6e55b48f8214f9c-deps] warning: unused import: `GaussianReferenceFunction`
  29. 71.51 s [gammaloop-crate-test-binaries-gammaloop-integration-tests-d6e55b48f8214f9c-deps] --> crates/gammaloop-api/src/state.rs:38:27
  30. 71.51 s [gammaloop-crate-test-binaries-gammaloop-integration-tests-d6e55b48f8214f9c-deps] |
  31. 71.51 s [gammaloop-crate-test-binaries-gammaloop-integration-tests-d6e55b48f8214f9c-deps] 38 | integrands::process::{GaussianReferenceFunction, ProcessIntegrand},
  32. 71.51 s [gammaloop-crate-test-binaries-gammaloop-integration-tests-d6e55b48f8214f9c-deps] | ^^^^^^^^^^^^^^^^^^^^^^^^^
  33. 71.51 s [gammaloop-crate-test-binaries-gammaloop-integration-tests-d6e55b48f8214f9c-deps] |
  34. 71.51 s [gammaloop-crate-test-binaries-gammaloop-integration-tests-d6e55b48f8214f9c-deps] = note: `#[warn(unused_imports)]` (part of `#[warn(unused)]`) on by default
  35. 71.51 s [gammaloop-crate-test-binaries-gammaloop-integration-tests-d6e55b48f8214f9c-deps]
  36. 71.51 s [gammaloop-crate-test-binaries-gammaloop-integration-tests-d6e55b48f8214f9c-deps] warning: `gammaloop-api` (lib) generated 1 warning (run `cargo fix --lib -p gammaloop-api` to apply 1 suggestion)
  37. 71.51 s [gammaloop-crate-test-binaries-gammaloop-integration-tests-d6e55b48f8214f9c-deps] Compiling gammaloop-integration-tests v0.1.0 (/build/source/tests)
  38. 71.64 s [gammaloop-crate-test-binaries-gammaloop-integration-tests-d6e55b48f8214f9c-deps] error[E0560]: struct `CutInfo` has no field named `lmb_channel_id`
  39. 71.64 s [gammaloop-crate-test-binaries-gammaloop-integration-tests-d6e55b48f8214f9c-deps] --> tests/tests/test_differential.rs:86:13
  40. 71.64 s [gammaloop-crate-test-binaries-gammaloop-integration-tests-d6e55b48f8214f9c-deps] |
  41. 71.64 s [gammaloop-crate-test-binaries-gammaloop-integration-tests-d6e55b48f8214f9c-deps] 86 | lmb_channel_id: None,
  42. 71.64 s [gammaloop-crate-test-binaries-gammaloop-integration-tests-d6e55b48f8214f9c-deps] | ^^^^^^^^^^^^^^ `CutInfo` does not have this field
  43. 71.64 s [gammaloop-crate-test-binaries-gammaloop-integration-tests-d6e55b48f8214f9c-deps] |
  44. 71.64 s [gammaloop-crate-test-binaries-gammaloop-integration-tests-d6e55b48f8214f9c-deps] = note: available fields are: `sampling_channel_id`, `sampling_channel_edge_ids`
  45. 71.64 s [gammaloop-crate-test-binaries-gammaloop-integration-tests-d6e55b48f8214f9c-deps]
  46. 71.64 s [gammaloop-crate-test-binaries-gammaloop-integration-tests-d6e55b48f8214f9c-deps] error[E0560]: struct `CutInfo` has no field named `lmb_channel_edge_ids`
  47. 71.64 s [gammaloop-crate-test-binaries-gammaloop-integration-tests-d6e55b48f8214f9c-deps] --> tests/tests/test_differential.rs:87:13
  48. 71.64 s [gammaloop-crate-test-binaries-gammaloop-integration-tests-d6e55b48f8214f9c-deps] |
  49. 71.64 s [gammaloop-crate-test-binaries-gammaloop-integration-tests-d6e55b48f8214f9c-deps] 87 | lmb_channel_edge_ids: None,
  50. 71.64 s [gammaloop-crate-test-binaries-gammaloop-integration-tests-d6e55b48f8214f9c-deps] | ^^^^^^^^^^^^^^^^^^^^ `CutInfo` does not have this field
  51. 71.64 s [gammaloop-crate-test-binaries-gammaloop-integration-tests-d6e55b48f8214f9c-deps] |
  52. 71.64 s [gammaloop-crate-test-binaries-gammaloop-integration-tests-d6e55b48f8214f9c-deps] = note: available fields are: `sampling_channel_id`, `sampling_channel_edge_ids`
  53. 71.64 s [gammaloop-crate-test-binaries-gammaloop-integration-tests-d6e55b48f8214f9c-deps]
  54. 71.70 s [gammaloop-crate-test-binaries-gammaloop-integration-tests-d6e55b48f8214f9c-deps] error[E0609]: no field `lmb_channel_edge_ids` on type `CutInfo`
  55. 71.70 s [gammaloop-crate-test-binaries-gammaloop-integration-tests-d6e55b48f8214f9c-deps] --> tests/tests/test_evaluation_api.rs:311:10
  56. 71.70 s [gammaloop-crate-test-binaries-gammaloop-integration-tests-d6e55b48f8214f9c-deps] |
  57. 71.70 s [gammaloop-crate-test-binaries-gammaloop-integration-tests-d6e55b48f8214f9c-deps] 311 | .lmb_channel_edge_ids
  58. 71.70 s [gammaloop-crate-test-binaries-gammaloop-integration-tests-d6e55b48f8214f9c-deps] | ^^^^^^^^^^^^^^^^^^^^ unknown field
  59. 71.70 s [gammaloop-crate-test-binaries-gammaloop-integration-tests-d6e55b48f8214f9c-deps] |
  60. 71.70 s [gammaloop-crate-test-binaries-gammaloop-integration-tests-d6e55b48f8214f9c-deps] = note: available fields are: `particle_pdgs`, `cut_id`, `graph_id`, `graph_group_id`, `orientation_id` ... and 2 others
  61. 71.70 s [gammaloop-crate-test-binaries-gammaloop-integration-tests-d6e55b48f8214f9c-deps]
  62. 71.70 s [gammaloop-crate-test-binaries-gammaloop-integration-tests-d6e55b48f8214f9c-deps] For more information about this error, try `rustc --explain E0560`.
  63. 71.73 s [gammaloop-crate-test-binaries-gammaloop-integration-tests-d6e55b48f8214f9c-deps] error[E0609]: no field `lmb_channel_edge_ids` on type `CutInfo`
  64. 71.73 s [gammaloop-crate-test-binaries-gammaloop-integration-tests-d6e55b48f8214f9c-deps] --> tests/tests/test_evaluation_api.rs:591:26
  65. 71.73 s [gammaloop-crate-test-binaries-gammaloop-integration-tests-d6e55b48f8214f9c-deps] |
  66. 71.73 s [gammaloop-crate-test-binaries-gammaloop-integration-tests-d6e55b48f8214f9c-deps] 591 | .lmb_channel_edge_ids
  67. 71.73 s [gammaloop-crate-test-binaries-gammaloop-integration-tests-d6e55b48f8214f9c-deps] | ^^^^^^^^^^^^^^^^^^^^ unknown field
  68. 71.73 s [gammaloop-crate-test-binaries-gammaloop-integration-tests-d6e55b48f8214f9c-deps] |
  69. 71.73 s [gammaloop-crate-test-binaries-gammaloop-integration-tests-d6e55b48f8214f9c-deps] = note: available fields are: `particle_pdgs`, `cut_id`, `graph_id`, `graph_group_id`, `orientation_id` ... and 2 others
  70. 71.73 s [gammaloop-crate-test-binaries-gammaloop-integration-tests-d6e55b48f8214f9c-deps]
  71. 71.73 s [gammaloop-crate-test-binaries-gammaloop-integration-tests-d6e55b48f8214f9c-deps] error: could not compile `gammaloop-integration-tests` (test "test_differential") due to 2 previous errors
  72. 71.73 s [gammaloop-crate-test-binaries-gammaloop-integration-tests-d6e55b48f8214f9c-deps] warning: build failed, waiting for other jobs to finish...
  73. 71.76 s [gammaloop-crate-test-binaries-gammaloop-integration-tests-d6e55b48f8214f9c-deps] error[E0609]: no field `lmb_channel_edge_ids` on type `CutInfo`
  74. 71.76 s [gammaloop-crate-test-binaries-gammaloop-integration-tests-d6e55b48f8214f9c-deps] --> tests/tests/test_evaluation_api.rs:1177:18
  75. 71.76 s [gammaloop-crate-test-binaries-gammaloop-integration-tests-d6e55b48f8214f9c-deps] |
  76. 71.76 s [gammaloop-crate-test-binaries-gammaloop-integration-tests-d6e55b48f8214f9c-deps] 1177 | .lmb_channel_edge_ids
  77. 71.76 s [gammaloop-crate-test-binaries-gammaloop-integration-tests-d6e55b48f8214f9c-deps] | ^^^^^^^^^^^^^^^^^^^^ unknown field
  78. 71.76 s [gammaloop-crate-test-binaries-gammaloop-integration-tests-d6e55b48f8214f9c-deps] |
  79. 71.76 s [gammaloop-crate-test-binaries-gammaloop-integration-tests-d6e55b48f8214f9c-deps] = note: available fields are: `particle_pdgs`, `cut_id`, `graph_id`, `graph_group_id`, `orientation_id` ... and 2 others
  80. 71.76 s [gammaloop-crate-test-binaries-gammaloop-integration-tests-d6e55b48f8214f9c-deps]
  81. 71.84 s [gammaloop-crate-test-binaries-gammaloop-integration-tests-d6e55b48f8214f9c-deps] error[E0609]: no field `lmb_channel_edge_ids` on type `CutInfo`
  82. 71.84 s [gammaloop-crate-test-binaries-gammaloop-integration-tests-d6e55b48f8214f9c-deps] --> tests/tests/test_evaluation_api.rs:1222:22
  83. 71.84 s [gammaloop-crate-test-binaries-gammaloop-integration-tests-d6e55b48f8214f9c-deps] |
  84. 71.84 s [gammaloop-crate-test-binaries-gammaloop-integration-tests-d6e55b48f8214f9c-deps] 1222 | .lmb_channel_edge_ids
  85. 71.84 s [gammaloop-crate-test-binaries-gammaloop-integration-tests-d6e55b48f8214f9c-deps] | ^^^^^^^^^^^^^^^^^^^^ unknown field
  86. 71.84 s [gammaloop-crate-test-binaries-gammaloop-integration-tests-d6e55b48f8214f9c-deps] |
  87. 71.84 s [gammaloop-crate-test-binaries-gammaloop-integration-tests-d6e55b48f8214f9c-deps] = note: available fields are: `particle_pdgs`, `cut_id`, `graph_id`, `graph_group_id`, `orientation_id` ... and 2 others
  88. 71.84 s [gammaloop-crate-test-binaries-gammaloop-integration-tests-d6e55b48f8214f9c-deps]
  89. 71.85 s [gammaloop-crate-test-binaries-gammaloop-integration-tests-d6e55b48f8214f9c-deps] error[E0609]: no field `lmb_channel_edge_ids` on type `CutInfo`
  90. 71.85 s [gammaloop-crate-test-binaries-gammaloop-integration-tests-d6e55b48f8214f9c-deps] --> tests/tests/test_evaluation_api.rs:1281:14
  91. 71.85 s [gammaloop-crate-test-binaries-gammaloop-integration-tests-d6e55b48f8214f9c-deps] |
  92. 71.85 s [gammaloop-crate-test-binaries-gammaloop-integration-tests-d6e55b48f8214f9c-deps] 1281 | .lmb_channel_edge_ids
  93. 71.85 s [gammaloop-crate-test-binaries-gammaloop-integration-tests-d6e55b48f8214f9c-deps] | ^^^^^^^^^^^^^^^^^^^^ unknown field
  94. 71.85 s [gammaloop-crate-test-binaries-gammaloop-integration-tests-d6e55b48f8214f9c-deps] |
  95. 71.85 s [gammaloop-crate-test-binaries-gammaloop-integration-tests-d6e55b48f8214f9c-deps] = note: available fields are: `particle_pdgs`, `cut_id`, `graph_id`, `graph_group_id`, `orientation_id` ... and 2 others
  96. 71.85 s [gammaloop-crate-test-binaries-gammaloop-integration-tests-d6e55b48f8214f9c-deps]
  97. 71.95 s [gammaloop-crate-test-binaries-gammaloop-integration-tests-d6e55b48f8214f9c-deps] error[E0609]: no field `lmb_channel_edge_ids` on type `CutInfo`
  98. 71.95 s [gammaloop-crate-test-binaries-gammaloop-integration-tests-d6e55b48f8214f9c-deps] --> tests/tests/test_evaluation_api.rs:1428:18
  99. 71.95 s [gammaloop-crate-test-binaries-gammaloop-integration-tests-d6e55b48f8214f9c-deps] |
  100. 71.95 s [gammaloop-crate-test-binaries-gammaloop-integration-tests-d6e55b48f8214f9c-deps] 1428 | .lmb_channel_edge_ids
  101. 71.95 s [gammaloop-crate-test-binaries-gammaloop-integration-tests-d6e55b48f8214f9c-deps] | ^^^^^^^^^^^^^^^^^^^^ unknown field
  102. 71.95 s [gammaloop-crate-test-binaries-gammaloop-integration-tests-d6e55b48f8214f9c-deps] |
  103. 71.95 s [gammaloop-crate-test-binaries-gammaloop-integration-tests-d6e55b48f8214f9c-deps] = note: available fields are: `particle_pdgs`, `cut_id`, `graph_id`, `graph_group_id`, `orientation_id` ... and 2 others
  104. 71.95 s [gammaloop-crate-test-binaries-gammaloop-integration-tests-d6e55b48f8214f9c-deps]
  105. 72.12 s [gammaloop-crate-test-binaries-gammaloop-integration-tests-d6e55b48f8214f9c-deps] For more information about this error, try `rustc --explain E0609`.
  106. 72.15 s [gammaloop-crate-test-binaries-gammaloop-integration-tests-d6e55b48f8214f9c-deps] error: could not compile `gammaloop-integration-tests` (test "test_evaluation_api") due to 6 previous errors
  107. 75.54 s [gammaloop-crate-test-binaries-gammaloop-integration-tests-d6e55b48f8214f9c-deps] error[E0609]: no field `lmb_channel_id` on type `CutInfo`
  108. 75.54 s [gammaloop-crate-test-binaries-gammaloop-integration-tests-d6e55b48f8214f9c-deps] --> tests/tests/test_runs/utils.rs:568:36
  109. 75.54 s [gammaloop-crate-test-binaries-gammaloop-integration-tests-d6e55b48f8214f9c-deps] |
  110. 75.54 s [gammaloop-crate-test-binaries-gammaloop-integration-tests-d6e55b48f8214f9c-deps] 568 | event.cut_info.lmb_channel_id,
  111. 75.54 s [gammaloop-crate-test-binaries-gammaloop-integration-tests-d6e55b48f8214f9c-deps] | ^^^^^^^^^^^^^^ unknown field
  112. 75.54 s [gammaloop-crate-test-binaries-gammaloop-integration-tests-d6e55b48f8214f9c-deps] |
  113. 75.54 s [gammaloop-crate-test-binaries-gammaloop-integration-tests-d6e55b48f8214f9c-deps] = note: available fields are: `particle_pdgs`, `cut_id`, `graph_id`, `graph_group_id`, `orientation_id` ... and 2 others
  114. 75.54 s [gammaloop-crate-test-binaries-gammaloop-integration-tests-d6e55b48f8214f9c-deps]
  115. 75.54 s [gammaloop-crate-test-binaries-gammaloop-integration-tests-d6e55b48f8214f9c-deps] error[E0609]: no field `lmb_channel_id` on type `CutInfo`
  116. 75.54 s [gammaloop-crate-test-binaries-gammaloop-integration-tests-d6e55b48f8214f9c-deps] --> tests/tests/test_runs/utils.rs:580:36
  117. 75.54 s [gammaloop-crate-test-binaries-gammaloop-integration-tests-d6e55b48f8214f9c-deps] |
  118. 75.54 s [gammaloop-crate-test-binaries-gammaloop-integration-tests-d6e55b48f8214f9c-deps] 580 | event.cut_info.lmb_channel_id,
  119. 75.54 s [gammaloop-crate-test-binaries-gammaloop-integration-tests-d6e55b48f8214f9c-deps] | ^^^^^^^^^^^^^^ unknown field
  120. 75.54 s [gammaloop-crate-test-binaries-gammaloop-integration-tests-d6e55b48f8214f9c-deps] |
  121. 75.54 s [gammaloop-crate-test-binaries-gammaloop-integration-tests-d6e55b48f8214f9c-deps] = note: available fields are: `particle_pdgs`, `cut_id`, `graph_id`, `graph_group_id`, `orientation_id` ... and 2 others
  122. 75.54 s [gammaloop-crate-test-binaries-gammaloop-integration-tests-d6e55b48f8214f9c-deps]
  123. 79.16 s [gammaloop-crate-test-binaries-gammaloop-integration-tests-d6e55b48f8214f9c-deps] error: could not compile `gammaloop-integration-tests` (test "test_runs") due to 2 previous errors
  124. 151.58 s Progress: 0 of 2 built (1 failed), 3 of 3 downloaded from cache
  125. 151.58 s Failed to build gammaloop-crate-test-binaries-gammaloop-integration-tests-d6e55b48f8214f9c-deps after 1m25s
  126. 151.58 s error: Cannot build '/nix/store/m7mdjihf4jw96zxzkr76zsn3871igrdi-gammaloop-crate-test-binaries-gammaloop-integration-tests-d6e55b48f8214f9c-deps-0.1.0.drv'.
  127. 151.58 s Reason: builder failed with exit code 101.
  128. 151.58 s Output paths:
  129. 151.58 s /nix/store/rx0ry5iql5nmp59kv3cxzwz83dpz86ib-gammaloop-crate-test-binaries-gammaloop-integration-tests-d6e55b48f8214f9c-deps-0.1.0
  130. 151.58 s Last 111 log lines:
  131. 151.58 s > Running phase: unpackPhase
  132. 151.58 s > unpacking source archive /nix/store/a8nx1wypjvxw84bsqigc8dbv41rngy1k-source
  133. 151.58 s > source root is source
  134. 151.58 s > Running phase: patchPhase
  135. 151.58 s > Executing configureCargoCommonVars
  136. 151.58 s > copying cargo artifacts from /nix/store/2wi4pvlxmvkipfdd2ff64zxslbq2mr1w-gammaloop-crate-test-binaries-gammaloop-integration-tests-d6e55b48f8214f9c-inputs/target to target
  137. 151.58 s > will deep copy artifacts (instead of symlinking) as requested
  138. 151.58 s > Running phase: updateAutotoolsGnuConfigScriptsPhase
  139. 151.58 s > Running phase: configurePhase
  140. 151.58 s > will append /build/source/.cargo-home/config.toml with contents of /nix/store/5drf77x6km4ky7gwlrzdx9bbd6fz09g3-vendor-cargo-deps/config.toml
  141. 151.58 s > default configurePhase, nothing to do
  142. 151.58 s > Running phase: buildPhase
  143. 151.58 s > +++ command cargo --version
  144. 151.58 s > cargo 1.97.0 (c980f4866 2026-06-30)
  145. 151.58 s > +++ command cargo test --profile ci-optim --no-run --offline -p gammaloop-integration-tests --features gammaloop-integration-tests/python-api-tests
  146. 151.58 s > warning: unused import: `GaussianReferenceFunction`
  147. 151.58 s > --> crates/gammaloop-api/src/state.rs:38:27
  148. 151.58 s > |
  149. 151.58 s > 38 | integrands::process::{GaussianReferenceFunction, ProcessIntegrand},
  150. 151.58 s > | ^^^^^^^^^^^^^^^^^^^^^^^^^
  151. 151.58 s > |
  152. 151.58 s > = note: `#[warn(unused_imports)]` (part of `#[warn(unused)]`) on by default
  153. 151.58 s >
  154. 151.58 s > warning: `gammaloop-api` (lib) generated 1 warning (run `cargo fix --lib -p gammaloop-api` to apply 1 suggestion)
  155. 151.58 s > Compiling gammaloop-integration-tests v0.1.0 (/build/source/tests)
  156. 151.58 s > error[E0560]: struct `CutInfo` has no field named `lmb_channel_id`
  157. 151.58 s > --> tests/tests/test_differential.rs:86:13
  158. 151.58 s > |
  159. 151.58 s > 86 | lmb_channel_id: None,
  160. 151.58 s > | ^^^^^^^^^^^^^^ `CutInfo` does not have this field
  161. 151.58 s > |
  162. 151.58 s > = note: available fields are: `sampling_channel_id`, `sampling_channel_edge_ids`
  163. 151.58 s >
  164. 151.58 s > error[E0560]: struct `CutInfo` has no field named `lmb_channel_edge_ids`
  165. 151.58 s > --> tests/tests/test_differential.rs:87:13
  166. 151.58 s > |
  167. 151.58 s > 87 | lmb_channel_edge_ids: None,
  168. 151.58 s > | ^^^^^^^^^^^^^^^^^^^^ `CutInfo` does not have this field
  169. 151.58 s > |
  170. 151.58 s > = note: available fields are: `sampling_channel_id`, `sampling_channel_edge_ids`
  171. 151.58 s >
  172. 151.58 s > error[E0609]: no field `lmb_channel_edge_ids` on type `CutInfo`
  173. 151.58 s > --> tests/tests/test_evaluation_api.rs:311:10
  174. 151.58 s > |
  175. 151.58 s > 311 | .lmb_channel_edge_ids
  176. 151.58 s > | ^^^^^^^^^^^^^^^^^^^^ unknown field
  177. 151.58 s > |
  178. 151.58 s > = note: available fields are: `particle_pdgs`, `cut_id`, `graph_id`, `graph_group_id`, `orientation_id` ... and 2 others
  179. 151.58 s >
  180. 151.58 s > For more information about this error, try `rustc --explain E0560`.
  181. 151.58 s > error[E0609]: no field `lmb_channel_edge_ids` on type `CutInfo`
  182. 151.58 s > --> tests/tests/test_evaluation_api.rs:591:26
  183. 151.58 s > |
  184. 151.58 s > 591 | .lmb_channel_edge_ids
  185. 151.58 s > | ^^^^^^^^^^^^^^^^^^^^ unknown field
  186. 151.58 s > |
  187. 151.58 s > = note: available fields are: `particle_pdgs`, `cut_id`, `graph_id`, `graph_group_id`, `orientation_id` ... and 2 others
  188. 151.58 s >
  189. 151.58 s > error: could not compile `gammaloop-integration-tests` (test "test_differential") due to 2 previous errors
  190. 151.58 s > warning: build failed, waiting for other jobs to finish...
  191. 151.58 s > error[E0609]: no field `lmb_channel_edge_ids` on type `CutInfo`
  192. 151.58 s > --> tests/tests/test_evaluation_api.rs:1177:18
  193. 151.58 s > |
  194. 151.58 s > 1177 | .lmb_channel_edge_ids
  195. 151.58 s > | ^^^^^^^^^^^^^^^^^^^^ unknown field
  196. 151.58 s > |
  197. 151.58 s > = note: available fields are: `particle_pdgs`, `cut_id`, `graph_id`, `graph_group_id`, `orientation_id` ... and 2 others
  198. 151.58 s >
  199. 151.58 s > error[E0609]: no field `lmb_channel_edge_ids` on type `CutInfo`
  200. 151.58 s > --> tests/tests/test_evaluation_api.rs:1222:22
  201. 151.58 s > |
  202. 151.58 s > 1222 | .lmb_channel_edge_ids
  203. 151.58 s > | ^^^^^^^^^^^^^^^^^^^^ unknown field
  204. 151.58 s > |
  205. 151.58 s > = note: available fields are: `particle_pdgs`, `cut_id`, `graph_id`, `graph_group_id`, `orientation_id` ... and 2 others
  206. 151.58 s >
  207. 151.58 s > error[E0609]: no field `lmb_channel_edge_ids` on type `CutInfo`
  208. 151.58 s > --> tests/tests/test_evaluation_api.rs:1281:14
  209. 151.58 s > |
  210. 151.58 s > 1281 | .lmb_channel_edge_ids
  211. 151.58 s > | ^^^^^^^^^^^^^^^^^^^^ unknown field
  212. 151.58 s > |
  213. 151.58 s > = note: available fields are: `particle_pdgs`, `cut_id`, `graph_id`, `graph_group_id`, `orientation_id` ... and 2 others
  214. 151.58 s >
  215. 151.58 s > error[E0609]: no field `lmb_channel_edge_ids` on type `CutInfo`
  216. 151.58 s > --> tests/tests/test_evaluation_api.rs:1428:18
  217. 151.58 s > |
  218. 151.58 s > 1428 | .lmb_channel_edge_ids
  219. 151.58 s > | ^^^^^^^^^^^^^^^^^^^^ unknown field
  220. 151.58 s > |
  221. 151.58 s > = note: available fields are: `particle_pdgs`, `cut_id`, `graph_id`, `graph_group_id`, `orientation_id` ... and 2 others
  222. 151.58 s >
  223. 151.58 s > For more information about this error, try `rustc --explain E0609`.
  224. 151.58 s > error: could not compile `gammaloop-integration-tests` (test "test_evaluation_api") due to 6 previous errors
  225. 151.58 s > error[E0609]: no field `lmb_channel_id` on type `CutInfo`
  226. 151.58 s > --> tests/tests/test_runs/utils.rs:568:36
  227. 151.58 s > |
  228. 151.58 s > 568 | event.cut_info.lmb_channel_id,
  229. 151.58 s > | ^^^^^^^^^^^^^^ unknown field
  230. 151.58 s > |
  231. 151.58 s > = note: available fields are: `particle_pdgs`, `cut_id`, `graph_id`, `graph_group_id`, `orientation_id` ... and 2 others
  232. 151.58 s >
  233. 151.58 s > error[E0609]: no field `lmb_channel_id` on type `CutInfo`
  234. 151.58 s > --> tests/tests/test_runs/utils.rs:580:36
  235. 151.58 s > |
  236. 151.58 s > 580 | event.cut_info.lmb_channel_id,
  237. 151.58 s > | ^^^^^^^^^^^^^^ unknown field
  238. 151.58 s > |
  239. 151.58 s > = note: available fields are: `particle_pdgs`, `cut_id`, `graph_id`, `graph_group_id`, `orientation_id` ... and 2 others
  240. 151.58 s >
  241. 151.58 s > error: could not compile `gammaloop-integration-tests` (test "test_runs") due to 2 previous errors
  242. 151.58 s For full logs, run:
  243. 151.58 s nix log /nix/store/m7mdjihf4jw96zxzkr76zsn3871igrdi-gammaloop-crate-test-binaries-gammaloop-integration-tests-d6e55b48f8214f9c-deps-0.1.0.drv
  244. 151.58 s error: Cannot build '/nix/store/dmkvxpnn0nfzz1rm9zk6aw2gnws5hp9z-nix-ci-artifact-barrier-crate-test-binaries-python-api-gammaloop-integration-tests.drv'.
  245. 151.58 s Reason: 1 dependency failed.
  246. 151.58 s Output paths:
  247. 151.58 s /nix/store/vpwdnd0f470vcml6h9z6qm78b5k80hv6-nix-ci-artifact-barrier-crate-test-binaries-python-api-gammaloop-integration-tests
  248. 151.58 s Build failed due to failed dependency
  249. 151.65 s Build failed.