build packages.x86_64-linux.crate-test-binaries-python-api-gammaloop-integration-tests

Reproduce this run
Retry Run
  1. 0.00 s $ /nix/store/9ypz3flqsrl5xl495mm8h645gadjsxi1-coreutils-9.11/bin/timeout --kill-after=15s 7200s /nix/store/23zk8sgzamrbmj1fday15szf7f2279s8-nix-2.34.7/bin/nix --extra-experimental-features nix-command --extra-experimental-features flakes --log-format internal-json build --no-link --print-out-paths git+https://github.com/alphal00p/gammaloop?ref=advanced_sampling&rev=2ca19f40f736965c54ac582014fbcfa827cf7c6f&shallow=1#packages.x86_64-linux.crate-test-binaries-python-api-gammaloop-integration-tests --print-build-logs
  2. 16.63 s
  3. 18.85 s Building /nix/store/g87l4w07s62r0wi8pd8mf4vsszfcqh58-gammaloop-crate-test-binaries-gammaloop-integration-tests-d6e55b48f8214f9c-inputs.drv
  4. 38.67 s [gammaloop-crate-test-binaries-gammaloop-integration-tests-d6e55b48f8214f9c-inputs:post-build] Uploading to the NixCI cache: /nix/store/2wi4pvlxmvkipfdd2ff64zxslbq2mr1w-gammaloop-crate-test-binaries-gammaloop-integration-tests-d6e55b48f8214f9c-inputs
  5. 38.73 s [gammaloop-crate-test-binaries-gammaloop-integration-tests-d6e55b48f8214f9c-inputs:post-build] warning: 'warn-short-path-literals' is deprecated, use 'lint-short-path-literals = ignore' instead
  6. 38.79 s [gammaloop-crate-test-binaries-gammaloop-integration-tests-d6e55b48f8214f9c-inputs:post-build] copying 1 paths...
  7. 38.79 s [gammaloop-crate-test-binaries-gammaloop-integration-tests-d6e55b48f8214f9c-inputs:post-build] copying path '/nix/store/2wi4pvlxmvkipfdd2ff64zxslbq2mr1w-gammaloop-crate-test-binaries-gammaloop-integration-tests-d6e55b48f8214f9c-inputs' to 'https://cache.nix-ci.com'...
  8. 230.10 s [gammaloop-crate-test-binaries-gammaloop-integration-tests-d6e55b48f8214f9c-inputs:post-build] warning: 'warn-short-path-literals' is deprecated, use 'lint-short-path-literals = ignore' instead
  9. 230.49 s [gammaloop-crate-test-binaries-gammaloop-integration-tests-d6e55b48f8214f9c-inputs:post-build] copying 1 paths...
  10. 230.49 s [gammaloop-crate-test-binaries-gammaloop-integration-tests-d6e55b48f8214f9c-inputs:post-build] copying path '/nix/store/g87l4w07s62r0wi8pd8mf4vsszfcqh58-gammaloop-crate-test-binaries-gammaloop-integration-tests-d6e55b48f8214f9c-inputs.drv' to 'https://cache.nix-ci.com'...
  11. 230.76 s Uploaded gammaloop-crate-test-binaries-gammaloop-integration-tests-d6e55b48f8214f9c-inputs in 3m12s
  12. 230.76 s Progress: 1 of 4 built
  13. 230.76 s Built gammaloop-crate-test-binaries-gammaloop-integration-tests-d6e55b48f8214f9c-inputs in 3m31s
  14. 230.87 s Building /nix/store/m7mdjihf4jw96zxzkr76zsn3871igrdi-gammaloop-crate-test-binaries-gammaloop-integration-tests-d6e55b48f8214f9c-deps-0.1.0.drv
  15. 230.97 s [gammaloop-crate-test-binaries-gammaloop-integration-tests-d6e55b48f8214f9c-deps] Phase: unpackPhase
  16. 230.98 s [gammaloop-crate-test-binaries-gammaloop-integration-tests-d6e55b48f8214f9c-deps] unpacking source archive /nix/store/a8nx1wypjvxw84bsqigc8dbv41rngy1k-source
  17. 231.06 s [gammaloop-crate-test-binaries-gammaloop-integration-tests-d6e55b48f8214f9c-deps] source root is source
  18. 231.08 s [gammaloop-crate-test-binaries-gammaloop-integration-tests-d6e55b48f8214f9c-deps] Phase: patchPhase
  19. 231.19 s [gammaloop-crate-test-binaries-gammaloop-integration-tests-d6e55b48f8214f9c-deps] Executing configureCargoCommonVars
  20. 231.20 s [gammaloop-crate-test-binaries-gammaloop-integration-tests-d6e55b48f8214f9c-deps] copying cargo artifacts from /nix/store/2wi4pvlxmvkipfdd2ff64zxslbq2mr1w-gammaloop-crate-test-binaries-gammaloop-integration-tests-d6e55b48f8214f9c-inputs/target to target
  21. 231.20 s [gammaloop-crate-test-binaries-gammaloop-integration-tests-d6e55b48f8214f9c-deps] will deep copy artifacts (instead of symlinking) as requested
  22. 233.29 s [gammaloop-crate-test-binaries-gammaloop-integration-tests-d6e55b48f8214f9c-deps] Phase: updateAutotoolsGnuConfigScriptsPhase
  23. 233.52 s [gammaloop-crate-test-binaries-gammaloop-integration-tests-d6e55b48f8214f9c-deps] Phase: configurePhase
  24. 233.55 s [gammaloop-crate-test-binaries-gammaloop-integration-tests-d6e55b48f8214f9c-deps] will append /build/source/.cargo-home/config.toml with contents of /nix/store/5drf77x6km4ky7gwlrzdx9bbd6fz09g3-vendor-cargo-deps/config.toml
  25. 233.55 s [gammaloop-crate-test-binaries-gammaloop-integration-tests-d6e55b48f8214f9c-deps] default configurePhase, nothing to do
  26. 233.55 s [gammaloop-crate-test-binaries-gammaloop-integration-tests-d6e55b48f8214f9c-deps] Phase: buildPhase
  27. 233.56 s [gammaloop-crate-test-binaries-gammaloop-integration-tests-d6e55b48f8214f9c-deps] +++ command cargo --version
  28. 233.57 s [gammaloop-crate-test-binaries-gammaloop-integration-tests-d6e55b48f8214f9c-deps] cargo 1.97.0 (c980f4866 2026-06-30)
  29. 233.57 s [gammaloop-crate-test-binaries-gammaloop-integration-tests-d6e55b48f8214f9c-deps] +++ command cargo test --profile ci-optim --no-run --offline -p gammaloop-integration-tests --features gammaloop-integration-tests/python-api-tests
  30. 234.39 s [gammaloop-crate-test-binaries-gammaloop-integration-tests-d6e55b48f8214f9c-deps] warning: unused import: `GaussianReferenceFunction`
  31. 234.39 s [gammaloop-crate-test-binaries-gammaloop-integration-tests-d6e55b48f8214f9c-deps] --> crates/gammaloop-api/src/state.rs:38:27
  32. 234.39 s [gammaloop-crate-test-binaries-gammaloop-integration-tests-d6e55b48f8214f9c-deps] |
  33. 234.39 s [gammaloop-crate-test-binaries-gammaloop-integration-tests-d6e55b48f8214f9c-deps] 38 | integrands::process::{GaussianReferenceFunction, ProcessIntegrand},
  34. 234.39 s [gammaloop-crate-test-binaries-gammaloop-integration-tests-d6e55b48f8214f9c-deps] | ^^^^^^^^^^^^^^^^^^^^^^^^^
  35. 234.39 s [gammaloop-crate-test-binaries-gammaloop-integration-tests-d6e55b48f8214f9c-deps] |
  36. 234.39 s [gammaloop-crate-test-binaries-gammaloop-integration-tests-d6e55b48f8214f9c-deps] = note: `#[warn(unused_imports)]` (part of `#[warn(unused)]`) on by default
  37. 234.39 s [gammaloop-crate-test-binaries-gammaloop-integration-tests-d6e55b48f8214f9c-deps]
  38. 234.39 s [gammaloop-crate-test-binaries-gammaloop-integration-tests-d6e55b48f8214f9c-deps] warning: `gammaloop-api` (lib) generated 1 warning (run `cargo fix --lib -p gammaloop-api` to apply 1 suggestion)
  39. 234.39 s [gammaloop-crate-test-binaries-gammaloop-integration-tests-d6e55b48f8214f9c-deps] Compiling gammaloop-integration-tests v0.1.0 (/build/source/tests)
  40. 234.56 s [gammaloop-crate-test-binaries-gammaloop-integration-tests-d6e55b48f8214f9c-deps] error[E0560]: struct `CutInfo` has no field named `lmb_channel_id`
  41. 234.56 s [gammaloop-crate-test-binaries-gammaloop-integration-tests-d6e55b48f8214f9c-deps] --> tests/tests/test_differential.rs:86:13
  42. 234.56 s [gammaloop-crate-test-binaries-gammaloop-integration-tests-d6e55b48f8214f9c-deps] |
  43. 234.56 s [gammaloop-crate-test-binaries-gammaloop-integration-tests-d6e55b48f8214f9c-deps] 86 | lmb_channel_id: None,
  44. 234.56 s [gammaloop-crate-test-binaries-gammaloop-integration-tests-d6e55b48f8214f9c-deps] | ^^^^^^^^^^^^^^ `CutInfo` does not have this field
  45. 234.56 s [gammaloop-crate-test-binaries-gammaloop-integration-tests-d6e55b48f8214f9c-deps] |
  46. 234.56 s [gammaloop-crate-test-binaries-gammaloop-integration-tests-d6e55b48f8214f9c-deps] = note: available fields are: `sampling_channel_id`, `sampling_channel_edge_ids`
  47. 234.56 s [gammaloop-crate-test-binaries-gammaloop-integration-tests-d6e55b48f8214f9c-deps]
  48. 234.57 s [gammaloop-crate-test-binaries-gammaloop-integration-tests-d6e55b48f8214f9c-deps] error[E0560]: struct `CutInfo` has no field named `lmb_channel_edge_ids`
  49. 234.57 s [gammaloop-crate-test-binaries-gammaloop-integration-tests-d6e55b48f8214f9c-deps] --> tests/tests/test_differential.rs:87:13
  50. 234.57 s [gammaloop-crate-test-binaries-gammaloop-integration-tests-d6e55b48f8214f9c-deps] |
  51. 234.57 s [gammaloop-crate-test-binaries-gammaloop-integration-tests-d6e55b48f8214f9c-deps] 87 | lmb_channel_edge_ids: None,
  52. 234.57 s [gammaloop-crate-test-binaries-gammaloop-integration-tests-d6e55b48f8214f9c-deps] | ^^^^^^^^^^^^^^^^^^^^ `CutInfo` does not have this field
  53. 234.57 s [gammaloop-crate-test-binaries-gammaloop-integration-tests-d6e55b48f8214f9c-deps] |
  54. 234.57 s [gammaloop-crate-test-binaries-gammaloop-integration-tests-d6e55b48f8214f9c-deps] = note: available fields are: `sampling_channel_id`, `sampling_channel_edge_ids`
  55. 234.57 s [gammaloop-crate-test-binaries-gammaloop-integration-tests-d6e55b48f8214f9c-deps]
  56. 234.66 s [gammaloop-crate-test-binaries-gammaloop-integration-tests-d6e55b48f8214f9c-deps] error[E0609]: no field `lmb_channel_edge_ids` on type `CutInfo`
  57. 234.66 s [gammaloop-crate-test-binaries-gammaloop-integration-tests-d6e55b48f8214f9c-deps] --> tests/tests/test_evaluation_api.rs:311:10
  58. 234.66 s [gammaloop-crate-test-binaries-gammaloop-integration-tests-d6e55b48f8214f9c-deps] |
  59. 234.66 s [gammaloop-crate-test-binaries-gammaloop-integration-tests-d6e55b48f8214f9c-deps] 311 | .lmb_channel_edge_ids
  60. 234.66 s [gammaloop-crate-test-binaries-gammaloop-integration-tests-d6e55b48f8214f9c-deps] | ^^^^^^^^^^^^^^^^^^^^ unknown field
  61. 234.66 s [gammaloop-crate-test-binaries-gammaloop-integration-tests-d6e55b48f8214f9c-deps] |
  62. 234.66 s [gammaloop-crate-test-binaries-gammaloop-integration-tests-d6e55b48f8214f9c-deps] = note: available fields are: `particle_pdgs`, `cut_id`, `graph_id`, `graph_group_id`, `orientation_id` ... and 2 others
  63. 234.66 s [gammaloop-crate-test-binaries-gammaloop-integration-tests-d6e55b48f8214f9c-deps]
  64. 234.69 s [gammaloop-crate-test-binaries-gammaloop-integration-tests-d6e55b48f8214f9c-deps] error[E0609]: no field `lmb_channel_edge_ids` on type `CutInfo`
  65. 234.69 s [gammaloop-crate-test-binaries-gammaloop-integration-tests-d6e55b48f8214f9c-deps] --> tests/tests/test_evaluation_api.rs:591:26
  66. 234.69 s [gammaloop-crate-test-binaries-gammaloop-integration-tests-d6e55b48f8214f9c-deps] |
  67. 234.69 s [gammaloop-crate-test-binaries-gammaloop-integration-tests-d6e55b48f8214f9c-deps] 591 | .lmb_channel_edge_ids
  68. 234.69 s [gammaloop-crate-test-binaries-gammaloop-integration-tests-d6e55b48f8214f9c-deps] | ^^^^^^^^^^^^^^^^^^^^ unknown field
  69. 234.69 s [gammaloop-crate-test-binaries-gammaloop-integration-tests-d6e55b48f8214f9c-deps] |
  70. 234.69 s [gammaloop-crate-test-binaries-gammaloop-integration-tests-d6e55b48f8214f9c-deps] = note: available fields are: `particle_pdgs`, `cut_id`, `graph_id`, `graph_group_id`, `orientation_id` ... and 2 others
  71. 234.69 s [gammaloop-crate-test-binaries-gammaloop-integration-tests-d6e55b48f8214f9c-deps]
  72. 234.74 s [gammaloop-crate-test-binaries-gammaloop-integration-tests-d6e55b48f8214f9c-deps] error[E0609]: no field `lmb_channel_edge_ids` on type `CutInfo`
  73. 234.74 s [gammaloop-crate-test-binaries-gammaloop-integration-tests-d6e55b48f8214f9c-deps] --> tests/tests/test_evaluation_api.rs:1177:18
  74. 234.74 s [gammaloop-crate-test-binaries-gammaloop-integration-tests-d6e55b48f8214f9c-deps] |
  75. 234.75 s [gammaloop-crate-test-binaries-gammaloop-integration-tests-d6e55b48f8214f9c-deps] 1177 | .lmb_channel_edge_ids
  76. 234.75 s [gammaloop-crate-test-binaries-gammaloop-integration-tests-d6e55b48f8214f9c-deps] | ^^^^^^^^^^^^^^^^^^^^ unknown field
  77. 234.75 s [gammaloop-crate-test-binaries-gammaloop-integration-tests-d6e55b48f8214f9c-deps] |
  78. 234.75 s [gammaloop-crate-test-binaries-gammaloop-integration-tests-d6e55b48f8214f9c-deps] = note: available fields are: `particle_pdgs`, `cut_id`, `graph_id`, `graph_group_id`, `orientation_id` ... and 2 others
  79. 234.75 s [gammaloop-crate-test-binaries-gammaloop-integration-tests-d6e55b48f8214f9c-deps]
  80. 234.75 s [gammaloop-crate-test-binaries-gammaloop-integration-tests-d6e55b48f8214f9c-deps] For more information about this error, try `rustc --explain E0560`.
  81. 234.78 s [gammaloop-crate-test-binaries-gammaloop-integration-tests-d6e55b48f8214f9c-deps] error: could not compile `gammaloop-integration-tests` (test "test_differential") due to 2 previous errors
  82. 234.78 s [gammaloop-crate-test-binaries-gammaloop-integration-tests-d6e55b48f8214f9c-deps] warning: build failed, waiting for other jobs to finish...
  83. 234.92 s [gammaloop-crate-test-binaries-gammaloop-integration-tests-d6e55b48f8214f9c-deps] error[E0609]: no field `lmb_channel_edge_ids` on type `CutInfo`
  84. 234.92 s [gammaloop-crate-test-binaries-gammaloop-integration-tests-d6e55b48f8214f9c-deps] --> tests/tests/test_evaluation_api.rs:1222:22
  85. 234.92 s [gammaloop-crate-test-binaries-gammaloop-integration-tests-d6e55b48f8214f9c-deps] |
  86. 234.92 s [gammaloop-crate-test-binaries-gammaloop-integration-tests-d6e55b48f8214f9c-deps] 1222 | .lmb_channel_edge_ids
  87. 234.92 s [gammaloop-crate-test-binaries-gammaloop-integration-tests-d6e55b48f8214f9c-deps] | ^^^^^^^^^^^^^^^^^^^^ unknown field
  88. 234.92 s [gammaloop-crate-test-binaries-gammaloop-integration-tests-d6e55b48f8214f9c-deps] |
  89. 234.92 s [gammaloop-crate-test-binaries-gammaloop-integration-tests-d6e55b48f8214f9c-deps] = note: available fields are: `particle_pdgs`, `cut_id`, `graph_id`, `graph_group_id`, `orientation_id` ... and 2 others
  90. 234.92 s [gammaloop-crate-test-binaries-gammaloop-integration-tests-d6e55b48f8214f9c-deps]
  91. 234.92 s [gammaloop-crate-test-binaries-gammaloop-integration-tests-d6e55b48f8214f9c-deps] error[E0609]: no field `lmb_channel_edge_ids` on type `CutInfo`
  92. 234.92 s [gammaloop-crate-test-binaries-gammaloop-integration-tests-d6e55b48f8214f9c-deps] --> tests/tests/test_evaluation_api.rs:1281:14
  93. 234.92 s [gammaloop-crate-test-binaries-gammaloop-integration-tests-d6e55b48f8214f9c-deps] |
  94. 234.92 s [gammaloop-crate-test-binaries-gammaloop-integration-tests-d6e55b48f8214f9c-deps] 1281 | .lmb_channel_edge_ids
  95. 234.92 s [gammaloop-crate-test-binaries-gammaloop-integration-tests-d6e55b48f8214f9c-deps] | ^^^^^^^^^^^^^^^^^^^^ unknown field
  96. 234.92 s [gammaloop-crate-test-binaries-gammaloop-integration-tests-d6e55b48f8214f9c-deps] |
  97. 234.92 s [gammaloop-crate-test-binaries-gammaloop-integration-tests-d6e55b48f8214f9c-deps] = note: available fields are: `particle_pdgs`, `cut_id`, `graph_id`, `graph_group_id`, `orientation_id` ... and 2 others
  98. 234.92 s [gammaloop-crate-test-binaries-gammaloop-integration-tests-d6e55b48f8214f9c-deps]
  99. 234.99 s [gammaloop-crate-test-binaries-gammaloop-integration-tests-d6e55b48f8214f9c-deps] error[E0609]: no field `lmb_channel_edge_ids` on type `CutInfo`
  100. 234.99 s [gammaloop-crate-test-binaries-gammaloop-integration-tests-d6e55b48f8214f9c-deps] --> tests/tests/test_evaluation_api.rs:1428:18
  101. 234.99 s [gammaloop-crate-test-binaries-gammaloop-integration-tests-d6e55b48f8214f9c-deps] |
  102. 234.99 s [gammaloop-crate-test-binaries-gammaloop-integration-tests-d6e55b48f8214f9c-deps] 1428 | .lmb_channel_edge_ids
  103. 234.99 s [gammaloop-crate-test-binaries-gammaloop-integration-tests-d6e55b48f8214f9c-deps] | ^^^^^^^^^^^^^^^^^^^^ unknown field
  104. 234.99 s [gammaloop-crate-test-binaries-gammaloop-integration-tests-d6e55b48f8214f9c-deps] |
  105. 234.99 s [gammaloop-crate-test-binaries-gammaloop-integration-tests-d6e55b48f8214f9c-deps] = note: available fields are: `particle_pdgs`, `cut_id`, `graph_id`, `graph_group_id`, `orientation_id` ... and 2 others
  106. 234.99 s [gammaloop-crate-test-binaries-gammaloop-integration-tests-d6e55b48f8214f9c-deps]
  107. 235.15 s [gammaloop-crate-test-binaries-gammaloop-integration-tests-d6e55b48f8214f9c-deps] For more information about this error, try `rustc --explain E0609`.
  108. 235.17 s [gammaloop-crate-test-binaries-gammaloop-integration-tests-d6e55b48f8214f9c-deps] error: could not compile `gammaloop-integration-tests` (test "test_evaluation_api") due to 6 previous errors
  109. 236.43 s [gammaloop-crate-test-binaries-gammaloop-integration-tests-d6e55b48f8214f9c-deps] error[E0609]: no field `lmb_channel_id` on type `CutInfo`
  110. 236.43 s [gammaloop-crate-test-binaries-gammaloop-integration-tests-d6e55b48f8214f9c-deps] --> tests/tests/test_runs/utils.rs:568:36
  111. 236.43 s [gammaloop-crate-test-binaries-gammaloop-integration-tests-d6e55b48f8214f9c-deps] |
  112. 236.43 s [gammaloop-crate-test-binaries-gammaloop-integration-tests-d6e55b48f8214f9c-deps] 568 | event.cut_info.lmb_channel_id,
  113. 236.43 s [gammaloop-crate-test-binaries-gammaloop-integration-tests-d6e55b48f8214f9c-deps] | ^^^^^^^^^^^^^^ unknown field
  114. 236.43 s [gammaloop-crate-test-binaries-gammaloop-integration-tests-d6e55b48f8214f9c-deps] |
  115. 236.43 s [gammaloop-crate-test-binaries-gammaloop-integration-tests-d6e55b48f8214f9c-deps] = note: available fields are: `particle_pdgs`, `cut_id`, `graph_id`, `graph_group_id`, `orientation_id` ... and 2 others
  116. 236.43 s [gammaloop-crate-test-binaries-gammaloop-integration-tests-d6e55b48f8214f9c-deps]
  117. 236.44 s [gammaloop-crate-test-binaries-gammaloop-integration-tests-d6e55b48f8214f9c-deps] error[E0609]: no field `lmb_channel_id` on type `CutInfo`
  118. 236.44 s [gammaloop-crate-test-binaries-gammaloop-integration-tests-d6e55b48f8214f9c-deps] --> tests/tests/test_runs/utils.rs:580:36
  119. 236.44 s [gammaloop-crate-test-binaries-gammaloop-integration-tests-d6e55b48f8214f9c-deps] |
  120. 236.44 s [gammaloop-crate-test-binaries-gammaloop-integration-tests-d6e55b48f8214f9c-deps] 580 | event.cut_info.lmb_channel_id,
  121. 236.44 s [gammaloop-crate-test-binaries-gammaloop-integration-tests-d6e55b48f8214f9c-deps] | ^^^^^^^^^^^^^^ unknown field
  122. 236.44 s [gammaloop-crate-test-binaries-gammaloop-integration-tests-d6e55b48f8214f9c-deps] |
  123. 236.44 s [gammaloop-crate-test-binaries-gammaloop-integration-tests-d6e55b48f8214f9c-deps] = note: available fields are: `particle_pdgs`, `cut_id`, `graph_id`, `graph_group_id`, `orientation_id` ... and 2 others
  124. 236.44 s [gammaloop-crate-test-binaries-gammaloop-integration-tests-d6e55b48f8214f9c-deps]
  125. 237.58 s [gammaloop-crate-test-binaries-gammaloop-integration-tests-d6e55b48f8214f9c-deps] error: could not compile `gammaloop-integration-tests` (test "test_runs") due to 2 previous errors
  126. 328.66 s Progress: 1 of 3 built (1 failed)
  127. 328.66 s Failed to build gammaloop-crate-test-binaries-gammaloop-integration-tests-d6e55b48f8214f9c-deps after 1m37s
  128. 328.67 s error: Cannot build '/nix/store/m7mdjihf4jw96zxzkr76zsn3871igrdi-gammaloop-crate-test-binaries-gammaloop-integration-tests-d6e55b48f8214f9c-deps-0.1.0.drv'.
  129. 328.67 s Reason: builder failed with exit code 101.
  130. 328.67 s Output paths:
  131. 328.67 s /nix/store/rx0ry5iql5nmp59kv3cxzwz83dpz86ib-gammaloop-crate-test-binaries-gammaloop-integration-tests-d6e55b48f8214f9c-deps-0.1.0
  132. 328.67 s Last 111 log lines:
  133. 328.67 s > Running phase: unpackPhase
  134. 328.67 s > unpacking source archive /nix/store/a8nx1wypjvxw84bsqigc8dbv41rngy1k-source
  135. 328.67 s > source root is source
  136. 328.67 s > Running phase: patchPhase
  137. 328.67 s > Executing configureCargoCommonVars
  138. 328.67 s > copying cargo artifacts from /nix/store/2wi4pvlxmvkipfdd2ff64zxslbq2mr1w-gammaloop-crate-test-binaries-gammaloop-integration-tests-d6e55b48f8214f9c-inputs/target to target
  139. 328.67 s > will deep copy artifacts (instead of symlinking) as requested
  140. 328.67 s > Running phase: updateAutotoolsGnuConfigScriptsPhase
  141. 328.67 s > Running phase: configurePhase
  142. 328.67 s > will append /build/source/.cargo-home/config.toml with contents of /nix/store/5drf77x6km4ky7gwlrzdx9bbd6fz09g3-vendor-cargo-deps/config.toml
  143. 328.67 s > default configurePhase, nothing to do
  144. 328.67 s > Running phase: buildPhase
  145. 328.67 s > +++ command cargo --version
  146. 328.67 s > cargo 1.97.0 (c980f4866 2026-06-30)
  147. 328.67 s > +++ command cargo test --profile ci-optim --no-run --offline -p gammaloop-integration-tests --features gammaloop-integration-tests/python-api-tests
  148. 328.67 s > warning: unused import: `GaussianReferenceFunction`
  149. 328.67 s > --> crates/gammaloop-api/src/state.rs:38:27
  150. 328.67 s > |
  151. 328.67 s > 38 | integrands::process::{GaussianReferenceFunction, ProcessIntegrand},
  152. 328.67 s > | ^^^^^^^^^^^^^^^^^^^^^^^^^
  153. 328.67 s > |
  154. 328.67 s > = note: `#[warn(unused_imports)]` (part of `#[warn(unused)]`) on by default
  155. 328.67 s >
  156. 328.67 s > warning: `gammaloop-api` (lib) generated 1 warning (run `cargo fix --lib -p gammaloop-api` to apply 1 suggestion)
  157. 328.67 s > Compiling gammaloop-integration-tests v0.1.0 (/build/source/tests)
  158. 328.67 s > error[E0560]: struct `CutInfo` has no field named `lmb_channel_id`
  159. 328.67 s > --> tests/tests/test_differential.rs:86:13
  160. 328.67 s > |
  161. 328.67 s > 86 | lmb_channel_id: None,
  162. 328.67 s > | ^^^^^^^^^^^^^^ `CutInfo` does not have this field
  163. 328.67 s > |
  164. 328.67 s > = note: available fields are: `sampling_channel_id`, `sampling_channel_edge_ids`
  165. 328.67 s >
  166. 328.67 s > error[E0560]: struct `CutInfo` has no field named `lmb_channel_edge_ids`
  167. 328.67 s > --> tests/tests/test_differential.rs:87:13
  168. 328.67 s > |
  169. 328.67 s > 87 | lmb_channel_edge_ids: None,
  170. 328.67 s > | ^^^^^^^^^^^^^^^^^^^^ `CutInfo` does not have this field
  171. 328.67 s > |
  172. 328.67 s > = note: available fields are: `sampling_channel_id`, `sampling_channel_edge_ids`
  173. 328.67 s >
  174. 328.67 s > error[E0609]: no field `lmb_channel_edge_ids` on type `CutInfo`
  175. 328.67 s > --> tests/tests/test_evaluation_api.rs:311:10
  176. 328.67 s > |
  177. 328.67 s > 311 | .lmb_channel_edge_ids
  178. 328.67 s > | ^^^^^^^^^^^^^^^^^^^^ unknown field
  179. 328.67 s > |
  180. 328.67 s > = note: available fields are: `particle_pdgs`, `cut_id`, `graph_id`, `graph_group_id`, `orientation_id` ... and 2 others
  181. 328.67 s >
  182. 328.67 s > error[E0609]: no field `lmb_channel_edge_ids` on type `CutInfo`
  183. 328.67 s > --> tests/tests/test_evaluation_api.rs:591:26
  184. 328.67 s > |
  185. 328.67 s > 591 | .lmb_channel_edge_ids
  186. 328.67 s > | ^^^^^^^^^^^^^^^^^^^^ unknown field
  187. 328.67 s > |
  188. 328.67 s > = note: available fields are: `particle_pdgs`, `cut_id`, `graph_id`, `graph_group_id`, `orientation_id` ... and 2 others
  189. 328.67 s >
  190. 328.67 s > error[E0609]: no field `lmb_channel_edge_ids` on type `CutInfo`
  191. 328.67 s > --> tests/tests/test_evaluation_api.rs:1177:18
  192. 328.67 s > |
  193. 328.67 s > 1177 | .lmb_channel_edge_ids
  194. 328.67 s > | ^^^^^^^^^^^^^^^^^^^^ unknown field
  195. 328.67 s > |
  196. 328.67 s > = note: available fields are: `particle_pdgs`, `cut_id`, `graph_id`, `graph_group_id`, `orientation_id` ... and 2 others
  197. 328.67 s >
  198. 328.67 s > For more information about this error, try `rustc --explain E0560`.
  199. 328.67 s > error: could not compile `gammaloop-integration-tests` (test "test_differential") due to 2 previous errors
  200. 328.67 s > warning: build failed, waiting for other jobs to finish...
  201. 328.67 s > error[E0609]: no field `lmb_channel_edge_ids` on type `CutInfo`
  202. 328.67 s > --> tests/tests/test_evaluation_api.rs:1222:22
  203. 328.67 s > |
  204. 328.67 s > 1222 | .lmb_channel_edge_ids
  205. 328.67 s > | ^^^^^^^^^^^^^^^^^^^^ unknown field
  206. 328.67 s > |
  207. 328.67 s > = note: available fields are: `particle_pdgs`, `cut_id`, `graph_id`, `graph_group_id`, `orientation_id` ... and 2 others
  208. 328.67 s >
  209. 328.67 s > error[E0609]: no field `lmb_channel_edge_ids` on type `CutInfo`
  210. 328.67 s > --> tests/tests/test_evaluation_api.rs:1281:14
  211. 328.67 s > |
  212. 328.67 s > 1281 | .lmb_channel_edge_ids
  213. 328.67 s > | ^^^^^^^^^^^^^^^^^^^^ unknown field
  214. 328.67 s > |
  215. 328.67 s > = note: available fields are: `particle_pdgs`, `cut_id`, `graph_id`, `graph_group_id`, `orientation_id` ... and 2 others
  216. 328.67 s >
  217. 328.67 s > error[E0609]: no field `lmb_channel_edge_ids` on type `CutInfo`
  218. 328.67 s > --> tests/tests/test_evaluation_api.rs:1428:18
  219. 328.67 s > |
  220. 328.67 s > 1428 | .lmb_channel_edge_ids
  221. 328.67 s > | ^^^^^^^^^^^^^^^^^^^^ unknown field
  222. 328.67 s > |
  223. 328.67 s > = note: available fields are: `particle_pdgs`, `cut_id`, `graph_id`, `graph_group_id`, `orientation_id` ... and 2 others
  224. 328.67 s >
  225. 328.67 s > For more information about this error, try `rustc --explain E0609`.
  226. 328.67 s > error: could not compile `gammaloop-integration-tests` (test "test_evaluation_api") due to 6 previous errors
  227. 328.67 s > error[E0609]: no field `lmb_channel_id` on type `CutInfo`
  228. 328.67 s > --> tests/tests/test_runs/utils.rs:568:36
  229. 328.67 s > |
  230. 328.67 s > 568 | event.cut_info.lmb_channel_id,
  231. 328.67 s > | ^^^^^^^^^^^^^^ unknown field
  232. 328.67 s > |
  233. 328.67 s > = note: available fields are: `particle_pdgs`, `cut_id`, `graph_id`, `graph_group_id`, `orientation_id` ... and 2 others
  234. 328.67 s >
  235. 328.67 s > error[E0609]: no field `lmb_channel_id` on type `CutInfo`
  236. 328.67 s > --> tests/tests/test_runs/utils.rs:580:36
  237. 328.67 s > |
  238. 328.67 s > 580 | event.cut_info.lmb_channel_id,
  239. 328.67 s > | ^^^^^^^^^^^^^^ unknown field
  240. 328.67 s > |
  241. 328.67 s > = note: available fields are: `particle_pdgs`, `cut_id`, `graph_id`, `graph_group_id`, `orientation_id` ... and 2 others
  242. 328.67 s >
  243. 328.67 s > error: could not compile `gammaloop-integration-tests` (test "test_runs") due to 2 previous errors
  244. 328.67 s For full logs, run:
  245. 328.67 s nix log /nix/store/m7mdjihf4jw96zxzkr76zsn3871igrdi-gammaloop-crate-test-binaries-gammaloop-integration-tests-d6e55b48f8214f9c-deps-0.1.0.drv
  246. 328.67 s error: Cannot build '/nix/store/dmkvxpnn0nfzz1rm9zk6aw2gnws5hp9z-nix-ci-artifact-barrier-crate-test-binaries-python-api-gammaloop-integration-tests.drv'.
  247. 328.67 s Reason: 1 dependency failed.
  248. 328.67 s Output paths:
  249. 328.67 s /nix/store/vpwdnd0f470vcml6h9z6qm78b5k80hv6-nix-ci-artifact-barrier-crate-test-binaries-python-api-gammaloop-integration-tests
  250. 328.68 s Build failed due to failed dependency
  251. 328.88 s Build failed.