1. 0.00 s $ /nix/store/9ypz3flqsrl5xl495mm8h645gadjsxi1-coreutils-9.11/bin/timeout --kill-after=15s 7200s /nix/store/23zk8sgzamrbmj1fday15szf7f2279s8-nix-2.34.7/bin/nix --extra-experimental-features nix-command --extra-experimental-features flakes --log-format internal-json build --no-link --print-out-paths git+https://github.com/alphal00p/gammaloop?ref=advanced_sampling&rev=2ca19f40f736965c54ac582014fbcfa827cf7c6f&shallow=1#checks.x86_64-linux.gammaloop-check --print-build-logs
  2. 0.34 s error (ignored): SQLite database '/var/cache/nix-ci-worker/eval-cache-v6/854e49c50ea44ef72bd6818a273a9742ab4c976c3390ebc05e3b6fbda314a964.sqlite' is busy
  3. 3.80 s
  4. 4.83 s Building /nix/store/53802zbj9009bwya0yb48jnjgdmqv87h-gammaloop-workspace-check-0.1.0.drv
  5. 4.96 s [gammaloop-workspace-check] Phase: unpackPhase
  6. 4.96 s [gammaloop-workspace-check] unpacking source archive /nix/store/401j5sh0ylbdhdhk1c9kp8s5d8i5hpv1-source
  7. 5.12 s [gammaloop-workspace-check] source root is source
  8. 5.19 s [gammaloop-workspace-check] Phase: patchPhase
  9. 5.21 s [gammaloop-workspace-check] Executing configureCargoCommonVars
  10. 5.22 s [gammaloop-workspace-check] decompressing cargo artifacts from /nix/store/50vpxlcgfxf2d57i27v3d10zjwxxbm2r-gammaloop-workspace-deps-deps-0.1.0/target.tar.zst to target
  11. 8.14 s [gammaloop-workspace-check] Phase: updateAutotoolsGnuConfigScriptsPhase
  12. 8.20 s [gammaloop-workspace-check] Phase: configurePhase
  13. 8.21 s [gammaloop-workspace-check] will append /build/source/.cargo-home/config.toml with contents of /nix/store/5drf77x6km4ky7gwlrzdx9bbd6fz09g3-vendor-cargo-deps/config.toml
  14. 8.22 s [gammaloop-workspace-check] default configurePhase, nothing to do
  15. 8.23 s [gammaloop-workspace-check] Phase: buildPhase
  16. 8.24 s [gammaloop-workspace-check] +++ command cargo --version
  17. 8.24 s [gammaloop-workspace-check] cargo 1.97.0 (c980f4866 2026-06-30)
  18. 8.29 s [gammaloop-workspace-check] +++ command cargo check --profile ci-optim --locked --workspace --features gammaloop-tracing-filter/clap,gammaloop-tracing-filter/symbolica,idenso/bincode,idenso/reference-cases,linnet/bincode,linnet/drawing,linnet/rkyv,linnet/serde,linnet/symbolica,spenso-macros/shadowing,spenso/shadowing,symbolica/tracing_max_level_info,three-dimensional-reps/display,three-dimensional-reps/eval,three-dimensional-reps/serde --all-targets
  19. 8.89 s [gammaloop-workspace-check] Checking cfg-if v1.0.4
  20. 8.89 s [gammaloop-workspace-check] Checking memchr v2.8.0
  21. 8.89 s [gammaloop-workspace-check] Checking once_cell v1.21.4
  22. 8.89 s [gammaloop-workspace-check] Checking either v1.15.0
  23. 8.91 s [gammaloop-workspace-check] Checking serde_core v1.0.228
  24. 8.91 s [gammaloop-workspace-check] Checking libc v0.2.186
  25. 8.91 s [gammaloop-workspace-check] Checking libm v0.2.16
  26. 8.91 s [gammaloop-workspace-check] Checking itoa v1.0.18
  27. 8.93 s [gammaloop-workspace-check] Checking log v0.4.29
  28. 8.94 s [gammaloop-workspace-check] Checking regex-syntax v0.8.10
  29. 8.94 s [gammaloop-workspace-check] Checking zerocopy v0.8.48
  30. 8.94 s [gammaloop-workspace-check] Checking crossbeam-utils v0.8.21
  31. 8.94 s [gammaloop-workspace-check] Checking equivalent v1.0.2
  32. 8.96 s [gammaloop-workspace-check] Checking zmij v1.0.21
  33. 8.97 s [gammaloop-workspace-check] Checking bytemuck v1.25.0
  34. 8.97 s [gammaloop-workspace-check] Checking lazy_static v1.5.0
  35. 8.97 s [gammaloop-workspace-check] Compiling target-lexicon v0.13.5
  36. 9.00 s [gammaloop-workspace-check] Checking arrayvec v0.7.6
  37. 9.06 s [gammaloop-workspace-check] Checking powerfmt v0.2.0
  38. 9.08 s [gammaloop-workspace-check] Checking num_threads v0.1.7
  39. 9.13 s [gammaloop-workspace-check] Checking itertools v0.14.0
  40. 9.16 s [gammaloop-workspace-check] Checking num-conv v0.2.1
  41. 9.20 s [gammaloop-workspace-check] Checking deranged v0.5.8
  42. 9.21 s [gammaloop-workspace-check] Checking pin-project-lite v0.2.17
  43. 9.25 s [gammaloop-workspace-check] Checking time-core v0.1.8
  44. 9.26 s [gammaloop-workspace-check] Checking tracing-core v0.1.36
  45. 9.26 s [gammaloop-workspace-check] Checking foldhash v0.2.0
  46. 9.27 s [gammaloop-workspace-check] Checking crossbeam-epoch v0.9.18
  47. 9.30 s [gammaloop-workspace-check] Checking allocator-api2 v0.2.21
  48. 9.34 s [gammaloop-workspace-check] Checking const-random v0.1.18
  49. 9.36 s [gammaloop-workspace-check] Checking static_assertions v1.1.0
  50. 9.36 s [gammaloop-workspace-check] Checking nu-ansi-term v0.50.3
  51. 9.40 s [gammaloop-workspace-check] Checking winnow v1.0.2
  52. 9.41 s [gammaloop-workspace-check] Checking unty v0.0.4
  53. 9.43 s [gammaloop-workspace-check] Checking safe_arch v0.7.4
  54. 9.47 s [gammaloop-workspace-check] Checking safe_arch v1.0.0
  55. 9.48 s [gammaloop-workspace-check] Checking crossbeam-deque v0.8.6
  56. 9.58 s [gammaloop-workspace-check] Checking sharded-slab v0.1.7
  57. 9.60 s [gammaloop-workspace-check] Checking rayon-core v1.13.0
  58. 9.64 s [gammaloop-workspace-check] Checking hashbrown v0.16.1
  59. 9.78 s [gammaloop-workspace-check] Checking wide v0.7.33
  60. 9.86 s [gammaloop-workspace-check] Checking thread_local v1.1.9
  61. 9.94 s [gammaloop-workspace-check] Checking aho-corasick v1.1.4
  62. 10.00 s [gammaloop-workspace-check] Checking tracing-log v0.2.0
  63. 10.06 s [gammaloop-workspace-check] Checking tracing v0.1.44
  64. 10.10 s [gammaloop-workspace-check] Checking az v1.3.0
  65. 10.11 s [gammaloop-workspace-check] Checking toml_writer v1.1.1+spec-1.1.0
  66. 10.12 s [gammaloop-workspace-check] Checking rayon v1.12.0
  67. 10.20 s [gammaloop-workspace-check] Checking indenter v0.3.4
  68. 10.27 s [gammaloop-workspace-check] Checking wide v1.3.0
  69. 10.35 s [gammaloop-workspace-check] Compiling phf_shared v0.11.3
  70. 10.60 s [gammaloop-workspace-check] Checking anyhow v1.0.102
  71. 10.65 s [gammaloop-workspace-check] Checking alloc-no-stdlib v2.0.4
  72. 10.76 s [gammaloop-workspace-check] Checking rawpointer v0.2.1
  73. 10.77 s [gammaloop-workspace-check] Checking toml_parser v1.1.2+spec-1.1.0
  74. 10.82 s [gammaloop-workspace-check] Checking num-traits v0.2.19
  75. 10.84 s [gammaloop-workspace-check] Checking dyn-clone v1.0.20
  76. 10.88 s [gammaloop-workspace-check] Checking utf8parse v0.2.2
  77. 10.91 s [gammaloop-workspace-check] Checking matrixmultiply v0.3.10
  78. 10.95 s [gammaloop-workspace-check] Checking alloc-stdlib v0.2.2
  79. 10.97 s [gammaloop-workspace-check] Checking anstyle-parse v1.0.0
  80. 11.05 s [gammaloop-workspace-check] Checking getrandom v0.3.4
  81. 11.07 s [gammaloop-workspace-check] Checking gmp-mpfr-sys v1.7.1
  82. 11.09 s [gammaloop-workspace-check] Checking anstyle-query v1.1.5
  83. 11.17 s [gammaloop-workspace-check] Checking anstyle v1.0.14
  84. 11.17 s [gammaloop-workspace-check] Checking rand_core v0.9.5
  85. 11.23 s [gammaloop-workspace-check] Checking is_terminal_polyfill v1.70.2
  86. 11.31 s [gammaloop-workspace-check] Checking colorchoice v1.0.5
  87. 11.37 s [gammaloop-workspace-check] Checking colored v3.1.1
  88. 11.39 s [gammaloop-workspace-check] Compiling phf_generator v0.11.3
  89. 11.42 s [gammaloop-workspace-check] Checking eyre v0.6.12
  90. 11.47 s [gammaloop-workspace-check] Checking unicode-width v0.2.2
  91. 11.47 s [gammaloop-workspace-check] Checking bitflags v1.3.2
  92. 11.51 s [gammaloop-workspace-check] Checking anstream v1.0.0
  93. 11.52 s [gammaloop-workspace-check] Checking region v3.0.2
  94. 11.64 s [gammaloop-workspace-check] Compiling phf_codegen v0.11.3
  95. 11.67 s [gammaloop-workspace-check] Compiling pyo3-build-config v0.28.3
  96. 11.68 s [gammaloop-workspace-check] Checking brotli-decompressor v5.0.0
  97. 11.73 s [gammaloop-workspace-check] Checking wasmtime-jit-icache-coherence v34.0.2
  98. 11.75 s [gammaloop-workspace-check] Checking time v0.3.47
  99. 11.78 s [gammaloop-workspace-check] Checking hugepage-rs v0.1.1
  100. 11.80 s [gammaloop-workspace-check] Checking inventory v0.3.24
  101. 11.81 s [gammaloop-workspace-check] Checking spec_math v0.1.6
  102. 11.83 s [gammaloop-workspace-check] Checking serde v1.0.228
  103. 11.84 s [gammaloop-workspace-check] Checking serde_json v1.0.149
  104. 11.86 s [gammaloop-workspace-check] Checking bitflags v2.11.1
  105. 11.90 s [gammaloop-workspace-check] Checking serde_spanned v1.1.1
  106. 11.93 s [gammaloop-workspace-check] Checking toml_datetime v1.1.1+spec-1.1.0
  107. 12.03 s [gammaloop-workspace-check] Checking thiserror v2.0.18
  108. 12.06 s [gammaloop-workspace-check] Compiling getopts v0.2.24
  109. 12.09 s [gammaloop-workspace-check] Checking libloading v0.9.0
  110. 12.10 s [gammaloop-workspace-check] Checking byteorder v1.5.0
  111. 12.10 s [gammaloop-workspace-check] Checking self_cell v1.2.2
  112. 12.10 s [gammaloop-workspace-check] Checking approx v0.5.1
  113. 12.13 s [gammaloop-workspace-check] Checking regex-automata v0.4.14
  114. 12.15 s [gammaloop-workspace-check] Checking num-integer v0.1.46
  115. 12.20 s [gammaloop-workspace-check] Checking append-only-vec v0.1.8
  116. 12.24 s [gammaloop-workspace-check] Checking bytes v1.11.1
  117. 12.32 s [gammaloop-workspace-check] Checking toml v1.1.2+spec-1.1.0
  118. 12.33 s [gammaloop-workspace-check] Checking tinyjson v2.5.1
  119. 12.36 s [gammaloop-workspace-check] Compiling unic-char-range v0.9.0
  120. 12.43 s [gammaloop-workspace-check] Checking linux-raw-sys v0.12.1
  121. 12.44 s [gammaloop-workspace-check] Compiling unic-common v0.9.0
  122. 12.54 s [gammaloop-workspace-check] Compiling unicode_names2_generator v1.3.0
  123. 12.57 s [gammaloop-workspace-check] Checking smallvec v1.15.1
  124. 12.61 s [gammaloop-workspace-check] Checking num-complex v0.4.6
  125. 12.63 s [gammaloop-workspace-check] Checking tracing-serde v0.2.0
  126. 12.70 s [gammaloop-workspace-check] Checking bincode v2.0.1
  127. 12.84 s [gammaloop-workspace-check] Checking smartstring v1.0.1
  128. 12.86 s [gammaloop-workspace-check] Checking rustix v1.1.4
  129. 12.88 s [gammaloop-workspace-check] Compiling unic-ucd-version v0.9.0
  130. 12.95 s [gammaloop-workspace-check] Compiling unic-char-property v0.9.0
  131. 13.08 s [gammaloop-workspace-check] Compiling is-macro v0.3.7
  132. 13.11 s [gammaloop-workspace-check] Checking simba v0.9.1
  133. 13.15 s [gammaloop-workspace-check] Compiling rustpython-parser-vendored v0.4.0
  134. 13.26 s [gammaloop-workspace-check] Checking iana-time-zone v0.1.65
  135. 13.42 s [gammaloop-workspace-check] Checking chrono v0.4.44
  136. 13.49 s [gammaloop-workspace-check] Checking brotli v8.0.2
  137. 13.54 s [gammaloop-workspace-check] Compiling rustpython-parser v0.4.0
  138. 13.66 s [gammaloop-workspace-check] Compiling phf v0.11.3
  139. 13.78 s [gammaloop-workspace-check] Checking rustc-hash v2.1.2
  140. 13.86 s [gammaloop-workspace-check] Checking ndarray v0.17.2
  141. 13.89 s [gammaloop-workspace-check] Compiling unic-ucd-ident v0.9.0
  142. 13.89 s [gammaloop-workspace-check] Compiling unic-emoji-char v0.9.0
  143. 14.09 s [gammaloop-workspace-check] Compiling lalrpop-util v0.20.2
  144. 14.10 s [gammaloop-workspace-check] Compiling rustc-hash v1.1.0
  145. 14.12 s [gammaloop-workspace-check] Checking rug v1.30.0
  146. 14.20 s [gammaloop-workspace-check] Checking unicode-segmentation v1.13.2
  147. 14.23 s [gammaloop-workspace-check] Checking ppv-lite86 v0.2.21
  148. 14.25 s [gammaloop-workspace-check] Checking ahash v0.8.12
  149. 14.29 s [gammaloop-workspace-check] Compiling symbolica v2.2.0 (https://github.com/alphal00p/symbolica?rev=a277a8dadbaae5a8d6605f2f381991a601e1f345#a277a8da)
  150. 14.48 s [gammaloop-workspace-check] Checking typenum v1.20.0
  151. 14.61 s [gammaloop-workspace-check] Checking getrandom v0.2.17
  152. 14.74 s [gammaloop-workspace-check] Checking rand_chacha v0.9.0
  153. 14.80 s [gammaloop-workspace-check] Checking scopeguard v1.2.0
  154. 14.84 s [gammaloop-workspace-check] Checking parking_lot_core v0.9.12
  155. 14.86 s [gammaloop-workspace-check] Checking lock_api v0.4.14
  156. 15.00 s [gammaloop-workspace-check] Checking unicode-ident v1.0.24
  157. 15.09 s [gammaloop-workspace-check] Checking rand v0.9.4
  158. 15.11 s [gammaloop-workspace-check] Checking hashbrown v0.17.0
  159. 15.13 s [gammaloop-workspace-check] Checking parking_lot v0.12.5
  160. 15.14 s [gammaloop-workspace-check] Checking errno v0.3.14
  161. 15.22 s [gammaloop-workspace-check] Checking strsim v0.11.1
  162. 15.25 s [gammaloop-workspace-check] Checking clap_lex v1.1.0
  163. 15.30 s [gammaloop-workspace-check] Checking unicase v2.9.0
  164. 15.36 s [gammaloop-workspace-check] Checking signal-hook-registry v1.4.8
  165. 15.38 s [gammaloop-workspace-check] Checking vte v0.14.1
  166. 15.46 s [gammaloop-workspace-check] Checking same-file v1.0.6
  167. 15.49 s [gammaloop-workspace-check] Checking signal-hook v0.3.18
  168. 15.49 s [gammaloop-workspace-check] Checking half v2.7.1
  169. 15.51 s [gammaloop-workspace-check] Checking indexmap v2.14.0
  170. 15.60 s [gammaloop-workspace-check] Checking walkdir v2.5.0
  171. 15.75 s [gammaloop-workspace-check] Checking mio v1.2.0
  172. 15.85 s [gammaloop-workspace-check] Checking ciborium-io v0.2.2
  173. 15.85 s [gammaloop-workspace-check] Checking minimal-lexical v0.2.1
  174. 15.88 s [gammaloop-workspace-check] Checking generic-array v0.14.7
  175. 15.91 s [gammaloop-workspace-check] Checking ciborium-ll v0.2.2
  176. 16.15 s [gammaloop-workspace-check] Checking derive_more v2.1.1
  177. 16.21 s [gammaloop-workspace-check] Checking nom v7.1.3
  178. 16.22 s [gammaloop-workspace-check] Checking signal-hook-mio v0.2.5
  179. 16.23 s [gammaloop-workspace-check] Checking num-bigint v0.4.6
  180. 16.26 s [gammaloop-workspace-check] Checking symjit v2.21.0
  181. 16.30 s [gammaloop-workspace-check] Checking console v0.16.3
  182. 16.30 s [gammaloop-workspace-check] Checking block-buffer v0.10.4
  183. 16.37 s [gammaloop-workspace-check] Checking crypto-common v0.1.7
  184. 16.44 s [gammaloop-workspace-check] Checking digest v0.10.7
  185. 16.58 s [gammaloop-workspace-check] Checking bstr v1.12.1
  186. 16.60 s [gammaloop-workspace-check] Checking linux-raw-sys v0.4.15
  187. 16.71 s [gammaloop-workspace-check] Checking terminal_size v0.4.4
  188. 16.78 s [gammaloop-workspace-check] Compiling unicode_names2 v1.3.0
  189. 16.80 s [gammaloop-workspace-check] Checking clap_builder v4.6.0
  190. 16.89 s [gammaloop-workspace-check] Checking winnow v0.7.15
  191. 16.90 s [gammaloop-workspace-check] Checking cpufeatures v0.2.17
  192. 16.97 s [gammaloop-workspace-check] Checking sha2 v0.10.9
  193. 17.04 s [gammaloop-workspace-check] Checking matchers v0.2.0
  194. 17.17 s [gammaloop-workspace-check] Checking regex v1.12.3
  195. 17.21 s [gammaloop-workspace-check] Checking tracing-subscriber v0.3.23
  196. 17.60 s [gammaloop-workspace-check] Checking globset v0.4.18
  197. 17.70 s [gammaloop-workspace-check] Checking rustix v0.38.44
  198. 17.86 s [gammaloop-workspace-check] Checking ciborium v0.2.2
  199. 17.96 s [gammaloop-workspace-check] Checking ansitok v0.3.0
  200. 18.24 s [gammaloop-workspace-check] Checking xprec v0.2.2
  201. 18.33 s [gammaloop-workspace-check] Checking getrandom v0.4.2
  202. 18.48 s [gammaloop-workspace-check] Checking rand_core v0.6.4
  203. 18.55 s [gammaloop-workspace-check] Checking fnv v1.0.7
  204. 18.57 s [gammaloop-workspace-check] Checking fastrand v2.4.1
  205. 18.58 s [gammaloop-workspace-check] Checking plotters-backend v0.3.7
  206. 18.61 s [gammaloop-workspace-check] Checking crossterm v0.28.1
  207. 18.63 s [gammaloop-workspace-check] Checking rust-embed-utils v8.11.0
  208. 18.69 s [gammaloop-workspace-check] Checking serde_spanned v0.6.9
  209. 18.71 s [gammaloop-workspace-check] Checking toml_datetime v0.6.11
  210. 18.82 s [gammaloop-workspace-check] Checking itertools v0.10.5
  211. 18.83 s [gammaloop-workspace-check] Checking toml_write v0.1.2
  212. 18.85 s [gammaloop-workspace-check] Checking cast v0.3.0
  213. 18.90 s [gammaloop-workspace-check] Checking tempfile v3.27.0
  214. 18.94 s [gammaloop-workspace-check] Checking tap v1.0.1
  215. 18.95 s [gammaloop-workspace-check] Checking rand_chacha v0.3.1
  216. 18.97 s [gammaloop-workspace-check] Checking plotters-svg v0.3.7
  217. 19.00 s [gammaloop-workspace-check] Checking wyz v0.5.1
  218. 19.05 s [gammaloop-workspace-check] Checking clap v4.6.1
  219. 19.09 s [gammaloop-workspace-check] Checking ansi-str v0.9.0
  220. 19.11 s [gammaloop-workspace-check] Checking radium v0.7.0
  221. 19.11 s [gammaloop-workspace-check] Checking typeid v1.0.3
  222. 19.15 s [gammaloop-workspace-check] Checking plotters v0.3.7
  223. 19.17 s [gammaloop-workspace-check] Checking similar v2.7.0
  224. 19.18 s [gammaloop-workspace-check] Checking tinytemplate v1.2.1
  225. 19.22 s [gammaloop-workspace-check] Checking is-terminal v0.4.17
  226. 19.28 s [gammaloop-workspace-check] Checking oorandom v11.1.5
  227. 19.30 s [gammaloop-workspace-check] Checking bytecount v0.6.9
  228. 19.32 s [gammaloop-workspace-check] Checking toml_edit v0.22.27
  229. 19.37 s [gammaloop-workspace-check] Checking anes v0.1.6
  230. 19.38 s [gammaloop-workspace-check] Checking funty v2.0.0
  231. 19.39 s [gammaloop-workspace-check] Checking papergrid v0.17.0
  232. 19.60 s [gammaloop-workspace-check] Checking ron v0.12.1
  233. 19.60 s [gammaloop-workspace-check] Checking rand v0.8.6
  234. 19.69 s [gammaloop-workspace-check] Checking testing_table v0.3.0
  235. 19.72 s [gammaloop-workspace-check] Checking bitvec v1.0.1
  236. 19.79 s [gammaloop-workspace-check] Checking env_filter v1.0.1
  237. 19.80 s [gammaloop-workspace-check] Checking toml_edit v0.25.11+spec-1.1.0
  238. 19.89 s [gammaloop-workspace-check] Checking uncased v0.9.10
  239. 19.97 s [gammaloop-workspace-check] Checking jiff v0.2.24
  240. 20.00 s [gammaloop-workspace-check] Checking ptr_meta v0.1.4
  241. 20.02 s [gammaloop-workspace-check] Checking simdutf8 v0.1.5
  242. 20.07 s [gammaloop-workspace-check] Checking ucd-trie v0.1.7
  243. 20.14 s [gammaloop-workspace-check] Checking bytecheck v0.6.12
  244. 20.16 s [gammaloop-workspace-check] Checking pest v2.8.6
  245. 20.22 s [gammaloop-workspace-check] Checking ahash v0.7.8
  246. 20.46 s [gammaloop-workspace-check] Compiling pyo3-ffi v0.28.3
  247. 20.46 s [gammaloop-workspace-check] Compiling pyo3-macros-backend v0.28.3
  248. 20.67 s [gammaloop-workspace-check] Compiling pyo3 v0.28.3
  249. 20.69 s [gammaloop-workspace-check] Compiling numpy v0.28.0
  250. 20.79 s [gammaloop-workspace-check] Checking tabled v0.20.0
  251. 20.96 s [gammaloop-workspace-check] Checking rend v0.4.2
  252. 21.07 s [gammaloop-workspace-check] Checking hashbrown v0.12.3
  253. 21.13 s [gammaloop-workspace-check] Checking approx v0.4.0
  254. 21.23 s [gammaloop-workspace-check] Checking seahash v4.1.0
  255. 21.26 s [gammaloop-workspace-check] Checking criterion-plot v0.5.0
  256. 21.29 s [gammaloop-workspace-check] Checking insta v1.47.2
  257. 21.30 s [gammaloop-workspace-check] Checking cgmath v0.18.0
  258. 21.57 s [gammaloop-workspace-check] Checking criterion v0.5.1
  259. 21.70 s [gammaloop-workspace-check] Checking num-rational v0.4.2
  260. 21.82 s [gammaloop-workspace-check] Checking dot-parser v0.5.1
  261. 21.86 s [gammaloop-workspace-check] Checking num-iter v0.1.45
  262. 21.93 s [gammaloop-workspace-check] Checking ref-ops v0.2.5
  263. 21.96 s [gammaloop-workspace-check] Checking num v0.4.3
  264. 21.98 s [gammaloop-workspace-check] Checking rand_xoshiro v0.6.0
  265. 22.01 s [gammaloop-workspace-check] Checking features v0.10.0
  266. 22.04 s [gammaloop-workspace-check] Checking constcat v0.5.1
  267. 22.06 s [gammaloop-workspace-check] Checking gat-lending-iterator v0.1.8
  268. 22.09 s [gammaloop-workspace-check] Checking colored v2.2.0
  269. 22.15 s [gammaloop-workspace-check] Checking toml v0.8.23
  270. 22.27 s [gammaloop-workspace-check] Checking constant_time_eq v0.4.2
  271. 22.30 s [gammaloop-workspace-check] Checking arrayref v0.3.9
  272. 22.35 s [gammaloop-workspace-check] Checking cpufeatures v0.3.0
  273. 22.36 s [gammaloop-workspace-check] Checking base64 v0.22.1
  274. 22.38 s [gammaloop-workspace-check] Checking joinery v2.1.0
  275. 22.39 s [gammaloop-workspace-check] Checking blake3 v1.8.5
  276. 22.42 s [gammaloop-workspace-check] Checking siphasher v1.0.2
  277. 22.45 s [gammaloop-workspace-check] Checking titlecase v2.2.1
  278. 22.51 s [gammaloop-workspace-check] Checking phf_shared v0.13.1
  279. 22.52 s [gammaloop-workspace-check] Checking subprocess v0.2.15
  280. 22.69 s [gammaloop-workspace-check] Checking rust_lisp v0.18.0
  281. 22.72 s [gammaloop-workspace-check] Compiling vakint v0.1.2 (/build/source/crates/vakint)
  282. 22.80 s [gammaloop-workspace-check] Checking phf v0.13.1
  283. 22.81 s [gammaloop-workspace-check] Checking version-compare v0.2.1
  284. 22.90 s [gammaloop-workspace-check] Checking figment v0.10.19
  285. 22.91 s [gammaloop-workspace-check] Checking xpct v0.5.1
  286. 22.92 s [gammaloop-workspace-check] Checking ryu v1.0.23
  287. 23.02 s [gammaloop-workspace-check] Checking castaway v0.2.4
  288. 23.02 s [gammaloop-workspace-check] Checking string-template-plus v0.4.3
  289. 23.14 s [gammaloop-workspace-check] Checking toml_datetime v0.7.5+spec-1.1.0
  290. 23.16 s [gammaloop-workspace-check] Checking strum v0.27.2
  291. 23.17 s [gammaloop-workspace-check] Checking compact_str v0.9.0
  292. 23.26 s [gammaloop-workspace-check] Checking unicode-truncate v2.0.1
  293. 23.40 s [gammaloop-workspace-check] Checking kasuari v0.4.12
  294. 23.40 s [gammaloop-workspace-check] Checking lru v0.16.4
  295. 23.52 s [gammaloop-workspace-check] Checking vte v0.15.0
  296. 23.52 s [gammaloop-workspace-check] Checking toml v0.9.12+spec-1.1.0
  297. 23.54 s [gammaloop-workspace-check] Checking portable-atomic v1.13.1
  298. 23.62 s [gammaloop-workspace-check] Checking vt100 v0.16.2
  299. 23.79 s [gammaloop-workspace-check] Checking unit-prefix v0.5.2
  300. 23.82 s [gammaloop-workspace-check] Checking rand_distr v0.4.3
  301. 23.87 s [gammaloop-workspace-check] Checking simba v0.6.0
  302. 23.88 s [gammaloop-workspace-check] Checking line-clipping v0.3.7
  303. 23.98 s [gammaloop-workspace-check] Checking ratatui-core v0.1.0
  304. 24.07 s [gammaloop-workspace-check] Checking adler2 v2.0.1
  305. 24.15 s [gammaloop-workspace-check] Checking gimli v0.32.3
  306. 24.17 s [gammaloop-workspace-check] Compiling three-dimensional-reps v0.1.0 (/build/source/crates/three-dimensional-reps)
  307. 24.18 s [gammaloop-workspace-check] Checking miniz_oxide v0.8.9
  308. 24.25 s [gammaloop-workspace-check] Checking indicatif v0.18.4
  309. 24.54 s [gammaloop-workspace-check] Checking thiserror v1.0.69
  310. 24.57 s [gammaloop-workspace-check] Checking derive_builder v0.11.2
  311. 24.61 s [gammaloop-workspace-check] Checking owo-colors v4.3.0
  312. 24.61 s [gammaloop-workspace-check] Checking crossterm v0.29.0
  313. 24.65 s [gammaloop-workspace-check] Checking object v0.37.3
  314. 24.66 s [gammaloop-workspace-check] Checking tracing-error v0.2.1
  315. 24.70 s [gammaloop-workspace-check] Compiling rustpython-parser-core v0.4.0
  316. 24.85 s [gammaloop-workspace-check] Compiling rustpython-ast v0.4.0
  317. 24.88 s [gammaloop-workspace-check] Checking typed-index-collections v3.5.0
  318. 24.90 s [gammaloop-workspace-check] Checking serde-big-array v0.5.1
  319. 24.97 s [gammaloop-workspace-check] Checking amd v0.2.2
  320. 25.09 s [gammaloop-workspace-check] Checking itertools v0.11.0
  321. 25.15 s [gammaloop-workspace-check] Checking env_logger v0.11.10
  322. 25.17 s [gammaloop-workspace-check] Compiling gammaloop-tracing-filter-macros v0.1.0 (/build/source/crates/gammaloop-tracing-filter-macros)
  323. 25.19 s [gammaloop-workspace-check] Checking option-ext v0.2.0
  324. 25.27 s [gammaloop-workspace-check] Checking rustc-demangle v0.1.27
  325. 25.32 s [gammaloop-workspace-check] Checking ratatui-widgets v0.3.0
  326. 25.33 s [gammaloop-workspace-check] Checking dirs-sys v0.5.0
  327. 25.50 s [gammaloop-workspace-check] Checking ref-cast v1.0.25
  328. 25.54 s [gammaloop-workspace-check] Checking nix v0.31.2
  329. 25.62 s [gammaloop-workspace-check] Checking rkyv v0.7.46
  330. 25.63 s [gammaloop-workspace-check] Checking integer-sqrt v0.1.5
  331. 25.67 s [gammaloop-workspace-check] Checking brotli-decompressor v4.0.3
  332. 25.71 s [gammaloop-workspace-check] Checking crossbeam-channel v0.5.15
  333. 25.79 s [gammaloop-workspace-check] Checking itertools v0.12.1
  334. 25.82 s [gammaloop-workspace-check] Checking ratatui-crossterm v0.1.0
  335. 25.87 s [gammaloop-workspace-check] Compiling gammalooprs v0.3.4 (/build/source/crates/gammalooprs)
  336. 25.96 s [gammaloop-workspace-check] Checking unsafe-libyaml v0.2.11
  337. 26.01 s [gammaloop-workspace-check] Checking symlink v0.1.0
  338. 26.06 s [gammaloop-workspace-check] Checking tracing-appender v0.2.5
  339. 26.26 s [gammaloop-workspace-check] Checking include_dir v0.7.4
  340. 26.35 s [gammaloop-workspace-check] Checking color-spantrace v0.3.0
  341. 26.40 s [gammaloop-workspace-check] Checking pathfinding v4.15.0
  342. 26.42 s [gammaloop-workspace-check] Checking schemars v1.2.1
  343. 26.52 s [gammaloop-workspace-check] Checking brotli v7.0.0
  344. 26.55 s [gammaloop-workspace-check] Checking slotmap v1.1.1
  345. 26.89 s [gammaloop-workspace-check] Checking dirs v6.0.0
  346. 26.99 s [gammaloop-workspace-check] Checking ctrlc v3.5.2
  347. 27.01 s [gammaloop-workspace-check] Checking tracing-indicatif v0.3.14
  348. 27.16 s [gammaloop-workspace-check] Checking addr2line v0.25.1
  349. 27.18 s [gammaloop-workspace-check] Checking json5 v0.4.1
  350. 27.19 s [gammaloop-workspace-check] Checking serde_yaml v0.9.34+deprecated
  351. 27.31 s [gammaloop-workspace-check] Checking vectorize v0.2.0
  352. 27.39 s [gammaloop-workspace-check] Checking ringbuffer v0.16.0
  353. 27.43 s [gammaloop-workspace-check] Checking base62 v2.2.4
  354. 27.51 s [gammaloop-workspace-check] Checking rust-embed v8.11.0
  355. 27.57 s [gammaloop-workspace-check] Checking clap_complete v4.6.3
  356. 27.60 s [gammaloop-workspace-check] Checking fd-lock v4.0.4
  357. 27.68 s [gammaloop-workspace-check] Checking strip-ansi-escapes v0.2.1
  358. 27.77 s [gammaloop-workspace-check] Compiling gammaloop-api v0.1.0 (/build/source/crates/gammaloop-api)
  359. 27.77 s [gammaloop-workspace-check] Checking clarabel v0.11.1
  360. 27.79 s [gammaloop-workspace-check] Checking itertools v0.13.0
  361. 27.79 s [gammaloop-workspace-check] Checking strum v0.26.3
  362. 27.80 s [gammaloop-workspace-check] Checking sysinfo v0.33.1
  363. 27.85 s [gammaloop-workspace-check] Checking ratatui-macros v0.7.0
  364. 27.90 s [gammaloop-workspace-check] Checking shlex v1.3.0
  365. 27.90 s [gammaloop-workspace-check] Checking clap_complete_nushell v4.6.0
  366. 27.93 s [gammaloop-workspace-check] Checking ratatui v0.30.0
  367. 27.99 s [gammaloop-workspace-check] Checking futures-core v0.3.32
  368. 28.00 s [gammaloop-workspace-check] Checking futures-task v0.3.32
  369. 28.08 s [gammaloop-workspace-check] Checking slab v0.4.12
  370. 28.16 s [gammaloop-workspace-check] Checking sdd v3.0.10
  371. 28.18 s [gammaloop-workspace-check] Compiling gammaloop-integration-tests v0.1.0 (/build/source/tests)
  372. 28.19 s [gammaloop-workspace-check] Compiling test-log-core v0.2.20
  373. 28.27 s [gammaloop-workspace-check] Checking futures-util v0.3.32
  374. 28.31 s [gammaloop-workspace-check] Checking scc v2.4.0
  375. 28.39 s [gammaloop-workspace-check] Compiling rustc_version v0.4.1
  376. 28.94 s [gammaloop-workspace-check] Checking which v8.0.2
  377. 29.10 s [gammaloop-workspace-check] Checking backtrace v0.3.76
  378. 29.39 s [gammaloop-workspace-check] Checking color-eyre v0.6.5
  379. 29.43 s [gammaloop-workspace-check] Checking bincode v1.3.3
  380. 29.58 s [gammaloop-workspace-check] Compiling gungraun-runner v0.18.2
  381. 29.69 s [gammaloop-workspace-check] Checking reedline v0.42.0
  382. 30.04 s [gammaloop-workspace-check] Compiling gungraun-macros v0.8.0
  383. 30.11 s [gammaloop-workspace-check] Checking proc-macro2 v1.0.106
  384. 30.20 s [gammaloop-workspace-check] Checking maplit v1.0.2
  385. 30.27 s [gammaloop-workspace-check] Checking base64 v0.21.7
  386. 30.42 s [gammaloop-workspace-check] Checking futures-executor v0.3.32
  387. 30.54 s [gammaloop-workspace-check] Compiling iai-callgrind-runner v0.14.2
  388. 30.58 s [gammaloop-workspace-check] Checking kurbo v0.13.0
  389. 30.72 s [gammaloop-workspace-check] Checking serial_test v3.4.0
  390. 30.80 s [gammaloop-workspace-check] Checking ron v0.8.1
  391. 30.93 s [gammaloop-workspace-check] Checking quote v1.0.45
  392. 31.19 s [gammaloop-workspace-check] Checking wait-timeout v0.2.1
  393. 31.21 s [gammaloop-workspace-check] Compiling iai-callgrind v0.14.2
  394. 31.36 s [gammaloop-workspace-check] Checking bit-vec v0.8.0
  395. 31.43 s [gammaloop-workspace-check] Checking quick-error v1.2.3
  396. 31.48 s [gammaloop-workspace-check] Compiling test-log-macros v0.2.20
  397. 31.53 s [gammaloop-workspace-check] Checking syn v2.0.117
  398. 31.54 s [gammaloop-workspace-check] Checking rusty-fork v0.3.1
  399. 31.70 s [gammaloop-workspace-check] Compiling numerica v2.2.0 (https://github.com/alphal00p/symbolica?rev=a277a8dadbaae5a8d6605f2f381991a601e1f345#a277a8da)
  400. 31.70 s [gammaloop-workspace-check] Checking bit-set v0.8.0
  401. 31.95 s [gammaloop-workspace-check] Compiling iai-callgrind-macros v0.5.1
  402. 32.00 s [gammaloop-workspace-check] Checking rand_xorshift v0.4.0
  403. 32.17 s [gammaloop-workspace-check] Checking console v0.15.11
  404. 32.51 s [gammaloop-workspace-check] Checking unarray v0.1.4
  405. 32.71 s [gammaloop-workspace-check] Checking pathdiff v0.2.3
  406. 32.77 s [gammaloop-workspace-check] Checking proptest v1.11.0
  407. 32.79 s [gammaloop-workspace-check] Checking nalgebra v0.29.0
  408. 32.85 s [gammaloop-workspace-check] Checking similar-asserts v1.7.0
  409. 33.18 s [gammaloop-workspace-check] Checking clinnet v0.1.8 (/build/source/crates/clinnet)
  410. 34.07 s [gammaloop-workspace-check] Checking kurvst v0.1.0 (/build/source/crates/kurvst)
  411. 36.20 s [gammaloop-workspace-check] Checking test-log v0.2.20
  412. 39.74 s [gammaloop-workspace-check] Compiling graphica v2.1.0 (https://github.com/alphal00p/symbolica?rev=a277a8dadbaae5a8d6605f2f381991a601e1f345#a277a8da)
  413. 42.98 s [gammaloop-workspace-check] Checking gungraun v0.18.2
  414. 43.91 s [gammaloop-workspace-check] Checking statrs v0.16.1
  415. 44.96 s [gammaloop-workspace-check] Checking momtrop v0.3.0
  416. 46.99 s [gammaloop-workspace-check] Compiling pyo3-stub-gen-derive v0.17.2
  417. 47.10 s [gammaloop-workspace-check] Compiling pyo3-macros v0.28.3
  418. 54.32 s [gammaloop-workspace-check] Checking pyo3-stub-gen v0.17.2
  419. 63.42 s [gammaloop-workspace-check] Checking symbolica-utils v0.1.0 (/build/source/crates/symbolica-utils)
  420. 63.42 s [gammaloop-workspace-check] Checking spenso-macros v0.3.2 (/build/source/crates/spenso-macros)
  421. 328.63 s [gammaloop-workspace-check] Compiling gammaloop-workspace-hack v0.1.0 (/build/source/crates/gammaloop-workspace-hack)
  422. 329.07 s [gammaloop-workspace-check] Checking linnet v0.17.0 (/build/source/crates/linnet)
  423. 334.85 s [gammaloop-workspace-check] Checking spenso v0.6.0 (/build/source/crates/spenso)
  424. 335.18 s [gammaloop-workspace-check] Checking linnet-py v0.1.0 (/build/source/crates/linnet-py)
  425. 335.18 s [gammaloop-workspace-check] Checking linnest v0.1.0 (/build/source/crates/linnest)
  426. 346.19 s [gammaloop-workspace-check] Checking idenso v0.3.0 (/build/source/crates/idenso)
  427. 346.20 s [gammaloop-workspace-check] Checking gammaloop-tracing-filter v0.1.0 (/build/source/crates/gammaloop-tracing-filter)
  428. 349.01 s [gammaloop-workspace-check] Checking spenso-hep-lib v0.1.7 (/build/source/crates/spenso-hep-lib)
  429. 349.59 s [gammaloop-workspace-check] Checking spynso3 v0.1.2 (/build/source/crates/spynso3)
  430. 391.69 s [gammaloop-workspace-check] warning: unused import: `GaussianReferenceFunction`
  431. 391.69 s [gammaloop-workspace-check] --> crates/gammaloop-api/src/state.rs:38:27
  432. 391.69 s [gammaloop-workspace-check] |
  433. 391.69 s [gammaloop-workspace-check] 38 | integrands::process::{GaussianReferenceFunction, ProcessIntegrand},
  434. 391.69 s [gammaloop-workspace-check] | ^^^^^^^^^^^^^^^^^^^^^^^^^
  435. 391.69 s [gammaloop-workspace-check] |
  436. 391.69 s [gammaloop-workspace-check] = note: `#[warn(unused_imports)]` (part of `#[warn(unused)]`) on by default
  437. 391.69 s [gammaloop-workspace-check]
  438. 398.56 s [gammaloop-workspace-check] warning: `gammaloop-api` (lib) generated 1 warning (run `cargo fix --lib -p gammaloop-api` to apply 1 suggestion)
  439. 399.29 s [gammaloop-workspace-check] error[E0609]: no field `lmb_channel_edge_ids` on type `CutInfo`
  440. 399.29 s [gammaloop-workspace-check] --> tests/tests/test_evaluation_api.rs:311:10
  441. 399.29 s [gammaloop-workspace-check] |
  442. 399.29 s [gammaloop-workspace-check] 311 | .lmb_channel_edge_ids
  443. 399.29 s [gammaloop-workspace-check] | ^^^^^^^^^^^^^^^^^^^^ unknown field
  444. 399.29 s [gammaloop-workspace-check] |
  445. 399.29 s [gammaloop-workspace-check] = note: available fields are: `particle_pdgs`, `cut_id`, `graph_id`, `graph_group_id`, `orientation_id` ... and 2 others
  446. 399.29 s [gammaloop-workspace-check]
  447. 399.32 s [gammaloop-workspace-check] error[E0609]: no field `lmb_channel_edge_ids` on type `CutInfo`
  448. 399.32 s [gammaloop-workspace-check] --> tests/tests/test_evaluation_api.rs:591:26
  449. 399.32 s [gammaloop-workspace-check] |
  450. 399.32 s [gammaloop-workspace-check] 591 | .lmb_channel_edge_ids
  451. 399.32 s [gammaloop-workspace-check] | ^^^^^^^^^^^^^^^^^^^^ unknown field
  452. 399.32 s [gammaloop-workspace-check] |
  453. 399.32 s [gammaloop-workspace-check] = note: available fields are: `particle_pdgs`, `cut_id`, `graph_id`, `graph_group_id`, `orientation_id` ... and 2 others
  454. 399.32 s [gammaloop-workspace-check]
  455. 399.34 s [gammaloop-workspace-check] error[E0560]: struct `CutInfo` has no field named `lmb_channel_id`
  456. 399.34 s [gammaloop-workspace-check] --> tests/tests/test_differential.rs:86:13
  457. 399.34 s [gammaloop-workspace-check] |
  458. 399.34 s [gammaloop-workspace-check] 86 | lmb_channel_id: None,
  459. 399.34 s [gammaloop-workspace-check] | ^^^^^^^^^^^^^^ `CutInfo` does not have this field
  460. 399.34 s [gammaloop-workspace-check] |
  461. 399.34 s [gammaloop-workspace-check] = note: available fields are: `sampling_channel_id`, `sampling_channel_edge_ids`
  462. 399.34 s [gammaloop-workspace-check]
  463. 399.34 s [gammaloop-workspace-check] error[E0560]: struct `CutInfo` has no field named `lmb_channel_edge_ids`
  464. 399.34 s [gammaloop-workspace-check] --> tests/tests/test_differential.rs:87:13
  465. 399.34 s [gammaloop-workspace-check] |
  466. 399.34 s [gammaloop-workspace-check] 87 | lmb_channel_edge_ids: None,
  467. 399.34 s [gammaloop-workspace-check] | ^^^^^^^^^^^^^^^^^^^^ `CutInfo` does not have this field
  468. 399.34 s [gammaloop-workspace-check] |
  469. 399.34 s [gammaloop-workspace-check] = note: available fields are: `sampling_channel_id`, `sampling_channel_edge_ids`
  470. 399.34 s [gammaloop-workspace-check]
  471. 399.38 s [gammaloop-workspace-check] error[E0609]: no field `lmb_channel_edge_ids` on type `CutInfo`
  472. 399.38 s [gammaloop-workspace-check] --> tests/tests/test_evaluation_api.rs:1177:18
  473. 399.38 s [gammaloop-workspace-check] |
  474. 399.38 s [gammaloop-workspace-check] 1177 | .lmb_channel_edge_ids
  475. 399.38 s [gammaloop-workspace-check] | ^^^^^^^^^^^^^^^^^^^^ unknown field
  476. 399.38 s [gammaloop-workspace-check] |
  477. 399.38 s [gammaloop-workspace-check] = note: available fields are: `particle_pdgs`, `cut_id`, `graph_id`, `graph_group_id`, `orientation_id` ... and 2 others
  478. 399.38 s [gammaloop-workspace-check]
  479. 399.50 s [gammaloop-workspace-check] error[E0609]: no field `lmb_channel_edge_ids` on type `CutInfo`
  480. 399.50 s [gammaloop-workspace-check] --> tests/tests/test_evaluation_api.rs:1222:22
  481. 399.50 s [gammaloop-workspace-check] |
  482. 399.50 s [gammaloop-workspace-check] 1222 | .lmb_channel_edge_ids
  483. 399.50 s [gammaloop-workspace-check] | ^^^^^^^^^^^^^^^^^^^^ unknown field
  484. 399.50 s [gammaloop-workspace-check] |
  485. 399.50 s [gammaloop-workspace-check] = note: available fields are: `particle_pdgs`, `cut_id`, `graph_id`, `graph_group_id`, `orientation_id` ... and 2 others
  486. 399.50 s [gammaloop-workspace-check]
  487. 399.51 s [gammaloop-workspace-check] error[E0609]: no field `lmb_channel_edge_ids` on type `CutInfo`
  488. 399.51 s [gammaloop-workspace-check] --> tests/tests/test_evaluation_api.rs:1281:14
  489. 399.51 s [gammaloop-workspace-check] |
  490. 399.51 s [gammaloop-workspace-check] 1281 | .lmb_channel_edge_ids
  491. 399.51 s [gammaloop-workspace-check] | ^^^^^^^^^^^^^^^^^^^^ unknown field
  492. 399.51 s [gammaloop-workspace-check] |
  493. 399.51 s [gammaloop-workspace-check] = note: available fields are: `particle_pdgs`, `cut_id`, `graph_id`, `graph_group_id`, `orientation_id` ... and 2 others
  494. 399.51 s [gammaloop-workspace-check]
  495. 399.57 s [gammaloop-workspace-check] error[E0609]: no field `lmb_channel_edge_ids` on type `CutInfo`
  496. 399.57 s [gammaloop-workspace-check] --> tests/tests/test_evaluation_api.rs:1428:18
  497. 399.57 s [gammaloop-workspace-check] |
  498. 399.57 s [gammaloop-workspace-check] 1428 | .lmb_channel_edge_ids
  499. 399.57 s [gammaloop-workspace-check] | ^^^^^^^^^^^^^^^^^^^^ unknown field
  500. 399.57 s [gammaloop-workspace-check] |
  501. 399.57 s [gammaloop-workspace-check] = note: available fields are: `particle_pdgs`, `cut_id`, `graph_id`, `graph_group_id`, `orientation_id` ... and 2 others
  502. 399.57 s [gammaloop-workspace-check]
  503. 399.66 s [gammaloop-workspace-check] For more information about this error, try `rustc --explain E0560`.
  504. 399.69 s [gammaloop-workspace-check] error: could not compile `gammaloop-integration-tests` (test "test_differential") due to 2 previous errors
  505. 399.69 s [gammaloop-workspace-check] warning: build failed, waiting for other jobs to finish...
  506. 399.73 s [gammaloop-workspace-check] For more information about this error, try `rustc --explain E0609`.
  507. 399.76 s [gammaloop-workspace-check] error: could not compile `gammaloop-integration-tests` (test "test_evaluation_api") due to 6 previous errors
  508. 400.47 s [gammaloop-workspace-check] error[E0609]: no field `lmb_channel_id` on type `CutInfo`
  509. 400.47 s [gammaloop-workspace-check] --> tests/tests/test_runs/utils.rs:568:36
  510. 400.47 s [gammaloop-workspace-check] |
  511. 400.47 s [gammaloop-workspace-check] 568 | event.cut_info.lmb_channel_id,
  512. 400.47 s [gammaloop-workspace-check] | ^^^^^^^^^^^^^^ unknown field
  513. 400.47 s [gammaloop-workspace-check] |
  514. 400.47 s [gammaloop-workspace-check] = note: available fields are: `particle_pdgs`, `cut_id`, `graph_id`, `graph_group_id`, `orientation_id` ... and 2 others
  515. 400.47 s [gammaloop-workspace-check]
  516. 400.47 s [gammaloop-workspace-check] error[E0609]: no field `lmb_channel_id` on type `CutInfo`
  517. 400.47 s [gammaloop-workspace-check] --> tests/tests/test_runs/utils.rs:580:36
  518. 400.47 s [gammaloop-workspace-check] |
  519. 400.47 s [gammaloop-workspace-check] 580 | event.cut_info.lmb_channel_id,
  520. 400.47 s [gammaloop-workspace-check] | ^^^^^^^^^^^^^^ unknown field
  521. 400.47 s [gammaloop-workspace-check] |
  522. 400.47 s [gammaloop-workspace-check] = note: available fields are: `particle_pdgs`, `cut_id`, `graph_id`, `graph_group_id`, `orientation_id` ... and 2 others
  523. 400.47 s [gammaloop-workspace-check]
  524. 401.09 s [gammaloop-workspace-check] error: could not compile `gammaloop-integration-tests` (test "test_runs") due to 2 previous errors
  525. 401.91 s Progress: 0 of 1 built (1 failed)
  526. 401.91 s Failed to build gammaloop-workspace-check after 6m37s
  527. 401.94 s Cannot build '/nix/store/53802zbj9009bwya0yb48jnjgdmqv87h-gammaloop-workspace-check-0.1.0.drv'.
  528. 401.94 s Reason: builder failed with exit code 101.
  529. 401.94 s Output paths:
  530. 401.94 s /nix/store/zix3gc9sr11cdhaa6ydaq99q1822fi52-gammaloop-workspace-check-0.1.0
  531. 401.94 s Last 520 log lines:
  532. 401.94 s > Running phase: unpackPhase
  533. 401.94 s > unpacking source archive /nix/store/401j5sh0ylbdhdhk1c9kp8s5d8i5hpv1-source
  534. 401.94 s > source root is source
  535. 401.94 s > Running phase: patchPhase
  536. 401.94 s > Executing configureCargoCommonVars
  537. 401.94 s > decompressing cargo artifacts from /nix/store/50vpxlcgfxf2d57i27v3d10zjwxxbm2r-gammaloop-workspace-deps-deps-0.1.0/target.tar.zst to target
  538. 401.94 s > Running phase: updateAutotoolsGnuConfigScriptsPhase
  539. 401.94 s > Running phase: configurePhase
  540. 401.94 s > will append /build/source/.cargo-home/config.toml with contents of /nix/store/5drf77x6km4ky7gwlrzdx9bbd6fz09g3-vendor-cargo-deps/config.toml
  541. 401.94 s > default configurePhase, nothing to do
  542. 401.94 s > Running phase: buildPhase
  543. 401.94 s > +++ command cargo --version
  544. 401.94 s > cargo 1.97.0 (c980f4866 2026-06-30)
  545. 401.94 s > +++ command cargo check --profile ci-optim --locked --workspace --features gammaloop-tracing-filter/clap,gammaloop-tracing-filter/symbolica,idenso/bincode,idenso/reference-cases,linnet/bincode,linnet/drawing,linnet/rkyv,linnet/serde,linnet/symbolica,spenso-macros/shadowing,spenso/shadowing,symbolica/tracing_max_level_info,three-dimensional-reps/display,three-dimensional-reps/eval,three-dimensional-reps/serde --all-targets
  546. 401.94 s > Checking cfg-if v1.0.4
  547. 401.94 s > Checking memchr v2.8.0
  548. 401.94 s > Checking once_cell v1.21.4
  549. 401.94 s > Checking either v1.15.0
  550. 401.94 s > Checking serde_core v1.0.228
  551. 401.94 s > Checking libc v0.2.186
  552. 401.94 s > Checking libm v0.2.16
  553. 401.94 s > Checking itoa v1.0.18
  554. 401.94 s > Checking log v0.4.29
  555. 401.94 s > Checking regex-syntax v0.8.10
  556. 401.94 s > Checking zerocopy v0.8.48
  557. 401.94 s > Checking crossbeam-utils v0.8.21
  558. 401.94 s > Checking equivalent v1.0.2
  559. 401.94 s > Checking zmij v1.0.21
  560. 401.94 s > Checking bytemuck v1.25.0
  561. 401.94 s > Checking lazy_static v1.5.0
  562. 401.94 s > Compiling target-lexicon v0.13.5
  563. 401.94 s > Checking arrayvec v0.7.6
  564. 401.94 s > Checking powerfmt v0.2.0
  565. 401.94 s > Checking num_threads v0.1.7
  566. 401.94 s > Checking itertools v0.14.0
  567. 401.94 s > Checking num-conv v0.2.1
  568. 401.94 s > Checking deranged v0.5.8
  569. 401.94 s > Checking pin-project-lite v0.2.17
  570. 401.94 s > Checking time-core v0.1.8
  571. 401.94 s > Checking tracing-core v0.1.36
  572. 401.94 s > Checking foldhash v0.2.0
  573. 401.94 s > Checking crossbeam-epoch v0.9.18
  574. 401.94 s > Checking allocator-api2 v0.2.21
  575. 401.94 s > Checking const-random v0.1.18
  576. 401.94 s > Checking static_assertions v1.1.0
  577. 401.94 s > Checking nu-ansi-term v0.50.3
  578. 401.94 s > Checking winnow v1.0.2
  579. 401.94 s > Checking unty v0.0.4
  580. 401.94 s > Checking safe_arch v0.7.4
  581. 401.94 s > Checking safe_arch v1.0.0
  582. 401.94 s > Checking crossbeam-deque v0.8.6
  583. 401.94 s > Checking sharded-slab v0.1.7
  584. 401.94 s > Checking rayon-core v1.13.0
  585. 401.94 s > Checking hashbrown v0.16.1
  586. 401.94 s > Checking wide v0.7.33
  587. 401.94 s > Checking thread_local v1.1.9
  588. 401.94 s > Checking aho-corasick v1.1.4
  589. 401.94 s > Checking tracing-log v0.2.0
  590. 401.94 s > Checking tracing v0.1.44
  591. 401.94 s > Checking az v1.3.0
  592. 401.94 s > Checking toml_writer v1.1.1+spec-1.1.0
  593. 401.94 s > Checking rayon v1.12.0
  594. 401.94 s > Checking indenter v0.3.4
  595. 401.94 s > Checking wide v1.3.0
  596. 401.94 s > Compiling phf_shared v0.11.3
  597. 401.94 s > Checking anyhow v1.0.102
  598. 401.94 s > Checking alloc-no-stdlib v2.0.4
  599. 401.94 s > Checking rawpointer v0.2.1
  600. 401.94 s > Checking toml_parser v1.1.2+spec-1.1.0
  601. 401.94 s > Checking num-traits v0.2.19
  602. 401.94 s > Checking dyn-clone v1.0.20
  603. 401.94 s > Checking utf8parse v0.2.2
  604. 401.94 s > Checking matrixmultiply v0.3.10
  605. 401.94 s > Checking alloc-stdlib v0.2.2
  606. 401.94 s > Checking anstyle-parse v1.0.0
  607. 401.94 s > Checking getrandom v0.3.4
  608. 401.94 s > Checking gmp-mpfr-sys v1.7.1
  609. 401.94 s > Checking anstyle-query v1.1.5
  610. 401.94 s > Checking anstyle v1.0.14
  611. 401.94 s > Checking rand_core v0.9.5
  612. 401.94 s > Checking is_terminal_polyfill v1.70.2
  613. 401.94 s > Checking colorchoice v1.0.5
  614. 401.94 s > Checking colored v3.1.1
  615. 401.94 s > Compiling phf_generator v0.11.3
  616. 401.94 s > Checking eyre v0.6.12
  617. 401.94 s > Checking unicode-width v0.2.2
  618. 401.94 s > Checking bitflags v1.3.2
  619. 401.94 s > Checking anstream v1.0.0
  620. 401.94 s > Checking region v3.0.2
  621. 401.94 s > Compiling phf_codegen v0.11.3
  622. 401.94 s > Compiling pyo3-build-config v0.28.3
  623. 401.94 s > Checking brotli-decompressor v5.0.0
  624. 401.94 s > Checking wasmtime-jit-icache-coherence v34.0.2
  625. 401.94 s > Checking time v0.3.47
  626. 401.94 s > Checking hugepage-rs v0.1.1
  627. 401.94 s > Checking inventory v0.3.24
  628. 401.94 s > Checking spec_math v0.1.6
  629. 401.94 s > Checking serde v1.0.228
  630. 401.94 s > Checking serde_json v1.0.149
  631. 401.94 s > Checking bitflags v2.11.1
  632. 401.94 s > Checking serde_spanned v1.1.1
  633. 401.94 s > Checking toml_datetime v1.1.1+spec-1.1.0
  634. 401.94 s > Checking thiserror v2.0.18
  635. 401.94 s > Compiling getopts v0.2.24
  636. 401.94 s > Checking libloading v0.9.0
  637. 401.94 s > Checking byteorder v1.5.0
  638. 401.94 s > Checking self_cell v1.2.2
  639. 401.94 s > Checking approx v0.5.1
  640. 401.94 s > Checking regex-automata v0.4.14
  641. 401.94 s > Checking num-integer v0.1.46
  642. 401.94 s > Checking append-only-vec v0.1.8
  643. 401.94 s > Checking bytes v1.11.1
  644. 401.94 s > Checking toml v1.1.2+spec-1.1.0
  645. 401.94 s > Checking tinyjson v2.5.1
  646. 401.94 s > Compiling unic-char-range v0.9.0
  647. 401.94 s > Checking linux-raw-sys v0.12.1
  648. 401.94 s > Compiling unic-common v0.9.0
  649. 401.94 s > Compiling unicode_names2_generator v1.3.0
  650. 401.94 s > Checking smallvec v1.15.1
  651. 401.94 s > Checking num-complex v0.4.6
  652. 401.94 s > Checking tracing-serde v0.2.0
  653. 401.94 s > Checking bincode v2.0.1
  654. 401.94 s > Checking smartstring v1.0.1
  655. 401.94 s > Checking rustix v1.1.4
  656. 401.94 s > Compiling unic-ucd-version v0.9.0
  657. 401.94 s > Compiling unic-char-property v0.9.0
  658. 401.94 s > Compiling is-macro v0.3.7
  659. 401.94 s > Checking simba v0.9.1
  660. 401.94 s > Compiling rustpython-parser-vendored v0.4.0
  661. 401.94 s > Checking iana-time-zone v0.1.65
  662. 401.94 s > Checking chrono v0.4.44
  663. 401.94 s > Checking brotli v8.0.2
  664. 401.94 s > Compiling rustpython-parser v0.4.0
  665. 401.94 s > Compiling phf v0.11.3
  666. 401.94 s > Checking rustc-hash v2.1.2
  667. 401.94 s > Checking ndarray v0.17.2
  668. 401.94 s > Compiling unic-ucd-ident v0.9.0
  669. 401.94 s > Compiling unic-emoji-char v0.9.0
  670. 401.94 s > Compiling lalrpop-util v0.20.2
  671. 401.94 s > Compiling rustc-hash v1.1.0
  672. 401.94 s > Checking rug v1.30.0
  673. 401.94 s > Checking unicode-segmentation v1.13.2
  674. 401.94 s > Checking ppv-lite86 v0.2.21
  675. 401.94 s > Checking ahash v0.8.12
  676. 401.94 s > Compiling symbolica v2.2.0 (https://github.com/alphal00p/symbolica?rev=a277a8dadbaae5a8d6605f2f381991a601e1f345#a277a8da)
  677. 401.94 s > Checking typenum v1.20.0
  678. 401.94 s > Checking getrandom v0.2.17
  679. 401.94 s > Checking rand_chacha v0.9.0
  680. 401.94 s > Checking scopeguard v1.2.0
  681. 401.94 s > Checking parking_lot_core v0.9.12
  682. 401.94 s > Checking lock_api v0.4.14
  683. 401.94 s > Checking unicode-ident v1.0.24
  684. 401.94 s > Checking rand v0.9.4
  685. 401.94 s > Checking hashbrown v0.17.0
  686. 401.94 s > Checking parking_lot v0.12.5
  687. 401.94 s > Checking errno v0.3.14
  688. 401.94 s > Checking strsim v0.11.1
  689. 401.94 s > Checking clap_lex v1.1.0
  690. 401.94 s > Checking unicase v2.9.0
  691. 401.94 s > Checking signal-hook-registry v1.4.8
  692. 401.94 s > Checking vte v0.14.1
  693. 401.94 s > Checking same-file v1.0.6
  694. 401.94 s > Checking signal-hook v0.3.18
  695. 401.94 s > Checking half v2.7.1
  696. 401.94 s > Checking indexmap v2.14.0
  697. 401.94 s > Checking walkdir v2.5.0
  698. 401.94 s > Checking mio v1.2.0
  699. 401.94 s > Checking ciborium-io v0.2.2
  700. 401.94 s > Checking minimal-lexical v0.2.1
  701. 401.94 s > Checking generic-array v0.14.7
  702. 401.94 s > Checking ciborium-ll v0.2.2
  703. 401.94 s > Checking derive_more v2.1.1
  704. 401.94 s > Checking nom v7.1.3
  705. 401.94 s > Checking signal-hook-mio v0.2.5
  706. 401.94 s > Checking num-bigint v0.4.6
  707. 401.94 s > Checking symjit v2.21.0
  708. 401.94 s > Checking console v0.16.3
  709. 401.94 s > Checking block-buffer v0.10.4
  710. 401.94 s > Checking crypto-common v0.1.7
  711. 401.94 s > Checking digest v0.10.7
  712. 401.94 s > Checking bstr v1.12.1
  713. 401.94 s > Checking linux-raw-sys v0.4.15
  714. 401.94 s > Checking terminal_size v0.4.4
  715. 401.94 s > Compiling unicode_names2 v1.3.0
  716. 401.94 s > Checking clap_builder v4.6.0
  717. 401.94 s > Checking winnow v0.7.15
  718. 401.94 s > Checking cpufeatures v0.2.17
  719. 401.94 s > Checking sha2 v0.10.9
  720. 401.94 s > Checking matchers v0.2.0
  721. 401.94 s > Checking regex v1.12.3
  722. 401.94 s > Checking tracing-subscriber v0.3.23
  723. 401.94 s > Checking globset v0.4.18
  724. 401.94 s > Checking rustix v0.38.44
  725. 401.94 s > Checking ciborium v0.2.2
  726. 401.94 s > Checking ansitok v0.3.0
  727. 401.94 s > Checking xprec v0.2.2
  728. 401.94 s > Checking getrandom v0.4.2
  729. 401.94 s > Checking rand_core v0.6.4
  730. 401.94 s > Checking fnv v1.0.7
  731. 401.94 s > Checking fastrand v2.4.1
  732. 401.94 s > Checking plotters-backend v0.3.7
  733. 401.94 s > Checking crossterm v0.28.1
  734. 401.94 s > Checking rust-embed-utils v8.11.0
  735. 401.94 s > Checking serde_spanned v0.6.9
  736. 401.94 s > Checking toml_datetime v0.6.11
  737. 401.94 s > Checking itertools v0.10.5
  738. 401.94 s > Checking toml_write v0.1.2
  739. 401.94 s > Checking cast v0.3.0
  740. 401.94 s > Checking tempfile v3.27.0
  741. 401.94 s > Checking tap v1.0.1
  742. 401.94 s > Checking rand_chacha v0.3.1
  743. 401.94 s > Checking plotters-svg v0.3.7
  744. 401.94 s > Checking wyz v0.5.1
  745. 401.94 s > Checking clap v4.6.1
  746. 401.94 s > Checking ansi-str v0.9.0
  747. 401.94 s > Checking radium v0.7.0
  748. 401.94 s > Checking typeid v1.0.3
  749. 401.94 s > Checking plotters v0.3.7
  750. 401.94 s > Checking similar v2.7.0
  751. 401.94 s > Checking tinytemplate v1.2.1
  752. 401.94 s > Checking is-terminal v0.4.17
  753. 401.94 s > Checking oorandom v11.1.5
  754. 401.94 s > Checking bytecount v0.6.9
  755. 401.94 s > Checking toml_edit v0.22.27
  756. 401.94 s > Checking anes v0.1.6
  757. 401.94 s > Checking funty v2.0.0
  758. 401.94 s > Checking papergrid v0.17.0
  759. 401.94 s > Checking ron v0.12.1
  760. 401.94 s > Checking rand v0.8.6
  761. 401.94 s > Checking testing_table v0.3.0
  762. 401.94 s > Checking bitvec v1.0.1
  763. 401.94 s > Checking env_filter v1.0.1
  764. 401.94 s > Checking toml_edit v0.25.11+spec-1.1.0
  765. 401.94 s > Checking uncased v0.9.10
  766. 401.94 s > Checking jiff v0.2.24
  767. 401.94 s > Checking ptr_meta v0.1.4
  768. 401.94 s > Checking simdutf8 v0.1.5
  769. 401.94 s > Checking ucd-trie v0.1.7
  770. 401.94 s > Checking bytecheck v0.6.12
  771. 401.94 s > Checking pest v2.8.6
  772. 401.94 s > Checking ahash v0.7.8
  773. 401.94 s > Compiling pyo3-ffi v0.28.3
  774. 401.94 s > Compiling pyo3-macros-backend v0.28.3
  775. 401.94 s > Compiling pyo3 v0.28.3
  776. 401.94 s > Compiling numpy v0.28.0
  777. 401.94 s > Checking tabled v0.20.0
  778. 401.94 s > Checking rend v0.4.2
  779. 401.94 s > Checking hashbrown v0.12.3
  780. 401.94 s > Checking approx v0.4.0
  781. 401.94 s > Checking seahash v4.1.0
  782. 401.94 s > Checking criterion-plot v0.5.0
  783. 401.94 s > Checking insta v1.47.2
  784. 401.94 s > Checking cgmath v0.18.0
  785. 401.94 s > Checking criterion v0.5.1
  786. 401.94 s > Checking num-rational v0.4.2
  787. 401.94 s > Checking dot-parser v0.5.1
  788. 401.94 s > Checking num-iter v0.1.45
  789. 401.94 s > Checking ref-ops v0.2.5
  790. 401.94 s > Checking num v0.4.3
  791. 401.94 s > Checking rand_xoshiro v0.6.0
  792. 401.94 s > Checking features v0.10.0
  793. 401.94 s > Checking constcat v0.5.1
  794. 401.94 s > Checking gat-lending-iterator v0.1.8
  795. 401.94 s > Checking colored v2.2.0
  796. 401.94 s > Checking toml v0.8.23
  797. 401.94 s > Checking constant_time_eq v0.4.2
  798. 401.94 s > Checking arrayref v0.3.9
  799. 401.94 s > Checking cpufeatures v0.3.0
  800. 401.94 s > Checking base64 v0.22.1
  801. 401.94 s > Checking joinery v2.1.0
  802. 401.94 s > Checking blake3 v1.8.5
  803. 401.94 s > Checking siphasher v1.0.2
  804. 401.94 s > Checking titlecase v2.2.1
  805. 401.94 s > Checking phf_shared v0.13.1
  806. 401.94 s > Checking subprocess v0.2.15
  807. 401.94 s > Checking rust_lisp v0.18.0
  808. 401.94 s > Compiling vakint v0.1.2 (/build/source/crates/vakint)
  809. 401.94 s > Checking phf v0.13.1
  810. 401.94 s > Checking version-compare v0.2.1
  811. 401.94 s > Checking figment v0.10.19
  812. 401.94 s > Checking xpct v0.5.1
  813. 401.94 s > Checking ryu v1.0.23
  814. 401.94 s > Checking castaway v0.2.4
  815. 401.94 s > Checking string-template-plus v0.4.3
  816. 401.94 s > Checking toml_datetime v0.7.5+spec-1.1.0
  817. 401.94 s > Checking strum v0.27.2
  818. 401.94 s > Checking compact_str v0.9.0
  819. 401.94 s > Checking unicode-truncate v2.0.1
  820. 401.94 s > Checking kasuari v0.4.12
  821. 401.94 s > Checking lru v0.16.4
  822. 401.94 s > Checking vte v0.15.0
  823. 401.94 s > Checking toml v0.9.12+spec-1.1.0
  824. 401.94 s > Checking portable-atomic v1.13.1
  825. 401.94 s > Checking vt100 v0.16.2
  826. 401.94 s > Checking unit-prefix v0.5.2
  827. 401.94 s > Checking rand_distr v0.4.3
  828. 401.94 s > Checking simba v0.6.0
  829. 401.94 s > Checking line-clipping v0.3.7
  830. 401.94 s > Checking ratatui-core v0.1.0
  831. 401.94 s > Checking adler2 v2.0.1
  832. 401.94 s > Checking gimli v0.32.3
  833. 401.94 s > Compiling three-dimensional-reps v0.1.0 (/build/source/crates/three-dimensional-reps)
  834. 401.94 s > Checking miniz_oxide v0.8.9
  835. 401.94 s > Checking indicatif v0.18.4
  836. 401.94 s > Checking thiserror v1.0.69
  837. 401.94 s > Checking derive_builder v0.11.2
  838. 401.94 s > Checking owo-colors v4.3.0
  839. 401.94 s > Checking crossterm v0.29.0
  840. 401.94 s > Checking object v0.37.3
  841. 401.94 s > Checking tracing-error v0.2.1
  842. 401.94 s > Compiling rustpython-parser-core v0.4.0
  843. 401.94 s > Compiling rustpython-ast v0.4.0
  844. 401.94 s > Checking typed-index-collections v3.5.0
  845. 401.94 s > Checking serde-big-array v0.5.1
  846. 401.94 s > Checking amd v0.2.2
  847. 401.94 s > Checking itertools v0.11.0
  848. 401.94 s > Checking env_logger v0.11.10
  849. 401.94 s > Compiling gammaloop-tracing-filter-macros v0.1.0 (/build/source/crates/gammaloop-tracing-filter-macros)
  850. 401.94 s > Checking option-ext v0.2.0
  851. 401.94 s > Checking rustc-demangle v0.1.27
  852. 401.94 s > Checking ratatui-widgets v0.3.0
  853. 401.94 s > Checking dirs-sys v0.5.0
  854. 401.94 s > Checking ref-cast v1.0.25
  855. 401.94 s > Checking nix v0.31.2
  856. 401.94 s > Checking rkyv v0.7.46
  857. 401.94 s > Checking integer-sqrt v0.1.5
  858. 401.94 s > Checking brotli-decompressor v4.0.3
  859. 401.94 s > Checking crossbeam-channel v0.5.15
  860. 401.94 s > Checking itertools v0.12.1
  861. 401.94 s > Checking ratatui-crossterm v0.1.0
  862. 401.94 s > Compiling gammalooprs v0.3.4 (/build/source/crates/gammalooprs)
  863. 401.94 s > Checking unsafe-libyaml v0.2.11
  864. 401.94 s > Checking symlink v0.1.0
  865. 401.94 s > Checking tracing-appender v0.2.5
  866. 401.94 s > Checking include_dir v0.7.4
  867. 401.94 s > Checking color-spantrace v0.3.0
  868. 401.94 s > Checking pathfinding v4.15.0
  869. 401.94 s > Checking schemars v1.2.1
  870. 401.94 s > Checking brotli v7.0.0
  871. 401.94 s > Checking slotmap v1.1.1
  872. 401.94 s > Checking dirs v6.0.0
  873. 401.94 s > Checking ctrlc v3.5.2
  874. 401.94 s > Checking tracing-indicatif v0.3.14
  875. 401.94 s > Checking addr2line v0.25.1
  876. 401.94 s > Checking json5 v0.4.1
  877. 401.94 s > Checking serde_yaml v0.9.34+deprecated
  878. 401.94 s > Checking vectorize v0.2.0
  879. 401.94 s > Checking ringbuffer v0.16.0
  880. 401.94 s > Checking base62 v2.2.4
  881. 401.94 s > Checking rust-embed v8.11.0
  882. 401.94 s > Checking clap_complete v4.6.3
  883. 401.94 s > Checking fd-lock v4.0.4
  884. 401.94 s > Checking strip-ansi-escapes v0.2.1
  885. 401.94 s > Compiling gammaloop-api v0.1.0 (/build/source/crates/gammaloop-api)
  886. 401.94 s > Checking clarabel v0.11.1
  887. 401.94 s > Checking itertools v0.13.0
  888. 401.94 s > Checking strum v0.26.3
  889. 401.94 s > Checking sysinfo v0.33.1
  890. 401.94 s > Checking ratatui-macros v0.7.0
  891. 401.94 s > Checking shlex v1.3.0
  892. 401.94 s > Checking clap_complete_nushell v4.6.0
  893. 401.94 s > Checking ratatui v0.30.0
  894. 401.94 s > Checking futures-core v0.3.32
  895. 401.94 s > Checking futures-task v0.3.32
  896. 401.94 s > Checking slab v0.4.12
  897. 401.94 s > Checking sdd v3.0.10
  898. 401.94 s > Compiling gammaloop-integration-tests v0.1.0 (/build/source/tests)
  899. 401.94 s > Compiling test-log-core v0.2.20
  900. 401.94 s > Checking futures-util v0.3.32
  901. 401.94 s > Checking scc v2.4.0
  902. 401.94 s > Compiling rustc_version v0.4.1
  903. 401.94 s > Checking which v8.0.2
  904. 401.94 s > Checking backtrace v0.3.76
  905. 401.94 s > Checking color-eyre v0.6.5
  906. 401.94 s > Checking bincode v1.3.3
  907. 401.94 s > Compiling gungraun-runner v0.18.2
  908. 401.94 s > Checking reedline v0.42.0
  909. 401.94 s > Compiling gungraun-macros v0.8.0
  910. 401.94 s > Checking proc-macro2 v1.0.106
  911. 401.94 s > Checking maplit v1.0.2
  912. 401.94 s > Checking base64 v0.21.7
  913. 401.94 s > Checking futures-executor v0.3.32
  914. 401.94 s > Compiling iai-callgrind-runner v0.14.2
  915. 401.94 s > Checking kurbo v0.13.0
  916. 401.94 s > Checking serial_test v3.4.0
  917. 401.94 s > Checking ron v0.8.1
  918. 401.94 s > Checking quote v1.0.45
  919. 401.94 s > Checking wait-timeout v0.2.1
  920. 401.94 s > Compiling iai-callgrind v0.14.2
  921. 401.94 s > Checking bit-vec v0.8.0
  922. 401.94 s > Checking quick-error v1.2.3
  923. 401.94 s > Compiling test-log-macros v0.2.20
  924. 401.94 s > Checking syn v2.0.117
  925. 401.94 s > Checking rusty-fork v0.3.1
  926. 401.94 s > Compiling numerica v2.2.0 (https://github.com/alphal00p/symbolica?rev=a277a8dadbaae5a8d6605f2f381991a601e1f345#a277a8da)
  927. 401.94 s > Checking bit-set v0.8.0
  928. 401.94 s > Compiling iai-callgrind-macros v0.5.1
  929. 401.94 s > Checking rand_xorshift v0.4.0
  930. 401.94 s > Checking console v0.15.11
  931. 401.94 s > Checking unarray v0.1.4
  932. 401.94 s > Checking pathdiff v0.2.3
  933. 401.94 s > Checking proptest v1.11.0
  934. 401.94 s > Checking nalgebra v0.29.0
  935. 401.94 s > Checking similar-asserts v1.7.0
  936. 401.94 s > Checking clinnet v0.1.8 (/build/source/crates/clinnet)
  937. 401.94 s > Checking kurvst v0.1.0 (/build/source/crates/kurvst)
  938. 401.94 s > Checking test-log v0.2.20
  939. 401.94 s > Compiling graphica v2.1.0 (https://github.com/alphal00p/symbolica?rev=a277a8dadbaae5a8d6605f2f381991a601e1f345#a277a8da)
  940. 401.94 s > Checking gungraun v0.18.2
  941. 401.94 s > Checking statrs v0.16.1
  942. 401.94 s > Checking momtrop v0.3.0
  943. 401.94 s > Compiling pyo3-stub-gen-derive v0.17.2
  944. 401.94 s > Compiling pyo3-macros v0.28.3
  945. 401.94 s > Checking pyo3-stub-gen v0.17.2
  946. 401.94 s > Checking symbolica-utils v0.1.0 (/build/source/crates/symbolica-utils)
  947. 401.94 s > Checking spenso-macros v0.3.2 (/build/source/crates/spenso-macros)
  948. 401.94 s > Compiling gammaloop-workspace-hack v0.1.0 (/build/source/crates/gammaloop-workspace-hack)
  949. 401.94 s > Checking linnet v0.17.0 (/build/source/crates/linnet)
  950. 401.94 s > Checking spenso v0.6.0 (/build/source/crates/spenso)
  951. 401.94 s > Checking linnet-py v0.1.0 (/build/source/crates/linnet-py)
  952. 401.94 s > Checking linnest v0.1.0 (/build/source/crates/linnest)
  953. 401.94 s > Checking idenso v0.3.0 (/build/source/crates/idenso)
  954. 401.94 s > Checking gammaloop-tracing-filter v0.1.0 (/build/source/crates/gammaloop-tracing-filter)
  955. 401.94 s > Checking spenso-hep-lib v0.1.7 (/build/source/crates/spenso-hep-lib)
  956. 401.94 s > Checking spynso3 v0.1.2 (/build/source/crates/spynso3)
  957. 401.94 s > warning: unused import: `GaussianReferenceFunction`
  958. 401.94 s > --> crates/gammaloop-api/src/state.rs:38:27
  959. 401.94 s > |
  960. 401.94 s > 38 | integrands::process::{GaussianReferenceFunction, ProcessIntegrand},
  961. 401.94 s > | ^^^^^^^^^^^^^^^^^^^^^^^^^
  962. 401.94 s > |
  963. 401.94 s > = note: `#[warn(unused_imports)]` (part of `#[warn(unused)]`) on by default
  964. 401.94 s >
  965. 401.94 s > warning: `gammaloop-api` (lib) generated 1 warning (run `cargo fix --lib -p gammaloop-api` to apply 1 suggestion)
  966. 401.94 s > error[E0609]: no field `lmb_channel_edge_ids` on type `CutInfo`
  967. 401.94 s > --> tests/tests/test_evaluation_api.rs:311:10
  968. 401.94 s > |
  969. 401.94 s > 311 | .lmb_channel_edge_ids
  970. 401.94 s > | ^^^^^^^^^^^^^^^^^^^^ unknown field
  971. 401.94 s > |
  972. 401.94 s > = note: available fields are: `particle_pdgs`, `cut_id`, `graph_id`, `graph_group_id`, `orientation_id` ... and 2 others
  973. 401.94 s >
  974. 401.94 s > error[E0609]: no field `lmb_channel_edge_ids` on type `CutInfo`
  975. 401.94 s > --> tests/tests/test_evaluation_api.rs:591:26
  976. 401.94 s > |
  977. 401.94 s > 591 | .lmb_channel_edge_ids
  978. 401.94 s > | ^^^^^^^^^^^^^^^^^^^^ unknown field
  979. 401.94 s > |
  980. 401.94 s > = note: available fields are: `particle_pdgs`, `cut_id`, `graph_id`, `graph_group_id`, `orientation_id` ... and 2 others
  981. 401.94 s >
  982. 401.94 s > error[E0560]: struct `CutInfo` has no field named `lmb_channel_id`
  983. 401.94 s > --> tests/tests/test_differential.rs:86:13
  984. 401.94 s > |
  985. 401.94 s > 86 | lmb_channel_id: None,
  986. 401.94 s > | ^^^^^^^^^^^^^^ `CutInfo` does not have this field
  987. 401.94 s > |
  988. 401.94 s > = note: available fields are: `sampling_channel_id`, `sampling_channel_edge_ids`
  989. 401.94 s >
  990. 401.94 s > error[E0560]: struct `CutInfo` has no field named `lmb_channel_edge_ids`
  991. 401.94 s > --> tests/tests/test_differential.rs:87:13
  992. 401.94 s > |
  993. 401.94 s > 87 | lmb_channel_edge_ids: None,
  994. 401.94 s > | ^^^^^^^^^^^^^^^^^^^^ `CutInfo` does not have this field
  995. 401.94 s > |
  996. 401.94 s > = note: available fields are: `sampling_channel_id`, `sampling_channel_edge_ids`
  997. 401.94 s >
  998. 401.94 s > error[E0609]: no field `lmb_channel_edge_ids` on type `CutInfo`
  999. 401.94 s > --> tests/tests/test_evaluation_api.rs:1177:18
  1000. 401.94 s > |
  1001. 401.94 s > 1177 | .lmb_channel_edge_ids
  1002. 401.94 s > | ^^^^^^^^^^^^^^^^^^^^ unknown field
  1003. 401.94 s > |
  1004. 401.94 s > = note: available fields are: `particle_pdgs`, `cut_id`, `graph_id`, `graph_group_id`, `orientation_id` ... and 2 others
  1005. 401.94 s >
  1006. 401.94 s > error[E0609]: no field `lmb_channel_edge_ids` on type `CutInfo`
  1007. 401.94 s > --> tests/tests/test_evaluation_api.rs:1222:22
  1008. 401.94 s > |
  1009. 401.94 s > 1222 | .lmb_channel_edge_ids
  1010. 401.94 s > | ^^^^^^^^^^^^^^^^^^^^ unknown field
  1011. 401.94 s > |
  1012. 401.94 s > = note: available fields are: `particle_pdgs`, `cut_id`, `graph_id`, `graph_group_id`, `orientation_id` ... and 2 others
  1013. 401.94 s >
  1014. 401.94 s > error[E0609]: no field `lmb_channel_edge_ids` on type `CutInfo`
  1015. 401.94 s > --> tests/tests/test_evaluation_api.rs:1281:14
  1016. 401.94 s > |
  1017. 401.94 s > 1281 | .lmb_channel_edge_ids
  1018. 401.94 s > | ^^^^^^^^^^^^^^^^^^^^ unknown field
  1019. 401.94 s > |
  1020. 401.94 s > = note: available fields are: `particle_pdgs`, `cut_id`, `graph_id`, `graph_group_id`, `orientation_id` ... and 2 others
  1021. 401.94 s >
  1022. 401.94 s > error[E0609]: no field `lmb_channel_edge_ids` on type `CutInfo`
  1023. 401.94 s > --> tests/tests/test_evaluation_api.rs:1428:18
  1024. 401.94 s > |
  1025. 401.94 s > 1428 | .lmb_channel_edge_ids
  1026. 401.94 s > | ^^^^^^^^^^^^^^^^^^^^ unknown field
  1027. 401.94 s > |
  1028. 401.94 s > = note: available fields are: `particle_pdgs`, `cut_id`, `graph_id`, `graph_group_id`, `orientation_id` ... and 2 others
  1029. 401.94 s >
  1030. 401.94 s > For more information about this error, try `rustc --explain E0560`.
  1031. 401.94 s > error: could not compile `gammaloop-integration-tests` (test "test_differential") due to 2 previous errors
  1032. 401.94 s > warning: build failed, waiting for other jobs to finish...
  1033. 401.94 s > For more information about this error, try `rustc --explain E0609`.
  1034. 401.94 s > error: could not compile `gammaloop-integration-tests` (test "test_evaluation_api") due to 6 previous errors
  1035. 401.94 s > error[E0609]: no field `lmb_channel_id` on type `CutInfo`
  1036. 401.94 s > --> tests/tests/test_runs/utils.rs:568:36
  1037. 401.94 s > |
  1038. 401.94 s > 568 | event.cut_info.lmb_channel_id,
  1039. 401.94 s > | ^^^^^^^^^^^^^^ unknown field
  1040. 401.94 s > |
  1041. 401.94 s > = note: available fields are: `particle_pdgs`, `cut_id`, `graph_id`, `graph_group_id`, `orientation_id` ... and 2 others
  1042. 401.94 s >
  1043. 401.94 s > error[E0609]: no field `lmb_channel_id` on type `CutInfo`
  1044. 401.94 s > --> tests/tests/test_runs/utils.rs:580:36
  1045. 401.94 s > |
  1046. 401.94 s > 580 | event.cut_info.lmb_channel_id,
  1047. 401.94 s > | ^^^^^^^^^^^^^^ unknown field
  1048. 401.94 s > |
  1049. 401.94 s > = note: available fields are: `particle_pdgs`, `cut_id`, `graph_id`, `graph_group_id`, `orientation_id` ... and 2 others
  1050. 401.94 s >
  1051. 401.94 s > error: could not compile `gammaloop-integration-tests` (test "test_runs") due to 2 previous errors
  1052. 401.94 s For full logs, run:
  1053. 401.94 s nix log /nix/store/53802zbj9009bwya0yb48jnjgdmqv87h-gammaloop-workspace-check-0.1.0.drv
  1054. 402.04 s Build failed.