build checks.x86_64-linux.gammaloop-check
0.00 s
$ /nix/store/9ypz3flqsrl5xl495mm8h645gadjsxi1-coreutils-9.11/bin/timeout --kill-after=15s 7200s /nix/store/23zk8sgzamrbmj1fday15szf7f2279s8-nix-2.34.7/bin/nix --extra-experimental-features nix-command --extra-experimental-features flakes --log-format internal-json build --no-link --print-out-paths git+https://github.com/alphal00p/gammaloop?ref=advanced_sampling&rev=2ca19f40f736965c54ac582014fbcfa827cf7c6f&shallow=1#checks.x86_64-linux.gammaloop-check --print-build-logs
0.34 s
error (ignored): SQLite database '/var/cache/nix-ci-worker/eval-cache-v6/854e49c50ea44ef72bd6818a273a9742ab4c976c3390ebc05e3b6fbda314a964.sqlite ' is busy
3.80 s
4.83 s
Building /nix/store/53802zbj9009bwya0yb48jnjgdmqv87h-gammaloop-workspace-check-0.1.0.drv
4.96 s
[gammaloop-workspace-check] Phase: unpackPhase
4.96 s
[gammaloop-workspace-check] unpacking source archive /nix/store/401j5sh0ylbdhdhk1c9kp8s5d8i5hpv1-source
5.12 s
[gammaloop-workspace-check] source root is source
5.19 s
[gammaloop-workspace-check] Phase: patchPhase
5.21 s
[gammaloop-workspace-check] Executing configureCargoCommonVars
5.22 s
[gammaloop-workspace-check] decompressing cargo artifacts from /nix/store/50vpxlcgfxf2d57i27v3d10zjwxxbm2r-gammaloop-workspace-deps-deps-0.1.0/target.tar.zst to target
8.14 s
[gammaloop-workspace-check] Phase: updateAutotoolsGnuConfigScriptsPhase
8.20 s
[gammaloop-workspace-check] Phase: configurePhase
8.21 s
[gammaloop-workspace-check] will append /build/source/.cargo-home/config.toml with contents of /nix/store/5drf77x6km4ky7gwlrzdx9bbd6fz09g3-vendor-cargo-deps/config.toml
8.22 s
[gammaloop-workspace-check] default configurePhase, nothing to do
8.23 s
[gammaloop-workspace-check] Phase: buildPhase
8.24 s
[gammaloop-workspace-check] +++ command cargo --version
8.24 s
[gammaloop-workspace-check] cargo 1.97.0 (c980f4866 2026-06-30)
8.29 s
[gammaloop-workspace-check] +++ command cargo check --profile ci-optim --locked --workspace --features gammaloop-tracing-filter/clap,gammaloop-tracing-filter/symbolica,idenso/bincode,idenso/reference-cases,linnet/bincode,linnet/drawing,linnet/rkyv,linnet/serde,linnet/symbolica,spenso-macros/shadowing,spenso/shadowing,symbolica/tracing_max_level_info,three-dimensional-reps/display,three-dimensional-reps/eval,three-dimensional-reps/serde --all-targets
8.89 s
[gammaloop-workspace-check] Checking cfg-if v1.0.4
8.89 s
[gammaloop-workspace-check] Checking memchr v2.8.0
8.89 s
[gammaloop-workspace-check] Checking once_cell v1.21.4
8.89 s
[gammaloop-workspace-check] Checking either v1.15.0
8.91 s
[gammaloop-workspace-check] Checking serde_core v1.0.228
8.91 s
[gammaloop-workspace-check] Checking libc v0.2.186
8.91 s
[gammaloop-workspace-check] Checking libm v0.2.16
8.91 s
[gammaloop-workspace-check] Checking itoa v1.0.18
8.93 s
[gammaloop-workspace-check] Checking log v0.4.29
8.94 s
[gammaloop-workspace-check] Checking regex-syntax v0.8.10
8.94 s
[gammaloop-workspace-check] Checking zerocopy v0.8.48
8.94 s
[gammaloop-workspace-check] Checking crossbeam-utils v0.8.21
8.94 s
[gammaloop-workspace-check] Checking equivalent v1.0.2
8.96 s
[gammaloop-workspace-check] Checking zmij v1.0.21
8.97 s
[gammaloop-workspace-check] Checking bytemuck v1.25.0
8.97 s
[gammaloop-workspace-check] Checking lazy_static v1.5.0
8.97 s
[gammaloop-workspace-check] Compiling target-lexicon v0.13.5
9.00 s
[gammaloop-workspace-check] Checking arrayvec v0.7.6
9.06 s
[gammaloop-workspace-check] Checking powerfmt v0.2.0
9.08 s
[gammaloop-workspace-check] Checking num_threads v0.1.7
9.13 s
[gammaloop-workspace-check] Checking itertools v0.14.0
9.16 s
[gammaloop-workspace-check] Checking num-conv v0.2.1
9.20 s
[gammaloop-workspace-check] Checking deranged v0.5.8
9.21 s
[gammaloop-workspace-check] Checking pin-project-lite v0.2.17
9.25 s
[gammaloop-workspace-check] Checking time-core v0.1.8
9.26 s
[gammaloop-workspace-check] Checking tracing-core v0.1.36
9.26 s
[gammaloop-workspace-check] Checking foldhash v0.2.0
9.27 s
[gammaloop-workspace-check] Checking crossbeam-epoch v0.9.18
9.30 s
[gammaloop-workspace-check] Checking allocator-api2 v0.2.21
9.34 s
[gammaloop-workspace-check] Checking const-random v0.1.18
9.36 s
[gammaloop-workspace-check] Checking static_assertions v1.1.0
9.36 s
[gammaloop-workspace-check] Checking nu-ansi-term v0.50.3
9.40 s
[gammaloop-workspace-check] Checking winnow v1.0.2
9.41 s
[gammaloop-workspace-check] Checking unty v0.0.4
9.43 s
[gammaloop-workspace-check] Checking safe_arch v0.7.4
9.47 s
[gammaloop-workspace-check] Checking safe_arch v1.0.0
9.48 s
[gammaloop-workspace-check] Checking crossbeam-deque v0.8.6
9.58 s
[gammaloop-workspace-check] Checking sharded-slab v0.1.7
9.60 s
[gammaloop-workspace-check] Checking rayon-core v1.13.0
9.64 s
[gammaloop-workspace-check] Checking hashbrown v0.16.1
9.78 s
[gammaloop-workspace-check] Checking wide v0.7.33
9.86 s
[gammaloop-workspace-check] Checking thread_local v1.1.9
9.94 s
[gammaloop-workspace-check] Checking aho-corasick v1.1.4
10.00 s
[gammaloop-workspace-check] Checking tracing-log v0.2.0
10.06 s
[gammaloop-workspace-check] Checking tracing v0.1.44
10.10 s
[gammaloop-workspace-check] Checking az v1.3.0
10.11 s
[gammaloop-workspace-check] Checking toml_writer v1.1.1+spec-1.1.0
10.12 s
[gammaloop-workspace-check] Checking rayon v1.12.0
10.20 s
[gammaloop-workspace-check] Checking indenter v0.3.4
10.27 s
[gammaloop-workspace-check] Checking wide v1.3.0
10.35 s
[gammaloop-workspace-check] Compiling phf_shared v0.11.3
10.60 s
[gammaloop-workspace-check] Checking anyhow v1.0.102
10.65 s
[gammaloop-workspace-check] Checking alloc-no-stdlib v2.0.4
10.76 s
[gammaloop-workspace-check] Checking rawpointer v0.2.1
10.77 s
[gammaloop-workspace-check] Checking toml_parser v1.1.2+spec-1.1.0
10.82 s
[gammaloop-workspace-check] Checking num-traits v0.2.19
10.84 s
[gammaloop-workspace-check] Checking dyn-clone v1.0.20
10.88 s
[gammaloop-workspace-check] Checking utf8parse v0.2.2
10.91 s
[gammaloop-workspace-check] Checking matrixmultiply v0.3.10
10.95 s
[gammaloop-workspace-check] Checking alloc-stdlib v0.2.2
10.97 s
[gammaloop-workspace-check] Checking anstyle-parse v1.0.0
11.05 s
[gammaloop-workspace-check] Checking getrandom v0.3.4
11.07 s
[gammaloop-workspace-check] Checking gmp-mpfr-sys v1.7.1
11.09 s
[gammaloop-workspace-check] Checking anstyle-query v1.1.5
11.17 s
[gammaloop-workspace-check] Checking anstyle v1.0.14
11.17 s
[gammaloop-workspace-check] Checking rand_core v0.9.5
11.23 s
[gammaloop-workspace-check] Checking is_terminal_polyfill v1.70.2
11.31 s
[gammaloop-workspace-check] Checking colorchoice v1.0.5
11.37 s
[gammaloop-workspace-check] Checking colored v3.1.1
11.39 s
[gammaloop-workspace-check] Compiling phf_generator v0.11.3
11.42 s
[gammaloop-workspace-check] Checking eyre v0.6.12
11.47 s
[gammaloop-workspace-check] Checking unicode-width v0.2.2
11.47 s
[gammaloop-workspace-check] Checking bitflags v1.3.2
11.51 s
[gammaloop-workspace-check] Checking anstream v1.0.0
11.52 s
[gammaloop-workspace-check] Checking region v3.0.2
11.64 s
[gammaloop-workspace-check] Compiling phf_codegen v0.11.3
11.67 s
[gammaloop-workspace-check] Compiling pyo3-build-config v0.28.3
11.68 s
[gammaloop-workspace-check] Checking brotli-decompressor v5.0.0
11.73 s
[gammaloop-workspace-check] Checking wasmtime-jit-icache-coherence v34.0.2
11.75 s
[gammaloop-workspace-check] Checking time v0.3.47
11.78 s
[gammaloop-workspace-check] Checking hugepage-rs v0.1.1
11.80 s
[gammaloop-workspace-check] Checking inventory v0.3.24
11.81 s
[gammaloop-workspace-check] Checking spec_math v0.1.6
11.83 s
[gammaloop-workspace-check] Checking serde v1.0.228
11.84 s
[gammaloop-workspace-check] Checking serde_json v1.0.149
11.86 s
[gammaloop-workspace-check] Checking bitflags v2.11.1
11.90 s
[gammaloop-workspace-check] Checking serde_spanned v1.1.1
11.93 s
[gammaloop-workspace-check] Checking toml_datetime v1.1.1+spec-1.1.0
12.03 s
[gammaloop-workspace-check] Checking thiserror v2.0.18
12.06 s
[gammaloop-workspace-check] Compiling getopts v0.2.24
12.09 s
[gammaloop-workspace-check] Checking libloading v0.9.0
12.10 s
[gammaloop-workspace-check] Checking byteorder v1.5.0
12.10 s
[gammaloop-workspace-check] Checking self_cell v1.2.2
12.10 s
[gammaloop-workspace-check] Checking approx v0.5.1
12.13 s
[gammaloop-workspace-check] Checking regex-automata v0.4.14
12.15 s
[gammaloop-workspace-check] Checking num-integer v0.1.46
12.20 s
[gammaloop-workspace-check] Checking append-only-vec v0.1.8
12.24 s
[gammaloop-workspace-check] Checking bytes v1.11.1
12.32 s
[gammaloop-workspace-check] Checking toml v1.1.2+spec-1.1.0
12.33 s
[gammaloop-workspace-check] Checking tinyjson v2.5.1
12.36 s
[gammaloop-workspace-check] Compiling unic-char-range v0.9.0
12.43 s
[gammaloop-workspace-check] Checking linux-raw-sys v0.12.1
12.44 s
[gammaloop-workspace-check] Compiling unic-common v0.9.0
12.54 s
[gammaloop-workspace-check] Compiling unicode_names2_generator v1.3.0
12.57 s
[gammaloop-workspace-check] Checking smallvec v1.15.1
12.61 s
[gammaloop-workspace-check] Checking num-complex v0.4.6
12.63 s
[gammaloop-workspace-check] Checking tracing-serde v0.2.0
12.70 s
[gammaloop-workspace-check] Checking bincode v2.0.1
12.84 s
[gammaloop-workspace-check] Checking smartstring v1.0.1
12.86 s
[gammaloop-workspace-check] Checking rustix v1.1.4
12.88 s
[gammaloop-workspace-check] Compiling unic-ucd-version v0.9.0
12.95 s
[gammaloop-workspace-check] Compiling unic-char-property v0.9.0
13.08 s
[gammaloop-workspace-check] Compiling is-macro v0.3.7
13.11 s
[gammaloop-workspace-check] Checking simba v0.9.1
13.15 s
[gammaloop-workspace-check] Compiling rustpython-parser-vendored v0.4.0
13.26 s
[gammaloop-workspace-check] Checking iana-time-zone v0.1.65
13.42 s
[gammaloop-workspace-check] Checking chrono v0.4.44
13.49 s
[gammaloop-workspace-check] Checking brotli v8.0.2
13.54 s
[gammaloop-workspace-check] Compiling rustpython-parser v0.4.0
13.66 s
[gammaloop-workspace-check] Compiling phf v0.11.3
13.78 s
[gammaloop-workspace-check] Checking rustc-hash v2.1.2
13.86 s
[gammaloop-workspace-check] Checking ndarray v0.17.2
13.89 s
[gammaloop-workspace-check] Compiling unic-ucd-ident v0.9.0
13.89 s
[gammaloop-workspace-check] Compiling unic-emoji-char v0.9.0
14.09 s
[gammaloop-workspace-check] Compiling lalrpop-util v0.20.2
14.10 s
[gammaloop-workspace-check] Compiling rustc-hash v1.1.0
14.12 s
[gammaloop-workspace-check] Checking rug v1.30.0
14.20 s
[gammaloop-workspace-check] Checking unicode-segmentation v1.13.2
14.23 s
[gammaloop-workspace-check] Checking ppv-lite86 v0.2.21
14.25 s
[gammaloop-workspace-check] Checking ahash v0.8.12
14.29 s
[gammaloop-workspace-check] Compiling symbolica v2.2.0 (https://github.com/alphal00p/symbolica?rev=a277a8dadbaae5a8d6605f2f381991a601e1f345#a277a8da)
14.48 s
[gammaloop-workspace-check] Checking typenum v1.20.0
14.61 s
[gammaloop-workspace-check] Checking getrandom v0.2.17
14.74 s
[gammaloop-workspace-check] Checking rand_chacha v0.9.0
14.80 s
[gammaloop-workspace-check] Checking scopeguard v1.2.0
14.84 s
[gammaloop-workspace-check] Checking parking_lot_core v0.9.12
14.86 s
[gammaloop-workspace-check] Checking lock_api v0.4.14
15.00 s
[gammaloop-workspace-check] Checking unicode-ident v1.0.24
15.09 s
[gammaloop-workspace-check] Checking rand v0.9.4
15.11 s
[gammaloop-workspace-check] Checking hashbrown v0.17.0
15.13 s
[gammaloop-workspace-check] Checking parking_lot v0.12.5
15.14 s
[gammaloop-workspace-check] Checking errno v0.3.14
15.22 s
[gammaloop-workspace-check] Checking strsim v0.11.1
15.25 s
[gammaloop-workspace-check] Checking clap_lex v1.1.0
15.30 s
[gammaloop-workspace-check] Checking unicase v2.9.0
15.36 s
[gammaloop-workspace-check] Checking signal-hook-registry v1.4.8
15.38 s
[gammaloop-workspace-check] Checking vte v0.14.1
15.46 s
[gammaloop-workspace-check] Checking same-file v1.0.6
15.49 s
[gammaloop-workspace-check] Checking signal-hook v0.3.18
15.49 s
[gammaloop-workspace-check] Checking half v2.7.1
15.51 s
[gammaloop-workspace-check] Checking indexmap v2.14.0
15.60 s
[gammaloop-workspace-check] Checking walkdir v2.5.0
15.75 s
[gammaloop-workspace-check] Checking mio v1.2.0
15.85 s
[gammaloop-workspace-check] Checking ciborium-io v0.2.2
15.85 s
[gammaloop-workspace-check] Checking minimal-lexical v0.2.1
15.88 s
[gammaloop-workspace-check] Checking generic-array v0.14.7
15.91 s
[gammaloop-workspace-check] Checking ciborium-ll v0.2.2
16.15 s
[gammaloop-workspace-check] Checking derive_more v2.1.1
16.21 s
[gammaloop-workspace-check] Checking nom v7.1.3
16.22 s
[gammaloop-workspace-check] Checking signal-hook-mio v0.2.5
16.23 s
[gammaloop-workspace-check] Checking num-bigint v0.4.6
16.26 s
[gammaloop-workspace-check] Checking symjit v2.21.0
16.30 s
[gammaloop-workspace-check] Checking console v0.16.3
16.30 s
[gammaloop-workspace-check] Checking block-buffer v0.10.4
16.37 s
[gammaloop-workspace-check] Checking crypto-common v0.1.7
16.44 s
[gammaloop-workspace-check] Checking digest v0.10.7
16.58 s
[gammaloop-workspace-check] Checking bstr v1.12.1
16.60 s
[gammaloop-workspace-check] Checking linux-raw-sys v0.4.15
16.71 s
[gammaloop-workspace-check] Checking terminal_size v0.4.4
16.78 s
[gammaloop-workspace-check] Compiling unicode_names2 v1.3.0
16.80 s
[gammaloop-workspace-check] Checking clap_builder v4.6.0
16.89 s
[gammaloop-workspace-check] Checking winnow v0.7.15
16.90 s
[gammaloop-workspace-check] Checking cpufeatures v0.2.17
16.97 s
[gammaloop-workspace-check] Checking sha2 v0.10.9
17.04 s
[gammaloop-workspace-check] Checking matchers v0.2.0
17.17 s
[gammaloop-workspace-check] Checking regex v1.12.3
17.21 s
[gammaloop-workspace-check] Checking tracing-subscriber v0.3.23
17.60 s
[gammaloop-workspace-check] Checking globset v0.4.18
17.70 s
[gammaloop-workspace-check] Checking rustix v0.38.44
17.86 s
[gammaloop-workspace-check] Checking ciborium v0.2.2
17.96 s
[gammaloop-workspace-check] Checking ansitok v0.3.0
18.24 s
[gammaloop-workspace-check] Checking xprec v0.2.2
18.33 s
[gammaloop-workspace-check] Checking getrandom v0.4.2
18.48 s
[gammaloop-workspace-check] Checking rand_core v0.6.4
18.55 s
[gammaloop-workspace-check] Checking fnv v1.0.7
18.57 s
[gammaloop-workspace-check] Checking fastrand v2.4.1
18.58 s
[gammaloop-workspace-check] Checking plotters-backend v0.3.7
18.61 s
[gammaloop-workspace-check] Checking crossterm v0.28.1
18.63 s
[gammaloop-workspace-check] Checking rust-embed-utils v8.11.0
18.69 s
[gammaloop-workspace-check] Checking serde_spanned v0.6.9
18.71 s
[gammaloop-workspace-check] Checking toml_datetime v0.6.11
18.82 s
[gammaloop-workspace-check] Checking itertools v0.10.5
18.83 s
[gammaloop-workspace-check] Checking toml_write v0.1.2
18.85 s
[gammaloop-workspace-check] Checking cast v0.3.0
18.90 s
[gammaloop-workspace-check] Checking tempfile v3.27.0
18.94 s
[gammaloop-workspace-check] Checking tap v1.0.1
18.95 s
[gammaloop-workspace-check] Checking rand_chacha v0.3.1
18.97 s
[gammaloop-workspace-check] Checking plotters-svg v0.3.7
19.00 s
[gammaloop-workspace-check] Checking wyz v0.5.1
19.05 s
[gammaloop-workspace-check] Checking clap v4.6.1
19.09 s
[gammaloop-workspace-check] Checking ansi-str v0.9.0
19.11 s
[gammaloop-workspace-check] Checking radium v0.7.0
19.11 s
[gammaloop-workspace-check] Checking typeid v1.0.3
19.15 s
[gammaloop-workspace-check] Checking plotters v0.3.7
19.17 s
[gammaloop-workspace-check] Checking similar v2.7.0
19.18 s
[gammaloop-workspace-check] Checking tinytemplate v1.2.1
19.22 s
[gammaloop-workspace-check] Checking is-terminal v0.4.17
19.28 s
[gammaloop-workspace-check] Checking oorandom v11.1.5
19.30 s
[gammaloop-workspace-check] Checking bytecount v0.6.9
19.32 s
[gammaloop-workspace-check] Checking toml_edit v0.22.27
19.37 s
[gammaloop-workspace-check] Checking anes v0.1.6
19.38 s
[gammaloop-workspace-check] Checking funty v2.0.0
19.39 s
[gammaloop-workspace-check] Checking papergrid v0.17.0
19.60 s
[gammaloop-workspace-check] Checking ron v0.12.1
19.60 s
[gammaloop-workspace-check] Checking rand v0.8.6
19.69 s
[gammaloop-workspace-check] Checking testing_table v0.3.0
19.72 s
[gammaloop-workspace-check] Checking bitvec v1.0.1
19.79 s
[gammaloop-workspace-check] Checking env_filter v1.0.1
19.80 s
[gammaloop-workspace-check] Checking toml_edit v0.25.11+spec-1.1.0
19.89 s
[gammaloop-workspace-check] Checking uncased v0.9.10
19.97 s
[gammaloop-workspace-check] Checking jiff v0.2.24
20.00 s
[gammaloop-workspace-check] Checking ptr_meta v0.1.4
20.02 s
[gammaloop-workspace-check] Checking simdutf8 v0.1.5
20.07 s
[gammaloop-workspace-check] Checking ucd-trie v0.1.7
20.14 s
[gammaloop-workspace-check] Checking bytecheck v0.6.12
20.16 s
[gammaloop-workspace-check] Checking pest v2.8.6
20.22 s
[gammaloop-workspace-check] Checking ahash v0.7.8
20.46 s
[gammaloop-workspace-check] Compiling pyo3-ffi v0.28.3
20.46 s
[gammaloop-workspace-check] Compiling pyo3-macros-backend v0.28.3
20.67 s
[gammaloop-workspace-check] Compiling pyo3 v0.28.3
20.69 s
[gammaloop-workspace-check] Compiling numpy v0.28.0
20.79 s
[gammaloop-workspace-check] Checking tabled v0.20.0
20.96 s
[gammaloop-workspace-check] Checking rend v0.4.2
21.07 s
[gammaloop-workspace-check] Checking hashbrown v0.12.3
21.13 s
[gammaloop-workspace-check] Checking approx v0.4.0
21.23 s
[gammaloop-workspace-check] Checking seahash v4.1.0
21.26 s
[gammaloop-workspace-check] Checking criterion-plot v0.5.0
21.29 s
[gammaloop-workspace-check] Checking insta v1.47.2
21.30 s
[gammaloop-workspace-check] Checking cgmath v0.18.0
21.57 s
[gammaloop-workspace-check] Checking criterion v0.5.1
21.70 s
[gammaloop-workspace-check] Checking num-rational v0.4.2
21.82 s
[gammaloop-workspace-check] Checking dot-parser v0.5.1
21.86 s
[gammaloop-workspace-check] Checking num-iter v0.1.45
21.93 s
[gammaloop-workspace-check] Checking ref-ops v0.2.5
21.96 s
[gammaloop-workspace-check] Checking num v0.4.3
21.98 s
[gammaloop-workspace-check] Checking rand_xoshiro v0.6.0
22.01 s
[gammaloop-workspace-check] Checking features v0.10.0
22.04 s
[gammaloop-workspace-check] Checking constcat v0.5.1
22.06 s
[gammaloop-workspace-check] Checking gat-lending-iterator v0.1.8
22.09 s
[gammaloop-workspace-check] Checking colored v2.2.0
22.15 s
[gammaloop-workspace-check] Checking toml v0.8.23
22.27 s
[gammaloop-workspace-check] Checking constant_time_eq v0.4.2
22.30 s
[gammaloop-workspace-check] Checking arrayref v0.3.9
22.35 s
[gammaloop-workspace-check] Checking cpufeatures v0.3.0
22.36 s
[gammaloop-workspace-check] Checking base64 v0.22.1
22.38 s
[gammaloop-workspace-check] Checking joinery v2.1.0
22.39 s
[gammaloop-workspace-check] Checking blake3 v1.8.5
22.42 s
[gammaloop-workspace-check] Checking siphasher v1.0.2
22.45 s
[gammaloop-workspace-check] Checking titlecase v2.2.1
22.51 s
[gammaloop-workspace-check] Checking phf_shared v0.13.1
22.52 s
[gammaloop-workspace-check] Checking subprocess v0.2.15
22.69 s
[gammaloop-workspace-check] Checking rust_lisp v0.18.0
22.72 s
[gammaloop-workspace-check] Compiling vakint v0.1.2 (/build/source/crates/vakint)
22.80 s
[gammaloop-workspace-check] Checking phf v0.13.1
22.81 s
[gammaloop-workspace-check] Checking version-compare v0.2.1
22.90 s
[gammaloop-workspace-check] Checking figment v0.10.19
22.91 s
[gammaloop-workspace-check] Checking xpct v0.5.1
22.92 s
[gammaloop-workspace-check] Checking ryu v1.0.23
23.02 s
[gammaloop-workspace-check] Checking castaway v0.2.4
23.02 s
[gammaloop-workspace-check] Checking string-template-plus v0.4.3
23.14 s
[gammaloop-workspace-check] Checking toml_datetime v0.7.5+spec-1.1.0
23.16 s
[gammaloop-workspace-check] Checking strum v0.27.2
23.17 s
[gammaloop-workspace-check] Checking compact_str v0.9.0
23.26 s
[gammaloop-workspace-check] Checking unicode-truncate v2.0.1
23.40 s
[gammaloop-workspace-check] Checking kasuari v0.4.12
23.40 s
[gammaloop-workspace-check] Checking lru v0.16.4
23.52 s
[gammaloop-workspace-check] Checking vte v0.15.0
23.52 s
[gammaloop-workspace-check] Checking toml v0.9.12+spec-1.1.0
23.54 s
[gammaloop-workspace-check] Checking portable-atomic v1.13.1
23.62 s
[gammaloop-workspace-check] Checking vt100 v0.16.2
23.79 s
[gammaloop-workspace-check] Checking unit-prefix v0.5.2
23.82 s
[gammaloop-workspace-check] Checking rand_distr v0.4.3
23.87 s
[gammaloop-workspace-check] Checking simba v0.6.0
23.88 s
[gammaloop-workspace-check] Checking line-clipping v0.3.7
23.98 s
[gammaloop-workspace-check] Checking ratatui-core v0.1.0
24.07 s
[gammaloop-workspace-check] Checking adler2 v2.0.1
24.15 s
[gammaloop-workspace-check] Checking gimli v0.32.3
24.17 s
[gammaloop-workspace-check] Compiling three-dimensional-reps v0.1.0 (/build/source/crates/three-dimensional-reps)
24.18 s
[gammaloop-workspace-check] Checking miniz_oxide v0.8.9
24.25 s
[gammaloop-workspace-check] Checking indicatif v0.18.4
24.54 s
[gammaloop-workspace-check] Checking thiserror v1.0.69
24.57 s
[gammaloop-workspace-check] Checking derive_builder v0.11.2
24.61 s
[gammaloop-workspace-check] Checking owo-colors v4.3.0
24.61 s
[gammaloop-workspace-check] Checking crossterm v0.29.0
24.65 s
[gammaloop-workspace-check] Checking object v0.37.3
24.66 s
[gammaloop-workspace-check] Checking tracing-error v0.2.1
24.70 s
[gammaloop-workspace-check] Compiling rustpython-parser-core v0.4.0
24.85 s
[gammaloop-workspace-check] Compiling rustpython-ast v0.4.0
24.88 s
[gammaloop-workspace-check] Checking typed-index-collections v3.5.0
24.90 s
[gammaloop-workspace-check] Checking serde-big-array v0.5.1
24.97 s
[gammaloop-workspace-check] Checking amd v0.2.2
25.09 s
[gammaloop-workspace-check] Checking itertools v0.11.0
25.15 s
[gammaloop-workspace-check] Checking env_logger v0.11.10
25.17 s
[gammaloop-workspace-check] Compiling gammaloop-tracing-filter-macros v0.1.0 (/build/source/crates/gammaloop-tracing-filter-macros)
25.19 s
[gammaloop-workspace-check] Checking option-ext v0.2.0
25.27 s
[gammaloop-workspace-check] Checking rustc-demangle v0.1.27
25.32 s
[gammaloop-workspace-check] Checking ratatui-widgets v0.3.0
25.33 s
[gammaloop-workspace-check] Checking dirs-sys v0.5.0
25.50 s
[gammaloop-workspace-check] Checking ref-cast v1.0.25
25.54 s
[gammaloop-workspace-check] Checking nix v0.31.2
25.62 s
[gammaloop-workspace-check] Checking rkyv v0.7.46
25.63 s
[gammaloop-workspace-check] Checking integer-sqrt v0.1.5
25.67 s
[gammaloop-workspace-check] Checking brotli-decompressor v4.0.3
25.71 s
[gammaloop-workspace-check] Checking crossbeam-channel v0.5.15
25.79 s
[gammaloop-workspace-check] Checking itertools v0.12.1
25.82 s
[gammaloop-workspace-check] Checking ratatui-crossterm v0.1.0
25.87 s
[gammaloop-workspace-check] Compiling gammalooprs v0.3.4 (/build/source/crates/gammalooprs)
25.96 s
[gammaloop-workspace-check] Checking unsafe-libyaml v0.2.11
26.01 s
[gammaloop-workspace-check] Checking symlink v0.1.0
26.06 s
[gammaloop-workspace-check] Checking tracing-appender v0.2.5
26.26 s
[gammaloop-workspace-check] Checking include_dir v0.7.4
26.35 s
[gammaloop-workspace-check] Checking color-spantrace v0.3.0
26.40 s
[gammaloop-workspace-check] Checking pathfinding v4.15.0
26.42 s
[gammaloop-workspace-check] Checking schemars v1.2.1
26.52 s
[gammaloop-workspace-check] Checking brotli v7.0.0
26.55 s
[gammaloop-workspace-check] Checking slotmap v1.1.1
26.89 s
[gammaloop-workspace-check] Checking dirs v6.0.0
26.99 s
[gammaloop-workspace-check] Checking ctrlc v3.5.2
27.01 s
[gammaloop-workspace-check] Checking tracing-indicatif v0.3.14
27.16 s
[gammaloop-workspace-check] Checking addr2line v0.25.1
27.18 s
[gammaloop-workspace-check] Checking json5 v0.4.1
27.19 s
[gammaloop-workspace-check] Checking serde_yaml v0.9.34+deprecated
27.31 s
[gammaloop-workspace-check] Checking vectorize v0.2.0
27.39 s
[gammaloop-workspace-check] Checking ringbuffer v0.16.0
27.43 s
[gammaloop-workspace-check] Checking base62 v2.2.4
27.51 s
[gammaloop-workspace-check] Checking rust-embed v8.11.0
27.57 s
[gammaloop-workspace-check] Checking clap_complete v4.6.3
27.60 s
[gammaloop-workspace-check] Checking fd-lock v4.0.4
27.68 s
[gammaloop-workspace-check] Checking strip-ansi-escapes v0.2.1
27.77 s
[gammaloop-workspace-check] Compiling gammaloop-api v0.1.0 (/build/source/crates/gammaloop-api)
27.77 s
[gammaloop-workspace-check] Checking clarabel v0.11.1
27.79 s
[gammaloop-workspace-check] Checking itertools v0.13.0
27.79 s
[gammaloop-workspace-check] Checking strum v0.26.3
27.80 s
[gammaloop-workspace-check] Checking sysinfo v0.33.1
27.85 s
[gammaloop-workspace-check] Checking ratatui-macros v0.7.0
27.90 s
[gammaloop-workspace-check] Checking shlex v1.3.0
27.90 s
[gammaloop-workspace-check] Checking clap_complete_nushell v4.6.0
27.93 s
[gammaloop-workspace-check] Checking ratatui v0.30.0
27.99 s
[gammaloop-workspace-check] Checking futures-core v0.3.32
28.00 s
[gammaloop-workspace-check] Checking futures-task v0.3.32
28.08 s
[gammaloop-workspace-check] Checking slab v0.4.12
28.16 s
[gammaloop-workspace-check] Checking sdd v3.0.10
28.18 s
[gammaloop-workspace-check] Compiling gammaloop-integration-tests v0.1.0 (/build/source/tests)
28.19 s
[gammaloop-workspace-check] Compiling test-log-core v0.2.20
28.27 s
[gammaloop-workspace-check] Checking futures-util v0.3.32
28.31 s
[gammaloop-workspace-check] Checking scc v2.4.0
28.39 s
[gammaloop-workspace-check] Compiling rustc_version v0.4.1
28.94 s
[gammaloop-workspace-check] Checking which v8.0.2
29.10 s
[gammaloop-workspace-check] Checking backtrace v0.3.76
29.39 s
[gammaloop-workspace-check] Checking color-eyre v0.6.5
29.43 s
[gammaloop-workspace-check] Checking bincode v1.3.3
29.58 s
[gammaloop-workspace-check] Compiling gungraun-runner v0.18.2
29.69 s
[gammaloop-workspace-check] Checking reedline v0.42.0
30.04 s
[gammaloop-workspace-check] Compiling gungraun-macros v0.8.0
30.11 s
[gammaloop-workspace-check] Checking proc-macro2 v1.0.106
30.20 s
[gammaloop-workspace-check] Checking maplit v1.0.2
30.27 s
[gammaloop-workspace-check] Checking base64 v0.21.7
30.42 s
[gammaloop-workspace-check] Checking futures-executor v0.3.32
30.54 s
[gammaloop-workspace-check] Compiling iai-callgrind-runner v0.14.2
30.58 s
[gammaloop-workspace-check] Checking kurbo v0.13.0
30.72 s
[gammaloop-workspace-check] Checking serial_test v3.4.0
30.80 s
[gammaloop-workspace-check] Checking ron v0.8.1
30.93 s
[gammaloop-workspace-check] Checking quote v1.0.45
31.19 s
[gammaloop-workspace-check] Checking wait-timeout v0.2.1
31.21 s
[gammaloop-workspace-check] Compiling iai-callgrind v0.14.2
31.36 s
[gammaloop-workspace-check] Checking bit-vec v0.8.0
31.43 s
[gammaloop-workspace-check] Checking quick-error v1.2.3
31.48 s
[gammaloop-workspace-check] Compiling test-log-macros v0.2.20
31.53 s
[gammaloop-workspace-check] Checking syn v2.0.117
31.54 s
[gammaloop-workspace-check] Checking rusty-fork v0.3.1
31.70 s
[gammaloop-workspace-check] Compiling numerica v2.2.0 (https://github.com/alphal00p/symbolica?rev=a277a8dadbaae5a8d6605f2f381991a601e1f345#a277a8da)
31.70 s
[gammaloop-workspace-check] Checking bit-set v0.8.0
31.95 s
[gammaloop-workspace-check] Compiling iai-callgrind-macros v0.5.1
32.00 s
[gammaloop-workspace-check] Checking rand_xorshift v0.4.0
32.17 s
[gammaloop-workspace-check] Checking console v0.15.11
32.51 s
[gammaloop-workspace-check] Checking unarray v0.1.4
32.71 s
[gammaloop-workspace-check] Checking pathdiff v0.2.3
32.77 s
[gammaloop-workspace-check] Checking proptest v1.11.0
32.79 s
[gammaloop-workspace-check] Checking nalgebra v0.29.0
32.85 s
[gammaloop-workspace-check] Checking similar-asserts v1.7.0
33.18 s
[gammaloop-workspace-check] Checking clinnet v0.1.8 (/build/source/crates/clinnet)
34.07 s
[gammaloop-workspace-check] Checking kurvst v0.1.0 (/build/source/crates/kurvst)
36.20 s
[gammaloop-workspace-check] Checking test-log v0.2.20
39.74 s
[gammaloop-workspace-check] Compiling graphica v2.1.0 (https://github.com/alphal00p/symbolica?rev=a277a8dadbaae5a8d6605f2f381991a601e1f345#a277a8da)
42.98 s
[gammaloop-workspace-check] Checking gungraun v0.18.2
43.91 s
[gammaloop-workspace-check] Checking statrs v0.16.1
44.96 s
[gammaloop-workspace-check] Checking momtrop v0.3.0
46.99 s
[gammaloop-workspace-check] Compiling pyo3-stub-gen-derive v0.17.2
47.10 s
[gammaloop-workspace-check] Compiling pyo3-macros v0.28.3
54.32 s
[gammaloop-workspace-check] Checking pyo3-stub-gen v0.17.2
63.42 s
[gammaloop-workspace-check] Checking symbolica-utils v0.1.0 (/build/source/crates/symbolica-utils)
63.42 s
[gammaloop-workspace-check] Checking spenso-macros v0.3.2 (/build/source/crates/spenso-macros)
328.63 s
[gammaloop-workspace-check] Compiling gammaloop-workspace-hack v0.1.0 (/build/source/crates/gammaloop-workspace-hack)
329.07 s
[gammaloop-workspace-check] Checking linnet v0.17.0 (/build/source/crates/linnet)
334.85 s
[gammaloop-workspace-check] Checking spenso v0.6.0 (/build/source/crates/spenso)
335.18 s
[gammaloop-workspace-check] Checking linnet-py v0.1.0 (/build/source/crates/linnet-py)
335.18 s
[gammaloop-workspace-check] Checking linnest v0.1.0 (/build/source/crates/linnest)
346.19 s
[gammaloop-workspace-check] Checking idenso v0.3.0 (/build/source/crates/idenso)
346.20 s
[gammaloop-workspace-check] Checking gammaloop-tracing-filter v0.1.0 (/build/source/crates/gammaloop-tracing-filter)
349.01 s
[gammaloop-workspace-check] Checking spenso-hep-lib v0.1.7 (/build/source/crates/spenso-hep-lib)
349.59 s
[gammaloop-workspace-check] Checking spynso3 v0.1.2 (/build/source/crates/spynso3)
391.69 s
[gammaloop-workspace-check] warning : unused import: `GaussianReferenceFunction`
391.69 s
[gammaloop-workspace-check] --> crates/gammaloop-api/src/state.rs:38:27
391.69 s
[gammaloop-workspace-check] |
391.69 s
[gammaloop-workspace-check] 38 | integrands::process::{GaussianReferenceFunction, ProcessIntegrand},
391.69 s
[gammaloop-workspace-check] | ^^^^^^^^^^^^^^^^^^^^^^^^^
391.69 s
[gammaloop-workspace-check] |
391.69 s
[gammaloop-workspace-check] = note : `#[warn(unused_imports)]` (part of `#[warn(unused)]`) on by default
391.69 s
[gammaloop-workspace-check]
398.56 s
[gammaloop-workspace-check] warning : `gammaloop-api` (lib) generated 1 warning (run `cargo fix --lib -p gammaloop-api` to apply 1 suggestion)
399.29 s
[gammaloop-workspace-check] error[E0609] : no field `lmb_channel_edge_ids` on type `CutInfo`
399.29 s
[gammaloop-workspace-check] --> tests/tests/test_evaluation_api.rs:311:10
399.29 s
[gammaloop-workspace-check] |
399.29 s
[gammaloop-workspace-check] 311 | .lmb_channel_edge_ids
399.29 s
[gammaloop-workspace-check] | ^^^^^^^^^^^^^^^^^^^^ unknown field
399.29 s
[gammaloop-workspace-check] |
399.29 s
[gammaloop-workspace-check] = note : available fields are: `particle_pdgs`, `cut_id`, `graph_id`, `graph_group_id`, `orientation_id` ... and 2 others
399.29 s
[gammaloop-workspace-check]
399.32 s
[gammaloop-workspace-check] error[E0609] : no field `lmb_channel_edge_ids` on type `CutInfo`
399.32 s
[gammaloop-workspace-check] --> tests/tests/test_evaluation_api.rs:591:26
399.32 s
[gammaloop-workspace-check] |
399.32 s
[gammaloop-workspace-check] 591 | .lmb_channel_edge_ids
399.32 s
[gammaloop-workspace-check] | ^^^^^^^^^^^^^^^^^^^^ unknown field
399.32 s
[gammaloop-workspace-check] |
399.32 s
[gammaloop-workspace-check] = note : available fields are: `particle_pdgs`, `cut_id`, `graph_id`, `graph_group_id`, `orientation_id` ... and 2 others
399.32 s
[gammaloop-workspace-check]
399.34 s
[gammaloop-workspace-check] error[E0560] : struct `CutInfo` has no field named `lmb_channel_id`
399.34 s
[gammaloop-workspace-check] --> tests/tests/test_differential.rs:86:13
399.34 s
[gammaloop-workspace-check] |
399.34 s
[gammaloop-workspace-check] 86 | lmb_channel_id: None,
399.34 s
[gammaloop-workspace-check] | ^^^^^^^^^^^^^^ `CutInfo` does not have this field
399.34 s
[gammaloop-workspace-check] |
399.34 s
[gammaloop-workspace-check] = note : available fields are: `sampling_channel_id`, `sampling_channel_edge_ids`
399.34 s
[gammaloop-workspace-check]
399.34 s
[gammaloop-workspace-check] error[E0560] : struct `CutInfo` has no field named `lmb_channel_edge_ids`
399.34 s
[gammaloop-workspace-check] --> tests/tests/test_differential.rs:87:13
399.34 s
[gammaloop-workspace-check] |
399.34 s
[gammaloop-workspace-check] 87 | lmb_channel_edge_ids: None,
399.34 s
[gammaloop-workspace-check] | ^^^^^^^^^^^^^^^^^^^^ `CutInfo` does not have this field
399.34 s
[gammaloop-workspace-check] |
399.34 s
[gammaloop-workspace-check] = note : available fields are: `sampling_channel_id`, `sampling_channel_edge_ids`
399.34 s
[gammaloop-workspace-check]
399.38 s
[gammaloop-workspace-check] error[E0609] : no field `lmb_channel_edge_ids` on type `CutInfo`
399.38 s
[gammaloop-workspace-check] --> tests/tests/test_evaluation_api.rs:1177:18
399.38 s
[gammaloop-workspace-check] |
399.38 s
[gammaloop-workspace-check] 1177 | .lmb_channel_edge_ids
399.38 s
[gammaloop-workspace-check] | ^^^^^^^^^^^^^^^^^^^^ unknown field
399.38 s
[gammaloop-workspace-check] |
399.38 s
[gammaloop-workspace-check] = note : available fields are: `particle_pdgs`, `cut_id`, `graph_id`, `graph_group_id`, `orientation_id` ... and 2 others
399.38 s
[gammaloop-workspace-check]
399.50 s
[gammaloop-workspace-check] error[E0609] : no field `lmb_channel_edge_ids` on type `CutInfo`
399.50 s
[gammaloop-workspace-check] --> tests/tests/test_evaluation_api.rs:1222:22
399.50 s
[gammaloop-workspace-check] |
399.50 s
[gammaloop-workspace-check] 1222 | .lmb_channel_edge_ids
399.50 s
[gammaloop-workspace-check] | ^^^^^^^^^^^^^^^^^^^^ unknown field
399.50 s
[gammaloop-workspace-check] |
399.50 s
[gammaloop-workspace-check] = note : available fields are: `particle_pdgs`, `cut_id`, `graph_id`, `graph_group_id`, `orientation_id` ... and 2 others
399.50 s
[gammaloop-workspace-check]
399.51 s
[gammaloop-workspace-check] error[E0609] : no field `lmb_channel_edge_ids` on type `CutInfo`
399.51 s
[gammaloop-workspace-check] --> tests/tests/test_evaluation_api.rs:1281:14
399.51 s
[gammaloop-workspace-check] |
399.51 s
[gammaloop-workspace-check] 1281 | .lmb_channel_edge_ids
399.51 s
[gammaloop-workspace-check] | ^^^^^^^^^^^^^^^^^^^^ unknown field
399.51 s
[gammaloop-workspace-check] |
399.51 s
[gammaloop-workspace-check] = note : available fields are: `particle_pdgs`, `cut_id`, `graph_id`, `graph_group_id`, `orientation_id` ... and 2 others
399.51 s
[gammaloop-workspace-check]
399.57 s
[gammaloop-workspace-check] error[E0609] : no field `lmb_channel_edge_ids` on type `CutInfo`
399.57 s
[gammaloop-workspace-check] --> tests/tests/test_evaluation_api.rs:1428:18
399.57 s
[gammaloop-workspace-check] |
399.57 s
[gammaloop-workspace-check] 1428 | .lmb_channel_edge_ids
399.57 s
[gammaloop-workspace-check] | ^^^^^^^^^^^^^^^^^^^^ unknown field
399.57 s
[gammaloop-workspace-check] |
399.57 s
[gammaloop-workspace-check] = note : available fields are: `particle_pdgs`, `cut_id`, `graph_id`, `graph_group_id`, `orientation_id` ... and 2 others
399.57 s
[gammaloop-workspace-check]
399.66 s
[gammaloop-workspace-check] For more information about this error, try `rustc --explain E0560`.
399.69 s
[gammaloop-workspace-check] error : could not compile `gammaloop-integration-tests` (test "test_differential") due to 2 previous errors
399.69 s
[gammaloop-workspace-check] warning : build failed, waiting for other jobs to finish...
399.73 s
[gammaloop-workspace-check] For more information about this error, try `rustc --explain E0609`.
399.76 s
[gammaloop-workspace-check] error : could not compile `gammaloop-integration-tests` (test "test_evaluation_api") due to 6 previous errors
400.47 s
[gammaloop-workspace-check] error[E0609] : no field `lmb_channel_id` on type `CutInfo`
400.47 s
[gammaloop-workspace-check] --> tests/tests/test_runs/utils.rs:568:36
400.47 s
[gammaloop-workspace-check] |
400.47 s
[gammaloop-workspace-check] 568 | event.cut_info.lmb_channel_id,
400.47 s
[gammaloop-workspace-check] | ^^^^^^^^^^^^^^ unknown field
400.47 s
[gammaloop-workspace-check] |
400.47 s
[gammaloop-workspace-check] = note : available fields are: `particle_pdgs`, `cut_id`, `graph_id`, `graph_group_id`, `orientation_id` ... and 2 others
400.47 s
[gammaloop-workspace-check]
400.47 s
[gammaloop-workspace-check] error[E0609] : no field `lmb_channel_id` on type `CutInfo`
400.47 s
[gammaloop-workspace-check] --> tests/tests/test_runs/utils.rs:580:36
400.47 s
[gammaloop-workspace-check] |
400.47 s
[gammaloop-workspace-check] 580 | event.cut_info.lmb_channel_id,
400.47 s
[gammaloop-workspace-check] | ^^^^^^^^^^^^^^ unknown field
400.47 s
[gammaloop-workspace-check] |
400.47 s
[gammaloop-workspace-check] = note : available fields are: `particle_pdgs`, `cut_id`, `graph_id`, `graph_group_id`, `orientation_id` ... and 2 others
400.47 s
[gammaloop-workspace-check]
401.09 s
[gammaloop-workspace-check] error : could not compile `gammaloop-integration-tests` (test "test_runs") due to 2 previous errors
401.91 s
Progress: 0 of 1 built (1 failed)
401.91 s
Failed to build gammaloop-workspace-check after 6m37s
401.94 s
Cannot build ' /nix/store/53802zbj9009bwya0yb48jnjgdmqv87h-gammaloop-workspace-check-0.1.0.drv '.
401.94 s
Reason: builder failed with exit code 101 .
401.94 s
Output paths:
401.94 s
/nix/store/zix3gc9sr11cdhaa6ydaq99q1822fi52-gammaloop-workspace-check-0.1.0
401.94 s
Last 520 log lines:
401.94 s
> Running phase: unpackPhase
401.94 s
> unpacking source archive /nix/store/401j5sh0ylbdhdhk1c9kp8s5d8i5hpv1-source
401.94 s
> source root is source
401.94 s
> Running phase: patchPhase
401.94 s
> Executing configureCargoCommonVars
401.94 s
> decompressing cargo artifacts from /nix/store/50vpxlcgfxf2d57i27v3d10zjwxxbm2r-gammaloop-workspace-deps-deps-0.1.0/target.tar.zst to target
401.94 s
> Running phase: updateAutotoolsGnuConfigScriptsPhase
401.94 s
> Running phase: configurePhase
401.94 s
> will append /build/source/.cargo-home/config.toml with contents of /nix/store/5drf77x6km4ky7gwlrzdx9bbd6fz09g3-vendor-cargo-deps/config.toml
401.94 s
> default configurePhase, nothing to do
401.94 s
> Running phase: buildPhase
401.94 s
> +++ command cargo --version
401.94 s
> cargo 1.97.0 (c980f4866 2026-06-30)
401.94 s
> +++ command cargo check --profile ci-optim --locked --workspace --features gammaloop-tracing-filter/clap,gammaloop-tracing-filter/symbolica,idenso/bincode,idenso/reference-cases,linnet/bincode,linnet/drawing,linnet/rkyv,linnet/serde,linnet/symbolica,spenso-macros/shadowing,spenso/shadowing,symbolica/tracing_max_level_info,three-dimensional-reps/display,three-dimensional-reps/eval,three-dimensional-reps/serde --all-targets
401.94 s
> Checking cfg-if v1.0.4
401.94 s
> Checking memchr v2.8.0
401.94 s
> Checking once_cell v1.21.4
401.94 s
> Checking either v1.15.0
401.94 s
> Checking serde_core v1.0.228
401.94 s
> Checking libc v0.2.186
401.94 s
> Checking libm v0.2.16
401.94 s
> Checking itoa v1.0.18
401.94 s
> Checking log v0.4.29
401.94 s
> Checking regex-syntax v0.8.10
401.94 s
> Checking zerocopy v0.8.48
401.94 s
> Checking crossbeam-utils v0.8.21
401.94 s
> Checking equivalent v1.0.2
401.94 s
> Checking zmij v1.0.21
401.94 s
> Checking bytemuck v1.25.0
401.94 s
> Checking lazy_static v1.5.0
401.94 s
> Compiling target-lexicon v0.13.5
401.94 s
> Checking arrayvec v0.7.6
401.94 s
> Checking powerfmt v0.2.0
401.94 s
> Checking num_threads v0.1.7
401.94 s
> Checking itertools v0.14.0
401.94 s
> Checking num-conv v0.2.1
401.94 s
> Checking deranged v0.5.8
401.94 s
> Checking pin-project-lite v0.2.17
401.94 s
> Checking time-core v0.1.8
401.94 s
> Checking tracing-core v0.1.36
401.94 s
> Checking foldhash v0.2.0
401.94 s
> Checking crossbeam-epoch v0.9.18
401.94 s
> Checking allocator-api2 v0.2.21
401.94 s
> Checking const-random v0.1.18
401.94 s
> Checking static_assertions v1.1.0
401.94 s
> Checking nu-ansi-term v0.50.3
401.94 s
> Checking winnow v1.0.2
401.94 s
> Checking unty v0.0.4
401.94 s
> Checking safe_arch v0.7.4
401.94 s
> Checking safe_arch v1.0.0
401.94 s
> Checking crossbeam-deque v0.8.6
401.94 s
> Checking sharded-slab v0.1.7
401.94 s
> Checking rayon-core v1.13.0
401.94 s
> Checking hashbrown v0.16.1
401.94 s
> Checking wide v0.7.33
401.94 s
> Checking thread_local v1.1.9
401.94 s
> Checking aho-corasick v1.1.4
401.94 s
> Checking tracing-log v0.2.0
401.94 s
> Checking tracing v0.1.44
401.94 s
> Checking az v1.3.0
401.94 s
> Checking toml_writer v1.1.1+spec-1.1.0
401.94 s
> Checking rayon v1.12.0
401.94 s
> Checking indenter v0.3.4
401.94 s
> Checking wide v1.3.0
401.94 s
> Compiling phf_shared v0.11.3
401.94 s
> Checking anyhow v1.0.102
401.94 s
> Checking alloc-no-stdlib v2.0.4
401.94 s
> Checking rawpointer v0.2.1
401.94 s
> Checking toml_parser v1.1.2+spec-1.1.0
401.94 s
> Checking num-traits v0.2.19
401.94 s
> Checking dyn-clone v1.0.20
401.94 s
> Checking utf8parse v0.2.2
401.94 s
> Checking matrixmultiply v0.3.10
401.94 s
> Checking alloc-stdlib v0.2.2
401.94 s
> Checking anstyle-parse v1.0.0
401.94 s
> Checking getrandom v0.3.4
401.94 s
> Checking gmp-mpfr-sys v1.7.1
401.94 s
> Checking anstyle-query v1.1.5
401.94 s
> Checking anstyle v1.0.14
401.94 s
> Checking rand_core v0.9.5
401.94 s
> Checking is_terminal_polyfill v1.70.2
401.94 s
> Checking colorchoice v1.0.5
401.94 s
> Checking colored v3.1.1
401.94 s
> Compiling phf_generator v0.11.3
401.94 s
> Checking eyre v0.6.12
401.94 s
> Checking unicode-width v0.2.2
401.94 s
> Checking bitflags v1.3.2
401.94 s
> Checking anstream v1.0.0
401.94 s
> Checking region v3.0.2
401.94 s
> Compiling phf_codegen v0.11.3
401.94 s
> Compiling pyo3-build-config v0.28.3
401.94 s
> Checking brotli-decompressor v5.0.0
401.94 s
> Checking wasmtime-jit-icache-coherence v34.0.2
401.94 s
> Checking time v0.3.47
401.94 s
> Checking hugepage-rs v0.1.1
401.94 s
> Checking inventory v0.3.24
401.94 s
> Checking spec_math v0.1.6
401.94 s
> Checking serde v1.0.228
401.94 s
> Checking serde_json v1.0.149
401.94 s
> Checking bitflags v2.11.1
401.94 s
> Checking serde_spanned v1.1.1
401.94 s
> Checking toml_datetime v1.1.1+spec-1.1.0
401.94 s
> Checking thiserror v2.0.18
401.94 s
> Compiling getopts v0.2.24
401.94 s
> Checking libloading v0.9.0
401.94 s
> Checking byteorder v1.5.0
401.94 s
> Checking self_cell v1.2.2
401.94 s
> Checking approx v0.5.1
401.94 s
> Checking regex-automata v0.4.14
401.94 s
> Checking num-integer v0.1.46
401.94 s
> Checking append-only-vec v0.1.8
401.94 s
> Checking bytes v1.11.1
401.94 s
> Checking toml v1.1.2+spec-1.1.0
401.94 s
> Checking tinyjson v2.5.1
401.94 s
> Compiling unic-char-range v0.9.0
401.94 s
> Checking linux-raw-sys v0.12.1
401.94 s
> Compiling unic-common v0.9.0
401.94 s
> Compiling unicode_names2_generator v1.3.0
401.94 s
> Checking smallvec v1.15.1
401.94 s
> Checking num-complex v0.4.6
401.94 s
> Checking tracing-serde v0.2.0
401.94 s
> Checking bincode v2.0.1
401.94 s
> Checking smartstring v1.0.1
401.94 s
> Checking rustix v1.1.4
401.94 s
> Compiling unic-ucd-version v0.9.0
401.94 s
> Compiling unic-char-property v0.9.0
401.94 s
> Compiling is-macro v0.3.7
401.94 s
> Checking simba v0.9.1
401.94 s
> Compiling rustpython-parser-vendored v0.4.0
401.94 s
> Checking iana-time-zone v0.1.65
401.94 s
> Checking chrono v0.4.44
401.94 s
> Checking brotli v8.0.2
401.94 s
> Compiling rustpython-parser v0.4.0
401.94 s
> Compiling phf v0.11.3
401.94 s
> Checking rustc-hash v2.1.2
401.94 s
> Checking ndarray v0.17.2
401.94 s
> Compiling unic-ucd-ident v0.9.0
401.94 s
> Compiling unic-emoji-char v0.9.0
401.94 s
> Compiling lalrpop-util v0.20.2
401.94 s
> Compiling rustc-hash v1.1.0
401.94 s
> Checking rug v1.30.0
401.94 s
> Checking unicode-segmentation v1.13.2
401.94 s
> Checking ppv-lite86 v0.2.21
401.94 s
> Checking ahash v0.8.12
401.94 s
> Compiling symbolica v2.2.0 (https://github.com/alphal00p/symbolica?rev=a277a8dadbaae5a8d6605f2f381991a601e1f345#a277a8da)
401.94 s
> Checking typenum v1.20.0
401.94 s
> Checking getrandom v0.2.17
401.94 s
> Checking rand_chacha v0.9.0
401.94 s
> Checking scopeguard v1.2.0
401.94 s
> Checking parking_lot_core v0.9.12
401.94 s
> Checking lock_api v0.4.14
401.94 s
> Checking unicode-ident v1.0.24
401.94 s
> Checking rand v0.9.4
401.94 s
> Checking hashbrown v0.17.0
401.94 s
> Checking parking_lot v0.12.5
401.94 s
> Checking errno v0.3.14
401.94 s
> Checking strsim v0.11.1
401.94 s
> Checking clap_lex v1.1.0
401.94 s
> Checking unicase v2.9.0
401.94 s
> Checking signal-hook-registry v1.4.8
401.94 s
> Checking vte v0.14.1
401.94 s
> Checking same-file v1.0.6
401.94 s
> Checking signal-hook v0.3.18
401.94 s
> Checking half v2.7.1
401.94 s
> Checking indexmap v2.14.0
401.94 s
> Checking walkdir v2.5.0
401.94 s
> Checking mio v1.2.0
401.94 s
> Checking ciborium-io v0.2.2
401.94 s
> Checking minimal-lexical v0.2.1
401.94 s
> Checking generic-array v0.14.7
401.94 s
> Checking ciborium-ll v0.2.2
401.94 s
> Checking derive_more v2.1.1
401.94 s
> Checking nom v7.1.3
401.94 s
> Checking signal-hook-mio v0.2.5
401.94 s
> Checking num-bigint v0.4.6
401.94 s
> Checking symjit v2.21.0
401.94 s
> Checking console v0.16.3
401.94 s
> Checking block-buffer v0.10.4
401.94 s
> Checking crypto-common v0.1.7
401.94 s
> Checking digest v0.10.7
401.94 s
> Checking bstr v1.12.1
401.94 s
> Checking linux-raw-sys v0.4.15
401.94 s
> Checking terminal_size v0.4.4
401.94 s
> Compiling unicode_names2 v1.3.0
401.94 s
> Checking clap_builder v4.6.0
401.94 s
> Checking winnow v0.7.15
401.94 s
> Checking cpufeatures v0.2.17
401.94 s
> Checking sha2 v0.10.9
401.94 s
> Checking matchers v0.2.0
401.94 s
> Checking regex v1.12.3
401.94 s
> Checking tracing-subscriber v0.3.23
401.94 s
> Checking globset v0.4.18
401.94 s
> Checking rustix v0.38.44
401.94 s
> Checking ciborium v0.2.2
401.94 s
> Checking ansitok v0.3.0
401.94 s
> Checking xprec v0.2.2
401.94 s
> Checking getrandom v0.4.2
401.94 s
> Checking rand_core v0.6.4
401.94 s
> Checking fnv v1.0.7
401.94 s
> Checking fastrand v2.4.1
401.94 s
> Checking plotters-backend v0.3.7
401.94 s
> Checking crossterm v0.28.1
401.94 s
> Checking rust-embed-utils v8.11.0
401.94 s
> Checking serde_spanned v0.6.9
401.94 s
> Checking toml_datetime v0.6.11
401.94 s
> Checking itertools v0.10.5
401.94 s
> Checking toml_write v0.1.2
401.94 s
> Checking cast v0.3.0
401.94 s
> Checking tempfile v3.27.0
401.94 s
> Checking tap v1.0.1
401.94 s
> Checking rand_chacha v0.3.1
401.94 s
> Checking plotters-svg v0.3.7
401.94 s
> Checking wyz v0.5.1
401.94 s
> Checking clap v4.6.1
401.94 s
> Checking ansi-str v0.9.0
401.94 s
> Checking radium v0.7.0
401.94 s
> Checking typeid v1.0.3
401.94 s
> Checking plotters v0.3.7
401.94 s
> Checking similar v2.7.0
401.94 s
> Checking tinytemplate v1.2.1
401.94 s
> Checking is-terminal v0.4.17
401.94 s
> Checking oorandom v11.1.5
401.94 s
> Checking bytecount v0.6.9
401.94 s
> Checking toml_edit v0.22.27
401.94 s
> Checking anes v0.1.6
401.94 s
> Checking funty v2.0.0
401.94 s
> Checking papergrid v0.17.0
401.94 s
> Checking ron v0.12.1
401.94 s
> Checking rand v0.8.6
401.94 s
> Checking testing_table v0.3.0
401.94 s
> Checking bitvec v1.0.1
401.94 s
> Checking env_filter v1.0.1
401.94 s
> Checking toml_edit v0.25.11+spec-1.1.0
401.94 s
> Checking uncased v0.9.10
401.94 s
> Checking jiff v0.2.24
401.94 s
> Checking ptr_meta v0.1.4
401.94 s
> Checking simdutf8 v0.1.5
401.94 s
> Checking ucd-trie v0.1.7
401.94 s
> Checking bytecheck v0.6.12
401.94 s
> Checking pest v2.8.6
401.94 s
> Checking ahash v0.7.8
401.94 s
> Compiling pyo3-ffi v0.28.3
401.94 s
> Compiling pyo3-macros-backend v0.28.3
401.94 s
> Compiling pyo3 v0.28.3
401.94 s
> Compiling numpy v0.28.0
401.94 s
> Checking tabled v0.20.0
401.94 s
> Checking rend v0.4.2
401.94 s
> Checking hashbrown v0.12.3
401.94 s
> Checking approx v0.4.0
401.94 s
> Checking seahash v4.1.0
401.94 s
> Checking criterion-plot v0.5.0
401.94 s
> Checking insta v1.47.2
401.94 s
> Checking cgmath v0.18.0
401.94 s
> Checking criterion v0.5.1
401.94 s
> Checking num-rational v0.4.2
401.94 s
> Checking dot-parser v0.5.1
401.94 s
> Checking num-iter v0.1.45
401.94 s
> Checking ref-ops v0.2.5
401.94 s
> Checking num v0.4.3
401.94 s
> Checking rand_xoshiro v0.6.0
401.94 s
> Checking features v0.10.0
401.94 s
> Checking constcat v0.5.1
401.94 s
> Checking gat-lending-iterator v0.1.8
401.94 s
> Checking colored v2.2.0
401.94 s
> Checking toml v0.8.23
401.94 s
> Checking constant_time_eq v0.4.2
401.94 s
> Checking arrayref v0.3.9
401.94 s
> Checking cpufeatures v0.3.0
401.94 s
> Checking base64 v0.22.1
401.94 s
> Checking joinery v2.1.0
401.94 s
> Checking blake3 v1.8.5
401.94 s
> Checking siphasher v1.0.2
401.94 s
> Checking titlecase v2.2.1
401.94 s
> Checking phf_shared v0.13.1
401.94 s
> Checking subprocess v0.2.15
401.94 s
> Checking rust_lisp v0.18.0
401.94 s
> Compiling vakint v0.1.2 (/build/source/crates/vakint)
401.94 s
> Checking phf v0.13.1
401.94 s
> Checking version-compare v0.2.1
401.94 s
> Checking figment v0.10.19
401.94 s
> Checking xpct v0.5.1
401.94 s
> Checking ryu v1.0.23
401.94 s
> Checking castaway v0.2.4
401.94 s
> Checking string-template-plus v0.4.3
401.94 s
> Checking toml_datetime v0.7.5+spec-1.1.0
401.94 s
> Checking strum v0.27.2
401.94 s
> Checking compact_str v0.9.0
401.94 s
> Checking unicode-truncate v2.0.1
401.94 s
> Checking kasuari v0.4.12
401.94 s
> Checking lru v0.16.4
401.94 s
> Checking vte v0.15.0
401.94 s
> Checking toml v0.9.12+spec-1.1.0
401.94 s
> Checking portable-atomic v1.13.1
401.94 s
> Checking vt100 v0.16.2
401.94 s
> Checking unit-prefix v0.5.2
401.94 s
> Checking rand_distr v0.4.3
401.94 s
> Checking simba v0.6.0
401.94 s
> Checking line-clipping v0.3.7
401.94 s
> Checking ratatui-core v0.1.0
401.94 s
> Checking adler2 v2.0.1
401.94 s
> Checking gimli v0.32.3
401.94 s
> Compiling three-dimensional-reps v0.1.0 (/build/source/crates/three-dimensional-reps)
401.94 s
> Checking miniz_oxide v0.8.9
401.94 s
> Checking indicatif v0.18.4
401.94 s
> Checking thiserror v1.0.69
401.94 s
> Checking derive_builder v0.11.2
401.94 s
> Checking owo-colors v4.3.0
401.94 s
> Checking crossterm v0.29.0
401.94 s
> Checking object v0.37.3
401.94 s
> Checking tracing-error v0.2.1
401.94 s
> Compiling rustpython-parser-core v0.4.0
401.94 s
> Compiling rustpython-ast v0.4.0
401.94 s
> Checking typed-index-collections v3.5.0
401.94 s
> Checking serde-big-array v0.5.1
401.94 s
> Checking amd v0.2.2
401.94 s
> Checking itertools v0.11.0
401.94 s
> Checking env_logger v0.11.10
401.94 s
> Compiling gammaloop-tracing-filter-macros v0.1.0 (/build/source/crates/gammaloop-tracing-filter-macros)
401.94 s
> Checking option-ext v0.2.0
401.94 s
> Checking rustc-demangle v0.1.27
401.94 s
> Checking ratatui-widgets v0.3.0
401.94 s
> Checking dirs-sys v0.5.0
401.94 s
> Checking ref-cast v1.0.25
401.94 s
> Checking nix v0.31.2
401.94 s
> Checking rkyv v0.7.46
401.94 s
> Checking integer-sqrt v0.1.5
401.94 s
> Checking brotli-decompressor v4.0.3
401.94 s
> Checking crossbeam-channel v0.5.15
401.94 s
> Checking itertools v0.12.1
401.94 s
> Checking ratatui-crossterm v0.1.0
401.94 s
> Compiling gammalooprs v0.3.4 (/build/source/crates/gammalooprs)
401.94 s
> Checking unsafe-libyaml v0.2.11
401.94 s
> Checking symlink v0.1.0
401.94 s
> Checking tracing-appender v0.2.5
401.94 s
> Checking include_dir v0.7.4
401.94 s
> Checking color-spantrace v0.3.0
401.94 s
> Checking pathfinding v4.15.0
401.94 s
> Checking schemars v1.2.1
401.94 s
> Checking brotli v7.0.0
401.94 s
> Checking slotmap v1.1.1
401.94 s
> Checking dirs v6.0.0
401.94 s
> Checking ctrlc v3.5.2
401.94 s
> Checking tracing-indicatif v0.3.14
401.94 s
> Checking addr2line v0.25.1
401.94 s
> Checking json5 v0.4.1
401.94 s
> Checking serde_yaml v0.9.34+deprecated
401.94 s
> Checking vectorize v0.2.0
401.94 s
> Checking ringbuffer v0.16.0
401.94 s
> Checking base62 v2.2.4
401.94 s
> Checking rust-embed v8.11.0
401.94 s
> Checking clap_complete v4.6.3
401.94 s
> Checking fd-lock v4.0.4
401.94 s
> Checking strip-ansi-escapes v0.2.1
401.94 s
> Compiling gammaloop-api v0.1.0 (/build/source/crates/gammaloop-api)
401.94 s
> Checking clarabel v0.11.1
401.94 s
> Checking itertools v0.13.0
401.94 s
> Checking strum v0.26.3
401.94 s
> Checking sysinfo v0.33.1
401.94 s
> Checking ratatui-macros v0.7.0
401.94 s
> Checking shlex v1.3.0
401.94 s
> Checking clap_complete_nushell v4.6.0
401.94 s
> Checking ratatui v0.30.0
401.94 s
> Checking futures-core v0.3.32
401.94 s
> Checking futures-task v0.3.32
401.94 s
> Checking slab v0.4.12
401.94 s
> Checking sdd v3.0.10
401.94 s
> Compiling gammaloop-integration-tests v0.1.0 (/build/source/tests)
401.94 s
> Compiling test-log-core v0.2.20
401.94 s
> Checking futures-util v0.3.32
401.94 s
> Checking scc v2.4.0
401.94 s
> Compiling rustc_version v0.4.1
401.94 s
> Checking which v8.0.2
401.94 s
> Checking backtrace v0.3.76
401.94 s
> Checking color-eyre v0.6.5
401.94 s
> Checking bincode v1.3.3
401.94 s
> Compiling gungraun-runner v0.18.2
401.94 s
> Checking reedline v0.42.0
401.94 s
> Compiling gungraun-macros v0.8.0
401.94 s
> Checking proc-macro2 v1.0.106
401.94 s
> Checking maplit v1.0.2
401.94 s
> Checking base64 v0.21.7
401.94 s
> Checking futures-executor v0.3.32
401.94 s
> Compiling iai-callgrind-runner v0.14.2
401.94 s
> Checking kurbo v0.13.0
401.94 s
> Checking serial_test v3.4.0
401.94 s
> Checking ron v0.8.1
401.94 s
> Checking quote v1.0.45
401.94 s
> Checking wait-timeout v0.2.1
401.94 s
> Compiling iai-callgrind v0.14.2
401.94 s
> Checking bit-vec v0.8.0
401.94 s
> Checking quick-error v1.2.3
401.94 s
> Compiling test-log-macros v0.2.20
401.94 s
> Checking syn v2.0.117
401.94 s
> Checking rusty-fork v0.3.1
401.94 s
> Compiling numerica v2.2.0 (https://github.com/alphal00p/symbolica?rev=a277a8dadbaae5a8d6605f2f381991a601e1f345#a277a8da)
401.94 s
> Checking bit-set v0.8.0
401.94 s
> Compiling iai-callgrind-macros v0.5.1
401.94 s
> Checking rand_xorshift v0.4.0
401.94 s
> Checking console v0.15.11
401.94 s
> Checking unarray v0.1.4
401.94 s
> Checking pathdiff v0.2.3
401.94 s
> Checking proptest v1.11.0
401.94 s
> Checking nalgebra v0.29.0
401.94 s
> Checking similar-asserts v1.7.0
401.94 s
> Checking clinnet v0.1.8 (/build/source/crates/clinnet)
401.94 s
> Checking kurvst v0.1.0 (/build/source/crates/kurvst)
401.94 s
> Checking test-log v0.2.20
401.94 s
> Compiling graphica v2.1.0 (https://github.com/alphal00p/symbolica?rev=a277a8dadbaae5a8d6605f2f381991a601e1f345#a277a8da)
401.94 s
> Checking gungraun v0.18.2
401.94 s
> Checking statrs v0.16.1
401.94 s
> Checking momtrop v0.3.0
401.94 s
> Compiling pyo3-stub-gen-derive v0.17.2
401.94 s
> Compiling pyo3-macros v0.28.3
401.94 s
> Checking pyo3-stub-gen v0.17.2
401.94 s
> Checking symbolica-utils v0.1.0 (/build/source/crates/symbolica-utils)
401.94 s
> Checking spenso-macros v0.3.2 (/build/source/crates/spenso-macros)
401.94 s
> Compiling gammaloop-workspace-hack v0.1.0 (/build/source/crates/gammaloop-workspace-hack)
401.94 s
> Checking linnet v0.17.0 (/build/source/crates/linnet)
401.94 s
> Checking spenso v0.6.0 (/build/source/crates/spenso)
401.94 s
> Checking linnet-py v0.1.0 (/build/source/crates/linnet-py)
401.94 s
> Checking linnest v0.1.0 (/build/source/crates/linnest)
401.94 s
> Checking idenso v0.3.0 (/build/source/crates/idenso)
401.94 s
> Checking gammaloop-tracing-filter v0.1.0 (/build/source/crates/gammaloop-tracing-filter)
401.94 s
> Checking spenso-hep-lib v0.1.7 (/build/source/crates/spenso-hep-lib)
401.94 s
> Checking spynso3 v0.1.2 (/build/source/crates/spynso3)
401.94 s
> warning : unused import: `GaussianReferenceFunction`
401.94 s
> --> crates/gammaloop-api/src/state.rs:38:27
401.94 s
> |
401.94 s
> 38 | integrands::process::{GaussianReferenceFunction, ProcessIntegrand},
401.94 s
> | ^^^^^^^^^^^^^^^^^^^^^^^^^
401.94 s
> |
401.94 s
> = note : `#[warn(unused_imports)]` (part of `#[warn(unused)]`) on by default
401.94 s
>
401.94 s
> warning : `gammaloop-api` (lib) generated 1 warning (run `cargo fix --lib -p gammaloop-api` to apply 1 suggestion)
401.94 s
> error[E0609] : no field `lmb_channel_edge_ids` on type `CutInfo`
401.94 s
> --> tests/tests/test_evaluation_api.rs:311:10
401.94 s
> |
401.94 s
> 311 | .lmb_channel_edge_ids
401.94 s
> | ^^^^^^^^^^^^^^^^^^^^ unknown field
401.94 s
> |
401.94 s
> = note : available fields are: `particle_pdgs`, `cut_id`, `graph_id`, `graph_group_id`, `orientation_id` ... and 2 others
401.94 s
>
401.94 s
> error[E0609] : no field `lmb_channel_edge_ids` on type `CutInfo`
401.94 s
> --> tests/tests/test_evaluation_api.rs:591:26
401.94 s
> |
401.94 s
> 591 | .lmb_channel_edge_ids
401.94 s
> | ^^^^^^^^^^^^^^^^^^^^ unknown field
401.94 s
> |
401.94 s
> = note : available fields are: `particle_pdgs`, `cut_id`, `graph_id`, `graph_group_id`, `orientation_id` ... and 2 others
401.94 s
>
401.94 s
> error[E0560] : struct `CutInfo` has no field named `lmb_channel_id`
401.94 s
> --> tests/tests/test_differential.rs:86:13
401.94 s
> |
401.94 s
> 86 | lmb_channel_id: None,
401.94 s
> | ^^^^^^^^^^^^^^ `CutInfo` does not have this field
401.94 s
> |
401.94 s
> = note : available fields are: `sampling_channel_id`, `sampling_channel_edge_ids`
401.94 s
>
401.94 s
> error[E0560] : struct `CutInfo` has no field named `lmb_channel_edge_ids`
401.94 s
> --> tests/tests/test_differential.rs:87:13
401.94 s
> |
401.94 s
> 87 | lmb_channel_edge_ids: None,
401.94 s
> | ^^^^^^^^^^^^^^^^^^^^ `CutInfo` does not have this field
401.94 s
> |
401.94 s
> = note : available fields are: `sampling_channel_id`, `sampling_channel_edge_ids`
401.94 s
>
401.94 s
> error[E0609] : no field `lmb_channel_edge_ids` on type `CutInfo`
401.94 s
> --> tests/tests/test_evaluation_api.rs:1177:18
401.94 s
> |
401.94 s
> 1177 | .lmb_channel_edge_ids
401.94 s
> | ^^^^^^^^^^^^^^^^^^^^ unknown field
401.94 s
> |
401.94 s
> = note : available fields are: `particle_pdgs`, `cut_id`, `graph_id`, `graph_group_id`, `orientation_id` ... and 2 others
401.94 s
>
401.94 s
> error[E0609] : no field `lmb_channel_edge_ids` on type `CutInfo`
401.94 s
> --> tests/tests/test_evaluation_api.rs:1222:22
401.94 s
> |
401.94 s
> 1222 | .lmb_channel_edge_ids
401.94 s
> | ^^^^^^^^^^^^^^^^^^^^ unknown field
401.94 s
> |
401.94 s
> = note : available fields are: `particle_pdgs`, `cut_id`, `graph_id`, `graph_group_id`, `orientation_id` ... and 2 others
401.94 s
>
401.94 s
> error[E0609] : no field `lmb_channel_edge_ids` on type `CutInfo`
401.94 s
> --> tests/tests/test_evaluation_api.rs:1281:14
401.94 s
> |
401.94 s
> 1281 | .lmb_channel_edge_ids
401.94 s
> | ^^^^^^^^^^^^^^^^^^^^ unknown field
401.94 s
> |
401.94 s
> = note : available fields are: `particle_pdgs`, `cut_id`, `graph_id`, `graph_group_id`, `orientation_id` ... and 2 others
401.94 s
>
401.94 s
> error[E0609] : no field `lmb_channel_edge_ids` on type `CutInfo`
401.94 s
> --> tests/tests/test_evaluation_api.rs:1428:18
401.94 s
> |
401.94 s
> 1428 | .lmb_channel_edge_ids
401.94 s
> | ^^^^^^^^^^^^^^^^^^^^ unknown field
401.94 s
> |
401.94 s
> = note : available fields are: `particle_pdgs`, `cut_id`, `graph_id`, `graph_group_id`, `orientation_id` ... and 2 others
401.94 s
>
401.94 s
> For more information about this error, try `rustc --explain E0560`.
401.94 s
> error : could not compile `gammaloop-integration-tests` (test "test_differential") due to 2 previous errors
401.94 s
> warning : build failed, waiting for other jobs to finish...
401.94 s
> For more information about this error, try `rustc --explain E0609`.
401.94 s
> error : could not compile `gammaloop-integration-tests` (test "test_evaluation_api") due to 6 previous errors
401.94 s
> error[E0609] : no field `lmb_channel_id` on type `CutInfo`
401.94 s
> --> tests/tests/test_runs/utils.rs:568:36
401.94 s
> |
401.94 s
> 568 | event.cut_info.lmb_channel_id,
401.94 s
> | ^^^^^^^^^^^^^^ unknown field
401.94 s
> |
401.94 s
> = note : available fields are: `particle_pdgs`, `cut_id`, `graph_id`, `graph_group_id`, `orientation_id` ... and 2 others
401.94 s
>
401.94 s
> error[E0609] : no field `lmb_channel_id` on type `CutInfo`
401.94 s
> --> tests/tests/test_runs/utils.rs:580:36
401.94 s
> |
401.94 s
> 580 | event.cut_info.lmb_channel_id,
401.94 s
> | ^^^^^^^^^^^^^^ unknown field
401.94 s
> |
401.94 s
> = note : available fields are: `particle_pdgs`, `cut_id`, `graph_id`, `graph_group_id`, `orientation_id` ... and 2 others
401.94 s
>
401.94 s
> error : could not compile `gammaloop-integration-tests` (test "test_runs") due to 2 previous errors
401.94 s
For full logs, run:
401.94 s
nix log /nix/store/53802zbj9009bwya0yb48jnjgdmqv87h-gammaloop-workspace-check-0.1.0.drv
402.04 s
Build failed.