0.01 s
$ /nix/store/9ypz3flqsrl5xl495mm8h645gadjsxi1-coreutils-9.11/bin/timeout --kill-after=15s 7200s /nix/store/23zk8sgzamrbmj1fday15szf7f2279s8-nix-2.34.7/bin/nix --extra-experimental-features nix-command --extra-experimental-features flakes --log-format internal-json build --no-link --print-out-paths git+https://github.com/alphal00p/gammaloop?ref=advanced_sampling&rev=2ca19f40f736965c54ac582014fbcfa827cf7c6f&shallow=1#checks.x86_64-linux.gammaloop-check --print-build-logs
0.39 s
error (ignored): SQLite database '/var/cache/nix-ci-worker/eval-cache-v6/854e49c50ea44ef72bd6818a273a9742ab4c976c3390ebc05e3b6fbda314a964.sqlite ' is busy
4.13 s
5.58 s
Building /nix/store/53802zbj9009bwya0yb48jnjgdmqv87h-gammaloop-workspace-check-0.1.0.drv
5.69 s
[gammaloop-workspace-check] Phase: unpackPhase
5.69 s
[gammaloop-workspace-check] unpacking source archive /nix/store/401j5sh0ylbdhdhk1c9kp8s5d8i5hpv1-source
5.90 s
[gammaloop-workspace-check] source root is source
5.97 s
[gammaloop-workspace-check] Phase: patchPhase
5.99 s
[gammaloop-workspace-check] Executing configureCargoCommonVars
6.00 s
[gammaloop-workspace-check] decompressing cargo artifacts from /nix/store/50vpxlcgfxf2d57i27v3d10zjwxxbm2r-gammaloop-workspace-deps-deps-0.1.0/target.tar.zst to target
10.21 s
[gammaloop-workspace-check] Phase: updateAutotoolsGnuConfigScriptsPhase
10.27 s
[gammaloop-workspace-check] Phase: configurePhase
10.27 s
[gammaloop-workspace-check] will append /build/source/.cargo-home/config.toml with contents of /nix/store/5drf77x6km4ky7gwlrzdx9bbd6fz09g3-vendor-cargo-deps/config.toml
10.27 s
[gammaloop-workspace-check] default configurePhase, nothing to do
10.28 s
[gammaloop-workspace-check] Phase: buildPhase
10.28 s
[gammaloop-workspace-check] +++ command cargo --version
10.29 s
[gammaloop-workspace-check] cargo 1.97.0 (c980f4866 2026-06-30)
10.33 s
[gammaloop-workspace-check] +++ command cargo check --profile ci-optim --locked --workspace --features gammaloop-tracing-filter/clap,gammaloop-tracing-filter/symbolica,idenso/bincode,idenso/reference-cases,linnet/bincode,linnet/drawing,linnet/rkyv,linnet/serde,linnet/symbolica,spenso-macros/shadowing,spenso/shadowing,symbolica/tracing_max_level_info,three-dimensional-reps/display,three-dimensional-reps/eval,three-dimensional-reps/serde --all-targets
11.32 s
[gammaloop-workspace-check] Checking cfg-if v1.0.4
11.32 s
[gammaloop-workspace-check] Checking memchr v2.8.0
11.32 s
[gammaloop-workspace-check] Checking once_cell v1.21.4
11.32 s
[gammaloop-workspace-check] Checking either v1.15.0
11.35 s
[gammaloop-workspace-check] Checking serde_core v1.0.228
11.35 s
[gammaloop-workspace-check] Checking libc v0.2.186
11.35 s
[gammaloop-workspace-check] Checking libm v0.2.16
11.35 s
[gammaloop-workspace-check] Checking itoa v1.0.18
11.37 s
[gammaloop-workspace-check] Checking log v0.4.29
11.37 s
[gammaloop-workspace-check] Checking regex-syntax v0.8.10
11.38 s
[gammaloop-workspace-check] Checking zerocopy v0.8.48
11.40 s
[gammaloop-workspace-check] Checking crossbeam-utils v0.8.21
11.40 s
[gammaloop-workspace-check] Checking equivalent v1.0.2
11.44 s
[gammaloop-workspace-check] Checking zmij v1.0.21
11.44 s
[gammaloop-workspace-check] Checking bytemuck v1.25.0
11.44 s
[gammaloop-workspace-check] Checking lazy_static v1.5.0
11.45 s
[gammaloop-workspace-check] Compiling target-lexicon v0.13.5
11.51 s
[gammaloop-workspace-check] Checking arrayvec v0.7.6
11.69 s
[gammaloop-workspace-check] Checking powerfmt v0.2.0
11.82 s
[gammaloop-workspace-check] Checking num_threads v0.1.7
11.85 s
[gammaloop-workspace-check] Checking deranged v0.5.8
11.86 s
[gammaloop-workspace-check] Checking time-core v0.1.8
11.89 s
[gammaloop-workspace-check] Checking itertools v0.14.0
11.96 s
[gammaloop-workspace-check] Checking pin-project-lite v0.2.17
12.02 s
[gammaloop-workspace-check] Checking num-conv v0.2.1
12.07 s
[gammaloop-workspace-check] Checking safe_arch v0.7.4
12.09 s
[gammaloop-workspace-check] Checking tracing-core v0.1.36
12.12 s
[gammaloop-workspace-check] Checking foldhash v0.2.0
12.21 s
[gammaloop-workspace-check] Checking allocator-api2 v0.2.21
12.23 s
[gammaloop-workspace-check] Checking crossbeam-epoch v0.9.18
12.30 s
[gammaloop-workspace-check] Checking const-random v0.1.18
12.34 s
[gammaloop-workspace-check] Checking static_assertions v1.1.0
12.39 s
[gammaloop-workspace-check] Checking unty v0.0.4
12.43 s
[gammaloop-workspace-check] Checking nu-ansi-term v0.50.3
12.49 s
[gammaloop-workspace-check] Checking winnow v1.0.2
12.50 s
[gammaloop-workspace-check] Checking safe_arch v1.0.0
12.53 s
[gammaloop-workspace-check] Checking wide v0.7.33
12.74 s
[gammaloop-workspace-check] Checking tracing v0.1.44
12.82 s
[gammaloop-workspace-check] Checking tracing-log v0.2.0
12.96 s
[gammaloop-workspace-check] Checking sharded-slab v0.1.7
12.97 s
[gammaloop-workspace-check] Checking aho-corasick v1.1.4
13.00 s
[gammaloop-workspace-check] Checking hashbrown v0.16.1
13.05 s
[gammaloop-workspace-check] Checking crossbeam-deque v0.8.6
13.52 s
[gammaloop-workspace-check] Checking thread_local v1.1.9
13.56 s
[gammaloop-workspace-check] Checking rayon-core v1.13.0
13.60 s
[gammaloop-workspace-check] Checking toml_writer v1.1.1+spec-1.1.0
13.86 s
[gammaloop-workspace-check] Checking num-traits v0.2.19
13.88 s
[gammaloop-workspace-check] Checking az v1.3.0
14.16 s
[gammaloop-workspace-check] Checking indenter v0.3.4
14.26 s
[gammaloop-workspace-check] Checking wide v1.3.0
14.47 s
[gammaloop-workspace-check] Compiling phf_shared v0.11.3
14.63 s
[gammaloop-workspace-check] Checking anyhow v1.0.102
14.76 s
[gammaloop-workspace-check] Checking rayon v1.12.0
14.78 s
[gammaloop-workspace-check] Checking rawpointer v0.2.1
14.91 s
[gammaloop-workspace-check] Checking alloc-no-stdlib v2.0.4
14.91 s
[gammaloop-workspace-check] Checking utf8parse v0.2.2
15.13 s
[gammaloop-workspace-check] Checking dyn-clone v1.0.20
15.15 s
[gammaloop-workspace-check] Checking anstyle-parse v1.0.0
15.18 s
[gammaloop-workspace-check] Checking toml_parser v1.1.2+spec-1.1.0
15.24 s
[gammaloop-workspace-check] Checking alloc-stdlib v0.2.2
15.40 s
[gammaloop-workspace-check] Checking matrixmultiply v0.3.10
15.43 s
[gammaloop-workspace-check] Checking is_terminal_polyfill v1.70.2
15.44 s
[gammaloop-workspace-check] Checking colorchoice v1.0.5
15.54 s
[gammaloop-workspace-check] Checking colored v3.1.1
15.59 s
[gammaloop-workspace-check] Checking anstyle v1.0.14
15.72 s
[gammaloop-workspace-check] Checking anstyle-query v1.1.5
15.86 s
[gammaloop-workspace-check] Compiling phf_generator v0.11.3
15.94 s
[gammaloop-workspace-check] Checking anstream v1.0.0
16.00 s
[gammaloop-workspace-check] Checking eyre v0.6.12
16.02 s
[gammaloop-workspace-check] Checking approx v0.5.1
16.07 s
[gammaloop-workspace-check] Checking serde v1.0.228
16.10 s
[gammaloop-workspace-check] Checking serde_json v1.0.149
16.12 s
[gammaloop-workspace-check] Checking bitflags v2.11.1
16.18 s
[gammaloop-workspace-check] Checking num-integer v0.1.46
16.20 s
[gammaloop-workspace-check] Checking serde_spanned v1.1.1
16.22 s
[gammaloop-workspace-check] Checking toml_datetime v1.1.1+spec-1.1.0
16.31 s
[gammaloop-workspace-check] Checking unicode-width v0.2.2
16.33 s
[gammaloop-workspace-check] Checking bitflags v1.3.2
16.36 s
[gammaloop-workspace-check] Compiling pyo3-build-config v0.28.3
16.39 s
[gammaloop-workspace-check] Compiling phf_codegen v0.11.3
16.41 s
[gammaloop-workspace-check] Checking brotli-decompressor v5.0.0
16.41 s
[gammaloop-workspace-check] Checking spec_math v0.1.6
16.44 s
[gammaloop-workspace-check] Checking inventory v0.3.24
16.47 s
[gammaloop-workspace-check] Checking regex-automata v0.4.14
16.53 s
[gammaloop-workspace-check] Checking thiserror v2.0.18
16.55 s
[gammaloop-workspace-check] Checking toml v1.1.2+spec-1.1.0
16.65 s
[gammaloop-workspace-check] Compiling getopts v0.2.24
16.68 s
[gammaloop-workspace-check] Checking libloading v0.9.0
16.68 s
[gammaloop-workspace-check] Checking byteorder v1.5.0
16.77 s
[gammaloop-workspace-check] Checking getrandom v0.3.4
16.86 s
[gammaloop-workspace-check] Checking time v0.3.47
16.90 s
[gammaloop-workspace-check] Checking gmp-mpfr-sys v1.7.1
17.00 s
[gammaloop-workspace-check] Checking region v3.0.2
17.02 s
[gammaloop-workspace-check] Checking hugepage-rs v0.1.1
17.08 s
[gammaloop-workspace-check] Checking rand_core v0.9.5
17.10 s
[gammaloop-workspace-check] Checking wasmtime-jit-icache-coherence v34.0.2
17.16 s
[gammaloop-workspace-check] Checking bytes v1.11.1
17.21 s
[gammaloop-workspace-check] Checking tinyjson v2.5.1
17.30 s
[gammaloop-workspace-check] Checking smallvec v1.15.1
17.31 s
[gammaloop-workspace-check] Checking num-complex v0.4.6
17.41 s
[gammaloop-workspace-check] Checking tracing-serde v0.2.0
17.48 s
[gammaloop-workspace-check] Checking bincode v2.0.1
17.54 s
[gammaloop-workspace-check] Checking smartstring v1.0.1
17.67 s
[gammaloop-workspace-check] Checking append-only-vec v0.1.8
17.70 s
[gammaloop-workspace-check] Checking self_cell v1.2.2
17.83 s
[gammaloop-workspace-check] Compiling unicode_names2_generator v1.3.0
17.87 s
[gammaloop-workspace-check] Compiling unic-common v0.9.0
17.99 s
[gammaloop-workspace-check] Checking linux-raw-sys v0.12.1
18.07 s
[gammaloop-workspace-check] Compiling unic-char-range v0.9.0
18.09 s
[gammaloop-workspace-check] Compiling unic-ucd-version v0.9.0
18.22 s
[gammaloop-workspace-check] Compiling unic-char-property v0.9.0
18.25 s
[gammaloop-workspace-check] Checking simba v0.9.1
18.30 s
[gammaloop-workspace-check] Compiling is-macro v0.3.7
18.37 s
[gammaloop-workspace-check] Checking brotli v8.0.2
18.42 s
[gammaloop-workspace-check] Compiling rustpython-parser-vendored v0.4.0
18.44 s
[gammaloop-workspace-check] Checking iana-time-zone v0.1.65
18.47 s
[gammaloop-workspace-check] Compiling rustpython-parser v0.4.0
18.73 s
[gammaloop-workspace-check] Checking chrono v0.4.44
18.87 s
[gammaloop-workspace-check] Checking rustix v1.1.4
19.08 s
[gammaloop-workspace-check] Compiling phf v0.11.3
19.31 s
[gammaloop-workspace-check] Checking ppv-lite86 v0.2.21
19.40 s
[gammaloop-workspace-check] Checking ahash v0.8.12
19.48 s
[gammaloop-workspace-check] Checking rustc-hash v2.1.2
19.51 s
[gammaloop-workspace-check] Compiling unic-emoji-char v0.9.0
19.51 s
[gammaloop-workspace-check] Compiling unic-ucd-ident v0.9.0
19.69 s
[gammaloop-workspace-check] Checking ndarray v0.17.2
19.85 s
[gammaloop-workspace-check] Compiling rustc-hash v1.1.0
19.91 s
[gammaloop-workspace-check] Compiling lalrpop-util v0.20.2
19.93 s
[gammaloop-workspace-check] Checking rug v1.30.0
19.96 s
[gammaloop-workspace-check] Checking unicode-segmentation v1.13.2
19.99 s
[gammaloop-workspace-check] Compiling symbolica v2.2.0 (https://github.com/alphal00p/symbolica?rev=a277a8dadbaae5a8d6605f2f381991a601e1f345#a277a8da)
20.12 s
[gammaloop-workspace-check] Checking typenum v1.20.0
20.26 s
[gammaloop-workspace-check] Checking getrandom v0.2.17
20.28 s
[gammaloop-workspace-check] Checking rand_chacha v0.9.0
20.65 s
[gammaloop-workspace-check] Checking scopeguard v1.2.0
20.76 s
[gammaloop-workspace-check] Checking rand v0.9.4
20.87 s
[gammaloop-workspace-check] Checking lock_api v0.4.14
21.07 s
[gammaloop-workspace-check] Checking parking_lot_core v0.9.12
21.13 s
[gammaloop-workspace-check] Checking unicode-ident v1.0.24
21.33 s
[gammaloop-workspace-check] Checking hashbrown v0.17.0
21.63 s
[gammaloop-workspace-check] Checking errno v0.3.14
21.67 s
[gammaloop-workspace-check] Checking parking_lot v0.12.5
21.83 s
[gammaloop-workspace-check] Checking unicase v2.9.0
21.93 s
[gammaloop-workspace-check] Checking strsim v0.11.1
22.07 s
[gammaloop-workspace-check] Checking clap_lex v1.1.0
22.11 s
[gammaloop-workspace-check] Checking signal-hook-registry v1.4.8
22.14 s
[gammaloop-workspace-check] Checking generic-array v0.14.7
22.16 s
[gammaloop-workspace-check] Checking vte v0.14.1
22.44 s
[gammaloop-workspace-check] Checking same-file v1.0.6
22.49 s
[gammaloop-workspace-check] Checking symjit v2.21.0
22.51 s
[gammaloop-workspace-check] Checking half v2.7.1
22.53 s
[gammaloop-workspace-check] Checking signal-hook v0.3.18
22.66 s
[gammaloop-workspace-check] Checking walkdir v2.5.0
22.69 s
[gammaloop-workspace-check] Checking indexmap v2.14.0
22.91 s
[gammaloop-workspace-check] Checking matchers v0.2.0
22.93 s
[gammaloop-workspace-check] Checking regex v1.12.3
23.06 s
[gammaloop-workspace-check] Checking crypto-common v0.1.7
23.10 s
[gammaloop-workspace-check] Checking block-buffer v0.10.4
23.14 s
[gammaloop-workspace-check] Checking tracing-subscriber v0.3.23
23.16 s
[gammaloop-workspace-check] Checking mio v1.2.0
23.20 s
[gammaloop-workspace-check] Checking terminal_size v0.4.4
23.29 s
[gammaloop-workspace-check] Checking minimal-lexical v0.2.1
23.35 s
[gammaloop-workspace-check] Checking ciborium-io v0.2.2
23.43 s
[gammaloop-workspace-check] Checking clap_builder v4.6.0
23.48 s
[gammaloop-workspace-check] Checking ciborium-ll v0.2.2
23.71 s
[gammaloop-workspace-check] Checking signal-hook-mio v0.2.5
23.74 s
[gammaloop-workspace-check] Checking digest v0.10.7
23.74 s
[gammaloop-workspace-check] Checking derive_more v2.1.1
23.85 s
[gammaloop-workspace-check] Checking nom v7.1.3
23.88 s
[gammaloop-workspace-check] Checking num-bigint v0.4.6
23.91 s
[gammaloop-workspace-check] Checking console v0.16.3
24.02 s
[gammaloop-workspace-check] Checking bstr v1.12.1
24.45 s
[gammaloop-workspace-check] Checking cpufeatures v0.2.17
24.56 s
[gammaloop-workspace-check] Checking winnow v0.7.15
24.59 s
[gammaloop-workspace-check] Checking linux-raw-sys v0.4.15
24.77 s
[gammaloop-workspace-check] Checking globset v0.4.18
25.36 s
[gammaloop-workspace-check] Checking rustix v0.38.44
25.51 s
[gammaloop-workspace-check] Checking sha2 v0.10.9
25.87 s
[gammaloop-workspace-check] Checking ciborium v0.2.2
26.08 s
[gammaloop-workspace-check] Checking getrandom v0.4.2
26.36 s
[gammaloop-workspace-check] Checking rand_core v0.6.4
26.53 s
[gammaloop-workspace-check] Checking fnv v1.0.7
26.55 s
[gammaloop-workspace-check] Checking fastrand v2.4.1
26.60 s
[gammaloop-workspace-check] Checking plotters-backend v0.3.7
26.63 s
[gammaloop-workspace-check] Checking rust-embed-utils v8.11.0
26.77 s
[gammaloop-workspace-check] Compiling unicode_names2 v1.3.0
26.83 s
[gammaloop-workspace-check] Checking serde_spanned v0.6.9
26.84 s
[gammaloop-workspace-check] Checking tempfile v3.27.0
26.86 s
[gammaloop-workspace-check] Checking toml_datetime v0.6.11
26.90 s
[gammaloop-workspace-check] Checking itertools v0.10.5
26.95 s
[gammaloop-workspace-check] Checking tap v1.0.1
27.00 s
[gammaloop-workspace-check] Checking crossterm v0.28.1
27.02 s
[gammaloop-workspace-check] Checking toml_write v0.1.2
27.10 s
[gammaloop-workspace-check] Checking plotters-svg v0.3.7
27.12 s
[gammaloop-workspace-check] Checking cast v0.3.0
27.19 s
[gammaloop-workspace-check] Checking wyz v0.5.1
27.24 s
[gammaloop-workspace-check] Checking clap v4.6.1
27.26 s
[gammaloop-workspace-check] Checking toml_edit v0.22.27
27.30 s
[gammaloop-workspace-check] Checking rand_chacha v0.3.1
27.31 s
[gammaloop-workspace-check] Checking plotters v0.3.7
27.33 s
[gammaloop-workspace-check] Checking radium v0.7.0
27.35 s
[gammaloop-workspace-check] Checking xprec v0.2.2
27.37 s
[gammaloop-workspace-check] Checking typeid v1.0.3
27.45 s
[gammaloop-workspace-check] Checking similar v2.7.0
27.47 s
[gammaloop-workspace-check] Checking ansitok v0.3.0
27.51 s
[gammaloop-workspace-check] Checking tinytemplate v1.2.1
27.54 s
[gammaloop-workspace-check] Checking is-terminal v0.4.17
27.59 s
[gammaloop-workspace-check] Checking anes v0.1.6
27.62 s
[gammaloop-workspace-check] Checking bytecount v0.6.9
27.65 s
[gammaloop-workspace-check] Checking funty v2.0.0
27.75 s
[gammaloop-workspace-check] Checking oorandom v11.1.5
27.86 s
[gammaloop-workspace-check] Checking rand v0.8.6
27.89 s
[gammaloop-workspace-check] Checking ron v0.12.1
27.91 s
[gammaloop-workspace-check] Checking toml_edit v0.25.11+spec-1.1.0
27.99 s
[gammaloop-workspace-check] Checking ansi-str v0.9.0
28.16 s
[gammaloop-workspace-check] Checking testing_table v0.3.0
28.30 s
[gammaloop-workspace-check] Checking env_filter v1.0.1
28.33 s
[gammaloop-workspace-check] Checking bitvec v1.0.1
28.39 s
[gammaloop-workspace-check] Checking criterion-plot v0.5.0
28.40 s
[gammaloop-workspace-check] Checking papergrid v0.17.0
28.48 s
[gammaloop-workspace-check] Checking uncased v0.9.10
28.50 s
[gammaloop-workspace-check] Checking jiff v0.2.24
28.62 s
[gammaloop-workspace-check] Checking ptr_meta v0.1.4
28.63 s
[gammaloop-workspace-check] Checking simdutf8 v0.1.5
28.66 s
[gammaloop-workspace-check] Checking ucd-trie v0.1.7
28.73 s
[gammaloop-workspace-check] Checking ahash v0.7.8
28.78 s
[gammaloop-workspace-check] Checking criterion v0.5.1
28.82 s
[gammaloop-workspace-check] Checking approx v0.4.0
28.90 s
[gammaloop-workspace-check] Checking pest v2.8.6
28.92 s
[gammaloop-workspace-check] Checking hashbrown v0.12.3
28.99 s
[gammaloop-workspace-check] Checking seahash v4.1.0
29.04 s
[gammaloop-workspace-check] Checking bytecheck v0.6.12
29.22 s
[gammaloop-workspace-check] Checking cgmath v0.18.0
29.38 s
[gammaloop-workspace-check] Checking num-rational v0.4.2
29.51 s
[gammaloop-workspace-check] Checking rend v0.4.2
29.54 s
[gammaloop-workspace-check] Checking insta v1.47.2
29.58 s
[gammaloop-workspace-check] Checking num-iter v0.1.45
29.83 s
[gammaloop-workspace-check] Checking ref-ops v0.2.5
29.96 s
[gammaloop-workspace-check] Checking num v0.4.3
29.98 s
[gammaloop-workspace-check] Checking rand_xoshiro v0.6.0
30.05 s
[gammaloop-workspace-check] Checking features v0.10.0
30.08 s
[gammaloop-workspace-check] Checking tabled v0.20.0
30.12 s
[gammaloop-workspace-check] Checking constcat v0.5.1
30.21 s
[gammaloop-workspace-check] Checking gat-lending-iterator v0.1.8
30.28 s
[gammaloop-workspace-check] Checking colored v2.2.0
30.29 s
[gammaloop-workspace-check] Checking arrayref v0.3.9
30.37 s
[gammaloop-workspace-check] Checking cpufeatures v0.3.0
30.42 s
[gammaloop-workspace-check] Checking constant_time_eq v0.4.2
30.64 s
[gammaloop-workspace-check] Checking blake3 v1.8.5
30.66 s
[gammaloop-workspace-check] Checking toml v0.8.23
30.68 s
[gammaloop-workspace-check] Checking base64 v0.22.1
30.80 s
[gammaloop-workspace-check] Checking joinery v2.1.0
30.89 s
[gammaloop-workspace-check] Checking siphasher v1.0.2
31.04 s
[gammaloop-workspace-check] Checking titlecase v2.2.1
31.06 s
[gammaloop-workspace-check] Checking subprocess v0.2.15
31.06 s
[gammaloop-workspace-check] Checking rust_lisp v0.18.0
31.06 s
[gammaloop-workspace-check] Compiling vakint v0.1.2 (/build/source/crates/vakint)
31.13 s
[gammaloop-workspace-check] Compiling pyo3-macros-backend v0.28.3
31.15 s
[gammaloop-workspace-check] Compiling pyo3-ffi v0.28.3
31.17 s
[gammaloop-workspace-check] Compiling pyo3 v0.28.3
31.23 s
[gammaloop-workspace-check] Compiling numpy v0.28.0
31.36 s
[gammaloop-workspace-check] Checking figment v0.10.19
31.51 s
[gammaloop-workspace-check] Checking dot-parser v0.5.1
31.66 s
[gammaloop-workspace-check] Checking phf_shared v0.13.1
31.73 s
[gammaloop-workspace-check] Checking string-template-plus v0.4.3
31.82 s
[gammaloop-workspace-check] Checking version-compare v0.2.1
31.84 s
[gammaloop-workspace-check] Checking xpct v0.5.1
31.86 s
[gammaloop-workspace-check] Checking ryu v1.0.23
31.96 s
[gammaloop-workspace-check] Checking castaway v0.2.4
31.98 s
[gammaloop-workspace-check] Checking phf v0.13.1
32.03 s
[gammaloop-workspace-check] Checking toml_datetime v0.7.5+spec-1.1.0
32.04 s
[gammaloop-workspace-check] Checking strum v0.27.2
32.16 s
[gammaloop-workspace-check] Checking unicode-truncate v2.0.1
32.19 s
[gammaloop-workspace-check] Checking kasuari v0.4.12
32.31 s
[gammaloop-workspace-check] Checking toml v0.9.12+spec-1.1.0
32.32 s
[gammaloop-workspace-check] Checking compact_str v0.9.0
32.34 s
[gammaloop-workspace-check] Checking lru v0.16.4
32.36 s
[gammaloop-workspace-check] Checking vte v0.15.0
32.38 s
[gammaloop-workspace-check] Checking portable-atomic v1.13.1
32.46 s
[gammaloop-workspace-check] Checking unit-prefix v0.5.2
32.51 s
[gammaloop-workspace-check] Checking rand_distr v0.4.3
32.57 s
[gammaloop-workspace-check] Checking vt100 v0.16.2
32.59 s
[gammaloop-workspace-check] Checking simba v0.6.0
32.64 s
[gammaloop-workspace-check] Checking line-clipping v0.3.7
32.67 s
[gammaloop-workspace-check] Checking adler2 v2.0.1
32.69 s
[gammaloop-workspace-check] Compiling three-dimensional-reps v0.1.0 (/build/source/crates/three-dimensional-reps)
32.72 s
[gammaloop-workspace-check] Checking gimli v0.32.3
32.77 s
[gammaloop-workspace-check] Checking miniz_oxide v0.8.9
32.80 s
[gammaloop-workspace-check] Checking env_logger v0.11.10
32.82 s
[gammaloop-workspace-check] Checking thiserror v1.0.69
32.91 s
[gammaloop-workspace-check] Checking derive_builder v0.11.2
32.95 s
[gammaloop-workspace-check] Checking owo-colors v4.3.0
33.00 s
[gammaloop-workspace-check] Checking object v0.37.3
33.05 s
[gammaloop-workspace-check] Checking ratatui-core v0.1.0
33.11 s
[gammaloop-workspace-check] Checking crossterm v0.29.0
33.13 s
[gammaloop-workspace-check] Checking tracing-error v0.2.1
33.20 s
[gammaloop-workspace-check] Checking indicatif v0.18.4
33.22 s
[gammaloop-workspace-check] Checking typed-index-collections v3.5.0
33.25 s
[gammaloop-workspace-check] Checking serde-big-array v0.5.1
33.33 s
[gammaloop-workspace-check] Checking amd v0.2.2
33.40 s
[gammaloop-workspace-check] Compiling rustpython-parser-core v0.4.0
33.42 s
[gammaloop-workspace-check] Checking itertools v0.11.0
33.45 s
[gammaloop-workspace-check] Compiling gammaloop-tracing-filter-macros v0.1.0 (/build/source/crates/gammaloop-tracing-filter-macros)
33.54 s
[gammaloop-workspace-check] Checking option-ext v0.2.0
33.67 s
[gammaloop-workspace-check] Checking rustc-demangle v0.1.27
33.68 s
[gammaloop-workspace-check] Checking rkyv v0.7.46
33.71 s
[gammaloop-workspace-check] Checking dirs-sys v0.5.0
33.81 s
[gammaloop-workspace-check] Compiling rustpython-ast v0.4.0
33.90 s
[gammaloop-workspace-check] Checking ref-cast v1.0.25
33.92 s
[gammaloop-workspace-check] Checking nix v0.31.2
34.01 s
[gammaloop-workspace-check] Checking integer-sqrt v0.1.5
34.03 s
[gammaloop-workspace-check] Checking brotli-decompressor v4.0.3
34.03 s
[gammaloop-workspace-check] Checking crossbeam-channel v0.5.15
34.03 s
[gammaloop-workspace-check] Checking itertools v0.12.1
34.10 s
[gammaloop-workspace-check] Checking unsafe-libyaml v0.2.11
34.10 s
[gammaloop-workspace-check] Checking color-spantrace v0.3.0
34.11 s
[gammaloop-workspace-check] Compiling gammalooprs v0.3.4 (/build/source/crates/gammalooprs)
34.34 s
[gammaloop-workspace-check] Checking symlink v0.1.0
34.39 s
[gammaloop-workspace-check] Checking include_dir v0.7.4
34.44 s
[gammaloop-workspace-check] Checking ratatui-widgets v0.3.0
34.55 s
[gammaloop-workspace-check] Checking ratatui-crossterm v0.1.0
34.56 s
[gammaloop-workspace-check] Checking tracing-appender v0.2.5
34.71 s
[gammaloop-workspace-check] Checking pathfinding v4.15.0
34.72 s
[gammaloop-workspace-check] Checking ctrlc v3.5.2
34.74 s
[gammaloop-workspace-check] Checking tracing-indicatif v0.3.14
34.84 s
[gammaloop-workspace-check] Checking clarabel v0.11.1
34.85 s
[gammaloop-workspace-check] Checking schemars v1.2.1
34.92 s
[gammaloop-workspace-check] Checking dirs v6.0.0
35.01 s
[gammaloop-workspace-check] Checking slotmap v1.1.1
35.06 s
[gammaloop-workspace-check] Checking json5 v0.4.1
35.13 s
[gammaloop-workspace-check] Checking brotli v7.0.0
35.18 s
[gammaloop-workspace-check] Checking serde_yaml v0.9.34+deprecated
35.50 s
[gammaloop-workspace-check] Checking vectorize v0.2.0
35.52 s
[gammaloop-workspace-check] Checking base62 v2.2.4
35.59 s
[gammaloop-workspace-check] Checking ringbuffer v0.16.0
35.75 s
[gammaloop-workspace-check] Checking rust-embed v8.11.0
35.77 s
[gammaloop-workspace-check] Checking addr2line v0.25.1
35.80 s
[gammaloop-workspace-check] Checking clap_complete v4.6.3
35.82 s
[gammaloop-workspace-check] Checking fd-lock v4.0.4
35.84 s
[gammaloop-workspace-check] Checking strip-ansi-escapes v0.2.1
35.92 s
[gammaloop-workspace-check] Checking ratatui-macros v0.7.0
35.94 s
[gammaloop-workspace-check] Compiling gammaloop-api v0.1.0 (/build/source/crates/gammaloop-api)
35.97 s
[gammaloop-workspace-check] Checking itertools v0.13.0
35.98 s
[gammaloop-workspace-check] Checking strum v0.26.3
36.04 s
[gammaloop-workspace-check] Checking ratatui v0.30.0
36.11 s
[gammaloop-workspace-check] Checking sysinfo v0.33.1
36.20 s
[gammaloop-workspace-check] Checking shlex v1.3.0
36.34 s
[gammaloop-workspace-check] Compiling numerica v2.2.0 (https://github.com/alphal00p/symbolica?rev=a277a8dadbaae5a8d6605f2f381991a601e1f345#a277a8da)
36.37 s
[gammaloop-workspace-check] Checking clap_complete_nushell v4.6.0
36.42 s
[gammaloop-workspace-check] Checking slab v0.4.12
36.50 s
[gammaloop-workspace-check] Checking futures-task v0.3.32
36.52 s
[gammaloop-workspace-check] Checking futures-core v0.3.32
36.62 s
[gammaloop-workspace-check] Checking sdd v3.0.10
36.77 s
[gammaloop-workspace-check] Compiling gammaloop-integration-tests v0.1.0 (/build/source/tests)
36.77 s
[gammaloop-workspace-check] Compiling test-log-core v0.2.20
36.80 s
[gammaloop-workspace-check] Checking futures-util v0.3.32
36.84 s
[gammaloop-workspace-check] Compiling rustc_version v0.4.1
37.02 s
[gammaloop-workspace-check] Checking which v8.0.2
37.07 s
[gammaloop-workspace-check] Checking scc v2.4.0
37.18 s
[gammaloop-workspace-check] Checking bincode v1.3.3
37.28 s
[gammaloop-workspace-check] Compiling gungraun-runner v0.18.2
37.59 s
[gammaloop-workspace-check] Checking backtrace v0.3.76
37.72 s
[gammaloop-workspace-check] Checking reedline v0.42.0
37.88 s
[gammaloop-workspace-check] Compiling gungraun-macros v0.8.0
38.15 s
[gammaloop-workspace-check] Checking color-eyre v0.6.5
38.17 s
[gammaloop-workspace-check] Checking nalgebra v0.29.0
38.36 s
[gammaloop-workspace-check] Checking proc-macro2 v1.0.106
38.83 s
[gammaloop-workspace-check] Checking maplit v1.0.2
38.90 s
[gammaloop-workspace-check] Checking base64 v0.21.7
38.96 s
[gammaloop-workspace-check] Compiling iai-callgrind-runner v0.14.2
38.99 s
[gammaloop-workspace-check] Checking quote v1.0.45
39.21 s
[gammaloop-workspace-check] Checking kurbo v0.13.0
39.33 s
[gammaloop-workspace-check] Checking futures-executor v0.3.32
39.41 s
[gammaloop-workspace-check] Checking ron v0.8.1
39.43 s
[gammaloop-workspace-check] Checking wait-timeout v0.2.1
39.47 s
[gammaloop-workspace-check] Compiling iai-callgrind v0.14.2
39.50 s
[gammaloop-workspace-check] Checking serial_test v3.4.0
39.54 s
[gammaloop-workspace-check] Checking bit-vec v0.8.0
39.62 s
[gammaloop-workspace-check] Checking quick-error v1.2.3
39.76 s
[gammaloop-workspace-check] Checking rusty-fork v0.3.1
39.88 s
[gammaloop-workspace-check] Compiling test-log-macros v0.2.20
39.94 s
[gammaloop-workspace-check] Checking bit-set v0.8.0
40.04 s
[gammaloop-workspace-check] Checking syn v2.0.117
40.06 s
[gammaloop-workspace-check] Compiling iai-callgrind-macros v0.5.1
40.16 s
[gammaloop-workspace-check] Checking rand_xorshift v0.4.0
40.35 s
[gammaloop-workspace-check] Checking console v0.15.11
40.38 s
[gammaloop-workspace-check] Checking unarray v0.1.4
40.38 s
[gammaloop-workspace-check] Checking pathdiff v0.2.3
40.52 s
[gammaloop-workspace-check] Checking proptest v1.11.0
40.54 s
[gammaloop-workspace-check] Checking clinnet v0.1.8 (/build/source/crates/clinnet)
40.90 s
[gammaloop-workspace-check] Checking similar-asserts v1.7.0
41.10 s
[gammaloop-workspace-check] Checking kurvst v0.1.0 (/build/source/crates/kurvst)
41.98 s
[gammaloop-workspace-check] Compiling graphica v2.1.0 (https://github.com/alphal00p/symbolica?rev=a277a8dadbaae5a8d6605f2f381991a601e1f345#a277a8da)
43.37 s
[gammaloop-workspace-check] Checking test-log v0.2.20
46.40 s
[gammaloop-workspace-check] Checking statrs v0.16.1
47.30 s
[gammaloop-workspace-check] Checking momtrop v0.3.0
48.35 s
[gammaloop-workspace-check] Checking gungraun v0.18.2
51.31 s
[gammaloop-workspace-check] Compiling pyo3-macros v0.28.3
52.02 s
[gammaloop-workspace-check] Compiling pyo3-stub-gen-derive v0.17.2
61.66 s
[gammaloop-workspace-check] Checking pyo3-stub-gen v0.17.2
76.11 s
[gammaloop-workspace-check] Checking symbolica-utils v0.1.0 (/build/source/crates/symbolica-utils)
76.11 s
[gammaloop-workspace-check] Checking spenso-macros v0.3.2 (/build/source/crates/spenso-macros)
363.91 s
[gammaloop-workspace-check] Compiling gammaloop-workspace-hack v0.1.0 (/build/source/crates/gammaloop-workspace-hack)
364.17 s
[gammaloop-workspace-check] Checking linnet v0.17.0 (/build/source/crates/linnet)
367.79 s
[gammaloop-workspace-check] Checking spenso v0.6.0 (/build/source/crates/spenso)
368.20 s
[gammaloop-workspace-check] Checking linnet-py v0.1.0 (/build/source/crates/linnet-py)
368.20 s
[gammaloop-workspace-check] Checking linnest v0.1.0 (/build/source/crates/linnest)
374.55 s
[gammaloop-workspace-check] Checking idenso v0.3.0 (/build/source/crates/idenso)
374.56 s
[gammaloop-workspace-check] Checking gammaloop-tracing-filter v0.1.0 (/build/source/crates/gammaloop-tracing-filter)
377.82 s
[gammaloop-workspace-check] Checking spenso-hep-lib v0.1.7 (/build/source/crates/spenso-hep-lib)
378.13 s
[gammaloop-workspace-check] Checking spynso3 v0.1.2 (/build/source/crates/spynso3)
423.06 s
[gammaloop-workspace-check] warning : unused import: `GaussianReferenceFunction`
423.06 s
[gammaloop-workspace-check] --> crates/gammaloop-api/src/state.rs:38:27
423.06 s
[gammaloop-workspace-check] |
423.06 s
[gammaloop-workspace-check] 38 | integrands::process::{GaussianReferenceFunction, ProcessIntegrand},
423.06 s
[gammaloop-workspace-check] | ^^^^^^^^^^^^^^^^^^^^^^^^^
423.06 s
[gammaloop-workspace-check] |
423.06 s
[gammaloop-workspace-check] = note : `#[warn(unused_imports)]` (part of `#[warn(unused)]`) on by default
423.06 s
[gammaloop-workspace-check]
432.35 s
[gammaloop-workspace-check] warning : `gammaloop-api` (lib) generated 1 warning (run `cargo fix --lib -p gammaloop-api` to apply 1 suggestion)
433.16 s
[gammaloop-workspace-check] error[E0560] : struct `CutInfo` has no field named `lmb_channel_id`
433.16 s
[gammaloop-workspace-check] --> tests/tests/test_differential.rs:86:13
433.16 s
[gammaloop-workspace-check] |
433.16 s
[gammaloop-workspace-check] 86 | lmb_channel_id: None,
433.16 s
[gammaloop-workspace-check] | ^^^^^^^^^^^^^^ `CutInfo` does not have this field
433.16 s
[gammaloop-workspace-check] |
433.16 s
[gammaloop-workspace-check] = note : available fields are: `sampling_channel_id`, `sampling_channel_edge_ids`
433.16 s
[gammaloop-workspace-check]
433.16 s
[gammaloop-workspace-check] error[E0560] : struct `CutInfo` has no field named `lmb_channel_edge_ids`
433.16 s
[gammaloop-workspace-check] --> tests/tests/test_differential.rs:87:13
433.16 s
[gammaloop-workspace-check] |
433.16 s
[gammaloop-workspace-check] 87 | lmb_channel_edge_ids: None,
433.16 s
[gammaloop-workspace-check] | ^^^^^^^^^^^^^^^^^^^^ `CutInfo` does not have this field
433.16 s
[gammaloop-workspace-check] |
433.16 s
[gammaloop-workspace-check] = note : available fields are: `sampling_channel_id`, `sampling_channel_edge_ids`
433.16 s
[gammaloop-workspace-check]
433.40 s
[gammaloop-workspace-check] For more information about this error, try `rustc --explain E0560`.
433.42 s
[gammaloop-workspace-check] error : could not compile `gammaloop-integration-tests` (test "test_differential") due to 2 previous errors
433.42 s
[gammaloop-workspace-check] warning : build failed, waiting for other jobs to finish...
433.57 s
[gammaloop-workspace-check] error[E0609] : no field `lmb_channel_edge_ids` on type `CutInfo`
433.57 s
[gammaloop-workspace-check] --> tests/tests/test_evaluation_api.rs:311:10
433.57 s
[gammaloop-workspace-check] |
433.57 s
[gammaloop-workspace-check] 311 | .lmb_channel_edge_ids
433.57 s
[gammaloop-workspace-check] | ^^^^^^^^^^^^^^^^^^^^ unknown field
433.57 s
[gammaloop-workspace-check] |
433.57 s
[gammaloop-workspace-check] = note : available fields are: `particle_pdgs`, `cut_id`, `graph_id`, `graph_group_id`, `orientation_id` ... and 2 others
433.57 s
[gammaloop-workspace-check]
433.62 s
[gammaloop-workspace-check] error[E0609] : no field `lmb_channel_edge_ids` on type `CutInfo`
433.62 s
[gammaloop-workspace-check] --> tests/tests/test_evaluation_api.rs:591:26
433.62 s
[gammaloop-workspace-check] |
433.62 s
[gammaloop-workspace-check] 591 | .lmb_channel_edge_ids
433.62 s
[gammaloop-workspace-check] | ^^^^^^^^^^^^^^^^^^^^ unknown field
433.62 s
[gammaloop-workspace-check] |
433.62 s
[gammaloop-workspace-check] = note : available fields are: `particle_pdgs`, `cut_id`, `graph_id`, `graph_group_id`, `orientation_id` ... and 2 others
433.62 s
[gammaloop-workspace-check]
433.71 s
[gammaloop-workspace-check] error[E0609] : no field `lmb_channel_edge_ids` on type `CutInfo`
433.71 s
[gammaloop-workspace-check] --> tests/tests/test_evaluation_api.rs:1177:18
433.71 s
[gammaloop-workspace-check] |
433.71 s
[gammaloop-workspace-check] 1177 | .lmb_channel_edge_ids
433.71 s
[gammaloop-workspace-check] | ^^^^^^^^^^^^^^^^^^^^ unknown field
433.71 s
[gammaloop-workspace-check] |
433.71 s
[gammaloop-workspace-check] = note : available fields are: `particle_pdgs`, `cut_id`, `graph_id`, `graph_group_id`, `orientation_id` ... and 2 others
433.71 s
[gammaloop-workspace-check]
433.93 s
[gammaloop-workspace-check] error[E0609] : no field `lmb_channel_edge_ids` on type `CutInfo`
433.93 s
[gammaloop-workspace-check] --> tests/tests/test_evaluation_api.rs:1222:22
433.93 s
[gammaloop-workspace-check] |
433.93 s
[gammaloop-workspace-check] 1222 | .lmb_channel_edge_ids
433.93 s
[gammaloop-workspace-check] | ^^^^^^^^^^^^^^^^^^^^ unknown field
433.93 s
[gammaloop-workspace-check] |
433.93 s
[gammaloop-workspace-check] = note : available fields are: `particle_pdgs`, `cut_id`, `graph_id`, `graph_group_id`, `orientation_id` ... and 2 others
433.93 s
[gammaloop-workspace-check]
433.93 s
[gammaloop-workspace-check] error[E0609] : no field `lmb_channel_edge_ids` on type `CutInfo`
433.93 s
[gammaloop-workspace-check] --> tests/tests/test_evaluation_api.rs:1281:14
433.93 s
[gammaloop-workspace-check] |
433.93 s
[gammaloop-workspace-check] 1281 | .lmb_channel_edge_ids
433.93 s
[gammaloop-workspace-check] | ^^^^^^^^^^^^^^^^^^^^ unknown field
433.93 s
[gammaloop-workspace-check] |
433.93 s
[gammaloop-workspace-check] = note : available fields are: `particle_pdgs`, `cut_id`, `graph_id`, `graph_group_id`, `orientation_id` ... and 2 others
433.93 s
[gammaloop-workspace-check]
434.04 s
[gammaloop-workspace-check] error[E0609] : no field `lmb_channel_edge_ids` on type `CutInfo`
434.04 s
[gammaloop-workspace-check] --> tests/tests/test_evaluation_api.rs:1428:18
434.04 s
[gammaloop-workspace-check] |
434.04 s
[gammaloop-workspace-check] 1428 | .lmb_channel_edge_ids
434.04 s
[gammaloop-workspace-check] | ^^^^^^^^^^^^^^^^^^^^ unknown field
434.04 s
[gammaloop-workspace-check] |
434.04 s
[gammaloop-workspace-check] = note : available fields are: `particle_pdgs`, `cut_id`, `graph_id`, `graph_group_id`, `orientation_id` ... and 2 others
434.04 s
[gammaloop-workspace-check]
434.25 s
[gammaloop-workspace-check] For more information about this error, try `rustc --explain E0609`.
434.29 s
[gammaloop-workspace-check] error : could not compile `gammaloop-integration-tests` (test "test_evaluation_api") due to 6 previous errors
435.41 s
[gammaloop-workspace-check] error[E0609] : no field `lmb_channel_id` on type `CutInfo`
435.41 s
[gammaloop-workspace-check] --> tests/tests/test_runs/utils.rs:568:36
435.41 s
[gammaloop-workspace-check] |
435.41 s
[gammaloop-workspace-check] 568 | event.cut_info.lmb_channel_id,
435.41 s
[gammaloop-workspace-check] | ^^^^^^^^^^^^^^ unknown field
435.41 s
[gammaloop-workspace-check] |
435.41 s
[gammaloop-workspace-check] = note : available fields are: `particle_pdgs`, `cut_id`, `graph_id`, `graph_group_id`, `orientation_id` ... and 2 others
435.41 s
[gammaloop-workspace-check]
435.42 s
[gammaloop-workspace-check] error[E0609] : no field `lmb_channel_id` on type `CutInfo`
435.42 s
[gammaloop-workspace-check] --> tests/tests/test_runs/utils.rs:580:36
435.42 s
[gammaloop-workspace-check] |
435.42 s
[gammaloop-workspace-check] 580 | event.cut_info.lmb_channel_id,
435.42 s
[gammaloop-workspace-check] | ^^^^^^^^^^^^^^ unknown field
435.42 s
[gammaloop-workspace-check] |
435.42 s
[gammaloop-workspace-check] = note : available fields are: `particle_pdgs`, `cut_id`, `graph_id`, `graph_group_id`, `orientation_id` ... and 2 others
435.42 s
[gammaloop-workspace-check]
436.42 s
[gammaloop-workspace-check] error : could not compile `gammaloop-integration-tests` (test "test_runs") due to 2 previous errors
437.53 s
Progress: 0 of 1 built (1 failed)
437.53 s
Failed to build gammaloop-workspace-check after 7m11s
437.54 s
Cannot build ' /nix/store/53802zbj9009bwya0yb48jnjgdmqv87h-gammaloop-workspace-check-0.1.0.drv '.
437.54 s
Reason: builder failed with exit code 101 .
437.54 s
Output paths:
437.54 s
/nix/store/zix3gc9sr11cdhaa6ydaq99q1822fi52-gammaloop-workspace-check-0.1.0
437.54 s
Last 520 log lines:
437.54 s
> Running phase: unpackPhase
437.54 s
> unpacking source archive /nix/store/401j5sh0ylbdhdhk1c9kp8s5d8i5hpv1-source
437.54 s
> source root is source
437.54 s
> Running phase: patchPhase
437.54 s
> Executing configureCargoCommonVars
437.54 s
> decompressing cargo artifacts from /nix/store/50vpxlcgfxf2d57i27v3d10zjwxxbm2r-gammaloop-workspace-deps-deps-0.1.0/target.tar.zst to target
437.54 s
> Running phase: updateAutotoolsGnuConfigScriptsPhase
437.54 s
> Running phase: configurePhase
437.54 s
> will append /build/source/.cargo-home/config.toml with contents of /nix/store/5drf77x6km4ky7gwlrzdx9bbd6fz09g3-vendor-cargo-deps/config.toml
437.54 s
> default configurePhase, nothing to do
437.54 s
> Running phase: buildPhase
437.54 s
> +++ command cargo --version
437.54 s
> cargo 1.97.0 (c980f4866 2026-06-30)
437.54 s
> +++ command cargo check --profile ci-optim --locked --workspace --features gammaloop-tracing-filter/clap,gammaloop-tracing-filter/symbolica,idenso/bincode,idenso/reference-cases,linnet/bincode,linnet/drawing,linnet/rkyv,linnet/serde,linnet/symbolica,spenso-macros/shadowing,spenso/shadowing,symbolica/tracing_max_level_info,three-dimensional-reps/display,three-dimensional-reps/eval,three-dimensional-reps/serde --all-targets
437.54 s
> Checking cfg-if v1.0.4
437.54 s
> Checking memchr v2.8.0
437.54 s
> Checking once_cell v1.21.4
437.54 s
> Checking either v1.15.0
437.54 s
> Checking serde_core v1.0.228
437.54 s
> Checking libc v0.2.186
437.54 s
> Checking libm v0.2.16
437.54 s
> Checking itoa v1.0.18
437.54 s
> Checking log v0.4.29
437.54 s
> Checking regex-syntax v0.8.10
437.54 s
> Checking zerocopy v0.8.48
437.54 s
> Checking crossbeam-utils v0.8.21
437.54 s
> Checking equivalent v1.0.2
437.54 s
> Checking zmij v1.0.21
437.54 s
> Checking bytemuck v1.25.0
437.54 s
> Checking lazy_static v1.5.0
437.54 s
> Compiling target-lexicon v0.13.5
437.54 s
> Checking arrayvec v0.7.6
437.54 s
> Checking powerfmt v0.2.0
437.54 s
> Checking num_threads v0.1.7
437.54 s
> Checking deranged v0.5.8
437.54 s
> Checking time-core v0.1.8
437.54 s
> Checking itertools v0.14.0
437.54 s
> Checking pin-project-lite v0.2.17
437.54 s
> Checking num-conv v0.2.1
437.54 s
> Checking safe_arch v0.7.4
437.54 s
> Checking tracing-core v0.1.36
437.54 s
> Checking foldhash v0.2.0
437.54 s
> Checking allocator-api2 v0.2.21
437.54 s
> Checking crossbeam-epoch v0.9.18
437.54 s
> Checking const-random v0.1.18
437.54 s
> Checking static_assertions v1.1.0
437.54 s
> Checking unty v0.0.4
437.54 s
> Checking nu-ansi-term v0.50.3
437.54 s
> Checking winnow v1.0.2
437.54 s
> Checking safe_arch v1.0.0
437.54 s
> Checking wide v0.7.33
437.54 s
> Checking tracing v0.1.44
437.54 s
> Checking tracing-log v0.2.0
437.54 s
> Checking sharded-slab v0.1.7
437.54 s
> Checking aho-corasick v1.1.4
437.54 s
> Checking hashbrown v0.16.1
437.54 s
> Checking crossbeam-deque v0.8.6
437.54 s
> Checking thread_local v1.1.9
437.54 s
> Checking rayon-core v1.13.0
437.54 s
> Checking toml_writer v1.1.1+spec-1.1.0
437.54 s
> Checking num-traits v0.2.19
437.54 s
> Checking az v1.3.0
437.54 s
> Checking indenter v0.3.4
437.54 s
> Checking wide v1.3.0
437.54 s
> Compiling phf_shared v0.11.3
437.54 s
> Checking anyhow v1.0.102
437.54 s
> Checking rayon v1.12.0
437.54 s
> Checking rawpointer v0.2.1
437.54 s
> Checking alloc-no-stdlib v2.0.4
437.54 s
> Checking utf8parse v0.2.2
437.54 s
> Checking dyn-clone v1.0.20
437.54 s
> Checking anstyle-parse v1.0.0
437.54 s
> Checking toml_parser v1.1.2+spec-1.1.0
437.54 s
> Checking alloc-stdlib v0.2.2
437.54 s
> Checking matrixmultiply v0.3.10
437.54 s
> Checking is_terminal_polyfill v1.70.2
437.54 s
> Checking colorchoice v1.0.5
437.54 s
> Checking colored v3.1.1
437.54 s
> Checking anstyle v1.0.14
437.54 s
> Checking anstyle-query v1.1.5
437.54 s
> Compiling phf_generator v0.11.3
437.54 s
> Checking anstream v1.0.0
437.54 s
> Checking eyre v0.6.12
437.54 s
> Checking approx v0.5.1
437.54 s
> Checking serde v1.0.228
437.54 s
> Checking serde_json v1.0.149
437.54 s
> Checking bitflags v2.11.1
437.54 s
> Checking num-integer v0.1.46
437.54 s
> Checking serde_spanned v1.1.1
437.54 s
> Checking toml_datetime v1.1.1+spec-1.1.0
437.54 s
> Checking unicode-width v0.2.2
437.54 s
> Checking bitflags v1.3.2
437.54 s
> Compiling pyo3-build-config v0.28.3
437.54 s
> Compiling phf_codegen v0.11.3
437.54 s
> Checking brotli-decompressor v5.0.0
437.54 s
> Checking spec_math v0.1.6
437.54 s
> Checking inventory v0.3.24
437.54 s
> Checking regex-automata v0.4.14
437.54 s
> Checking thiserror v2.0.18
437.54 s
> Checking toml v1.1.2+spec-1.1.0
437.54 s
> Compiling getopts v0.2.24
437.54 s
> Checking libloading v0.9.0
437.54 s
> Checking byteorder v1.5.0
437.54 s
> Checking getrandom v0.3.4
437.54 s
> Checking time v0.3.47
437.54 s
> Checking gmp-mpfr-sys v1.7.1
437.54 s
> Checking region v3.0.2
437.54 s
> Checking hugepage-rs v0.1.1
437.54 s
> Checking rand_core v0.9.5
437.54 s
> Checking wasmtime-jit-icache-coherence v34.0.2
437.54 s
> Checking bytes v1.11.1
437.54 s
> Checking tinyjson v2.5.1
437.54 s
> Checking smallvec v1.15.1
437.54 s
> Checking num-complex v0.4.6
437.54 s
> Checking tracing-serde v0.2.0
437.54 s
> Checking bincode v2.0.1
437.54 s
> Checking smartstring v1.0.1
437.54 s
> Checking append-only-vec v0.1.8
437.54 s
> Checking self_cell v1.2.2
437.54 s
> Compiling unicode_names2_generator v1.3.0
437.54 s
> Compiling unic-common v0.9.0
437.54 s
> Checking linux-raw-sys v0.12.1
437.54 s
> Compiling unic-char-range v0.9.0
437.54 s
> Compiling unic-ucd-version v0.9.0
437.54 s
> Compiling unic-char-property v0.9.0
437.54 s
> Checking simba v0.9.1
437.54 s
> Compiling is-macro v0.3.7
437.54 s
> Checking brotli v8.0.2
437.54 s
> Compiling rustpython-parser-vendored v0.4.0
437.54 s
> Checking iana-time-zone v0.1.65
437.54 s
> Compiling rustpython-parser v0.4.0
437.54 s
> Checking chrono v0.4.44
437.54 s
> Checking rustix v1.1.4
437.54 s
> Compiling phf v0.11.3
437.54 s
> Checking ppv-lite86 v0.2.21
437.54 s
> Checking ahash v0.8.12
437.54 s
> Checking rustc-hash v2.1.2
437.54 s
> Compiling unic-emoji-char v0.9.0
437.54 s
> Compiling unic-ucd-ident v0.9.0
437.54 s
> Checking ndarray v0.17.2
437.54 s
> Compiling rustc-hash v1.1.0
437.54 s
> Compiling lalrpop-util v0.20.2
437.54 s
> Checking rug v1.30.0
437.54 s
> Checking unicode-segmentation v1.13.2
437.54 s
> Compiling symbolica v2.2.0 (https://github.com/alphal00p/symbolica?rev=a277a8dadbaae5a8d6605f2f381991a601e1f345#a277a8da)
437.54 s
> Checking typenum v1.20.0
437.54 s
> Checking getrandom v0.2.17
437.54 s
> Checking rand_chacha v0.9.0
437.54 s
> Checking scopeguard v1.2.0
437.54 s
> Checking rand v0.9.4
437.54 s
> Checking lock_api v0.4.14
437.54 s
> Checking parking_lot_core v0.9.12
437.54 s
> Checking unicode-ident v1.0.24
437.54 s
> Checking hashbrown v0.17.0
437.54 s
> Checking errno v0.3.14
437.54 s
> Checking parking_lot v0.12.5
437.54 s
> Checking unicase v2.9.0
437.54 s
> Checking strsim v0.11.1
437.54 s
> Checking clap_lex v1.1.0
437.54 s
> Checking signal-hook-registry v1.4.8
437.54 s
> Checking generic-array v0.14.7
437.54 s
> Checking vte v0.14.1
437.54 s
> Checking same-file v1.0.6
437.54 s
> Checking symjit v2.21.0
437.54 s
> Checking half v2.7.1
437.54 s
> Checking signal-hook v0.3.18
437.54 s
> Checking walkdir v2.5.0
437.54 s
> Checking indexmap v2.14.0
437.54 s
> Checking matchers v0.2.0
437.54 s
> Checking regex v1.12.3
437.54 s
> Checking crypto-common v0.1.7
437.54 s
> Checking block-buffer v0.10.4
437.54 s
> Checking tracing-subscriber v0.3.23
437.54 s
> Checking mio v1.2.0
437.54 s
> Checking terminal_size v0.4.4
437.54 s
> Checking minimal-lexical v0.2.1
437.54 s
> Checking ciborium-io v0.2.2
437.54 s
> Checking clap_builder v4.6.0
437.54 s
> Checking ciborium-ll v0.2.2
437.54 s
> Checking signal-hook-mio v0.2.5
437.54 s
> Checking digest v0.10.7
437.54 s
> Checking derive_more v2.1.1
437.54 s
> Checking nom v7.1.3
437.54 s
> Checking num-bigint v0.4.6
437.54 s
> Checking console v0.16.3
437.54 s
> Checking bstr v1.12.1
437.54 s
> Checking cpufeatures v0.2.17
437.54 s
> Checking winnow v0.7.15
437.54 s
> Checking linux-raw-sys v0.4.15
437.54 s
> Checking globset v0.4.18
437.54 s
> Checking rustix v0.38.44
437.54 s
> Checking sha2 v0.10.9
437.54 s
> Checking ciborium v0.2.2
437.54 s
> Checking getrandom v0.4.2
437.54 s
> Checking rand_core v0.6.4
437.54 s
> Checking fnv v1.0.7
437.54 s
> Checking fastrand v2.4.1
437.54 s
> Checking plotters-backend v0.3.7
437.54 s
> Checking rust-embed-utils v8.11.0
437.54 s
> Compiling unicode_names2 v1.3.0
437.54 s
> Checking serde_spanned v0.6.9
437.54 s
> Checking tempfile v3.27.0
437.54 s
> Checking toml_datetime v0.6.11
437.54 s
> Checking itertools v0.10.5
437.54 s
> Checking tap v1.0.1
437.54 s
> Checking crossterm v0.28.1
437.54 s
> Checking toml_write v0.1.2
437.54 s
> Checking plotters-svg v0.3.7
437.54 s
> Checking cast v0.3.0
437.54 s
> Checking wyz v0.5.1
437.54 s
> Checking clap v4.6.1
437.54 s
> Checking toml_edit v0.22.27
437.54 s
> Checking rand_chacha v0.3.1
437.54 s
> Checking plotters v0.3.7
437.54 s
> Checking radium v0.7.0
437.54 s
> Checking xprec v0.2.2
437.54 s
> Checking typeid v1.0.3
437.54 s
> Checking similar v2.7.0
437.54 s
> Checking ansitok v0.3.0
437.54 s
> Checking tinytemplate v1.2.1
437.54 s
> Checking is-terminal v0.4.17
437.54 s
> Checking anes v0.1.6
437.54 s
> Checking bytecount v0.6.9
437.54 s
> Checking funty v2.0.0
437.54 s
> Checking oorandom v11.1.5
437.54 s
> Checking rand v0.8.6
437.54 s
> Checking ron v0.12.1
437.54 s
> Checking toml_edit v0.25.11+spec-1.1.0
437.54 s
> Checking ansi-str v0.9.0
437.54 s
> Checking testing_table v0.3.0
437.54 s
> Checking env_filter v1.0.1
437.54 s
> Checking bitvec v1.0.1
437.54 s
> Checking criterion-plot v0.5.0
437.54 s
> Checking papergrid v0.17.0
437.54 s
> Checking uncased v0.9.10
437.54 s
> Checking jiff v0.2.24
437.54 s
> Checking ptr_meta v0.1.4
437.54 s
> Checking simdutf8 v0.1.5
437.54 s
> Checking ucd-trie v0.1.7
437.54 s
> Checking ahash v0.7.8
437.54 s
> Checking criterion v0.5.1
437.54 s
> Checking approx v0.4.0
437.54 s
> Checking pest v2.8.6
437.54 s
> Checking hashbrown v0.12.3
437.54 s
> Checking seahash v4.1.0
437.54 s
> Checking bytecheck v0.6.12
437.54 s
> Checking cgmath v0.18.0
437.54 s
> Checking num-rational v0.4.2
437.54 s
> Checking rend v0.4.2
437.54 s
> Checking insta v1.47.2
437.54 s
> Checking num-iter v0.1.45
437.54 s
> Checking ref-ops v0.2.5
437.54 s
> Checking num v0.4.3
437.54 s
> Checking rand_xoshiro v0.6.0
437.54 s
> Checking features v0.10.0
437.54 s
> Checking tabled v0.20.0
437.54 s
> Checking constcat v0.5.1
437.54 s
> Checking gat-lending-iterator v0.1.8
437.54 s
> Checking colored v2.2.0
437.54 s
> Checking arrayref v0.3.9
437.54 s
> Checking cpufeatures v0.3.0
437.54 s
> Checking constant_time_eq v0.4.2
437.54 s
> Checking blake3 v1.8.5
437.54 s
> Checking toml v0.8.23
437.54 s
> Checking base64 v0.22.1
437.54 s
> Checking joinery v2.1.0
437.54 s
> Checking siphasher v1.0.2
437.54 s
> Checking titlecase v2.2.1
437.54 s
> Checking subprocess v0.2.15
437.54 s
> Checking rust_lisp v0.18.0
437.54 s
> Compiling vakint v0.1.2 (/build/source/crates/vakint)
437.54 s
> Compiling pyo3-macros-backend v0.28.3
437.54 s
> Compiling pyo3-ffi v0.28.3
437.54 s
> Compiling pyo3 v0.28.3
437.54 s
> Compiling numpy v0.28.0
437.54 s
> Checking figment v0.10.19
437.54 s
> Checking dot-parser v0.5.1
437.54 s
> Checking phf_shared v0.13.1
437.54 s
> Checking string-template-plus v0.4.3
437.54 s
> Checking version-compare v0.2.1
437.54 s
> Checking xpct v0.5.1
437.54 s
> Checking ryu v1.0.23
437.54 s
> Checking castaway v0.2.4
437.54 s
> Checking phf v0.13.1
437.54 s
> Checking toml_datetime v0.7.5+spec-1.1.0
437.54 s
> Checking strum v0.27.2
437.54 s
> Checking unicode-truncate v2.0.1
437.54 s
> Checking kasuari v0.4.12
437.54 s
> Checking toml v0.9.12+spec-1.1.0
437.54 s
> Checking compact_str v0.9.0
437.54 s
> Checking lru v0.16.4
437.54 s
> Checking vte v0.15.0
437.54 s
> Checking portable-atomic v1.13.1
437.54 s
> Checking unit-prefix v0.5.2
437.54 s
> Checking rand_distr v0.4.3
437.54 s
> Checking vt100 v0.16.2
437.54 s
> Checking simba v0.6.0
437.54 s
> Checking line-clipping v0.3.7
437.54 s
> Checking adler2 v2.0.1
437.54 s
> Compiling three-dimensional-reps v0.1.0 (/build/source/crates/three-dimensional-reps)
437.54 s
> Checking gimli v0.32.3
437.54 s
> Checking miniz_oxide v0.8.9
437.54 s
> Checking env_logger v0.11.10
437.54 s
> Checking thiserror v1.0.69
437.54 s
> Checking derive_builder v0.11.2
437.54 s
> Checking owo-colors v4.3.0
437.54 s
> Checking object v0.37.3
437.54 s
> Checking ratatui-core v0.1.0
437.54 s
> Checking crossterm v0.29.0
437.54 s
> Checking tracing-error v0.2.1
437.54 s
> Checking indicatif v0.18.4
437.54 s
> Checking typed-index-collections v3.5.0
437.54 s
> Checking serde-big-array v0.5.1
437.54 s
> Checking amd v0.2.2
437.54 s
> Compiling rustpython-parser-core v0.4.0
437.54 s
> Checking itertools v0.11.0
437.54 s
> Compiling gammaloop-tracing-filter-macros v0.1.0 (/build/source/crates/gammaloop-tracing-filter-macros)
437.54 s
> Checking option-ext v0.2.0
437.54 s
> Checking rustc-demangle v0.1.27
437.54 s
> Checking rkyv v0.7.46
437.54 s
> Checking dirs-sys v0.5.0
437.54 s
> Compiling rustpython-ast v0.4.0
437.54 s
> Checking ref-cast v1.0.25
437.54 s
> Checking nix v0.31.2
437.54 s
> Checking integer-sqrt v0.1.5
437.54 s
> Checking brotli-decompressor v4.0.3
437.54 s
> Checking crossbeam-channel v0.5.15
437.54 s
> Checking itertools v0.12.1
437.54 s
> Checking unsafe-libyaml v0.2.11
437.54 s
> Checking color-spantrace v0.3.0
437.54 s
> Compiling gammalooprs v0.3.4 (/build/source/crates/gammalooprs)
437.54 s
> Checking symlink v0.1.0
437.54 s
> Checking include_dir v0.7.4
437.54 s
> Checking ratatui-widgets v0.3.0
437.54 s
> Checking ratatui-crossterm v0.1.0
437.54 s
> Checking tracing-appender v0.2.5
437.54 s
> Checking pathfinding v4.15.0
437.54 s
> Checking ctrlc v3.5.2
437.54 s
> Checking tracing-indicatif v0.3.14
437.54 s
> Checking clarabel v0.11.1
437.54 s
> Checking schemars v1.2.1
437.54 s
> Checking dirs v6.0.0
437.54 s
> Checking slotmap v1.1.1
437.54 s
> Checking json5 v0.4.1
437.54 s
> Checking brotli v7.0.0
437.54 s
> Checking serde_yaml v0.9.34+deprecated
437.54 s
> Checking vectorize v0.2.0
437.54 s
> Checking base62 v2.2.4
437.54 s
> Checking ringbuffer v0.16.0
437.54 s
> Checking rust-embed v8.11.0
437.54 s
> Checking addr2line v0.25.1
437.54 s
> Checking clap_complete v4.6.3
437.54 s
> Checking fd-lock v4.0.4
437.54 s
> Checking strip-ansi-escapes v0.2.1
437.54 s
> Checking ratatui-macros v0.7.0
437.54 s
> Compiling gammaloop-api v0.1.0 (/build/source/crates/gammaloop-api)
437.54 s
> Checking itertools v0.13.0
437.54 s
> Checking strum v0.26.3
437.54 s
> Checking ratatui v0.30.0
437.54 s
> Checking sysinfo v0.33.1
437.54 s
> Checking shlex v1.3.0
437.54 s
> Compiling numerica v2.2.0 (https://github.com/alphal00p/symbolica?rev=a277a8dadbaae5a8d6605f2f381991a601e1f345#a277a8da)
437.54 s
> Checking clap_complete_nushell v4.6.0
437.54 s
> Checking slab v0.4.12
437.54 s
> Checking futures-task v0.3.32
437.54 s
> Checking futures-core v0.3.32
437.54 s
> Checking sdd v3.0.10
437.54 s
> Compiling gammaloop-integration-tests v0.1.0 (/build/source/tests)
437.54 s
> Compiling test-log-core v0.2.20
437.54 s
> Checking futures-util v0.3.32
437.54 s
> Compiling rustc_version v0.4.1
437.54 s
> Checking which v8.0.2
437.54 s
> Checking scc v2.4.0
437.54 s
> Checking bincode v1.3.3
437.54 s
> Compiling gungraun-runner v0.18.2
437.54 s
> Checking backtrace v0.3.76
437.54 s
> Checking reedline v0.42.0
437.54 s
> Compiling gungraun-macros v0.8.0
437.54 s
> Checking color-eyre v0.6.5
437.54 s
> Checking nalgebra v0.29.0
437.54 s
> Checking proc-macro2 v1.0.106
437.54 s
> Checking maplit v1.0.2
437.54 s
> Checking base64 v0.21.7
437.54 s
> Compiling iai-callgrind-runner v0.14.2
437.54 s
> Checking quote v1.0.45
437.54 s
> Checking kurbo v0.13.0
437.54 s
> Checking futures-executor v0.3.32
437.54 s
> Checking ron v0.8.1
437.54 s
> Checking wait-timeout v0.2.1
437.54 s
> Compiling iai-callgrind v0.14.2
437.54 s
> Checking serial_test v3.4.0
437.54 s
> Checking bit-vec v0.8.0
437.54 s
> Checking quick-error v1.2.3
437.54 s
> Checking rusty-fork v0.3.1
437.54 s
> Compiling test-log-macros v0.2.20
437.54 s
> Checking bit-set v0.8.0
437.54 s
> Checking syn v2.0.117
437.54 s
> Compiling iai-callgrind-macros v0.5.1
437.54 s
> Checking rand_xorshift v0.4.0
437.54 s
> Checking console v0.15.11
437.54 s
> Checking unarray v0.1.4
437.54 s
> Checking pathdiff v0.2.3
437.54 s
> Checking proptest v1.11.0
437.54 s
> Checking clinnet v0.1.8 (/build/source/crates/clinnet)
437.54 s
> Checking similar-asserts v1.7.0
437.54 s
> Checking kurvst v0.1.0 (/build/source/crates/kurvst)
437.54 s
> Compiling graphica v2.1.0 (https://github.com/alphal00p/symbolica?rev=a277a8dadbaae5a8d6605f2f381991a601e1f345#a277a8da)
437.54 s
> Checking test-log v0.2.20
437.54 s
> Checking statrs v0.16.1
437.54 s
> Checking momtrop v0.3.0
437.54 s
> Checking gungraun v0.18.2
437.54 s
> Compiling pyo3-macros v0.28.3
437.54 s
> Compiling pyo3-stub-gen-derive v0.17.2
437.54 s
> Checking pyo3-stub-gen v0.17.2
437.54 s
> Checking symbolica-utils v0.1.0 (/build/source/crates/symbolica-utils)
437.54 s
> Checking spenso-macros v0.3.2 (/build/source/crates/spenso-macros)
437.54 s
> Compiling gammaloop-workspace-hack v0.1.0 (/build/source/crates/gammaloop-workspace-hack)
437.54 s
> Checking linnet v0.17.0 (/build/source/crates/linnet)
437.54 s
> Checking spenso v0.6.0 (/build/source/crates/spenso)
437.54 s
> Checking linnet-py v0.1.0 (/build/source/crates/linnet-py)
437.54 s
> Checking linnest v0.1.0 (/build/source/crates/linnest)
437.54 s
> Checking idenso v0.3.0 (/build/source/crates/idenso)
437.54 s
> Checking gammaloop-tracing-filter v0.1.0 (/build/source/crates/gammaloop-tracing-filter)
437.54 s
> Checking spenso-hep-lib v0.1.7 (/build/source/crates/spenso-hep-lib)
437.54 s
> Checking spynso3 v0.1.2 (/build/source/crates/spynso3)
437.54 s
> warning : unused import: `GaussianReferenceFunction`
437.54 s
> --> crates/gammaloop-api/src/state.rs:38:27
437.54 s
> |
437.54 s
> 38 | integrands::process::{GaussianReferenceFunction, ProcessIntegrand},
437.54 s
> | ^^^^^^^^^^^^^^^^^^^^^^^^^
437.54 s
> |
437.54 s
> = note : `#[warn(unused_imports)]` (part of `#[warn(unused)]`) on by default
437.54 s
>
437.54 s
> warning : `gammaloop-api` (lib) generated 1 warning (run `cargo fix --lib -p gammaloop-api` to apply 1 suggestion)
437.54 s
> error[E0560] : struct `CutInfo` has no field named `lmb_channel_id`
437.54 s
> --> tests/tests/test_differential.rs:86:13
437.54 s
> |
437.54 s
> 86 | lmb_channel_id: None,
437.54 s
> | ^^^^^^^^^^^^^^ `CutInfo` does not have this field
437.54 s
> |
437.54 s
> = note : available fields are: `sampling_channel_id`, `sampling_channel_edge_ids`
437.54 s
>
437.54 s
> error[E0560] : struct `CutInfo` has no field named `lmb_channel_edge_ids`
437.54 s
> --> tests/tests/test_differential.rs:87:13
437.54 s
> |
437.54 s
> 87 | lmb_channel_edge_ids: None,
437.54 s
> | ^^^^^^^^^^^^^^^^^^^^ `CutInfo` does not have this field
437.54 s
> |
437.54 s
> = note : available fields are: `sampling_channel_id`, `sampling_channel_edge_ids`
437.54 s
>
437.54 s
> For more information about this error, try `rustc --explain E0560`.
437.54 s
> error : could not compile `gammaloop-integration-tests` (test "test_differential") due to 2 previous errors
437.54 s
> warning : build failed, waiting for other jobs to finish...
437.54 s
> error[E0609] : no field `lmb_channel_edge_ids` on type `CutInfo`
437.54 s
> --> tests/tests/test_evaluation_api.rs:311:10
437.54 s
> |
437.54 s
> 311 | .lmb_channel_edge_ids
437.54 s
> | ^^^^^^^^^^^^^^^^^^^^ unknown field
437.54 s
> |
437.54 s
> = note : available fields are: `particle_pdgs`, `cut_id`, `graph_id`, `graph_group_id`, `orientation_id` ... and 2 others
437.54 s
>
437.54 s
> error[E0609] : no field `lmb_channel_edge_ids` on type `CutInfo`
437.54 s
> --> tests/tests/test_evaluation_api.rs:591:26
437.54 s
> |
437.54 s
> 591 | .lmb_channel_edge_ids
437.54 s
> | ^^^^^^^^^^^^^^^^^^^^ unknown field
437.54 s
> |
437.54 s
> = note : available fields are: `particle_pdgs`, `cut_id`, `graph_id`, `graph_group_id`, `orientation_id` ... and 2 others
437.54 s
>
437.54 s
> error[E0609] : no field `lmb_channel_edge_ids` on type `CutInfo`
437.54 s
> --> tests/tests/test_evaluation_api.rs:1177:18
437.54 s
> |
437.54 s
> 1177 | .lmb_channel_edge_ids
437.54 s
> | ^^^^^^^^^^^^^^^^^^^^ unknown field
437.54 s
> |
437.54 s
> = note : available fields are: `particle_pdgs`, `cut_id`, `graph_id`, `graph_group_id`, `orientation_id` ... and 2 others
437.54 s
>
437.54 s
> error[E0609] : no field `lmb_channel_edge_ids` on type `CutInfo`
437.54 s
> --> tests/tests/test_evaluation_api.rs:1222:22
437.54 s
> |
437.54 s
> 1222 | .lmb_channel_edge_ids
437.54 s
> | ^^^^^^^^^^^^^^^^^^^^ unknown field
437.54 s
> |
437.54 s
> = note : available fields are: `particle_pdgs`, `cut_id`, `graph_id`, `graph_group_id`, `orientation_id` ... and 2 others
437.54 s
>
437.54 s
> error[E0609] : no field `lmb_channel_edge_ids` on type `CutInfo`
437.54 s
> --> tests/tests/test_evaluation_api.rs:1281:14
437.54 s
> |
437.54 s
> 1281 | .lmb_channel_edge_ids
437.54 s
> | ^^^^^^^^^^^^^^^^^^^^ unknown field
437.54 s
> |
437.54 s
> = note : available fields are: `particle_pdgs`, `cut_id`, `graph_id`, `graph_group_id`, `orientation_id` ... and 2 others
437.54 s
>
437.54 s
> error[E0609] : no field `lmb_channel_edge_ids` on type `CutInfo`
437.54 s
> --> tests/tests/test_evaluation_api.rs:1428:18
437.54 s
> |
437.54 s
> 1428 | .lmb_channel_edge_ids
437.54 s
> | ^^^^^^^^^^^^^^^^^^^^ unknown field
437.54 s
> |
437.54 s
> = note : available fields are: `particle_pdgs`, `cut_id`, `graph_id`, `graph_group_id`, `orientation_id` ... and 2 others
437.54 s
>
437.54 s
> For more information about this error, try `rustc --explain E0609`.
437.54 s
> error : could not compile `gammaloop-integration-tests` (test "test_evaluation_api") due to 6 previous errors
437.54 s
> error[E0609] : no field `lmb_channel_id` on type `CutInfo`
437.54 s
> --> tests/tests/test_runs/utils.rs:568:36
437.54 s
> |
437.54 s
> 568 | event.cut_info.lmb_channel_id,
437.54 s
> | ^^^^^^^^^^^^^^ unknown field
437.54 s
> |
437.54 s
> = note : available fields are: `particle_pdgs`, `cut_id`, `graph_id`, `graph_group_id`, `orientation_id` ... and 2 others
437.54 s
>
437.54 s
> error[E0609] : no field `lmb_channel_id` on type `CutInfo`
437.54 s
> --> tests/tests/test_runs/utils.rs:580:36
437.54 s
> |
437.54 s
> 580 | event.cut_info.lmb_channel_id,
437.54 s
> | ^^^^^^^^^^^^^^ unknown field
437.54 s
> |
437.54 s
> = note : available fields are: `particle_pdgs`, `cut_id`, `graph_id`, `graph_group_id`, `orientation_id` ... and 2 others
437.54 s
>
437.54 s
> error : could not compile `gammaloop-integration-tests` (test "test_runs") due to 2 previous errors
437.54 s
For full logs, run:
437.54 s
nix log /nix/store/53802zbj9009bwya0yb48jnjgdmqv87h-gammaloop-workspace-check-0.1.0.drv
437.61 s
Build failed.