build checks.x86_64-linux.gammaloop-check

Reproduce this run
Original Run
  1. 0.01 s $ /nix/store/9ypz3flqsrl5xl495mm8h645gadjsxi1-coreutils-9.11/bin/timeout --kill-after=15s 7200s /nix/store/23zk8sgzamrbmj1fday15szf7f2279s8-nix-2.34.7/bin/nix --extra-experimental-features nix-command --extra-experimental-features flakes --log-format internal-json build --no-link --print-out-paths git+https://github.com/alphal00p/gammaloop?ref=advanced_sampling&rev=2ca19f40f736965c54ac582014fbcfa827cf7c6f&shallow=1#checks.x86_64-linux.gammaloop-check --print-build-logs
  2. 0.39 s error (ignored): SQLite database '/var/cache/nix-ci-worker/eval-cache-v6/854e49c50ea44ef72bd6818a273a9742ab4c976c3390ebc05e3b6fbda314a964.sqlite' is busy
  3. 4.13 s
  4. 5.58 s Building /nix/store/53802zbj9009bwya0yb48jnjgdmqv87h-gammaloop-workspace-check-0.1.0.drv
  5. 5.69 s [gammaloop-workspace-check] Phase: unpackPhase
  6. 5.69 s [gammaloop-workspace-check] unpacking source archive /nix/store/401j5sh0ylbdhdhk1c9kp8s5d8i5hpv1-source
  7. 5.90 s [gammaloop-workspace-check] source root is source
  8. 5.97 s [gammaloop-workspace-check] Phase: patchPhase
  9. 5.99 s [gammaloop-workspace-check] Executing configureCargoCommonVars
  10. 6.00 s [gammaloop-workspace-check] decompressing cargo artifacts from /nix/store/50vpxlcgfxf2d57i27v3d10zjwxxbm2r-gammaloop-workspace-deps-deps-0.1.0/target.tar.zst to target
  11. 10.21 s [gammaloop-workspace-check] Phase: updateAutotoolsGnuConfigScriptsPhase
  12. 10.27 s [gammaloop-workspace-check] Phase: configurePhase
  13. 10.27 s [gammaloop-workspace-check] will append /build/source/.cargo-home/config.toml with contents of /nix/store/5drf77x6km4ky7gwlrzdx9bbd6fz09g3-vendor-cargo-deps/config.toml
  14. 10.27 s [gammaloop-workspace-check] default configurePhase, nothing to do
  15. 10.28 s [gammaloop-workspace-check] Phase: buildPhase
  16. 10.28 s [gammaloop-workspace-check] +++ command cargo --version
  17. 10.29 s [gammaloop-workspace-check] cargo 1.97.0 (c980f4866 2026-06-30)
  18. 10.33 s [gammaloop-workspace-check] +++ command cargo check --profile ci-optim --locked --workspace --features gammaloop-tracing-filter/clap,gammaloop-tracing-filter/symbolica,idenso/bincode,idenso/reference-cases,linnet/bincode,linnet/drawing,linnet/rkyv,linnet/serde,linnet/symbolica,spenso-macros/shadowing,spenso/shadowing,symbolica/tracing_max_level_info,three-dimensional-reps/display,three-dimensional-reps/eval,three-dimensional-reps/serde --all-targets
  19. 11.32 s [gammaloop-workspace-check] Checking cfg-if v1.0.4
  20. 11.32 s [gammaloop-workspace-check] Checking memchr v2.8.0
  21. 11.32 s [gammaloop-workspace-check] Checking once_cell v1.21.4
  22. 11.32 s [gammaloop-workspace-check] Checking either v1.15.0
  23. 11.35 s [gammaloop-workspace-check] Checking serde_core v1.0.228
  24. 11.35 s [gammaloop-workspace-check] Checking libc v0.2.186
  25. 11.35 s [gammaloop-workspace-check] Checking libm v0.2.16
  26. 11.35 s [gammaloop-workspace-check] Checking itoa v1.0.18
  27. 11.37 s [gammaloop-workspace-check] Checking log v0.4.29
  28. 11.37 s [gammaloop-workspace-check] Checking regex-syntax v0.8.10
  29. 11.38 s [gammaloop-workspace-check] Checking zerocopy v0.8.48
  30. 11.40 s [gammaloop-workspace-check] Checking crossbeam-utils v0.8.21
  31. 11.40 s [gammaloop-workspace-check] Checking equivalent v1.0.2
  32. 11.44 s [gammaloop-workspace-check] Checking zmij v1.0.21
  33. 11.44 s [gammaloop-workspace-check] Checking bytemuck v1.25.0
  34. 11.44 s [gammaloop-workspace-check] Checking lazy_static v1.5.0
  35. 11.45 s [gammaloop-workspace-check] Compiling target-lexicon v0.13.5
  36. 11.51 s [gammaloop-workspace-check] Checking arrayvec v0.7.6
  37. 11.69 s [gammaloop-workspace-check] Checking powerfmt v0.2.0
  38. 11.82 s [gammaloop-workspace-check] Checking num_threads v0.1.7
  39. 11.85 s [gammaloop-workspace-check] Checking deranged v0.5.8
  40. 11.86 s [gammaloop-workspace-check] Checking time-core v0.1.8
  41. 11.89 s [gammaloop-workspace-check] Checking itertools v0.14.0
  42. 11.96 s [gammaloop-workspace-check] Checking pin-project-lite v0.2.17
  43. 12.02 s [gammaloop-workspace-check] Checking num-conv v0.2.1
  44. 12.07 s [gammaloop-workspace-check] Checking safe_arch v0.7.4
  45. 12.09 s [gammaloop-workspace-check] Checking tracing-core v0.1.36
  46. 12.12 s [gammaloop-workspace-check] Checking foldhash v0.2.0
  47. 12.21 s [gammaloop-workspace-check] Checking allocator-api2 v0.2.21
  48. 12.23 s [gammaloop-workspace-check] Checking crossbeam-epoch v0.9.18
  49. 12.30 s [gammaloop-workspace-check] Checking const-random v0.1.18
  50. 12.34 s [gammaloop-workspace-check] Checking static_assertions v1.1.0
  51. 12.39 s [gammaloop-workspace-check] Checking unty v0.0.4
  52. 12.43 s [gammaloop-workspace-check] Checking nu-ansi-term v0.50.3
  53. 12.49 s [gammaloop-workspace-check] Checking winnow v1.0.2
  54. 12.50 s [gammaloop-workspace-check] Checking safe_arch v1.0.0
  55. 12.53 s [gammaloop-workspace-check] Checking wide v0.7.33
  56. 12.74 s [gammaloop-workspace-check] Checking tracing v0.1.44
  57. 12.82 s [gammaloop-workspace-check] Checking tracing-log v0.2.0
  58. 12.96 s [gammaloop-workspace-check] Checking sharded-slab v0.1.7
  59. 12.97 s [gammaloop-workspace-check] Checking aho-corasick v1.1.4
  60. 13.00 s [gammaloop-workspace-check] Checking hashbrown v0.16.1
  61. 13.05 s [gammaloop-workspace-check] Checking crossbeam-deque v0.8.6
  62. 13.52 s [gammaloop-workspace-check] Checking thread_local v1.1.9
  63. 13.56 s [gammaloop-workspace-check] Checking rayon-core v1.13.0
  64. 13.60 s [gammaloop-workspace-check] Checking toml_writer v1.1.1+spec-1.1.0
  65. 13.86 s [gammaloop-workspace-check] Checking num-traits v0.2.19
  66. 13.88 s [gammaloop-workspace-check] Checking az v1.3.0
  67. 14.16 s [gammaloop-workspace-check] Checking indenter v0.3.4
  68. 14.26 s [gammaloop-workspace-check] Checking wide v1.3.0
  69. 14.47 s [gammaloop-workspace-check] Compiling phf_shared v0.11.3
  70. 14.63 s [gammaloop-workspace-check] Checking anyhow v1.0.102
  71. 14.76 s [gammaloop-workspace-check] Checking rayon v1.12.0
  72. 14.78 s [gammaloop-workspace-check] Checking rawpointer v0.2.1
  73. 14.91 s [gammaloop-workspace-check] Checking alloc-no-stdlib v2.0.4
  74. 14.91 s [gammaloop-workspace-check] Checking utf8parse v0.2.2
  75. 15.13 s [gammaloop-workspace-check] Checking dyn-clone v1.0.20
  76. 15.15 s [gammaloop-workspace-check] Checking anstyle-parse v1.0.0
  77. 15.18 s [gammaloop-workspace-check] Checking toml_parser v1.1.2+spec-1.1.0
  78. 15.24 s [gammaloop-workspace-check] Checking alloc-stdlib v0.2.2
  79. 15.40 s [gammaloop-workspace-check] Checking matrixmultiply v0.3.10
  80. 15.43 s [gammaloop-workspace-check] Checking is_terminal_polyfill v1.70.2
  81. 15.44 s [gammaloop-workspace-check] Checking colorchoice v1.0.5
  82. 15.54 s [gammaloop-workspace-check] Checking colored v3.1.1
  83. 15.59 s [gammaloop-workspace-check] Checking anstyle v1.0.14
  84. 15.72 s [gammaloop-workspace-check] Checking anstyle-query v1.1.5
  85. 15.86 s [gammaloop-workspace-check] Compiling phf_generator v0.11.3
  86. 15.94 s [gammaloop-workspace-check] Checking anstream v1.0.0
  87. 16.00 s [gammaloop-workspace-check] Checking eyre v0.6.12
  88. 16.02 s [gammaloop-workspace-check] Checking approx v0.5.1
  89. 16.07 s [gammaloop-workspace-check] Checking serde v1.0.228
  90. 16.10 s [gammaloop-workspace-check] Checking serde_json v1.0.149
  91. 16.12 s [gammaloop-workspace-check] Checking bitflags v2.11.1
  92. 16.18 s [gammaloop-workspace-check] Checking num-integer v0.1.46
  93. 16.20 s [gammaloop-workspace-check] Checking serde_spanned v1.1.1
  94. 16.22 s [gammaloop-workspace-check] Checking toml_datetime v1.1.1+spec-1.1.0
  95. 16.31 s [gammaloop-workspace-check] Checking unicode-width v0.2.2
  96. 16.33 s [gammaloop-workspace-check] Checking bitflags v1.3.2
  97. 16.36 s [gammaloop-workspace-check] Compiling pyo3-build-config v0.28.3
  98. 16.39 s [gammaloop-workspace-check] Compiling phf_codegen v0.11.3
  99. 16.41 s [gammaloop-workspace-check] Checking brotli-decompressor v5.0.0
  100. 16.41 s [gammaloop-workspace-check] Checking spec_math v0.1.6
  101. 16.44 s [gammaloop-workspace-check] Checking inventory v0.3.24
  102. 16.47 s [gammaloop-workspace-check] Checking regex-automata v0.4.14
  103. 16.53 s [gammaloop-workspace-check] Checking thiserror v2.0.18
  104. 16.55 s [gammaloop-workspace-check] Checking toml v1.1.2+spec-1.1.0
  105. 16.65 s [gammaloop-workspace-check] Compiling getopts v0.2.24
  106. 16.68 s [gammaloop-workspace-check] Checking libloading v0.9.0
  107. 16.68 s [gammaloop-workspace-check] Checking byteorder v1.5.0
  108. 16.77 s [gammaloop-workspace-check] Checking getrandom v0.3.4
  109. 16.86 s [gammaloop-workspace-check] Checking time v0.3.47
  110. 16.90 s [gammaloop-workspace-check] Checking gmp-mpfr-sys v1.7.1
  111. 17.00 s [gammaloop-workspace-check] Checking region v3.0.2
  112. 17.02 s [gammaloop-workspace-check] Checking hugepage-rs v0.1.1
  113. 17.08 s [gammaloop-workspace-check] Checking rand_core v0.9.5
  114. 17.10 s [gammaloop-workspace-check] Checking wasmtime-jit-icache-coherence v34.0.2
  115. 17.16 s [gammaloop-workspace-check] Checking bytes v1.11.1
  116. 17.21 s [gammaloop-workspace-check] Checking tinyjson v2.5.1
  117. 17.30 s [gammaloop-workspace-check] Checking smallvec v1.15.1
  118. 17.31 s [gammaloop-workspace-check] Checking num-complex v0.4.6
  119. 17.41 s [gammaloop-workspace-check] Checking tracing-serde v0.2.0
  120. 17.48 s [gammaloop-workspace-check] Checking bincode v2.0.1
  121. 17.54 s [gammaloop-workspace-check] Checking smartstring v1.0.1
  122. 17.67 s [gammaloop-workspace-check] Checking append-only-vec v0.1.8
  123. 17.70 s [gammaloop-workspace-check] Checking self_cell v1.2.2
  124. 17.83 s [gammaloop-workspace-check] Compiling unicode_names2_generator v1.3.0
  125. 17.87 s [gammaloop-workspace-check] Compiling unic-common v0.9.0
  126. 17.99 s [gammaloop-workspace-check] Checking linux-raw-sys v0.12.1
  127. 18.07 s [gammaloop-workspace-check] Compiling unic-char-range v0.9.0
  128. 18.09 s [gammaloop-workspace-check] Compiling unic-ucd-version v0.9.0
  129. 18.22 s [gammaloop-workspace-check] Compiling unic-char-property v0.9.0
  130. 18.25 s [gammaloop-workspace-check] Checking simba v0.9.1
  131. 18.30 s [gammaloop-workspace-check] Compiling is-macro v0.3.7
  132. 18.37 s [gammaloop-workspace-check] Checking brotli v8.0.2
  133. 18.42 s [gammaloop-workspace-check] Compiling rustpython-parser-vendored v0.4.0
  134. 18.44 s [gammaloop-workspace-check] Checking iana-time-zone v0.1.65
  135. 18.47 s [gammaloop-workspace-check] Compiling rustpython-parser v0.4.0
  136. 18.73 s [gammaloop-workspace-check] Checking chrono v0.4.44
  137. 18.87 s [gammaloop-workspace-check] Checking rustix v1.1.4
  138. 19.08 s [gammaloop-workspace-check] Compiling phf v0.11.3
  139. 19.31 s [gammaloop-workspace-check] Checking ppv-lite86 v0.2.21
  140. 19.40 s [gammaloop-workspace-check] Checking ahash v0.8.12
  141. 19.48 s [gammaloop-workspace-check] Checking rustc-hash v2.1.2
  142. 19.51 s [gammaloop-workspace-check] Compiling unic-emoji-char v0.9.0
  143. 19.51 s [gammaloop-workspace-check] Compiling unic-ucd-ident v0.9.0
  144. 19.69 s [gammaloop-workspace-check] Checking ndarray v0.17.2
  145. 19.85 s [gammaloop-workspace-check] Compiling rustc-hash v1.1.0
  146. 19.91 s [gammaloop-workspace-check] Compiling lalrpop-util v0.20.2
  147. 19.93 s [gammaloop-workspace-check] Checking rug v1.30.0
  148. 19.96 s [gammaloop-workspace-check] Checking unicode-segmentation v1.13.2
  149. 19.99 s [gammaloop-workspace-check] Compiling symbolica v2.2.0 (https://github.com/alphal00p/symbolica?rev=a277a8dadbaae5a8d6605f2f381991a601e1f345#a277a8da)
  150. 20.12 s [gammaloop-workspace-check] Checking typenum v1.20.0
  151. 20.26 s [gammaloop-workspace-check] Checking getrandom v0.2.17
  152. 20.28 s [gammaloop-workspace-check] Checking rand_chacha v0.9.0
  153. 20.65 s [gammaloop-workspace-check] Checking scopeguard v1.2.0
  154. 20.76 s [gammaloop-workspace-check] Checking rand v0.9.4
  155. 20.87 s [gammaloop-workspace-check] Checking lock_api v0.4.14
  156. 21.07 s [gammaloop-workspace-check] Checking parking_lot_core v0.9.12
  157. 21.13 s [gammaloop-workspace-check] Checking unicode-ident v1.0.24
  158. 21.33 s [gammaloop-workspace-check] Checking hashbrown v0.17.0
  159. 21.63 s [gammaloop-workspace-check] Checking errno v0.3.14
  160. 21.67 s [gammaloop-workspace-check] Checking parking_lot v0.12.5
  161. 21.83 s [gammaloop-workspace-check] Checking unicase v2.9.0
  162. 21.93 s [gammaloop-workspace-check] Checking strsim v0.11.1
  163. 22.07 s [gammaloop-workspace-check] Checking clap_lex v1.1.0
  164. 22.11 s [gammaloop-workspace-check] Checking signal-hook-registry v1.4.8
  165. 22.14 s [gammaloop-workspace-check] Checking generic-array v0.14.7
  166. 22.16 s [gammaloop-workspace-check] Checking vte v0.14.1
  167. 22.44 s [gammaloop-workspace-check] Checking same-file v1.0.6
  168. 22.49 s [gammaloop-workspace-check] Checking symjit v2.21.0
  169. 22.51 s [gammaloop-workspace-check] Checking half v2.7.1
  170. 22.53 s [gammaloop-workspace-check] Checking signal-hook v0.3.18
  171. 22.66 s [gammaloop-workspace-check] Checking walkdir v2.5.0
  172. 22.69 s [gammaloop-workspace-check] Checking indexmap v2.14.0
  173. 22.91 s [gammaloop-workspace-check] Checking matchers v0.2.0
  174. 22.93 s [gammaloop-workspace-check] Checking regex v1.12.3
  175. 23.06 s [gammaloop-workspace-check] Checking crypto-common v0.1.7
  176. 23.10 s [gammaloop-workspace-check] Checking block-buffer v0.10.4
  177. 23.14 s [gammaloop-workspace-check] Checking tracing-subscriber v0.3.23
  178. 23.16 s [gammaloop-workspace-check] Checking mio v1.2.0
  179. 23.20 s [gammaloop-workspace-check] Checking terminal_size v0.4.4
  180. 23.29 s [gammaloop-workspace-check] Checking minimal-lexical v0.2.1
  181. 23.35 s [gammaloop-workspace-check] Checking ciborium-io v0.2.2
  182. 23.43 s [gammaloop-workspace-check] Checking clap_builder v4.6.0
  183. 23.48 s [gammaloop-workspace-check] Checking ciborium-ll v0.2.2
  184. 23.71 s [gammaloop-workspace-check] Checking signal-hook-mio v0.2.5
  185. 23.74 s [gammaloop-workspace-check] Checking digest v0.10.7
  186. 23.74 s [gammaloop-workspace-check] Checking derive_more v2.1.1
  187. 23.85 s [gammaloop-workspace-check] Checking nom v7.1.3
  188. 23.88 s [gammaloop-workspace-check] Checking num-bigint v0.4.6
  189. 23.91 s [gammaloop-workspace-check] Checking console v0.16.3
  190. 24.02 s [gammaloop-workspace-check] Checking bstr v1.12.1
  191. 24.45 s [gammaloop-workspace-check] Checking cpufeatures v0.2.17
  192. 24.56 s [gammaloop-workspace-check] Checking winnow v0.7.15
  193. 24.59 s [gammaloop-workspace-check] Checking linux-raw-sys v0.4.15
  194. 24.77 s [gammaloop-workspace-check] Checking globset v0.4.18
  195. 25.36 s [gammaloop-workspace-check] Checking rustix v0.38.44
  196. 25.51 s [gammaloop-workspace-check] Checking sha2 v0.10.9
  197. 25.87 s [gammaloop-workspace-check] Checking ciborium v0.2.2
  198. 26.08 s [gammaloop-workspace-check] Checking getrandom v0.4.2
  199. 26.36 s [gammaloop-workspace-check] Checking rand_core v0.6.4
  200. 26.53 s [gammaloop-workspace-check] Checking fnv v1.0.7
  201. 26.55 s [gammaloop-workspace-check] Checking fastrand v2.4.1
  202. 26.60 s [gammaloop-workspace-check] Checking plotters-backend v0.3.7
  203. 26.63 s [gammaloop-workspace-check] Checking rust-embed-utils v8.11.0
  204. 26.77 s [gammaloop-workspace-check] Compiling unicode_names2 v1.3.0
  205. 26.83 s [gammaloop-workspace-check] Checking serde_spanned v0.6.9
  206. 26.84 s [gammaloop-workspace-check] Checking tempfile v3.27.0
  207. 26.86 s [gammaloop-workspace-check] Checking toml_datetime v0.6.11
  208. 26.90 s [gammaloop-workspace-check] Checking itertools v0.10.5
  209. 26.95 s [gammaloop-workspace-check] Checking tap v1.0.1
  210. 27.00 s [gammaloop-workspace-check] Checking crossterm v0.28.1
  211. 27.02 s [gammaloop-workspace-check] Checking toml_write v0.1.2
  212. 27.10 s [gammaloop-workspace-check] Checking plotters-svg v0.3.7
  213. 27.12 s [gammaloop-workspace-check] Checking cast v0.3.0
  214. 27.19 s [gammaloop-workspace-check] Checking wyz v0.5.1
  215. 27.24 s [gammaloop-workspace-check] Checking clap v4.6.1
  216. 27.26 s [gammaloop-workspace-check] Checking toml_edit v0.22.27
  217. 27.30 s [gammaloop-workspace-check] Checking rand_chacha v0.3.1
  218. 27.31 s [gammaloop-workspace-check] Checking plotters v0.3.7
  219. 27.33 s [gammaloop-workspace-check] Checking radium v0.7.0
  220. 27.35 s [gammaloop-workspace-check] Checking xprec v0.2.2
  221. 27.37 s [gammaloop-workspace-check] Checking typeid v1.0.3
  222. 27.45 s [gammaloop-workspace-check] Checking similar v2.7.0
  223. 27.47 s [gammaloop-workspace-check] Checking ansitok v0.3.0
  224. 27.51 s [gammaloop-workspace-check] Checking tinytemplate v1.2.1
  225. 27.54 s [gammaloop-workspace-check] Checking is-terminal v0.4.17
  226. 27.59 s [gammaloop-workspace-check] Checking anes v0.1.6
  227. 27.62 s [gammaloop-workspace-check] Checking bytecount v0.6.9
  228. 27.65 s [gammaloop-workspace-check] Checking funty v2.0.0
  229. 27.75 s [gammaloop-workspace-check] Checking oorandom v11.1.5
  230. 27.86 s [gammaloop-workspace-check] Checking rand v0.8.6
  231. 27.89 s [gammaloop-workspace-check] Checking ron v0.12.1
  232. 27.91 s [gammaloop-workspace-check] Checking toml_edit v0.25.11+spec-1.1.0
  233. 27.99 s [gammaloop-workspace-check] Checking ansi-str v0.9.0
  234. 28.16 s [gammaloop-workspace-check] Checking testing_table v0.3.0
  235. 28.30 s [gammaloop-workspace-check] Checking env_filter v1.0.1
  236. 28.33 s [gammaloop-workspace-check] Checking bitvec v1.0.1
  237. 28.39 s [gammaloop-workspace-check] Checking criterion-plot v0.5.0
  238. 28.40 s [gammaloop-workspace-check] Checking papergrid v0.17.0
  239. 28.48 s [gammaloop-workspace-check] Checking uncased v0.9.10
  240. 28.50 s [gammaloop-workspace-check] Checking jiff v0.2.24
  241. 28.62 s [gammaloop-workspace-check] Checking ptr_meta v0.1.4
  242. 28.63 s [gammaloop-workspace-check] Checking simdutf8 v0.1.5
  243. 28.66 s [gammaloop-workspace-check] Checking ucd-trie v0.1.7
  244. 28.73 s [gammaloop-workspace-check] Checking ahash v0.7.8
  245. 28.78 s [gammaloop-workspace-check] Checking criterion v0.5.1
  246. 28.82 s [gammaloop-workspace-check] Checking approx v0.4.0
  247. 28.90 s [gammaloop-workspace-check] Checking pest v2.8.6
  248. 28.92 s [gammaloop-workspace-check] Checking hashbrown v0.12.3
  249. 28.99 s [gammaloop-workspace-check] Checking seahash v4.1.0
  250. 29.04 s [gammaloop-workspace-check] Checking bytecheck v0.6.12
  251. 29.22 s [gammaloop-workspace-check] Checking cgmath v0.18.0
  252. 29.38 s [gammaloop-workspace-check] Checking num-rational v0.4.2
  253. 29.51 s [gammaloop-workspace-check] Checking rend v0.4.2
  254. 29.54 s [gammaloop-workspace-check] Checking insta v1.47.2
  255. 29.58 s [gammaloop-workspace-check] Checking num-iter v0.1.45
  256. 29.83 s [gammaloop-workspace-check] Checking ref-ops v0.2.5
  257. 29.96 s [gammaloop-workspace-check] Checking num v0.4.3
  258. 29.98 s [gammaloop-workspace-check] Checking rand_xoshiro v0.6.0
  259. 30.05 s [gammaloop-workspace-check] Checking features v0.10.0
  260. 30.08 s [gammaloop-workspace-check] Checking tabled v0.20.0
  261. 30.12 s [gammaloop-workspace-check] Checking constcat v0.5.1
  262. 30.21 s [gammaloop-workspace-check] Checking gat-lending-iterator v0.1.8
  263. 30.28 s [gammaloop-workspace-check] Checking colored v2.2.0
  264. 30.29 s [gammaloop-workspace-check] Checking arrayref v0.3.9
  265. 30.37 s [gammaloop-workspace-check] Checking cpufeatures v0.3.0
  266. 30.42 s [gammaloop-workspace-check] Checking constant_time_eq v0.4.2
  267. 30.64 s [gammaloop-workspace-check] Checking blake3 v1.8.5
  268. 30.66 s [gammaloop-workspace-check] Checking toml v0.8.23
  269. 30.68 s [gammaloop-workspace-check] Checking base64 v0.22.1
  270. 30.80 s [gammaloop-workspace-check] Checking joinery v2.1.0
  271. 30.89 s [gammaloop-workspace-check] Checking siphasher v1.0.2
  272. 31.04 s [gammaloop-workspace-check] Checking titlecase v2.2.1
  273. 31.06 s [gammaloop-workspace-check] Checking subprocess v0.2.15
  274. 31.06 s [gammaloop-workspace-check] Checking rust_lisp v0.18.0
  275. 31.06 s [gammaloop-workspace-check] Compiling vakint v0.1.2 (/build/source/crates/vakint)
  276. 31.13 s [gammaloop-workspace-check] Compiling pyo3-macros-backend v0.28.3
  277. 31.15 s [gammaloop-workspace-check] Compiling pyo3-ffi v0.28.3
  278. 31.17 s [gammaloop-workspace-check] Compiling pyo3 v0.28.3
  279. 31.23 s [gammaloop-workspace-check] Compiling numpy v0.28.0
  280. 31.36 s [gammaloop-workspace-check] Checking figment v0.10.19
  281. 31.51 s [gammaloop-workspace-check] Checking dot-parser v0.5.1
  282. 31.66 s [gammaloop-workspace-check] Checking phf_shared v0.13.1
  283. 31.73 s [gammaloop-workspace-check] Checking string-template-plus v0.4.3
  284. 31.82 s [gammaloop-workspace-check] Checking version-compare v0.2.1
  285. 31.84 s [gammaloop-workspace-check] Checking xpct v0.5.1
  286. 31.86 s [gammaloop-workspace-check] Checking ryu v1.0.23
  287. 31.96 s [gammaloop-workspace-check] Checking castaway v0.2.4
  288. 31.98 s [gammaloop-workspace-check] Checking phf v0.13.1
  289. 32.03 s [gammaloop-workspace-check] Checking toml_datetime v0.7.5+spec-1.1.0
  290. 32.04 s [gammaloop-workspace-check] Checking strum v0.27.2
  291. 32.16 s [gammaloop-workspace-check] Checking unicode-truncate v2.0.1
  292. 32.19 s [gammaloop-workspace-check] Checking kasuari v0.4.12
  293. 32.31 s [gammaloop-workspace-check] Checking toml v0.9.12+spec-1.1.0
  294. 32.32 s [gammaloop-workspace-check] Checking compact_str v0.9.0
  295. 32.34 s [gammaloop-workspace-check] Checking lru v0.16.4
  296. 32.36 s [gammaloop-workspace-check] Checking vte v0.15.0
  297. 32.38 s [gammaloop-workspace-check] Checking portable-atomic v1.13.1
  298. 32.46 s [gammaloop-workspace-check] Checking unit-prefix v0.5.2
  299. 32.51 s [gammaloop-workspace-check] Checking rand_distr v0.4.3
  300. 32.57 s [gammaloop-workspace-check] Checking vt100 v0.16.2
  301. 32.59 s [gammaloop-workspace-check] Checking simba v0.6.0
  302. 32.64 s [gammaloop-workspace-check] Checking line-clipping v0.3.7
  303. 32.67 s [gammaloop-workspace-check] Checking adler2 v2.0.1
  304. 32.69 s [gammaloop-workspace-check] Compiling three-dimensional-reps v0.1.0 (/build/source/crates/three-dimensional-reps)
  305. 32.72 s [gammaloop-workspace-check] Checking gimli v0.32.3
  306. 32.77 s [gammaloop-workspace-check] Checking miniz_oxide v0.8.9
  307. 32.80 s [gammaloop-workspace-check] Checking env_logger v0.11.10
  308. 32.82 s [gammaloop-workspace-check] Checking thiserror v1.0.69
  309. 32.91 s [gammaloop-workspace-check] Checking derive_builder v0.11.2
  310. 32.95 s [gammaloop-workspace-check] Checking owo-colors v4.3.0
  311. 33.00 s [gammaloop-workspace-check] Checking object v0.37.3
  312. 33.05 s [gammaloop-workspace-check] Checking ratatui-core v0.1.0
  313. 33.11 s [gammaloop-workspace-check] Checking crossterm v0.29.0
  314. 33.13 s [gammaloop-workspace-check] Checking tracing-error v0.2.1
  315. 33.20 s [gammaloop-workspace-check] Checking indicatif v0.18.4
  316. 33.22 s [gammaloop-workspace-check] Checking typed-index-collections v3.5.0
  317. 33.25 s [gammaloop-workspace-check] Checking serde-big-array v0.5.1
  318. 33.33 s [gammaloop-workspace-check] Checking amd v0.2.2
  319. 33.40 s [gammaloop-workspace-check] Compiling rustpython-parser-core v0.4.0
  320. 33.42 s [gammaloop-workspace-check] Checking itertools v0.11.0
  321. 33.45 s [gammaloop-workspace-check] Compiling gammaloop-tracing-filter-macros v0.1.0 (/build/source/crates/gammaloop-tracing-filter-macros)
  322. 33.54 s [gammaloop-workspace-check] Checking option-ext v0.2.0
  323. 33.67 s [gammaloop-workspace-check] Checking rustc-demangle v0.1.27
  324. 33.68 s [gammaloop-workspace-check] Checking rkyv v0.7.46
  325. 33.71 s [gammaloop-workspace-check] Checking dirs-sys v0.5.0
  326. 33.81 s [gammaloop-workspace-check] Compiling rustpython-ast v0.4.0
  327. 33.90 s [gammaloop-workspace-check] Checking ref-cast v1.0.25
  328. 33.92 s [gammaloop-workspace-check] Checking nix v0.31.2
  329. 34.01 s [gammaloop-workspace-check] Checking integer-sqrt v0.1.5
  330. 34.03 s [gammaloop-workspace-check] Checking brotli-decompressor v4.0.3
  331. 34.03 s [gammaloop-workspace-check] Checking crossbeam-channel v0.5.15
  332. 34.03 s [gammaloop-workspace-check] Checking itertools v0.12.1
  333. 34.10 s [gammaloop-workspace-check] Checking unsafe-libyaml v0.2.11
  334. 34.10 s [gammaloop-workspace-check] Checking color-spantrace v0.3.0
  335. 34.11 s [gammaloop-workspace-check] Compiling gammalooprs v0.3.4 (/build/source/crates/gammalooprs)
  336. 34.34 s [gammaloop-workspace-check] Checking symlink v0.1.0
  337. 34.39 s [gammaloop-workspace-check] Checking include_dir v0.7.4
  338. 34.44 s [gammaloop-workspace-check] Checking ratatui-widgets v0.3.0
  339. 34.55 s [gammaloop-workspace-check] Checking ratatui-crossterm v0.1.0
  340. 34.56 s [gammaloop-workspace-check] Checking tracing-appender v0.2.5
  341. 34.71 s [gammaloop-workspace-check] Checking pathfinding v4.15.0
  342. 34.72 s [gammaloop-workspace-check] Checking ctrlc v3.5.2
  343. 34.74 s [gammaloop-workspace-check] Checking tracing-indicatif v0.3.14
  344. 34.84 s [gammaloop-workspace-check] Checking clarabel v0.11.1
  345. 34.85 s [gammaloop-workspace-check] Checking schemars v1.2.1
  346. 34.92 s [gammaloop-workspace-check] Checking dirs v6.0.0
  347. 35.01 s [gammaloop-workspace-check] Checking slotmap v1.1.1
  348. 35.06 s [gammaloop-workspace-check] Checking json5 v0.4.1
  349. 35.13 s [gammaloop-workspace-check] Checking brotli v7.0.0
  350. 35.18 s [gammaloop-workspace-check] Checking serde_yaml v0.9.34+deprecated
  351. 35.50 s [gammaloop-workspace-check] Checking vectorize v0.2.0
  352. 35.52 s [gammaloop-workspace-check] Checking base62 v2.2.4
  353. 35.59 s [gammaloop-workspace-check] Checking ringbuffer v0.16.0
  354. 35.75 s [gammaloop-workspace-check] Checking rust-embed v8.11.0
  355. 35.77 s [gammaloop-workspace-check] Checking addr2line v0.25.1
  356. 35.80 s [gammaloop-workspace-check] Checking clap_complete v4.6.3
  357. 35.82 s [gammaloop-workspace-check] Checking fd-lock v4.0.4
  358. 35.84 s [gammaloop-workspace-check] Checking strip-ansi-escapes v0.2.1
  359. 35.92 s [gammaloop-workspace-check] Checking ratatui-macros v0.7.0
  360. 35.94 s [gammaloop-workspace-check] Compiling gammaloop-api v0.1.0 (/build/source/crates/gammaloop-api)
  361. 35.97 s [gammaloop-workspace-check] Checking itertools v0.13.0
  362. 35.98 s [gammaloop-workspace-check] Checking strum v0.26.3
  363. 36.04 s [gammaloop-workspace-check] Checking ratatui v0.30.0
  364. 36.11 s [gammaloop-workspace-check] Checking sysinfo v0.33.1
  365. 36.20 s [gammaloop-workspace-check] Checking shlex v1.3.0
  366. 36.34 s [gammaloop-workspace-check] Compiling numerica v2.2.0 (https://github.com/alphal00p/symbolica?rev=a277a8dadbaae5a8d6605f2f381991a601e1f345#a277a8da)
  367. 36.37 s [gammaloop-workspace-check] Checking clap_complete_nushell v4.6.0
  368. 36.42 s [gammaloop-workspace-check] Checking slab v0.4.12
  369. 36.50 s [gammaloop-workspace-check] Checking futures-task v0.3.32
  370. 36.52 s [gammaloop-workspace-check] Checking futures-core v0.3.32
  371. 36.62 s [gammaloop-workspace-check] Checking sdd v3.0.10
  372. 36.77 s [gammaloop-workspace-check] Compiling gammaloop-integration-tests v0.1.0 (/build/source/tests)
  373. 36.77 s [gammaloop-workspace-check] Compiling test-log-core v0.2.20
  374. 36.80 s [gammaloop-workspace-check] Checking futures-util v0.3.32
  375. 36.84 s [gammaloop-workspace-check] Compiling rustc_version v0.4.1
  376. 37.02 s [gammaloop-workspace-check] Checking which v8.0.2
  377. 37.07 s [gammaloop-workspace-check] Checking scc v2.4.0
  378. 37.18 s [gammaloop-workspace-check] Checking bincode v1.3.3
  379. 37.28 s [gammaloop-workspace-check] Compiling gungraun-runner v0.18.2
  380. 37.59 s [gammaloop-workspace-check] Checking backtrace v0.3.76
  381. 37.72 s [gammaloop-workspace-check] Checking reedline v0.42.0
  382. 37.88 s [gammaloop-workspace-check] Compiling gungraun-macros v0.8.0
  383. 38.15 s [gammaloop-workspace-check] Checking color-eyre v0.6.5
  384. 38.17 s [gammaloop-workspace-check] Checking nalgebra v0.29.0
  385. 38.36 s [gammaloop-workspace-check] Checking proc-macro2 v1.0.106
  386. 38.83 s [gammaloop-workspace-check] Checking maplit v1.0.2
  387. 38.90 s [gammaloop-workspace-check] Checking base64 v0.21.7
  388. 38.96 s [gammaloop-workspace-check] Compiling iai-callgrind-runner v0.14.2
  389. 38.99 s [gammaloop-workspace-check] Checking quote v1.0.45
  390. 39.21 s [gammaloop-workspace-check] Checking kurbo v0.13.0
  391. 39.33 s [gammaloop-workspace-check] Checking futures-executor v0.3.32
  392. 39.41 s [gammaloop-workspace-check] Checking ron v0.8.1
  393. 39.43 s [gammaloop-workspace-check] Checking wait-timeout v0.2.1
  394. 39.47 s [gammaloop-workspace-check] Compiling iai-callgrind v0.14.2
  395. 39.50 s [gammaloop-workspace-check] Checking serial_test v3.4.0
  396. 39.54 s [gammaloop-workspace-check] Checking bit-vec v0.8.0
  397. 39.62 s [gammaloop-workspace-check] Checking quick-error v1.2.3
  398. 39.76 s [gammaloop-workspace-check] Checking rusty-fork v0.3.1
  399. 39.88 s [gammaloop-workspace-check] Compiling test-log-macros v0.2.20
  400. 39.94 s [gammaloop-workspace-check] Checking bit-set v0.8.0
  401. 40.04 s [gammaloop-workspace-check] Checking syn v2.0.117
  402. 40.06 s [gammaloop-workspace-check] Compiling iai-callgrind-macros v0.5.1
  403. 40.16 s [gammaloop-workspace-check] Checking rand_xorshift v0.4.0
  404. 40.35 s [gammaloop-workspace-check] Checking console v0.15.11
  405. 40.38 s [gammaloop-workspace-check] Checking unarray v0.1.4
  406. 40.38 s [gammaloop-workspace-check] Checking pathdiff v0.2.3
  407. 40.52 s [gammaloop-workspace-check] Checking proptest v1.11.0
  408. 40.54 s [gammaloop-workspace-check] Checking clinnet v0.1.8 (/build/source/crates/clinnet)
  409. 40.90 s [gammaloop-workspace-check] Checking similar-asserts v1.7.0
  410. 41.10 s [gammaloop-workspace-check] Checking kurvst v0.1.0 (/build/source/crates/kurvst)
  411. 41.98 s [gammaloop-workspace-check] Compiling graphica v2.1.0 (https://github.com/alphal00p/symbolica?rev=a277a8dadbaae5a8d6605f2f381991a601e1f345#a277a8da)
  412. 43.37 s [gammaloop-workspace-check] Checking test-log v0.2.20
  413. 46.40 s [gammaloop-workspace-check] Checking statrs v0.16.1
  414. 47.30 s [gammaloop-workspace-check] Checking momtrop v0.3.0
  415. 48.35 s [gammaloop-workspace-check] Checking gungraun v0.18.2
  416. 51.31 s [gammaloop-workspace-check] Compiling pyo3-macros v0.28.3
  417. 52.02 s [gammaloop-workspace-check] Compiling pyo3-stub-gen-derive v0.17.2
  418. 61.66 s [gammaloop-workspace-check] Checking pyo3-stub-gen v0.17.2
  419. 76.11 s [gammaloop-workspace-check] Checking symbolica-utils v0.1.0 (/build/source/crates/symbolica-utils)
  420. 76.11 s [gammaloop-workspace-check] Checking spenso-macros v0.3.2 (/build/source/crates/spenso-macros)
  421. 363.91 s [gammaloop-workspace-check] Compiling gammaloop-workspace-hack v0.1.0 (/build/source/crates/gammaloop-workspace-hack)
  422. 364.17 s [gammaloop-workspace-check] Checking linnet v0.17.0 (/build/source/crates/linnet)
  423. 367.79 s [gammaloop-workspace-check] Checking spenso v0.6.0 (/build/source/crates/spenso)
  424. 368.20 s [gammaloop-workspace-check] Checking linnet-py v0.1.0 (/build/source/crates/linnet-py)
  425. 368.20 s [gammaloop-workspace-check] Checking linnest v0.1.0 (/build/source/crates/linnest)
  426. 374.55 s [gammaloop-workspace-check] Checking idenso v0.3.0 (/build/source/crates/idenso)
  427. 374.56 s [gammaloop-workspace-check] Checking gammaloop-tracing-filter v0.1.0 (/build/source/crates/gammaloop-tracing-filter)
  428. 377.82 s [gammaloop-workspace-check] Checking spenso-hep-lib v0.1.7 (/build/source/crates/spenso-hep-lib)
  429. 378.13 s [gammaloop-workspace-check] Checking spynso3 v0.1.2 (/build/source/crates/spynso3)
  430. 423.06 s [gammaloop-workspace-check] warning: unused import: `GaussianReferenceFunction`
  431. 423.06 s [gammaloop-workspace-check] --> crates/gammaloop-api/src/state.rs:38:27
  432. 423.06 s [gammaloop-workspace-check] |
  433. 423.06 s [gammaloop-workspace-check] 38 | integrands::process::{GaussianReferenceFunction, ProcessIntegrand},
  434. 423.06 s [gammaloop-workspace-check] | ^^^^^^^^^^^^^^^^^^^^^^^^^
  435. 423.06 s [gammaloop-workspace-check] |
  436. 423.06 s [gammaloop-workspace-check] = note: `#[warn(unused_imports)]` (part of `#[warn(unused)]`) on by default
  437. 423.06 s [gammaloop-workspace-check]
  438. 432.35 s [gammaloop-workspace-check] warning: `gammaloop-api` (lib) generated 1 warning (run `cargo fix --lib -p gammaloop-api` to apply 1 suggestion)
  439. 433.16 s [gammaloop-workspace-check] error[E0560]: struct `CutInfo` has no field named `lmb_channel_id`
  440. 433.16 s [gammaloop-workspace-check] --> tests/tests/test_differential.rs:86:13
  441. 433.16 s [gammaloop-workspace-check] |
  442. 433.16 s [gammaloop-workspace-check] 86 | lmb_channel_id: None,
  443. 433.16 s [gammaloop-workspace-check] | ^^^^^^^^^^^^^^ `CutInfo` does not have this field
  444. 433.16 s [gammaloop-workspace-check] |
  445. 433.16 s [gammaloop-workspace-check] = note: available fields are: `sampling_channel_id`, `sampling_channel_edge_ids`
  446. 433.16 s [gammaloop-workspace-check]
  447. 433.16 s [gammaloop-workspace-check] error[E0560]: struct `CutInfo` has no field named `lmb_channel_edge_ids`
  448. 433.16 s [gammaloop-workspace-check] --> tests/tests/test_differential.rs:87:13
  449. 433.16 s [gammaloop-workspace-check] |
  450. 433.16 s [gammaloop-workspace-check] 87 | lmb_channel_edge_ids: None,
  451. 433.16 s [gammaloop-workspace-check] | ^^^^^^^^^^^^^^^^^^^^ `CutInfo` does not have this field
  452. 433.16 s [gammaloop-workspace-check] |
  453. 433.16 s [gammaloop-workspace-check] = note: available fields are: `sampling_channel_id`, `sampling_channel_edge_ids`
  454. 433.16 s [gammaloop-workspace-check]
  455. 433.40 s [gammaloop-workspace-check] For more information about this error, try `rustc --explain E0560`.
  456. 433.42 s [gammaloop-workspace-check] error: could not compile `gammaloop-integration-tests` (test "test_differential") due to 2 previous errors
  457. 433.42 s [gammaloop-workspace-check] warning: build failed, waiting for other jobs to finish...
  458. 433.57 s [gammaloop-workspace-check] error[E0609]: no field `lmb_channel_edge_ids` on type `CutInfo`
  459. 433.57 s [gammaloop-workspace-check] --> tests/tests/test_evaluation_api.rs:311:10
  460. 433.57 s [gammaloop-workspace-check] |
  461. 433.57 s [gammaloop-workspace-check] 311 | .lmb_channel_edge_ids
  462. 433.57 s [gammaloop-workspace-check] | ^^^^^^^^^^^^^^^^^^^^ unknown field
  463. 433.57 s [gammaloop-workspace-check] |
  464. 433.57 s [gammaloop-workspace-check] = note: available fields are: `particle_pdgs`, `cut_id`, `graph_id`, `graph_group_id`, `orientation_id` ... and 2 others
  465. 433.57 s [gammaloop-workspace-check]
  466. 433.62 s [gammaloop-workspace-check] error[E0609]: no field `lmb_channel_edge_ids` on type `CutInfo`
  467. 433.62 s [gammaloop-workspace-check] --> tests/tests/test_evaluation_api.rs:591:26
  468. 433.62 s [gammaloop-workspace-check] |
  469. 433.62 s [gammaloop-workspace-check] 591 | .lmb_channel_edge_ids
  470. 433.62 s [gammaloop-workspace-check] | ^^^^^^^^^^^^^^^^^^^^ unknown field
  471. 433.62 s [gammaloop-workspace-check] |
  472. 433.62 s [gammaloop-workspace-check] = note: available fields are: `particle_pdgs`, `cut_id`, `graph_id`, `graph_group_id`, `orientation_id` ... and 2 others
  473. 433.62 s [gammaloop-workspace-check]
  474. 433.71 s [gammaloop-workspace-check] error[E0609]: no field `lmb_channel_edge_ids` on type `CutInfo`
  475. 433.71 s [gammaloop-workspace-check] --> tests/tests/test_evaluation_api.rs:1177:18
  476. 433.71 s [gammaloop-workspace-check] |
  477. 433.71 s [gammaloop-workspace-check] 1177 | .lmb_channel_edge_ids
  478. 433.71 s [gammaloop-workspace-check] | ^^^^^^^^^^^^^^^^^^^^ unknown field
  479. 433.71 s [gammaloop-workspace-check] |
  480. 433.71 s [gammaloop-workspace-check] = note: available fields are: `particle_pdgs`, `cut_id`, `graph_id`, `graph_group_id`, `orientation_id` ... and 2 others
  481. 433.71 s [gammaloop-workspace-check]
  482. 433.93 s [gammaloop-workspace-check] error[E0609]: no field `lmb_channel_edge_ids` on type `CutInfo`
  483. 433.93 s [gammaloop-workspace-check] --> tests/tests/test_evaluation_api.rs:1222:22
  484. 433.93 s [gammaloop-workspace-check] |
  485. 433.93 s [gammaloop-workspace-check] 1222 | .lmb_channel_edge_ids
  486. 433.93 s [gammaloop-workspace-check] | ^^^^^^^^^^^^^^^^^^^^ unknown field
  487. 433.93 s [gammaloop-workspace-check] |
  488. 433.93 s [gammaloop-workspace-check] = note: available fields are: `particle_pdgs`, `cut_id`, `graph_id`, `graph_group_id`, `orientation_id` ... and 2 others
  489. 433.93 s [gammaloop-workspace-check]
  490. 433.93 s [gammaloop-workspace-check] error[E0609]: no field `lmb_channel_edge_ids` on type `CutInfo`
  491. 433.93 s [gammaloop-workspace-check] --> tests/tests/test_evaluation_api.rs:1281:14
  492. 433.93 s [gammaloop-workspace-check] |
  493. 433.93 s [gammaloop-workspace-check] 1281 | .lmb_channel_edge_ids
  494. 433.93 s [gammaloop-workspace-check] | ^^^^^^^^^^^^^^^^^^^^ unknown field
  495. 433.93 s [gammaloop-workspace-check] |
  496. 433.93 s [gammaloop-workspace-check] = note: available fields are: `particle_pdgs`, `cut_id`, `graph_id`, `graph_group_id`, `orientation_id` ... and 2 others
  497. 433.93 s [gammaloop-workspace-check]
  498. 434.04 s [gammaloop-workspace-check] error[E0609]: no field `lmb_channel_edge_ids` on type `CutInfo`
  499. 434.04 s [gammaloop-workspace-check] --> tests/tests/test_evaluation_api.rs:1428:18
  500. 434.04 s [gammaloop-workspace-check] |
  501. 434.04 s [gammaloop-workspace-check] 1428 | .lmb_channel_edge_ids
  502. 434.04 s [gammaloop-workspace-check] | ^^^^^^^^^^^^^^^^^^^^ unknown field
  503. 434.04 s [gammaloop-workspace-check] |
  504. 434.04 s [gammaloop-workspace-check] = note: available fields are: `particle_pdgs`, `cut_id`, `graph_id`, `graph_group_id`, `orientation_id` ... and 2 others
  505. 434.04 s [gammaloop-workspace-check]
  506. 434.25 s [gammaloop-workspace-check] For more information about this error, try `rustc --explain E0609`.
  507. 434.29 s [gammaloop-workspace-check] error: could not compile `gammaloop-integration-tests` (test "test_evaluation_api") due to 6 previous errors
  508. 435.41 s [gammaloop-workspace-check] error[E0609]: no field `lmb_channel_id` on type `CutInfo`
  509. 435.41 s [gammaloop-workspace-check] --> tests/tests/test_runs/utils.rs:568:36
  510. 435.41 s [gammaloop-workspace-check] |
  511. 435.41 s [gammaloop-workspace-check] 568 | event.cut_info.lmb_channel_id,
  512. 435.41 s [gammaloop-workspace-check] | ^^^^^^^^^^^^^^ unknown field
  513. 435.41 s [gammaloop-workspace-check] |
  514. 435.41 s [gammaloop-workspace-check] = note: available fields are: `particle_pdgs`, `cut_id`, `graph_id`, `graph_group_id`, `orientation_id` ... and 2 others
  515. 435.41 s [gammaloop-workspace-check]
  516. 435.42 s [gammaloop-workspace-check] error[E0609]: no field `lmb_channel_id` on type `CutInfo`
  517. 435.42 s [gammaloop-workspace-check] --> tests/tests/test_runs/utils.rs:580:36
  518. 435.42 s [gammaloop-workspace-check] |
  519. 435.42 s [gammaloop-workspace-check] 580 | event.cut_info.lmb_channel_id,
  520. 435.42 s [gammaloop-workspace-check] | ^^^^^^^^^^^^^^ unknown field
  521. 435.42 s [gammaloop-workspace-check] |
  522. 435.42 s [gammaloop-workspace-check] = note: available fields are: `particle_pdgs`, `cut_id`, `graph_id`, `graph_group_id`, `orientation_id` ... and 2 others
  523. 435.42 s [gammaloop-workspace-check]
  524. 436.42 s [gammaloop-workspace-check] error: could not compile `gammaloop-integration-tests` (test "test_runs") due to 2 previous errors
  525. 437.53 s Progress: 0 of 1 built (1 failed)
  526. 437.53 s Failed to build gammaloop-workspace-check after 7m11s
  527. 437.54 s Cannot build '/nix/store/53802zbj9009bwya0yb48jnjgdmqv87h-gammaloop-workspace-check-0.1.0.drv'.
  528. 437.54 s Reason: builder failed with exit code 101.
  529. 437.54 s Output paths:
  530. 437.54 s /nix/store/zix3gc9sr11cdhaa6ydaq99q1822fi52-gammaloop-workspace-check-0.1.0
  531. 437.54 s Last 520 log lines:
  532. 437.54 s > Running phase: unpackPhase
  533. 437.54 s > unpacking source archive /nix/store/401j5sh0ylbdhdhk1c9kp8s5d8i5hpv1-source
  534. 437.54 s > source root is source
  535. 437.54 s > Running phase: patchPhase
  536. 437.54 s > Executing configureCargoCommonVars
  537. 437.54 s > decompressing cargo artifacts from /nix/store/50vpxlcgfxf2d57i27v3d10zjwxxbm2r-gammaloop-workspace-deps-deps-0.1.0/target.tar.zst to target
  538. 437.54 s > Running phase: updateAutotoolsGnuConfigScriptsPhase
  539. 437.54 s > Running phase: configurePhase
  540. 437.54 s > will append /build/source/.cargo-home/config.toml with contents of /nix/store/5drf77x6km4ky7gwlrzdx9bbd6fz09g3-vendor-cargo-deps/config.toml
  541. 437.54 s > default configurePhase, nothing to do
  542. 437.54 s > Running phase: buildPhase
  543. 437.54 s > +++ command cargo --version
  544. 437.54 s > cargo 1.97.0 (c980f4866 2026-06-30)
  545. 437.54 s > +++ command cargo check --profile ci-optim --locked --workspace --features gammaloop-tracing-filter/clap,gammaloop-tracing-filter/symbolica,idenso/bincode,idenso/reference-cases,linnet/bincode,linnet/drawing,linnet/rkyv,linnet/serde,linnet/symbolica,spenso-macros/shadowing,spenso/shadowing,symbolica/tracing_max_level_info,three-dimensional-reps/display,three-dimensional-reps/eval,three-dimensional-reps/serde --all-targets
  546. 437.54 s > Checking cfg-if v1.0.4
  547. 437.54 s > Checking memchr v2.8.0
  548. 437.54 s > Checking once_cell v1.21.4
  549. 437.54 s > Checking either v1.15.0
  550. 437.54 s > Checking serde_core v1.0.228
  551. 437.54 s > Checking libc v0.2.186
  552. 437.54 s > Checking libm v0.2.16
  553. 437.54 s > Checking itoa v1.0.18
  554. 437.54 s > Checking log v0.4.29
  555. 437.54 s > Checking regex-syntax v0.8.10
  556. 437.54 s > Checking zerocopy v0.8.48
  557. 437.54 s > Checking crossbeam-utils v0.8.21
  558. 437.54 s > Checking equivalent v1.0.2
  559. 437.54 s > Checking zmij v1.0.21
  560. 437.54 s > Checking bytemuck v1.25.0
  561. 437.54 s > Checking lazy_static v1.5.0
  562. 437.54 s > Compiling target-lexicon v0.13.5
  563. 437.54 s > Checking arrayvec v0.7.6
  564. 437.54 s > Checking powerfmt v0.2.0
  565. 437.54 s > Checking num_threads v0.1.7
  566. 437.54 s > Checking deranged v0.5.8
  567. 437.54 s > Checking time-core v0.1.8
  568. 437.54 s > Checking itertools v0.14.0
  569. 437.54 s > Checking pin-project-lite v0.2.17
  570. 437.54 s > Checking num-conv v0.2.1
  571. 437.54 s > Checking safe_arch v0.7.4
  572. 437.54 s > Checking tracing-core v0.1.36
  573. 437.54 s > Checking foldhash v0.2.0
  574. 437.54 s > Checking allocator-api2 v0.2.21
  575. 437.54 s > Checking crossbeam-epoch v0.9.18
  576. 437.54 s > Checking const-random v0.1.18
  577. 437.54 s > Checking static_assertions v1.1.0
  578. 437.54 s > Checking unty v0.0.4
  579. 437.54 s > Checking nu-ansi-term v0.50.3
  580. 437.54 s > Checking winnow v1.0.2
  581. 437.54 s > Checking safe_arch v1.0.0
  582. 437.54 s > Checking wide v0.7.33
  583. 437.54 s > Checking tracing v0.1.44
  584. 437.54 s > Checking tracing-log v0.2.0
  585. 437.54 s > Checking sharded-slab v0.1.7
  586. 437.54 s > Checking aho-corasick v1.1.4
  587. 437.54 s > Checking hashbrown v0.16.1
  588. 437.54 s > Checking crossbeam-deque v0.8.6
  589. 437.54 s > Checking thread_local v1.1.9
  590. 437.54 s > Checking rayon-core v1.13.0
  591. 437.54 s > Checking toml_writer v1.1.1+spec-1.1.0
  592. 437.54 s > Checking num-traits v0.2.19
  593. 437.54 s > Checking az v1.3.0
  594. 437.54 s > Checking indenter v0.3.4
  595. 437.54 s > Checking wide v1.3.0
  596. 437.54 s > Compiling phf_shared v0.11.3
  597. 437.54 s > Checking anyhow v1.0.102
  598. 437.54 s > Checking rayon v1.12.0
  599. 437.54 s > Checking rawpointer v0.2.1
  600. 437.54 s > Checking alloc-no-stdlib v2.0.4
  601. 437.54 s > Checking utf8parse v0.2.2
  602. 437.54 s > Checking dyn-clone v1.0.20
  603. 437.54 s > Checking anstyle-parse v1.0.0
  604. 437.54 s > Checking toml_parser v1.1.2+spec-1.1.0
  605. 437.54 s > Checking alloc-stdlib v0.2.2
  606. 437.54 s > Checking matrixmultiply v0.3.10
  607. 437.54 s > Checking is_terminal_polyfill v1.70.2
  608. 437.54 s > Checking colorchoice v1.0.5
  609. 437.54 s > Checking colored v3.1.1
  610. 437.54 s > Checking anstyle v1.0.14
  611. 437.54 s > Checking anstyle-query v1.1.5
  612. 437.54 s > Compiling phf_generator v0.11.3
  613. 437.54 s > Checking anstream v1.0.0
  614. 437.54 s > Checking eyre v0.6.12
  615. 437.54 s > Checking approx v0.5.1
  616. 437.54 s > Checking serde v1.0.228
  617. 437.54 s > Checking serde_json v1.0.149
  618. 437.54 s > Checking bitflags v2.11.1
  619. 437.54 s > Checking num-integer v0.1.46
  620. 437.54 s > Checking serde_spanned v1.1.1
  621. 437.54 s > Checking toml_datetime v1.1.1+spec-1.1.0
  622. 437.54 s > Checking unicode-width v0.2.2
  623. 437.54 s > Checking bitflags v1.3.2
  624. 437.54 s > Compiling pyo3-build-config v0.28.3
  625. 437.54 s > Compiling phf_codegen v0.11.3
  626. 437.54 s > Checking brotli-decompressor v5.0.0
  627. 437.54 s > Checking spec_math v0.1.6
  628. 437.54 s > Checking inventory v0.3.24
  629. 437.54 s > Checking regex-automata v0.4.14
  630. 437.54 s > Checking thiserror v2.0.18
  631. 437.54 s > Checking toml v1.1.2+spec-1.1.0
  632. 437.54 s > Compiling getopts v0.2.24
  633. 437.54 s > Checking libloading v0.9.0
  634. 437.54 s > Checking byteorder v1.5.0
  635. 437.54 s > Checking getrandom v0.3.4
  636. 437.54 s > Checking time v0.3.47
  637. 437.54 s > Checking gmp-mpfr-sys v1.7.1
  638. 437.54 s > Checking region v3.0.2
  639. 437.54 s > Checking hugepage-rs v0.1.1
  640. 437.54 s > Checking rand_core v0.9.5
  641. 437.54 s > Checking wasmtime-jit-icache-coherence v34.0.2
  642. 437.54 s > Checking bytes v1.11.1
  643. 437.54 s > Checking tinyjson v2.5.1
  644. 437.54 s > Checking smallvec v1.15.1
  645. 437.54 s > Checking num-complex v0.4.6
  646. 437.54 s > Checking tracing-serde v0.2.0
  647. 437.54 s > Checking bincode v2.0.1
  648. 437.54 s > Checking smartstring v1.0.1
  649. 437.54 s > Checking append-only-vec v0.1.8
  650. 437.54 s > Checking self_cell v1.2.2
  651. 437.54 s > Compiling unicode_names2_generator v1.3.0
  652. 437.54 s > Compiling unic-common v0.9.0
  653. 437.54 s > Checking linux-raw-sys v0.12.1
  654. 437.54 s > Compiling unic-char-range v0.9.0
  655. 437.54 s > Compiling unic-ucd-version v0.9.0
  656. 437.54 s > Compiling unic-char-property v0.9.0
  657. 437.54 s > Checking simba v0.9.1
  658. 437.54 s > Compiling is-macro v0.3.7
  659. 437.54 s > Checking brotli v8.0.2
  660. 437.54 s > Compiling rustpython-parser-vendored v0.4.0
  661. 437.54 s > Checking iana-time-zone v0.1.65
  662. 437.54 s > Compiling rustpython-parser v0.4.0
  663. 437.54 s > Checking chrono v0.4.44
  664. 437.54 s > Checking rustix v1.1.4
  665. 437.54 s > Compiling phf v0.11.3
  666. 437.54 s > Checking ppv-lite86 v0.2.21
  667. 437.54 s > Checking ahash v0.8.12
  668. 437.54 s > Checking rustc-hash v2.1.2
  669. 437.54 s > Compiling unic-emoji-char v0.9.0
  670. 437.54 s > Compiling unic-ucd-ident v0.9.0
  671. 437.54 s > Checking ndarray v0.17.2
  672. 437.54 s > Compiling rustc-hash v1.1.0
  673. 437.54 s > Compiling lalrpop-util v0.20.2
  674. 437.54 s > Checking rug v1.30.0
  675. 437.54 s > Checking unicode-segmentation v1.13.2
  676. 437.54 s > Compiling symbolica v2.2.0 (https://github.com/alphal00p/symbolica?rev=a277a8dadbaae5a8d6605f2f381991a601e1f345#a277a8da)
  677. 437.54 s > Checking typenum v1.20.0
  678. 437.54 s > Checking getrandom v0.2.17
  679. 437.54 s > Checking rand_chacha v0.9.0
  680. 437.54 s > Checking scopeguard v1.2.0
  681. 437.54 s > Checking rand v0.9.4
  682. 437.54 s > Checking lock_api v0.4.14
  683. 437.54 s > Checking parking_lot_core v0.9.12
  684. 437.54 s > Checking unicode-ident v1.0.24
  685. 437.54 s > Checking hashbrown v0.17.0
  686. 437.54 s > Checking errno v0.3.14
  687. 437.54 s > Checking parking_lot v0.12.5
  688. 437.54 s > Checking unicase v2.9.0
  689. 437.54 s > Checking strsim v0.11.1
  690. 437.54 s > Checking clap_lex v1.1.0
  691. 437.54 s > Checking signal-hook-registry v1.4.8
  692. 437.54 s > Checking generic-array v0.14.7
  693. 437.54 s > Checking vte v0.14.1
  694. 437.54 s > Checking same-file v1.0.6
  695. 437.54 s > Checking symjit v2.21.0
  696. 437.54 s > Checking half v2.7.1
  697. 437.54 s > Checking signal-hook v0.3.18
  698. 437.54 s > Checking walkdir v2.5.0
  699. 437.54 s > Checking indexmap v2.14.0
  700. 437.54 s > Checking matchers v0.2.0
  701. 437.54 s > Checking regex v1.12.3
  702. 437.54 s > Checking crypto-common v0.1.7
  703. 437.54 s > Checking block-buffer v0.10.4
  704. 437.54 s > Checking tracing-subscriber v0.3.23
  705. 437.54 s > Checking mio v1.2.0
  706. 437.54 s > Checking terminal_size v0.4.4
  707. 437.54 s > Checking minimal-lexical v0.2.1
  708. 437.54 s > Checking ciborium-io v0.2.2
  709. 437.54 s > Checking clap_builder v4.6.0
  710. 437.54 s > Checking ciborium-ll v0.2.2
  711. 437.54 s > Checking signal-hook-mio v0.2.5
  712. 437.54 s > Checking digest v0.10.7
  713. 437.54 s > Checking derive_more v2.1.1
  714. 437.54 s > Checking nom v7.1.3
  715. 437.54 s > Checking num-bigint v0.4.6
  716. 437.54 s > Checking console v0.16.3
  717. 437.54 s > Checking bstr v1.12.1
  718. 437.54 s > Checking cpufeatures v0.2.17
  719. 437.54 s > Checking winnow v0.7.15
  720. 437.54 s > Checking linux-raw-sys v0.4.15
  721. 437.54 s > Checking globset v0.4.18
  722. 437.54 s > Checking rustix v0.38.44
  723. 437.54 s > Checking sha2 v0.10.9
  724. 437.54 s > Checking ciborium v0.2.2
  725. 437.54 s > Checking getrandom v0.4.2
  726. 437.54 s > Checking rand_core v0.6.4
  727. 437.54 s > Checking fnv v1.0.7
  728. 437.54 s > Checking fastrand v2.4.1
  729. 437.54 s > Checking plotters-backend v0.3.7
  730. 437.54 s > Checking rust-embed-utils v8.11.0
  731. 437.54 s > Compiling unicode_names2 v1.3.0
  732. 437.54 s > Checking serde_spanned v0.6.9
  733. 437.54 s > Checking tempfile v3.27.0
  734. 437.54 s > Checking toml_datetime v0.6.11
  735. 437.54 s > Checking itertools v0.10.5
  736. 437.54 s > Checking tap v1.0.1
  737. 437.54 s > Checking crossterm v0.28.1
  738. 437.54 s > Checking toml_write v0.1.2
  739. 437.54 s > Checking plotters-svg v0.3.7
  740. 437.54 s > Checking cast v0.3.0
  741. 437.54 s > Checking wyz v0.5.1
  742. 437.54 s > Checking clap v4.6.1
  743. 437.54 s > Checking toml_edit v0.22.27
  744. 437.54 s > Checking rand_chacha v0.3.1
  745. 437.54 s > Checking plotters v0.3.7
  746. 437.54 s > Checking radium v0.7.0
  747. 437.54 s > Checking xprec v0.2.2
  748. 437.54 s > Checking typeid v1.0.3
  749. 437.54 s > Checking similar v2.7.0
  750. 437.54 s > Checking ansitok v0.3.0
  751. 437.54 s > Checking tinytemplate v1.2.1
  752. 437.54 s > Checking is-terminal v0.4.17
  753. 437.54 s > Checking anes v0.1.6
  754. 437.54 s > Checking bytecount v0.6.9
  755. 437.54 s > Checking funty v2.0.0
  756. 437.54 s > Checking oorandom v11.1.5
  757. 437.54 s > Checking rand v0.8.6
  758. 437.54 s > Checking ron v0.12.1
  759. 437.54 s > Checking toml_edit v0.25.11+spec-1.1.0
  760. 437.54 s > Checking ansi-str v0.9.0
  761. 437.54 s > Checking testing_table v0.3.0
  762. 437.54 s > Checking env_filter v1.0.1
  763. 437.54 s > Checking bitvec v1.0.1
  764. 437.54 s > Checking criterion-plot v0.5.0
  765. 437.54 s > Checking papergrid v0.17.0
  766. 437.54 s > Checking uncased v0.9.10
  767. 437.54 s > Checking jiff v0.2.24
  768. 437.54 s > Checking ptr_meta v0.1.4
  769. 437.54 s > Checking simdutf8 v0.1.5
  770. 437.54 s > Checking ucd-trie v0.1.7
  771. 437.54 s > Checking ahash v0.7.8
  772. 437.54 s > Checking criterion v0.5.1
  773. 437.54 s > Checking approx v0.4.0
  774. 437.54 s > Checking pest v2.8.6
  775. 437.54 s > Checking hashbrown v0.12.3
  776. 437.54 s > Checking seahash v4.1.0
  777. 437.54 s > Checking bytecheck v0.6.12
  778. 437.54 s > Checking cgmath v0.18.0
  779. 437.54 s > Checking num-rational v0.4.2
  780. 437.54 s > Checking rend v0.4.2
  781. 437.54 s > Checking insta v1.47.2
  782. 437.54 s > Checking num-iter v0.1.45
  783. 437.54 s > Checking ref-ops v0.2.5
  784. 437.54 s > Checking num v0.4.3
  785. 437.54 s > Checking rand_xoshiro v0.6.0
  786. 437.54 s > Checking features v0.10.0
  787. 437.54 s > Checking tabled v0.20.0
  788. 437.54 s > Checking constcat v0.5.1
  789. 437.54 s > Checking gat-lending-iterator v0.1.8
  790. 437.54 s > Checking colored v2.2.0
  791. 437.54 s > Checking arrayref v0.3.9
  792. 437.54 s > Checking cpufeatures v0.3.0
  793. 437.54 s > Checking constant_time_eq v0.4.2
  794. 437.54 s > Checking blake3 v1.8.5
  795. 437.54 s > Checking toml v0.8.23
  796. 437.54 s > Checking base64 v0.22.1
  797. 437.54 s > Checking joinery v2.1.0
  798. 437.54 s > Checking siphasher v1.0.2
  799. 437.54 s > Checking titlecase v2.2.1
  800. 437.54 s > Checking subprocess v0.2.15
  801. 437.54 s > Checking rust_lisp v0.18.0
  802. 437.54 s > Compiling vakint v0.1.2 (/build/source/crates/vakint)
  803. 437.54 s > Compiling pyo3-macros-backend v0.28.3
  804. 437.54 s > Compiling pyo3-ffi v0.28.3
  805. 437.54 s > Compiling pyo3 v0.28.3
  806. 437.54 s > Compiling numpy v0.28.0
  807. 437.54 s > Checking figment v0.10.19
  808. 437.54 s > Checking dot-parser v0.5.1
  809. 437.54 s > Checking phf_shared v0.13.1
  810. 437.54 s > Checking string-template-plus v0.4.3
  811. 437.54 s > Checking version-compare v0.2.1
  812. 437.54 s > Checking xpct v0.5.1
  813. 437.54 s > Checking ryu v1.0.23
  814. 437.54 s > Checking castaway v0.2.4
  815. 437.54 s > Checking phf v0.13.1
  816. 437.54 s > Checking toml_datetime v0.7.5+spec-1.1.0
  817. 437.54 s > Checking strum v0.27.2
  818. 437.54 s > Checking unicode-truncate v2.0.1
  819. 437.54 s > Checking kasuari v0.4.12
  820. 437.54 s > Checking toml v0.9.12+spec-1.1.0
  821. 437.54 s > Checking compact_str v0.9.0
  822. 437.54 s > Checking lru v0.16.4
  823. 437.54 s > Checking vte v0.15.0
  824. 437.54 s > Checking portable-atomic v1.13.1
  825. 437.54 s > Checking unit-prefix v0.5.2
  826. 437.54 s > Checking rand_distr v0.4.3
  827. 437.54 s > Checking vt100 v0.16.2
  828. 437.54 s > Checking simba v0.6.0
  829. 437.54 s > Checking line-clipping v0.3.7
  830. 437.54 s > Checking adler2 v2.0.1
  831. 437.54 s > Compiling three-dimensional-reps v0.1.0 (/build/source/crates/three-dimensional-reps)
  832. 437.54 s > Checking gimli v0.32.3
  833. 437.54 s > Checking miniz_oxide v0.8.9
  834. 437.54 s > Checking env_logger v0.11.10
  835. 437.54 s > Checking thiserror v1.0.69
  836. 437.54 s > Checking derive_builder v0.11.2
  837. 437.54 s > Checking owo-colors v4.3.0
  838. 437.54 s > Checking object v0.37.3
  839. 437.54 s > Checking ratatui-core v0.1.0
  840. 437.54 s > Checking crossterm v0.29.0
  841. 437.54 s > Checking tracing-error v0.2.1
  842. 437.54 s > Checking indicatif v0.18.4
  843. 437.54 s > Checking typed-index-collections v3.5.0
  844. 437.54 s > Checking serde-big-array v0.5.1
  845. 437.54 s > Checking amd v0.2.2
  846. 437.54 s > Compiling rustpython-parser-core v0.4.0
  847. 437.54 s > Checking itertools v0.11.0
  848. 437.54 s > Compiling gammaloop-tracing-filter-macros v0.1.0 (/build/source/crates/gammaloop-tracing-filter-macros)
  849. 437.54 s > Checking option-ext v0.2.0
  850. 437.54 s > Checking rustc-demangle v0.1.27
  851. 437.54 s > Checking rkyv v0.7.46
  852. 437.54 s > Checking dirs-sys v0.5.0
  853. 437.54 s > Compiling rustpython-ast v0.4.0
  854. 437.54 s > Checking ref-cast v1.0.25
  855. 437.54 s > Checking nix v0.31.2
  856. 437.54 s > Checking integer-sqrt v0.1.5
  857. 437.54 s > Checking brotli-decompressor v4.0.3
  858. 437.54 s > Checking crossbeam-channel v0.5.15
  859. 437.54 s > Checking itertools v0.12.1
  860. 437.54 s > Checking unsafe-libyaml v0.2.11
  861. 437.54 s > Checking color-spantrace v0.3.0
  862. 437.54 s > Compiling gammalooprs v0.3.4 (/build/source/crates/gammalooprs)
  863. 437.54 s > Checking symlink v0.1.0
  864. 437.54 s > Checking include_dir v0.7.4
  865. 437.54 s > Checking ratatui-widgets v0.3.0
  866. 437.54 s > Checking ratatui-crossterm v0.1.0
  867. 437.54 s > Checking tracing-appender v0.2.5
  868. 437.54 s > Checking pathfinding v4.15.0
  869. 437.54 s > Checking ctrlc v3.5.2
  870. 437.54 s > Checking tracing-indicatif v0.3.14
  871. 437.54 s > Checking clarabel v0.11.1
  872. 437.54 s > Checking schemars v1.2.1
  873. 437.54 s > Checking dirs v6.0.0
  874. 437.54 s > Checking slotmap v1.1.1
  875. 437.54 s > Checking json5 v0.4.1
  876. 437.54 s > Checking brotli v7.0.0
  877. 437.54 s > Checking serde_yaml v0.9.34+deprecated
  878. 437.54 s > Checking vectorize v0.2.0
  879. 437.54 s > Checking base62 v2.2.4
  880. 437.54 s > Checking ringbuffer v0.16.0
  881. 437.54 s > Checking rust-embed v8.11.0
  882. 437.54 s > Checking addr2line v0.25.1
  883. 437.54 s > Checking clap_complete v4.6.3
  884. 437.54 s > Checking fd-lock v4.0.4
  885. 437.54 s > Checking strip-ansi-escapes v0.2.1
  886. 437.54 s > Checking ratatui-macros v0.7.0
  887. 437.54 s > Compiling gammaloop-api v0.1.0 (/build/source/crates/gammaloop-api)
  888. 437.54 s > Checking itertools v0.13.0
  889. 437.54 s > Checking strum v0.26.3
  890. 437.54 s > Checking ratatui v0.30.0
  891. 437.54 s > Checking sysinfo v0.33.1
  892. 437.54 s > Checking shlex v1.3.0
  893. 437.54 s > Compiling numerica v2.2.0 (https://github.com/alphal00p/symbolica?rev=a277a8dadbaae5a8d6605f2f381991a601e1f345#a277a8da)
  894. 437.54 s > Checking clap_complete_nushell v4.6.0
  895. 437.54 s > Checking slab v0.4.12
  896. 437.54 s > Checking futures-task v0.3.32
  897. 437.54 s > Checking futures-core v0.3.32
  898. 437.54 s > Checking sdd v3.0.10
  899. 437.54 s > Compiling gammaloop-integration-tests v0.1.0 (/build/source/tests)
  900. 437.54 s > Compiling test-log-core v0.2.20
  901. 437.54 s > Checking futures-util v0.3.32
  902. 437.54 s > Compiling rustc_version v0.4.1
  903. 437.54 s > Checking which v8.0.2
  904. 437.54 s > Checking scc v2.4.0
  905. 437.54 s > Checking bincode v1.3.3
  906. 437.54 s > Compiling gungraun-runner v0.18.2
  907. 437.54 s > Checking backtrace v0.3.76
  908. 437.54 s > Checking reedline v0.42.0
  909. 437.54 s > Compiling gungraun-macros v0.8.0
  910. 437.54 s > Checking color-eyre v0.6.5
  911. 437.54 s > Checking nalgebra v0.29.0
  912. 437.54 s > Checking proc-macro2 v1.0.106
  913. 437.54 s > Checking maplit v1.0.2
  914. 437.54 s > Checking base64 v0.21.7
  915. 437.54 s > Compiling iai-callgrind-runner v0.14.2
  916. 437.54 s > Checking quote v1.0.45
  917. 437.54 s > Checking kurbo v0.13.0
  918. 437.54 s > Checking futures-executor v0.3.32
  919. 437.54 s > Checking ron v0.8.1
  920. 437.54 s > Checking wait-timeout v0.2.1
  921. 437.54 s > Compiling iai-callgrind v0.14.2
  922. 437.54 s > Checking serial_test v3.4.0
  923. 437.54 s > Checking bit-vec v0.8.0
  924. 437.54 s > Checking quick-error v1.2.3
  925. 437.54 s > Checking rusty-fork v0.3.1
  926. 437.54 s > Compiling test-log-macros v0.2.20
  927. 437.54 s > Checking bit-set v0.8.0
  928. 437.54 s > Checking syn v2.0.117
  929. 437.54 s > Compiling iai-callgrind-macros v0.5.1
  930. 437.54 s > Checking rand_xorshift v0.4.0
  931. 437.54 s > Checking console v0.15.11
  932. 437.54 s > Checking unarray v0.1.4
  933. 437.54 s > Checking pathdiff v0.2.3
  934. 437.54 s > Checking proptest v1.11.0
  935. 437.54 s > Checking clinnet v0.1.8 (/build/source/crates/clinnet)
  936. 437.54 s > Checking similar-asserts v1.7.0
  937. 437.54 s > Checking kurvst v0.1.0 (/build/source/crates/kurvst)
  938. 437.54 s > Compiling graphica v2.1.0 (https://github.com/alphal00p/symbolica?rev=a277a8dadbaae5a8d6605f2f381991a601e1f345#a277a8da)
  939. 437.54 s > Checking test-log v0.2.20
  940. 437.54 s > Checking statrs v0.16.1
  941. 437.54 s > Checking momtrop v0.3.0
  942. 437.54 s > Checking gungraun v0.18.2
  943. 437.54 s > Compiling pyo3-macros v0.28.3
  944. 437.54 s > Compiling pyo3-stub-gen-derive v0.17.2
  945. 437.54 s > Checking pyo3-stub-gen v0.17.2
  946. 437.54 s > Checking symbolica-utils v0.1.0 (/build/source/crates/symbolica-utils)
  947. 437.54 s > Checking spenso-macros v0.3.2 (/build/source/crates/spenso-macros)
  948. 437.54 s > Compiling gammaloop-workspace-hack v0.1.0 (/build/source/crates/gammaloop-workspace-hack)
  949. 437.54 s > Checking linnet v0.17.0 (/build/source/crates/linnet)
  950. 437.54 s > Checking spenso v0.6.0 (/build/source/crates/spenso)
  951. 437.54 s > Checking linnet-py v0.1.0 (/build/source/crates/linnet-py)
  952. 437.54 s > Checking linnest v0.1.0 (/build/source/crates/linnest)
  953. 437.54 s > Checking idenso v0.3.0 (/build/source/crates/idenso)
  954. 437.54 s > Checking gammaloop-tracing-filter v0.1.0 (/build/source/crates/gammaloop-tracing-filter)
  955. 437.54 s > Checking spenso-hep-lib v0.1.7 (/build/source/crates/spenso-hep-lib)
  956. 437.54 s > Checking spynso3 v0.1.2 (/build/source/crates/spynso3)
  957. 437.54 s > warning: unused import: `GaussianReferenceFunction`
  958. 437.54 s > --> crates/gammaloop-api/src/state.rs:38:27
  959. 437.54 s > |
  960. 437.54 s > 38 | integrands::process::{GaussianReferenceFunction, ProcessIntegrand},
  961. 437.54 s > | ^^^^^^^^^^^^^^^^^^^^^^^^^
  962. 437.54 s > |
  963. 437.54 s > = note: `#[warn(unused_imports)]` (part of `#[warn(unused)]`) on by default
  964. 437.54 s >
  965. 437.54 s > warning: `gammaloop-api` (lib) generated 1 warning (run `cargo fix --lib -p gammaloop-api` to apply 1 suggestion)
  966. 437.54 s > error[E0560]: struct `CutInfo` has no field named `lmb_channel_id`
  967. 437.54 s > --> tests/tests/test_differential.rs:86:13
  968. 437.54 s > |
  969. 437.54 s > 86 | lmb_channel_id: None,
  970. 437.54 s > | ^^^^^^^^^^^^^^ `CutInfo` does not have this field
  971. 437.54 s > |
  972. 437.54 s > = note: available fields are: `sampling_channel_id`, `sampling_channel_edge_ids`
  973. 437.54 s >
  974. 437.54 s > error[E0560]: struct `CutInfo` has no field named `lmb_channel_edge_ids`
  975. 437.54 s > --> tests/tests/test_differential.rs:87:13
  976. 437.54 s > |
  977. 437.54 s > 87 | lmb_channel_edge_ids: None,
  978. 437.54 s > | ^^^^^^^^^^^^^^^^^^^^ `CutInfo` does not have this field
  979. 437.54 s > |
  980. 437.54 s > = note: available fields are: `sampling_channel_id`, `sampling_channel_edge_ids`
  981. 437.54 s >
  982. 437.54 s > For more information about this error, try `rustc --explain E0560`.
  983. 437.54 s > error: could not compile `gammaloop-integration-tests` (test "test_differential") due to 2 previous errors
  984. 437.54 s > warning: build failed, waiting for other jobs to finish...
  985. 437.54 s > error[E0609]: no field `lmb_channel_edge_ids` on type `CutInfo`
  986. 437.54 s > --> tests/tests/test_evaluation_api.rs:311:10
  987. 437.54 s > |
  988. 437.54 s > 311 | .lmb_channel_edge_ids
  989. 437.54 s > | ^^^^^^^^^^^^^^^^^^^^ unknown field
  990. 437.54 s > |
  991. 437.54 s > = note: available fields are: `particle_pdgs`, `cut_id`, `graph_id`, `graph_group_id`, `orientation_id` ... and 2 others
  992. 437.54 s >
  993. 437.54 s > error[E0609]: no field `lmb_channel_edge_ids` on type `CutInfo`
  994. 437.54 s > --> tests/tests/test_evaluation_api.rs:591:26
  995. 437.54 s > |
  996. 437.54 s > 591 | .lmb_channel_edge_ids
  997. 437.54 s > | ^^^^^^^^^^^^^^^^^^^^ unknown field
  998. 437.54 s > |
  999. 437.54 s > = note: available fields are: `particle_pdgs`, `cut_id`, `graph_id`, `graph_group_id`, `orientation_id` ... and 2 others
  1000. 437.54 s >
  1001. 437.54 s > error[E0609]: no field `lmb_channel_edge_ids` on type `CutInfo`
  1002. 437.54 s > --> tests/tests/test_evaluation_api.rs:1177:18
  1003. 437.54 s > |
  1004. 437.54 s > 1177 | .lmb_channel_edge_ids
  1005. 437.54 s > | ^^^^^^^^^^^^^^^^^^^^ unknown field
  1006. 437.54 s > |
  1007. 437.54 s > = note: available fields are: `particle_pdgs`, `cut_id`, `graph_id`, `graph_group_id`, `orientation_id` ... and 2 others
  1008. 437.54 s >
  1009. 437.54 s > error[E0609]: no field `lmb_channel_edge_ids` on type `CutInfo`
  1010. 437.54 s > --> tests/tests/test_evaluation_api.rs:1222:22
  1011. 437.54 s > |
  1012. 437.54 s > 1222 | .lmb_channel_edge_ids
  1013. 437.54 s > | ^^^^^^^^^^^^^^^^^^^^ unknown field
  1014. 437.54 s > |
  1015. 437.54 s > = note: available fields are: `particle_pdgs`, `cut_id`, `graph_id`, `graph_group_id`, `orientation_id` ... and 2 others
  1016. 437.54 s >
  1017. 437.54 s > error[E0609]: no field `lmb_channel_edge_ids` on type `CutInfo`
  1018. 437.54 s > --> tests/tests/test_evaluation_api.rs:1281:14
  1019. 437.54 s > |
  1020. 437.54 s > 1281 | .lmb_channel_edge_ids
  1021. 437.54 s > | ^^^^^^^^^^^^^^^^^^^^ unknown field
  1022. 437.54 s > |
  1023. 437.54 s > = note: available fields are: `particle_pdgs`, `cut_id`, `graph_id`, `graph_group_id`, `orientation_id` ... and 2 others
  1024. 437.54 s >
  1025. 437.54 s > error[E0609]: no field `lmb_channel_edge_ids` on type `CutInfo`
  1026. 437.54 s > --> tests/tests/test_evaluation_api.rs:1428:18
  1027. 437.54 s > |
  1028. 437.54 s > 1428 | .lmb_channel_edge_ids
  1029. 437.54 s > | ^^^^^^^^^^^^^^^^^^^^ unknown field
  1030. 437.54 s > |
  1031. 437.54 s > = note: available fields are: `particle_pdgs`, `cut_id`, `graph_id`, `graph_group_id`, `orientation_id` ... and 2 others
  1032. 437.54 s >
  1033. 437.54 s > For more information about this error, try `rustc --explain E0609`.
  1034. 437.54 s > error: could not compile `gammaloop-integration-tests` (test "test_evaluation_api") due to 6 previous errors
  1035. 437.54 s > error[E0609]: no field `lmb_channel_id` on type `CutInfo`
  1036. 437.54 s > --> tests/tests/test_runs/utils.rs:568:36
  1037. 437.54 s > |
  1038. 437.54 s > 568 | event.cut_info.lmb_channel_id,
  1039. 437.54 s > | ^^^^^^^^^^^^^^ unknown field
  1040. 437.54 s > |
  1041. 437.54 s > = note: available fields are: `particle_pdgs`, `cut_id`, `graph_id`, `graph_group_id`, `orientation_id` ... and 2 others
  1042. 437.54 s >
  1043. 437.54 s > error[E0609]: no field `lmb_channel_id` on type `CutInfo`
  1044. 437.54 s > --> tests/tests/test_runs/utils.rs:580:36
  1045. 437.54 s > |
  1046. 437.54 s > 580 | event.cut_info.lmb_channel_id,
  1047. 437.54 s > | ^^^^^^^^^^^^^^ unknown field
  1048. 437.54 s > |
  1049. 437.54 s > = note: available fields are: `particle_pdgs`, `cut_id`, `graph_id`, `graph_group_id`, `orientation_id` ... and 2 others
  1050. 437.54 s >
  1051. 437.54 s > error: could not compile `gammaloop-integration-tests` (test "test_runs") due to 2 previous errors
  1052. 437.54 s For full logs, run:
  1053. 437.54 s nix log /nix/store/53802zbj9009bwya0yb48jnjgdmqv87h-gammaloop-workspace-check-0.1.0.drv
  1054. 437.61 s Build failed.