0.00 s
$ /nix/store/9ypz3flqsrl5xl495mm8h645gadjsxi1-coreutils-9.11/bin/timeout --kill-after=15s 7200s /nix/store/23zk8sgzamrbmj1fday15szf7f2279s8-nix-2.34.7/bin/nix --extra-experimental-features nix-command --extra-experimental-features flakes flake clone git+https://github.com/alphal00p/gammaloop --dest /tmp/nix-ci-worker/stable-pwd/repo/
0.07 s
Cloning into '/tmp/nix-ci-worker/stable-pwd/repo'...
0.76 s
remote: Enumerating objects: 93878, done.
0.88 s
remote: Counting objects: 0% (1/9169)
remote: Counting objects: 1% (92/9169)
remote: Counting objects: 2% (184/9169)
remote: Counting objects: 3% (276/9169)
remote: Counting objects: 4% (367/9169)
remote: Counting objects: 5% (459/9169)
remote: Counting objects: 6% (551/9169)
remote: Counting objects: 7% (642/9169)
remote: Counting objects: 8% (734/9169)
remote: Counting objects: 9% (826/9169)
remote: Counting objects: 10% (917/9169)
remote: Counting objects: 11% (1009/9169)
remote: Counting objects: 12% (1101/9169)
remote: Counting objects: 13% (1192/9169)
remote: Counting objects: 14% (1284/9169)
remote: Counting objects: 15% (1376/9169)
remote: Counting objects: 16% (1468/9169)
remote: Counting objects: 17% (1559/9169)
remote: Counting objects: 18% (1651/9169)
remote: Counting objects: 19% (1743/9169)
remote: Counting objects: 20% (1834/9169)
remote: Counting objects: 21% (1926/9169)
remote: Counting objects: 22% (2018/9169)
remote: Counting objects: 23% (2109/9169)
remote: Counting objects: 24% (2201/9169)
remote: Counting objects: 25% (2293/9169)
remote: Counting objects: 26% (2384/9169)
remote: Counting objects: 27% (2476/9169)
remote: Counting objects: 28% (2568/9169)
remote: Counting objects: 29% (2660/9169)
remote: Counting objects: 30% (2751/9169)
remote: Counting objects: 31% (2843/9169)
remote: Counting objects: 32% (2935/9169)
remote: Counting objects: 33% (3026/9169)
remote: Counting objects: 34% (3118/9169)
remote: Counting objects: 35% (3210/9169)
remote: Counting objects: 36% (3301/9169)
remote: Counting objects: 37% (3393/9169)
remote: Counting objects: 38% (3485/9169)
remote: Counting objects: 39% (3576/9169)
remote: Counting objects: 40% (3668/9169)
remote: Counting objects: 41% (3760/9169)
remote: Counting objects: 42% (3851/9169)
remote: Counting objects: 43% (3943/9169)
remote: Counting objects: 44% (4035/9169)
remote: Counting objects: 45% (4127/9169)
remote: Counting objects: 46% (4218/9169)
remote: Counting objects: 47% (4310/9169)
remote: Counting objects: 48% (4402/9169)
remote: Counting objects: 49% (4493/9169)
remote: Counting objects: 50% (4585/9169)
remote: Counting objects: 51% (4677/9169)
remote: Counting objects: 52% (4768/9169)
remote: Counting objects: 53% (4860/9169)
remote: Counting objects: 54% (4952/9169)
remote: Counting objects: 55% (5043/9169)
remote: Counting objects: 56% (5135/9169)
remote: Counting objects: 57% (5227/9169)
remote: Counting objects: 58% (5319/9169)
remote: Counting objects: 59% (5410/9169)
remote: Counting objects: 60% (5502/9169)
remote: Counting objects: 61% (5594/9169)
remote: Counting objects: 62% (5685/9169)
remote: Counting objects: 63% (5777/9169)
remote: Counting objects: 64% (5869/9169)
remote: Counting objects: 65% (5960/9169)
remote: Counting objects: 66% (6052/9169)
remote: Counting objects: 67% (6144/9169)
remote: Counting objects: 68% (6235/9169)
remote: Counting objects: 69% (6327/9169)
remote: Counting objects: 70% (6419/9169)
remote: Counting objects: 71% (6510/9169)
remote: Counting objects: 72% (6602/9169)
remote: Counting objects: 73% (6694/9169)
remote: Counting objects: 74% (6786/9169)
remote: Counting objects: 75% (6877/9169)
remote: Counting objects: 76% (6969/9169)
remote: Counting objects: 77% (7061/9169)
remote: Counting objects: 78% (7152/9169)
remote: Counting objects: 79% (7244/9169)
remote: Counting objects: 80% (7336/9169)
remote: Counting objects: 81% (7427/9169)
remote: Counting objects: 82% (7519/9169)
remote: Counting objects: 83% (7611/9169)
remote: Counting objects: 84% (7702/9169)
remote: Counting objects: 85% (7794/9169)
remote: Counting objects: 86% (7886/9169)
remote: Counting objects: 87% (7978/9169)
remote: Counting objects: 88% (8069/9169)
remote: Counting objects: 89% (8161/9169)
remote: Counting objects: 90% (8253/9169)
remote: Counting objects: 91% (8344/9169)
remote: Counting objects: 92% (8436/9169)
remote: Counting objects: 93% (8528/9169)
remote: Counting objects: 94% (8619/9169)
remote: Counting objects: 95% (8711/9169)
remote: Counting objects: 96% (8803/9169)
remote: Counting objects: 97% (8894/9169)
remote: Counting objects: 98% (8986/9169)
remote: Counting objects: 99% (9078/9169)
remote: Counting objects: 100% (9169/9169)
remote: Counting objects: 100% (9169/9169), done.
3.21 s
remote: Compressing objects: 0% (1/1923)
remote: Compressing objects: 1% (20/1923)
remote: Compressing objects: 2% (39/1923)
remote: Compressing objects: 3% (58/1923)
remote: Compressing objects: 4% (77/1923)
remote: Compressing objects: 5% (97/1923)
remote: Compressing objects: 6% (116/1923)
remote: Compressing objects: 7% (135/1923)
remote: Compressing objects: 7% (140/1923)
remote: Compressing objects: 8% (154/1923)
remote: Compressing objects: 9% (174/1923)
remote: Compressing objects: 10% (193/1923)
remote: Compressing objects: 11% (212/1923)
remote: Compressing objects: 12% (231/1923)
remote: Compressing objects: 13% (250/1923)
remote: Compressing objects: 14% (270/1923)
remote: Compressing objects: 15% (289/1923)
remote: Compressing objects: 16% (308/1923)
remote: Compressing objects: 17% (327/1923)
remote: Compressing objects: 18% (347/1923)
remote: Compressing objects: 18% (355/1923)
remote: Compressing objects: 19% (366/1923)
remote: Compressing objects: 20% (385/1923)
remote: Compressing objects: 21% (404/1923)
remote: Compressing objects: 22% (424/1923)
remote: Compressing objects: 23% (443/1923)
remote: Compressing objects: 24% (462/1923)
remote: Compressing objects: 25% (481/1923)
remote: Compressing objects: 26% (500/1923)
remote: Compressing objects: 27% (520/1923)
remote: Compressing objects: 28% (539/1923)
remote: Compressing objects: 29% (558/1923)
remote: Compressing objects: 30% (577/1923)
remote: Compressing objects: 31% (597/1923)
remote: Compressing objects: 32% (616/1923)
remote: Compressing objects: 33% (635/1923)
remote: Compressing objects: 34% (654/1923)
remote: Compressing objects: 35% (674/1923)
remote: Compressing objects: 36% (693/1923)
remote: Compressing objects: 37% (712/1923)
remote: Compressing objects: 38% (731/1923)
remote: Compressing objects: 39% (750/1923)
remote: Compressing objects: 40% (770/1923)
remote: Compressing objects: 41% (789/1923)
remote: Compressing objects: 42% (808/1923)
remote: Compressing objects: 43% (827/1923)
remote: Compressing objects: 44% (847/1923)
remote: Compressing objects: 45% (866/1923)
remote: Compressing objects: 46% (885/1923)
remote: Compressing objects: 47% (904/1923)
remote: Compressing objects: 48% (924/1923)
remote: Compressing objects: 49% (943/1923)
remote: Compressing objects: 50% (962/1923)
remote: Compressing objects: 51% (981/1923)
remote: Compressing objects: 52% (1000/1923)
remote: Compressing objects: 53% (1020/1923)
remote: Compressing objects: 54% (1039/1923)
remote: Compressing objects: 55% (1058/1923)
remote: Compressing objects: 56% (1077/1923)
remote: Compressing objects: 57% (1097/1923)
remote: Compressing objects: 58% (1116/1923)
remote: Compressing objects: 59% (1135/1923)
remote: Compressing objects: 60% (1154/1923)
remote: Compressing objects: 61% (1174/1923)
remote: Compressing objects: 62% (1193/1923)
remote: Compressing objects: 63% (1212/1923)
remote: Compressing objects: 64% (1231/1923)
remote: Compressing objects: 65% (1250/1923)
remote: Compressing objects: 66% (1270/1923)
remote: Compressing objects: 67% (1289/1923)
remote: Compressing objects: 68% (1308/1923)
remote: Compressing objects: 69% (1327/1923)
remote: Compressing objects: 70% (1347/1923)
remote: Compressing objects: 71% (1366/1923)
remote: Compressing objects: 72% (1385/1923)
remote: Compressing objects: 73% (1404/1923)
remote: Compressing objects: 74% (1424/1923)
remote: Compressing objects: 75% (1443/1923)
remote: Compressing objects: 76% (1462/1923)
remote: Compressing objects: 77% (1481/1923)
remote: Compressing objects: 78% (1500/1923)
remote: Compressing objects: 79% (1520/1923)
remote: Compressing objects: 80% (1539/1923)
remote: Compressing objects: 81% (1558/1923)
remote: Compressing objects: 82% (1577/1923)
remote: Compressing objects: 83% (1597/1923)
remote: Compressing objects: 84% (1616/1923)
remote: Compressing objects: 85% (1635/1923)
remote: Compressing objects: 86% (1654/1923)
remote: Compressing objects: 87% (1674/1923)
remote: Compressing objects: 88% (1693/1923)
remote: Compressing objects: 89% (1712/1923)
remote: Compressing objects: 90% (1731/1923)
remote: Compressing objects: 91% (1750/1923)
remote: Compressing objects: 92% (1770/1923)
remote: Compressing objects: 93% (1789/1923)
remote: Compressing objects: 94% (1808/1923)
remote: Compressing objects: 95% (1827/1923)
remote: Compressing objects: 96% (1847/1923)
remote: Compressing objects: 97% (1866/1923)
remote: Compressing objects: 98% (1885/1923)
remote: Compressing objects: 99% (1904/1923)
remote: Compressing objects: 100% (1923/1923)
remote: Compressing objects: 100% (1923/1923), done.
12.79 s
Receiving objects: 0% (1/93878)
Receiving objects: 1% (939/93878)
Receiving objects: 2% (1878/93878)
Receiving objects: 3% (2817/93878)
Receiving objects: 4% (3756/93878)
Receiving objects: 5% (4694/93878)
Receiving objects: 6% (5633/93878)
Receiving objects: 7% (6572/93878)
Receiving objects: 8% (7511/93878), 15.69 MiB | 31.43 MiB/s
Receiving objects: 9% (8450/93878), 15.69 MiB | 31.43 MiB/s
Receiving objects: 10% (9388/93878), 15.69 MiB | 31.43 MiB/s
Receiving objects: 11% (10327/93878), 15.69 MiB | 31.43 MiB/s
Receiving objects: 12% (11266/93878), 15.69 MiB | 31.43 MiB/s
Receiving objects: 13% (12205/93878), 15.69 MiB | 31.43 MiB/s
Receiving objects: 14% (13143/93878), 15.69 MiB | 31.43 MiB/s
Receiving objects: 15% (14082/93878), 15.69 MiB | 31.43 MiB/s
Receiving objects: 16% (15021/93878), 15.69 MiB | 31.43 MiB/s
Receiving objects: 17% (15960/93878), 15.69 MiB | 31.43 MiB/s
Receiving objects: 18% (16899/93878), 15.69 MiB | 31.43 MiB/s
Receiving objects: 19% (17837/93878), 15.69 MiB | 31.43 MiB/s
Receiving objects: 20% (18776/93878), 15.69 MiB | 31.43 MiB/s
Receiving objects: 21% (19715/93878), 15.69 MiB | 31.43 MiB/s
Receiving objects: 22% (20654/93878), 15.69 MiB | 31.43 MiB/s
Receiving objects: 23% (21592/93878), 15.69 MiB | 31.43 MiB/s
Receiving objects: 24% (22531/93878), 15.69 MiB | 31.43 MiB/s
Receiving objects: 25% (23470/93878), 15.69 MiB | 31.43 MiB/s
Receiving objects: 26% (24409/93878), 15.69 MiB | 31.43 MiB/s
Receiving objects: 27% (25348/93878), 15.69 MiB | 31.43 MiB/s
Receiving objects: 28% (26286/93878), 15.69 MiB | 31.43 MiB/s
Receiving objects: 29% (27225/93878), 15.69 MiB | 31.43 MiB/s
Receiving objects: 30% (28164/93878), 15.69 MiB | 31.43 MiB/s
Receiving objects: 31% (29103/93878), 15.69 MiB | 31.43 MiB/s
Receiving objects: 32% (30041/93878), 15.69 MiB | 31.43 MiB/s
Receiving objects: 33% (30980/93878), 15.69 MiB | 31.43 MiB/s
Receiving objects: 34% (31919/93878), 15.69 MiB | 31.43 MiB/s
Receiving objects: 34% (32648/93878), 30.32 MiB | 30.34 MiB/s
Receiving objects: 35% (32858/93878), 30.32 MiB | 30.34 MiB/s
Receiving objects: 36% (33797/93878), 30.32 MiB | 30.34 MiB/s
Receiving objects: 37% (34735/93878), 30.32 MiB | 30.34 MiB/s
Receiving objects: 38% (35674/93878), 30.32 MiB | 30.34 MiB/s
Receiving objects: 39% (36613/93878), 30.32 MiB | 30.34 MiB/s
Receiving objects: 40% (37552/93878), 30.32 MiB | 30.34 MiB/s
Receiving objects: 41% (38490/93878), 43.59 MiB | 29.07 MiB/s
Receiving objects: 42% (39429/93878), 43.59 MiB | 29.07 MiB/s
Receiving objects: 43% (40368/93878), 43.59 MiB | 29.07 MiB/s
Receiving objects: 44% (41307/93878), 43.59 MiB | 29.07 MiB/s
Receiving objects: 45% (42246/93878), 43.59 MiB | 29.07 MiB/s
Receiving objects: 46% (43184/93878), 43.59 MiB | 29.07 MiB/s
Receiving objects: 47% (44123/93878), 43.59 MiB | 29.07 MiB/s
Receiving objects: 48% (45062/93878), 43.59 MiB | 29.07 MiB/s
Receiving objects: 49% (46001/93878), 43.59 MiB | 29.07 MiB/s
Receiving objects: 50% (46939/93878), 43.59 MiB | 29.07 MiB/s
Receiving objects: 50% (47467/93878), 43.59 MiB | 29.07 MiB/s
Receiving objects: 51% (47878/93878), 60.00 MiB | 30.03 MiB/s
Receiving objects: 52% (48817/93878), 60.00 MiB | 30.03 MiB/s
Receiving objects: 53% (49756/93878), 60.00 MiB | 30.03 MiB/s
Receiving objects: 54% (50695/93878), 60.00 MiB | 30.03 MiB/s
Receiving objects: 55% (51633/93878), 60.00 MiB | 30.03 MiB/s
Receiving objects: 56% (52572/93878), 60.00 MiB | 30.03 MiB/s
Receiving objects: 57% (53511/93878), 60.00 MiB | 30.03 MiB/s
Receiving objects: 58% (54450/93878), 77.50 MiB | 31.03 MiB/s
Receiving objects: 59% (55389/93878), 77.50 MiB | 31.03 MiB/s
Receiving objects: 60% (56327/93878), 77.50 MiB | 31.03 MiB/s
Receiving objects: 61% (57266/93878), 77.50 MiB | 31.03 MiB/s
Receiving objects: 61% (57307/93878), 92.66 MiB | 30.91 MiB/s
Receiving objects: 61% (57464/93878), 126.46 MiB | 31.64 MiB/s
Receiving objects: 61% (57557/93878), 142.50 MiB | 31.59 MiB/s
Receiving objects: 61% (58011/93878), 193.35 MiB | 33.06 MiB/s
Receiving objects: 62% (58205/93878), 209.47 MiB | 32.95 MiB/s
Receiving objects: 63% (59144/93878), 209.47 MiB | 32.95 MiB/s
Receiving objects: 64% (60082/93878), 209.47 MiB | 32.95 MiB/s
Receiving objects: 65% (61021/93878), 209.47 MiB | 32.95 MiB/s
Receiving objects: 66% (61960/93878), 209.47 MiB | 32.95 MiB/s
Receiving objects: 67% (62899/93878), 209.47 MiB | 32.95 MiB/s
Receiving objects: 68% (63838/93878), 209.47 MiB | 32.95 MiB/s
Receiving objects: 68% (63912/93878), 226.48 MiB | 32.84 MiB/s
Receiving objects: 69% (64776/93878), 226.48 MiB | 32.84 MiB/s
Receiving objects: 70% (65715/93878), 226.48 MiB | 32.84 MiB/s
Receiving objects: 71% (66654/93878), 226.48 MiB | 32.84 MiB/s
Receiving objects: 72% (67593/93878), 226.48 MiB | 32.84 MiB/s
Receiving objects: 73% (68531/93878), 226.48 MiB | 32.84 MiB/s
Receiving objects: 74% (69470/93878), 226.48 MiB | 32.84 MiB/s
Receiving objects: 75% (70409/93878), 226.48 MiB | 32.84 MiB/s
Receiving objects: 76% (71348/93878), 243.37 MiB | 33.14 MiB/s
Receiving objects: 77% (72287/93878), 243.37 MiB | 33.14 MiB/s
Receiving objects: 78% (73225/93878), 243.37 MiB | 33.14 MiB/s
Receiving objects: 79% (74164/93878), 243.37 MiB | 33.14 MiB/s
Receiving objects: 80% (75103/93878), 243.37 MiB | 33.14 MiB/s
Receiving objects: 81% (76042/93878), 243.37 MiB | 33.14 MiB/s
Receiving objects: 81% (76287/93878), 243.37 MiB | 33.14 MiB/s
Receiving objects: 82% (76980/93878), 260.25 MiB | 33.15 MiB/s
Receiving objects: 83% (77919/93878), 276.80 MiB | 33.02 MiB/s
Receiving objects: 84% (78858/93878), 276.80 MiB | 33.02 MiB/s
Receiving objects: 85% (79797/93878), 276.80 MiB | 33.02 MiB/s
Receiving objects: 86% (80736/93878), 276.80 MiB | 33.02 MiB/s
Receiving objects: 87% (81674/93878), 276.80 MiB | 33.02 MiB/s
Receiving objects: 87% (81774/93878), 276.80 MiB | 33.02 MiB/s
Receiving objects: 88% (82613/93878), 293.20 MiB | 33.10 MiB/s
Receiving objects: 89% (83552/93878), 293.20 MiB | 33.10 MiB/s
Receiving objects: 90% (84491/93878), 293.20 MiB | 33.10 MiB/s
Receiving objects: 91% (85429/93878), 293.20 MiB | 33.10 MiB/s
Receiving objects: 92% (86368/93878), 293.20 MiB | 33.10 MiB/s
Receiving objects: 93% (87307/93878), 293.20 MiB | 33.10 MiB/s
Receiving objects: 94% (88246/93878), 293.20 MiB | 33.10 MiB/s
Receiving objects: 95% (89185/93878), 293.20 MiB | 33.10 MiB/s
Receiving objects: 96% (90123/93878), 293.20 MiB | 33.10 MiB/s
Receiving objects: 97% (91062/93878), 293.20 MiB | 33.10 MiB/s
Receiving objects: 98% (92001/93878), 293.20 MiB | 33.10 MiB/s
Receiving objects: 99% (92940/93878), 293.20 MiB | 33.10 MiB/s
remote: Total 93878 (delta 7949), reused 7309 (delta 7245), pack-reused 84709 (from 3)
12.79 s
Receiving objects: 100% (93878/93878), 293.20 MiB | 33.10 MiB/s
Receiving objects: 100% (93878/93878), 309.93 MiB | 32.39 MiB/s, done.
13.83 s
Resolving deltas: 0% (0/63138)
Resolving deltas: 1% (635/63138)
Resolving deltas: 2% (1263/63138)
Resolving deltas: 3% (1895/63138)
Resolving deltas: 4% (2526/63138)
Resolving deltas: 5% (3157/63138)
Resolving deltas: 6% (3789/63138)
Resolving deltas: 7% (4420/63138)
Resolving deltas: 8% (5052/63138)
Resolving deltas: 9% (5683/63138)
Resolving deltas: 10% (6314/63138)
Resolving deltas: 11% (6946/63138)
Resolving deltas: 12% (7577/63138)
Resolving deltas: 13% (8208/63138)
Resolving deltas: 14% (8840/63138)
Resolving deltas: 15% (9472/63138)
Resolving deltas: 16% (10104/63138)
Resolving deltas: 17% (10734/63138)
Resolving deltas: 18% (11367/63138)
Resolving deltas: 19% (11997/63138)
Resolving deltas: 20% (12628/63138)
Resolving deltas: 21% (13260/63138)
Resolving deltas: 22% (13891/63138)
Resolving deltas: 23% (14522/63138)
Resolving deltas: 24% (15154/63138)
Resolving deltas: 25% (15785/63138)
Resolving deltas: 26% (16416/63138)
Resolving deltas: 27% (17048/63138)
Resolving deltas: 28% (17679/63138)
Resolving deltas: 29% (18311/63138)
Resolving deltas: 30% (18942/63138)
Resolving deltas: 31% (19573/63138)
Resolving deltas: 32% (20205/63138)
Resolving deltas: 33% (20836/63138)
Resolving deltas: 34% (21467/63138)
Resolving deltas: 35% (22100/63138)
Resolving deltas: 36% (22730/63138)
Resolving deltas: 37% (23362/63138)
Resolving deltas: 38% (23993/63138)
Resolving deltas: 39% (24624/63138)
Resolving deltas: 40% (25257/63138)
Resolving deltas: 41% (25888/63138)
Resolving deltas: 42% (26519/63138)
Resolving deltas: 43% (27150/63138)
Resolving deltas: 44% (27782/63138)
Resolving deltas: 45% (28413/63138)
Resolving deltas: 46% (29044/63138)
Resolving deltas: 47% (29675/63138)
Resolving deltas: 48% (30307/63138)
Resolving deltas: 49% (30938/63138)
Resolving deltas: 50% (31569/63138)
Resolving deltas: 51% (32201/63138)
Resolving deltas: 52% (32833/63138)
Resolving deltas: 53% (33464/63138)
Resolving deltas: 54% (34097/63138)
Resolving deltas: 55% (34726/63138)
Resolving deltas: 56% (35358/63138)
Resolving deltas: 57% (35991/63138)
Resolving deltas: 58% (36621/63138)
Resolving deltas: 59% (37252/63138)
Resolving deltas: 60% (37883/63138)
Resolving deltas: 61% (38515/63138)
Resolving deltas: 62% (39146/63138)
Resolving deltas: 63% (39777/63138)
Resolving deltas: 64% (40409/63138)
Resolving deltas: 65% (41040/63138)
Resolving deltas: 66% (41672/63138)
Resolving deltas: 67% (42303/63138)
Resolving deltas: 68% (42936/63138)
Resolving deltas: 69% (43566/63138)
Resolving deltas: 70% (44197/63138)
Resolving deltas: 71% (44830/63138)
Resolving deltas: 72% (45460/63138)
Resolving deltas: 73% (46091/63138)
Resolving deltas: 74% (46723/63138)
Resolving deltas: 75% (47359/63138)
Resolving deltas: 76% (47985/63138)
Resolving deltas: 77% (48617/63138)
Resolving deltas: 78% (49248/63138)
Resolving deltas: 79% (49880/63138)
Resolving deltas: 80% (50511/63138)
Resolving deltas: 81% (51142/63138)
Resolving deltas: 82% (51774/63138)
Resolving deltas: 83% (52405/63138)
Resolving deltas: 84% (53036/63138)
Resolving deltas: 85% (53668/63138)
Resolving deltas: 86% (54299/63138)
Resolving deltas: 87% (54931/63138)
Resolving deltas: 88% (55563/63138)
Resolving deltas: 89% (56193/63138)
Resolving deltas: 90% (56825/63138)
Resolving deltas: 91% (57456/63138)
Resolving deltas: 92% (58088/63138)
Resolving deltas: 93% (58720/63138)
Resolving deltas: 94% (59350/63138)
Resolving deltas: 95% (59982/63138)
Resolving deltas: 96% (60613/63138)
Resolving deltas: 96% (60650/63138)
Resolving deltas: 97% (61246/63138)
Resolving deltas: 98% (61876/63138)
Resolving deltas: 99% (62507/63138)
Resolving deltas: 100% (63138/63138)
Resolving deltas: 100% (63138/63138), done.
14.37 s
Fetching commit 3f9429122eb2e371af39dd0423cbb68dcf4c90ba for advanced_sampling ...
14.37 s
$ /nix/store/bcnisk3ydfgv26v2gw3zlky24g00yww2-git-2.54.0/bin/git fetch origin 3f9429122eb2e371af39dd0423cbb68dcf4c90ba
14.78 s
From https://github.com/alphal00p/gammaloop
14.78 s
* branch 3f9429122eb2e371af39dd0423cbb68dcf4c90ba -> FETCH_HEAD
14.79 s
$ /nix/store/9ypz3flqsrl5xl495mm8h645gadjsxi1-coreutils-9.11/bin/timeout --kill-after=15s 7200s /nix/store/bcnisk3ydfgv26v2gw3zlky24g00yww2-git-2.54.0/bin/git -c advice.detachedHead=false checkout 3f9429122eb2e371af39dd0423cbb68dcf4c90ba
15.28 s
HEAD is now at 3f9429122 handle fully weighted underflow in stability checks
15.29 s
$ /nix/store/9ypz3flqsrl5xl495mm8h645gadjsxi1-coreutils-9.11/bin/timeout --kill-after=15s 7200s /nix/store/23zk8sgzamrbmj1fday15szf7f2279s8-nix-2.34.7/bin/nix --extra-experimental-features nix-command --extra-experimental-features flakes --log-format internal-json run .#packages.x86_64-linux.nix-ci-check-gammaloop-nextest-python-api --print-build-logs
22.78 s
22.84 s
Downloading cached gammaloop-nextest-binaries-python-api-gammaloop-integration-tests from https://cache.nix-ci.com
22.84 s
Downloading cached gammaloop-python-module from https://cache.nix-ci.com
22.94 s
Downloaded cached gammaloop-nextest-binaries-python-api-gammaloop-integration-tests (8.5 MiB) in 101ms
22.94 s
Progress: 0 of 1 built, 1 of 4 downloaded from cache (1 downloading)
22.94 s
Downloading cached gammaloop-nextest-binaries-python-api from https://cache.nix-ci.com
22.95 s
Downloaded cached gammaloop-nextest-binaries-python-api (520 B) in 11ms
22.95 s
Progress: 0 of 1 built, 2 of 4 downloaded from cache (1 downloading)
23.92 s
Downloaded cached gammaloop-python-module (150.8 MiB) in 1.0s
23.92 s
Progress: 0 of 1 built, 3 of 4 downloaded from cache
23.92 s
Downloading cached nix-ci-check-gammaloop-nextest-python-api from https://cache.nix-ci.com
23.92 s
Downloaded cached nix-ci-check-gammaloop-nextest-python-api (1104 B) in 4ms
23.92 s
Progress: 0 of 1 built, 4 of 4 downloaded from cache
31.53 s
evaluating derivation 'g
copying '/nix/store/881j
evaluating derivation 'g
copying '/nix/store/881j
evaluating derivation 'g
copying '/nix/store/881j
evaluating derivation 'g
copying '/nix/store/881j
evaluating derivation 'g
copying '/nix/store/881j
evaluating derivation 'g
copying '/nix/store/881j
evaluating derivation 'g
copying '/nix/store/881j
evaluating derivation 'g
querying gammaloop-nexte
[0.0 KiB DL] querying in
[0 /7 built, 5 /0 /12 copiebuilder.pl> Running phase: patchPhase
31.54 s
[1 /0 /5 built, 2 /5 /12 copbuilder.pl> Running phase: updateAutotoolsGnuConfigScriptsPhase
31.55 s
builder.pl> Running phase: configurePhase
31.55 s
builder.pl> no configure script, doing nothing
31.56 s
builder.pl> Running phase: buildPhase
31.56 s
builder.pl> Running phase: checkPhase
31.57 s
builder.pl> Running phase: installPhase
31.57 s
builder.pl> no Makefile or custom installPhase, doing nothing
31.57 s
builder.pl> Running phase: fixupPhase
31.58 s
builder.pl> shrinking RPATHs of ELF executables and libraries in /nix/store/n17p4y03iknmyjpnfk30rj7i0klr448n-builder.pl
31.58 s
builder.pl> checking for references to /build/ in /nix/store/n17p4y03iknmyjpnfk30rj7i0klr448n-builder.pl...
31.59 s
builder.pl> patching script interpreter paths in /nix/store/n17p4y03iknmyjpnfk30rj7i0klr448n-builder.pl
31.61 s
builder.pl (post)> Uploading to the NixCI cache: /nix/store/n17p4y03iknmyjpnfk30rj7i0klr448n-builder.pl
31.66 s
builder.pl (post)> warning: 'warn-short-path-literals' is deprecated, use 'lint-short-path-literals = ignore' instead
31.68 s
builder.pl (post)> copying 0 paths...
31.73 s
builder.pl (post)> warning: 'warn-short-path-literals' is deprecated, use 'lint-short-path-literals = ignore' instead
31.77 s
builder.pl (post)> copying 0 paths...
32.32 s
[1 /4 built, 2 /7 /12 copie
[1 /4 built, 1 /11 /12 copi
[1 /3 built, 12 copied (2 python3> structuredAttrs is enabled
32.39 s
[1 /1 /3 built, 12 copied python3> created 227 symlinks in user environment
33.19 s
python3 (post)> Uploading to the NixCI cache: /nix/store/3gi2x25n327sf3xma8b08jd57aqv69x5-python3-3.13.14-env
33.23 s
python3 (post)> warning: 'warn-short-path-literals' is deprecated, use 'lint-short-path-literals = ignore' instead
33.26 s
python3 (post)> copying 0 paths...
33.30 s
python3 (post)> warning: 'warn-short-path-literals' is deprecated, use 'lint-short-path-literals = ignore' instead
33.44 s
python3 (post)> copying 0 paths...
33.74 s
[2 /4 built, 12 copied (2
[1 /2 /3 built, 12 copied gammaloop-nextest-python-api> Extracting 1 binary, 1 build script output directory, and 3 linked paths to /build/nextest-archive-J5dUI3
33.80 s
gammaloop-nextest-python-api> Extracted 18 files to /build/nextest-archive-J5dUI3 in 0.07s
33.81 s
gammaloop-nextest-python-api> ------------
33.81 s
gammaloop-nextest-python-api> Nextest run ID 1991f1e6-a793-428e-a18d-828fc205d70b with nextest profile: ci_gammaloop
33.81 s
gammaloop-nextest-python-api> Starting 5 tests across 1 binary
33.93 s
gammaloop-nextest-python-api> FAIL [ 0.118s] (1/5) gammaloop-integration-tests::test_python_api python_evaluate_sample_honors_generate_events_and_observable_snapshots
33.93 s
gammaloop-nextest-python-api> stdout ---
33.93 s
gammaloop-nextest-python-api>
33.93 s
gammaloop-nextest-python-api> running 1 test
33.93 s
gammaloop-nextest-python-api> test python_evaluate_sample_honors_generate_events_and_observable_snapshots ... FAILED
33.93 s
gammaloop-nextest-python-api>
33.93 s
gammaloop-nextest-python-api> failures:
33.93 s
gammaloop-nextest-python-api>
33.93 s
gammaloop-nextest-python-api> failures:
33.93 s
gammaloop-nextest-python-api> python_evaluate_sample_honors_generate_events_and_observable_snapshots
33.93 s
gammaloop-nextest-python-api>
33.93 s
gammaloop-nextest-python-api> test result: FAILED. 0 passed; 1 failed; 0 ignored; 0 measured; 4 filtered out; finished in 0.11s
33.93 s
gammaloop-nextest-python-api>
33.93 s
gammaloop-nextest-python-api> stderr ---
33.93 s
gammaloop-nextest-python-api> Error: Python API test subprocess failed.
33.93 s
gammaloop-nextest-python-api> stdout:
33.93 s
gammaloop-nextest-python-api> ┌────────────────────────────────────────────────────────┐
33.93 s
gammaloop-nextest-python-api> │ You are running a restricted Symbolica instance. │
33.93 s
gammaloop-nextest-python-api> │ │
33.93 s
gammaloop-nextest-python-api> │ This mode is only permitted for non-commercial use and │
33.93 s
gammaloop-nextest-python-api> │ is limited to one instance and core per machine. │
33.93 s
gammaloop-nextest-python-api> │ │
33.93 s
gammaloop-nextest-python-api> │ Hobbyists can easily acquire a free license key │
33.93 s
gammaloop-nextest-python-api> │ that unlocks all cores and removes this banner: │
33.93 s
gammaloop-nextest-python-api> │ │
33.93 s
gammaloop-nextest-python-api> │ from symbolica import * │
33.93 s
gammaloop-nextest-python-api> │ request_hobbyist_license('YOUR_NAME', 'YOUR_EMAIL') │
33.93 s
gammaloop-nextest-python-api> │ │
33.93 s
gammaloop-nextest-python-api> │ All other users can obtain a free 30-day trial key: │
33.93 s
gammaloop-nextest-python-api> │ │
33.93 s
gammaloop-nextest-python-api> │ from symbolica import * │
33.93 s
gammaloop-nextest-python-api> │ request_trial_license('NAME', 'EMAIL', 'EMPLOYER') │
33.93 s
gammaloop-nextest-python-api> │ │
33.93 s
gammaloop-nextest-python-api> │ See https://symbolica.io/docs/get_started.html#license │
33.93 s
gammaloop-nextest-python-api> └────────────────────────────────────────────────────────┘
33.93 s
gammaloop-nextest-python-api> ┌───────────────────────────────────────────────────────────────────────────────────────────────────────────┐
33.93 s
gammaloop-nextest-python-api> │ Cannot start new unlicensed Symbolica instance since there is already another one running on the machine. │
33.93 s
gammaloop-nextest-python-api> └───────────────────────────────────────────────────────────────────────────────────────────────────────────┘
33.93 s
gammaloop-nextest-python-api>
33.93 s
gammaloop-nextest-python-api> stderr:
33.93 s
gammaloop-nextest-python-api>
33.93 s
gammaloop-nextest-python-api> ┌───────────────────────────────────────────────────────────┐
33.93 s
gammaloop-nextest-python-api> │ Could not resolve the IP of the Symbolica license server. │
33.93 s
gammaloop-nextest-python-api> │ │
33.93 s
gammaloop-nextest-python-api> │ Please check your DNS configuration. │
33.93 s
gammaloop-nextest-python-api> └───────────────────────────────────────────────────────────┘
33.93 s
gammaloop-nextest-python-api> Error: failed to lookup address information: Temporary failure in name resolution
33.93 s
gammaloop-nextest-python-api>
33.93 s
gammaloop-nextest-python-api>
33.93 s
gammaloop-nextest-python-api> Location:
33.93 s
gammaloop-nextest-python-api> tests/tests/test_python_api.rs:156:20
33.93 s
gammaloop-nextest-python-api>
33.93 s
gammaloop-nextest-python-api> FAIL [ 0.118s] (2/5) gammaloop-integration-tests::test_python_api python_session_getters_return_live_toml_and_command_blocks
33.93 s
gammaloop-nextest-python-api> stdout ---
33.93 s
gammaloop-nextest-python-api>
33.93 s
gammaloop-nextest-python-api> running 1 test
33.93 s
gammaloop-nextest-python-api> test python_session_getters_return_live_toml_and_command_blocks ... FAILED
33.93 s
gammaloop-nextest-python-api>
33.93 s
gammaloop-nextest-python-api> failures:
33.93 s
gammaloop-nextest-python-api>
33.93 s
gammaloop-nextest-python-api> failures:
33.93 s
gammaloop-nextest-python-api> python_session_getters_return_live_toml_and_command_blocks
33.93 s
gammaloop-nextest-python-api>
33.93 s
gammaloop-nextest-python-api> test result: FAILED. 0 passed; 1 failed; 0 ignored; 0 measured; 4 filtered out; finished in 0.11s
33.93 s
gammaloop-nextest-python-api>
33.93 s
gammaloop-nextest-python-api> stderr ---
33.93 s
gammaloop-nextest-python-api> Error: Python API test subprocess failed.
33.93 s
gammaloop-nextest-python-api> stdout:
33.93 s
gammaloop-nextest-python-api> ┌────────────────────────────────────────────────────────┐
33.93 s
gammaloop-nextest-python-api> │ You are running a restricted Symbolica instance. │
33.93 s
gammaloop-nextest-python-api> │ │
33.93 s
gammaloop-nextest-python-api> │ This mode is only permitted for non-commercial use and │
33.93 s
gammaloop-nextest-python-api> │ is limited to one instance and core per machine. │
33.93 s
gammaloop-nextest-python-api> │ │
33.93 s
gammaloop-nextest-python-api> │ Hobbyists can easily acquire a free license key │
33.93 s
gammaloop-nextest-python-api> │ that unlocks all cores and removes this banner: │
33.93 s
gammaloop-nextest-python-api> │ │
33.93 s
gammaloop-nextest-python-api> │ from symbolica import * │
33.93 s
gammaloop-nextest-python-api> │ request_hobbyist_license('YOUR_NAME', 'YOUR_EMAIL') │
33.93 s
gammaloop-nextest-python-api> │ │
33.93 s
gammaloop-nextest-python-api> │ All other users can obtain a free 30-day trial key: │
33.93 s
gammaloop-nextest-python-api> │ │
33.93 s
gammaloop-nextest-python-api> │ from symbolica import * │
33.93 s
gammaloop-nextest-python-api> │ request_trial_license('NAME', 'EMAIL', 'EMPLOYER') │
33.93 s
gammaloop-nextest-python-api> │ │
33.93 s
gammaloop-nextest-python-api> │ See https://symbolica.io/docs/get_started.html#license │
33.93 s
gammaloop-nextest-python-api> └────────────────────────────────────────────────────────┘
33.93 s
gammaloop-nextest-python-api> ┌───────────────────────────────────────────────────────────────────────────────────────────────────────────┐
33.93 s
gammaloop-nextest-python-api> │ Cannot start new unlicensed Symbolica instance since there is already another one running on the machine. │
33.93 s
gammaloop-nextest-python-api> └───────────────────────────────────────────────────────────────────────────────────────────────────────────┘
33.93 s
gammaloop-nextest-python-api>
33.93 s
gammaloop-nextest-python-api> stderr:
33.93 s
gammaloop-nextest-python-api>
33.93 s
gammaloop-nextest-python-api> ┌───────────────────────────────────────────────────────────┐
33.93 s
gammaloop-nextest-python-api> │ Could not resolve the IP of the Symbolica license server. │
33.93 s
gammaloop-nextest-python-api> │ │
33.93 s
gammaloop-nextest-python-api> │ Please check your DNS configuration. │
33.93 s
gammaloop-nextest-python-api> └───────────────────────────────────────────────────────────┘
33.93 s
gammaloop-nextest-python-api> Error: failed to lookup address information: Temporary failure in name resolution
33.93 s
gammaloop-nextest-python-api>
33.93 s
gammaloop-nextest-python-api>
33.93 s
gammaloop-nextest-python-api> Location:
33.93 s
gammaloop-nextest-python-api> tests/tests/test_python_api.rs:156:20
33.93 s
gammaloop-nextest-python-api>
33.94 s
gammaloop-nextest-python-api> FAIL [ 0.126s] (3/5) gammaloop-integration-tests::test_python_api python_evaluate_sample_preserves_graph_grouping_and_incoming_pdgs
33.94 s
gammaloop-nextest-python-api> stdout ---
33.94 s
gammaloop-nextest-python-api>
33.94 s
gammaloop-nextest-python-api> running 1 test
33.94 s
gammaloop-nextest-python-api> test python_evaluate_sample_preserves_graph_grouping_and_incoming_pdgs ... FAILED
33.94 s
gammaloop-nextest-python-api>
33.94 s
gammaloop-nextest-python-api> failures:
33.94 s
gammaloop-nextest-python-api>
33.94 s
gammaloop-nextest-python-api> failures:
33.94 s
gammaloop-nextest-python-api> python_evaluate_sample_preserves_graph_grouping_and_incoming_pdgs
33.94 s
gammaloop-nextest-python-api>
33.94 s
gammaloop-nextest-python-api> test result: FAILED. 0 passed; 1 failed; 0 ignored; 0 measured; 4 filtered out; finished in 0.12s
33.94 s
gammaloop-nextest-python-api>
33.94 s
gammaloop-nextest-python-api> stderr ---
33.94 s
gammaloop-nextest-python-api> Error: Python API test subprocess failed.
33.94 s
gammaloop-nextest-python-api> stdout:
33.94 s
gammaloop-nextest-python-api> ┌────────────────────────────────────────────────────────┐
33.94 s
gammaloop-nextest-python-api> │ You are running a restricted Symbolica instance. │
33.94 s
gammaloop-nextest-python-api> │ │
33.94 s
gammaloop-nextest-python-api> │ This mode is only permitted for non-commercial use and │
33.94 s
gammaloop-nextest-python-api> │ is limited to one instance and core per machine. │
33.94 s
gammaloop-nextest-python-api> │ │
33.94 s
gammaloop-nextest-python-api> │ Hobbyists can easily acquire a free license key │
33.94 s
gammaloop-nextest-python-api> │ that unlocks all cores and removes this banner: │
33.94 s
gammaloop-nextest-python-api> │ │
33.94 s
gammaloop-nextest-python-api> │ from symbolica import * │
33.94 s
gammaloop-nextest-python-api> │ request_hobbyist_license('YOUR_NAME', 'YOUR_EMAIL') │
33.94 s
gammaloop-nextest-python-api> │ │
33.94 s
gammaloop-nextest-python-api> │ All other users can obtain a free 30-day trial key: │
33.94 s
gammaloop-nextest-python-api> │ │
33.94 s
gammaloop-nextest-python-api> │ from symbolica import * │
33.94 s
gammaloop-nextest-python-api> │ request_trial_license('NAME', 'EMAIL', 'EMPLOYER') │
33.94 s
gammaloop-nextest-python-api> │ │
33.94 s
gammaloop-nextest-python-api> │ See https://symbolica.io/docs/get_started.html#license │
33.94 s
gammaloop-nextest-python-api> └────────────────────────────────────────────────────────┘
33.94 s
gammaloop-nextest-python-api> ┌───────────────────────────────────────────────────────────────────────────────────────────────────────────┐
33.94 s
gammaloop-nextest-python-api> │ Cannot start new unlicensed Symbolica instance since there is already another one running on the machine. │
33.94 s
gammaloop-nextest-python-api> └───────────────────────────────────────────────────────────────────────────────────────────────────────────┘
33.94 s
gammaloop-nextest-python-api>
33.94 s
gammaloop-nextest-python-api> stderr:
33.94 s
gammaloop-nextest-python-api>
33.94 s
gammaloop-nextest-python-api> ┌───────────────────────────────────────────────────────────┐
33.94 s
gammaloop-nextest-python-api> │ Could not resolve the IP of the Symbolica license server. │
33.94 s
gammaloop-nextest-python-api> │ │
33.94 s
gammaloop-nextest-python-api> │ Please check your DNS configuration. │
33.94 s
gammaloop-nextest-python-api> └───────────────────────────────────────────────────────────┘
33.94 s
gammaloop-nextest-python-api> Error: failed to lookup address information: Temporary failure in name resolution
33.94 s
gammaloop-nextest-python-api>
33.94 s
gammaloop-nextest-python-api>
33.94 s
gammaloop-nextest-python-api> Location:
33.94 s
gammaloop-nextest-python-api> tests/tests/test_python_api.rs:156:20
33.94 s
gammaloop-nextest-python-api>
34.02 s
gammaloop-nextest-python-api> FAIL [ 0.211s] (4/5) gammaloop-integration-tests::test_python_api python_evaluate_samples_batch_and_momentum_space_have_expected_shape
34.02 s
gammaloop-nextest-python-api> stdout ---
34.02 s
gammaloop-nextest-python-api>
34.02 s
gammaloop-nextest-python-api> running 1 test
34.02 s
gammaloop-nextest-python-api> test python_evaluate_samples_batch_and_momentum_space_have_expected_shape ... FAILED
34.02 s
gammaloop-nextest-python-api>
34.02 s
gammaloop-nextest-python-api> failures:
34.02 s
gammaloop-nextest-python-api>
34.02 s
gammaloop-nextest-python-api> failures:
34.02 s
gammaloop-nextest-python-api> python_evaluate_samples_batch_and_momentum_space_have_expected_shape
34.02 s
gammaloop-nextest-python-api>
34.02 s
gammaloop-nextest-python-api> test result: FAILED. 0 passed; 1 failed; 0 ignored; 0 measured; 4 filtered out; finished in 0.21s
34.02 s
gammaloop-nextest-python-api>
34.02 s
gammaloop-nextest-python-api> stderr ---
34.02 s
gammaloop-nextest-python-api> Error: Python API test subprocess failed.
34.02 s
gammaloop-nextest-python-api> stdout:
34.02 s
gammaloop-nextest-python-api> ┌────────────────────────────────────────────────────────┐
34.02 s
gammaloop-nextest-python-api> │ You are running a restricted Symbolica instance. │
34.02 s
gammaloop-nextest-python-api> │ │
34.02 s
gammaloop-nextest-python-api> │ This mode is only permitted for non-commercial use and │
34.02 s
gammaloop-nextest-python-api> │ is limited to one instance and core per machine. │
34.02 s
gammaloop-nextest-python-api> │ │
34.02 s
gammaloop-nextest-python-api> │ Hobbyists can easily acquire a free license key │
34.02 s
gammaloop-nextest-python-api> │ that unlocks all cores and removes this banner: │
34.02 s
gammaloop-nextest-python-api> │ │
34.02 s
gammaloop-nextest-python-api> │ from symbolica import * │
34.02 s
gammaloop-nextest-python-api> │ request_hobbyist_license('YOUR_NAME', 'YOUR_EMAIL') │
34.02 s
gammaloop-nextest-python-api> │ │
34.02 s
gammaloop-nextest-python-api> │ All other users can obtain a free 30-day trial key: │
34.02 s
gammaloop-nextest-python-api> │ │
34.02 s
gammaloop-nextest-python-api> │ from symbolica import * │
34.02 s
gammaloop-nextest-python-api> │ request_trial_license('NAME', 'EMAIL', 'EMPLOYER') │
34.02 s
gammaloop-nextest-python-api> │ │
34.02 s
gammaloop-nextest-python-api> │ See https://symbolica.io/docs/get_started.html#license │
34.02 s
gammaloop-nextest-python-api> └────────────────────────────────────────────────────────┘
34.02 s
gammaloop-nextest-python-api> ┌───────────────────────────────────────────────────────────────────────────────────────────────────────────┐
34.02 s
gammaloop-nextest-python-api> │ Cannot start new unlicensed Symbolica instance since there is already another one running on the machine. │
34.02 s
gammaloop-nextest-python-api> └───────────────────────────────────────────────────────────────────────────────────────────────────────────┘
34.02 s
gammaloop-nextest-python-api>
34.02 s
gammaloop-nextest-python-api> stderr:
34.02 s
gammaloop-nextest-python-api>
34.02 s
gammaloop-nextest-python-api> ┌───────────────────────────────────────────────────────────┐
34.02 s
gammaloop-nextest-python-api> │ Could not resolve the IP of the Symbolica license server. │
34.02 s
gammaloop-nextest-python-api> │ │
34.02 s
gammaloop-nextest-python-api> │ Please check your DNS configuration. │
34.02 s
gammaloop-nextest-python-api> └───────────────────────────────────────────────────────────┘
34.02 s
gammaloop-nextest-python-api> Error: failed to lookup address information: Temporary failure in name resolution
34.02 s
gammaloop-nextest-python-api> [2026-09-14 22:20:37.313] @gammaloop_api::se... INFO : Running command import model sm-default
34.02 s
gammaloop-nextest-python-api> [2026-09-14 22:20:37.313] @import::model INFO : Loading built-in JSON model sm-default
34.02 s
gammaloop-nextest-python-api> [2026-09-14 22:20:37.348] @gammalooprs::model INFO : The following 11 external parameters were forced to zero by the restriction card:
34.02 s
gammaloop-nextest-python-api> lamWS, AWS, rhoWS, etaWS, ymc, yme, ymm, MC, Me, MM, WTau
34.02 s
gammaloop-nextest-python-api> [2026-09-14 22:20:37.348] @gammalooprs::model INFO : The following 34 vertex rules were removed by the restriction card:
34.02 s
gammaloop-nextest-python-api> V_82 -> (c~, d, G+) | V_83 -> (t~, d, G+) | V_84 -> (c~, s, G+) | V_85 -> (t~, s, G+) | V_86 -> (u~, b, G+) | V_87 -> (c~, b, G+) | V_90 -> (c~, d, W+) | V_91 -> (t~, d, W+) | V_92 -> (u~, s, W+) | V_94 -> (t~, s, W+) | V_95 -> (u~, b, W+) | V_96 -> (c~, b, W+) | V_101 -> (e+, e-, G0) | V_102 -> (mu+, mu-, G0) | V_104 -> (e+, e-, H) | V_105 -> (mu+, mu-, H) | V_110 -> (ve~, e-, G+) | V_111 -> (vm~, mu-, G+) | V_116 -> (b~, u, G-) | V_117 -> (d~, c, G-) | V_118 -> (s~, c, G-) | V_119 -> (b~, c, G-) | V_120 -> (d~, t, G-) | V_121 -> (s~, t, G-) | V_124 -> (s~, u, W-) | V_125 -> (b~, u, W-) | V_126 -> (d~, c, W-) | V_128 -> (b~, c, W-) | V_129 -> (d~, t, W-) | V_130 -> (s~, t, W-) | V_138 -> (c~, c, G0) | V_140 -> (c~, c, H) | V_145 -> (e+, ve, G-) | V_146 -> (mu+, vm, G-)
34.02 s
gammaloop-nextest-python-api> [2026-09-14 22:20:37.348] @gammalooprs::model INFO : The following 36 couplings were removed by the restriction card:
34.02 s
gammaloop-nextest-python-api> GC_13, GC_14, GC_16, GC_17, GC_18, GC_19, GC_20, GC_22, GC_23, GC_24, GC_25, GC_26, GC_28, GC_29, GC_42, GC_43, GC_44, GC_46, GC_47, GC_48, GC_84, GC_85, GC_86, GC_87, GC_88, GC_89, GC_90, GC_91, GC_92, GC_93, GC_101, GC_102, GC_103, GC_105, GC_106, GC_107
34.02 s
gammaloop-nextest-python-api> [2026-09-14 22:20:37.348] @gammaloop_api::se... INFO : Running command set default-runtime kv kinematics.externals='{"type":"constant","data":{"momenta":[[32.0,0.0,0.0,32.0],[32.0,0.0,0.0,-32.0]],"helicities":[1,1]}}'
34.02 s
gammaloop-nextest-python-api> [2026-09-14 22:20:37.349] @gammaloop_api::se... INFO : Running command set default-runtime kv subtraction.disable_threshold_subtraction=true
34.02 s
gammaloop-nextest-python-api> [2026-09-14 22:20:37.350] @gammaloop_api::se... INFO : Running command generate xs e+ e- > d d~ g | e- a d g QED^2==4 [{{2}} QCD=0] --numerator-grouping group_identical_graphs_up_to_sign --clear-existing-processes --only-diagrams
34.02 s
gammaloop-nextest-python-api> [2026-09-14 22:20:37.352] @feyngen::diagram_... INFO : 0s | Δ=0s | Starting Feynman graph generation with Symbolica...
34.02 s
gammaloop-nextest-python-api> [2026-09-14 22:20:37.355] @feyngen::diagram_... INFO : 0s | Δ=0s | Number of graphs resulting from Symbolica generation: 246
34.02 s
gammaloop-nextest-python-api> [2026-09-14 22:20:37.356] @feyngen::diagram_... INFO : 0s | Δ=0s | Number of graphs retained after enforcing supergraph particle content: 8
34.02 s
gammaloop-nextest-python-api> [2026-09-14 22:20:37.356] @feyngen::diagram_... INFO : 0s | Δ=0s | Number of graphs retained after removal of vetoed topologies: 8
34.02 s
gammaloop-nextest-python-api> [2026-09-14 22:20:37.356] @feyngen::diagram_... INFO : 0s | Δ=0s | Number of graphs after vertex info assignment: 8
34.02 s
gammaloop-nextest-python-api> [2026-09-14 22:20:37.356] @feyngen::diagram_... INFO : 0s | Δ=0s | Number of graphs after all complete graphs filters are applied: 8
34.02 s
gammaloop-nextest-python-api>
34.02 s
gammaloop-nextest-python-api>
34.02 s
gammaloop-nextest-python-api> Location:
34.02 s
gammaloop-nextest-python-api> tests/tests/test_python_api.rs:156:20
34.02 s
gammaloop-nextest-python-api>
34.04 s
gammaloop-nextest-python-api> FAIL [ 0.225s] (5/5) gammaloop-integration-tests::test_python_api python_settings_wrappers_expose_nested_runtime_and_global_settings
34.04 s
gammaloop-nextest-python-api> stdout ---
34.04 s
gammaloop-nextest-python-api>
34.04 s
gammaloop-nextest-python-api> running 1 test
34.04 s
gammaloop-nextest-python-api> test python_settings_wrappers_expose_nested_runtime_and_global_settings ... FAILED
34.04 s
gammaloop-nextest-python-api>
34.04 s
gammaloop-nextest-python-api> failures:
34.04 s
gammaloop-nextest-python-api>
34.04 s
gammaloop-nextest-python-api> failures:
34.04 s
gammaloop-nextest-python-api> python_settings_wrappers_expose_nested_runtime_and_global_settings
34.04 s
gammaloop-nextest-python-api>
34.04 s
gammaloop-nextest-python-api> test result: FAILED. 0 passed; 1 failed; 0 ignored; 0 measured; 4 filtered out; finished in 0.22s
34.04 s
gammaloop-nextest-python-api>
34.04 s
gammaloop-nextest-python-api> stderr ---
34.04 s
gammaloop-nextest-python-api> Error: Python API test subprocess failed.
34.04 s
gammaloop-nextest-python-api> stdout:
34.04 s
gammaloop-nextest-python-api> ┌────────────────────────────────────────────────────────┐
34.04 s
gammaloop-nextest-python-api> │ You are running a restricted Symbolica instance. │
34.04 s
gammaloop-nextest-python-api> │ │
34.04 s
gammaloop-nextest-python-api> │ This mode is only permitted for non-commercial use and │
34.04 s
gammaloop-nextest-python-api> │ is limited to one instance and core per machine. │
34.04 s
gammaloop-nextest-python-api> │ │
34.04 s
gammaloop-nextest-python-api> │ Hobbyists can easily acquire a free license key │
34.04 s
gammaloop-nextest-python-api> │ that unlocks all cores and removes this banner: │
34.04 s
gammaloop-nextest-python-api> │ │
34.04 s
gammaloop-nextest-python-api> │ from symbolica import * │
34.04 s
gammaloop-nextest-python-api> │ request_hobbyist_license('YOUR_NAME', 'YOUR_EMAIL') │
34.04 s
gammaloop-nextest-python-api> │ │
34.04 s
gammaloop-nextest-python-api> │ All other users can obtain a free 30-day trial key: │
34.04 s
gammaloop-nextest-python-api> │ │
34.04 s
gammaloop-nextest-python-api> │ from symbolica import * │
34.04 s
gammaloop-nextest-python-api> │ request_trial_license('NAME', 'EMAIL', 'EMPLOYER') │
34.04 s
gammaloop-nextest-python-api> │ │
34.04 s
gammaloop-nextest-python-api> │ See https://symbolica.io/docs/get_started.html#license │
34.04 s
gammaloop-nextest-python-api> └────────────────────────────────────────────────────────┘
34.04 s
gammaloop-nextest-python-api> ┌───────────────────────────────────────────────────────────────────────────────────────────────────────────┐
34.04 s
gammaloop-nextest-python-api> │ Cannot start new unlicensed Symbolica instance since there is already another one running on the machine. │
34.04 s
gammaloop-nextest-python-api> └───────────────────────────────────────────────────────────────────────────────────────────────────────────┘
34.04 s
gammaloop-nextest-python-api>
34.04 s
gammaloop-nextest-python-api> stderr:
34.04 s
gammaloop-nextest-python-api>
34.04 s
gammaloop-nextest-python-api> ┌───────────────────────────────────────────────────────────┐
34.04 s
gammaloop-nextest-python-api> │ Could not resolve the IP of the Symbolica license server. │
34.04 s
gammaloop-nextest-python-api> │ │
34.04 s
gammaloop-nextest-python-api> │ Please check your DNS configuration. │
34.04 s
gammaloop-nextest-python-api> └───────────────────────────────────────────────────────────┘
34.04 s
gammaloop-nextest-python-api> Error: failed to lookup address information: Temporary failure in name resolution
34.04 s
gammaloop-nextest-python-api>
34.04 s
gammaloop-nextest-python-api>
34.04 s
gammaloop-nextest-python-api> Location:
34.04 s
gammaloop-nextest-python-api> tests/tests/test_python_api.rs:156:20
34.04 s
gammaloop-nextest-python-api>
34.04 s
gammaloop-nextest-python-api> ------------
34.04 s
gammaloop-nextest-python-api> Summary [ 0.226s] 5 tests run: 0 passed , 5 failed , 0 skipped
34.04 s
gammaloop-nextest-python-api> FAIL [ 0.118s] (1/5) gammaloop-integration-tests::test_python_api python_evaluate_sample_honors_generate_events_and_observable_snapshots
34.04 s
gammaloop-nextest-python-api> stdout ---
34.04 s
gammaloop-nextest-python-api>
34.04 s
gammaloop-nextest-python-api> running 1 test
34.04 s
gammaloop-nextest-python-api> test python_evaluate_sample_honors_generate_events_and_observable_snapshots ... FAILED
34.04 s
gammaloop-nextest-python-api>
34.04 s
gammaloop-nextest-python-api> failures:
34.04 s
gammaloop-nextest-python-api>
34.04 s
gammaloop-nextest-python-api> failures:
34.04 s
gammaloop-nextest-python-api> python_evaluate_sample_honors_generate_events_and_observable_snapshots
34.04 s
gammaloop-nextest-python-api>
34.04 s
gammaloop-nextest-python-api> test result: FAILED. 0 passed; 1 failed; 0 ignored; 0 measured; 4 filtered out; finished in 0.11s
34.04 s
gammaloop-nextest-python-api>
34.04 s
gammaloop-nextest-python-api> stderr ---
34.04 s
gammaloop-nextest-python-api> Error: Python API test subprocess failed.
34.04 s
gammaloop-nextest-python-api> stdout:
34.04 s
gammaloop-nextest-python-api> ┌────────────────────────────────────────────────────────┐
34.04 s
gammaloop-nextest-python-api> │ You are running a restricted Symbolica instance. │
34.04 s
gammaloop-nextest-python-api> │ │
34.04 s
gammaloop-nextest-python-api> │ This mode is only permitted for non-commercial use and │
34.04 s
gammaloop-nextest-python-api> │ is limited to one instance and core per machine. │
34.04 s
gammaloop-nextest-python-api> │ │
34.04 s
gammaloop-nextest-python-api> │ Hobbyists can easily acquire a free license key │
34.04 s
gammaloop-nextest-python-api> │ that unlocks all cores and removes this banner: │
34.04 s
gammaloop-nextest-python-api> │ │
34.04 s
gammaloop-nextest-python-api> │ from symbolica import * │
34.04 s
gammaloop-nextest-python-api> │ request_hobbyist_license('YOUR_NAME', 'YOUR_EMAIL') │
34.04 s
gammaloop-nextest-python-api> │ │
34.04 s
gammaloop-nextest-python-api> │ All other users can obtain a free 30-day trial key: │
34.04 s
gammaloop-nextest-python-api> │ │
34.04 s
gammaloop-nextest-python-api> │ from symbolica import * │
34.04 s
gammaloop-nextest-python-api> │ request_trial_license('NAME', 'EMAIL', 'EMPLOYER') │
34.04 s
gammaloop-nextest-python-api> │ │
34.04 s
gammaloop-nextest-python-api> │ See https://symbolica.io/docs/get_started.html#license │
34.04 s
gammaloop-nextest-python-api> └────────────────────────────────────────────────────────┘
34.04 s
gammaloop-nextest-python-api> ┌───────────────────────────────────────────────────────────────────────────────────────────────────────────┐
34.04 s
gammaloop-nextest-python-api> │ Cannot start new unlicensed Symbolica instance since there is already another one running on the machine. │
34.04 s
gammaloop-nextest-python-api> └───────────────────────────────────────────────────────────────────────────────────────────────────────────┘
34.04 s
gammaloop-nextest-python-api>
34.04 s
gammaloop-nextest-python-api> stderr:
34.04 s
gammaloop-nextest-python-api>
34.04 s
gammaloop-nextest-python-api> ┌───────────────────────────────────────────────────────────┐
34.04 s
gammaloop-nextest-python-api> │ Could not resolve the IP of the Symbolica license server. │
34.04 s
gammaloop-nextest-python-api> │ │
34.04 s
gammaloop-nextest-python-api> │ Please check your DNS configuration. │
34.04 s
gammaloop-nextest-python-api> └───────────────────────────────────────────────────────────┘
34.04 s
gammaloop-nextest-python-api> Error: failed to lookup address information: Temporary failure in name resolution
34.04 s
gammaloop-nextest-python-api>
34.04 s
gammaloop-nextest-python-api>
34.04 s
gammaloop-nextest-python-api> Location:
34.04 s
gammaloop-nextest-python-api> tests/tests/test_python_api.rs:156:20
34.04 s
gammaloop-nextest-python-api>
34.04 s
gammaloop-nextest-python-api> FAIL [ 0.118s] (2/5) gammaloop-integration-tests::test_python_api python_session_getters_return_live_toml_and_command_blocks
34.04 s
gammaloop-nextest-python-api> stdout ---
34.04 s
gammaloop-nextest-python-api>
34.04 s
gammaloop-nextest-python-api> running 1 test
34.04 s
gammaloop-nextest-python-api> test python_session_getters_return_live_toml_and_command_blocks ... FAILED
34.04 s
gammaloop-nextest-python-api>
34.04 s
gammaloop-nextest-python-api> failures:
34.04 s
gammaloop-nextest-python-api>
34.04 s
gammaloop-nextest-python-api> failures:
34.04 s
gammaloop-nextest-python-api> python_session_getters_return_live_toml_and_command_blocks
34.04 s
gammaloop-nextest-python-api>
34.04 s
gammaloop-nextest-python-api> test result: FAILED. 0 passed; 1 failed; 0 ignored; 0 measured; 4 filtered out; finished in 0.11s
34.04 s
gammaloop-nextest-python-api>
34.04 s
gammaloop-nextest-python-api> stderr ---
34.04 s
gammaloop-nextest-python-api> Error: Python API test subprocess failed.
34.04 s
gammaloop-nextest-python-api> stdout:
34.04 s
gammaloop-nextest-python-api> ┌────────────────────────────────────────────────────────┐
34.04 s
gammaloop-nextest-python-api> │ You are running a restricted Symbolica instance. │
34.04 s
gammaloop-nextest-python-api> │ │
34.04 s
gammaloop-nextest-python-api> │ This mode is only permitted for non-commercial use and │
34.04 s
gammaloop-nextest-python-api> │ is limited to one instance and core per machine. │
34.04 s
gammaloop-nextest-python-api> │ │
34.04 s
gammaloop-nextest-python-api> │ Hobbyists can easily acquire a free license key │
34.04 s
gammaloop-nextest-python-api> │ that unlocks all cores and removes this banner: │
34.04 s
gammaloop-nextest-python-api> │ │
34.04 s
gammaloop-nextest-python-api> │ from symbolica import * │
34.04 s
gammaloop-nextest-python-api> │ request_hobbyist_license('YOUR_NAME', 'YOUR_EMAIL') │
34.04 s
gammaloop-nextest-python-api> │ │
34.04 s
gammaloop-nextest-python-api> │ All other users can obtain a free 30-day trial key: │
34.04 s
gammaloop-nextest-python-api> │ │
34.04 s
gammaloop-nextest-python-api> │ from symbolica import * │
34.04 s
gammaloop-nextest-python-api> │ request_trial_license('NAME', 'EMAIL', 'EMPLOYER') │
34.04 s
gammaloop-nextest-python-api> │ │
34.04 s
gammaloop-nextest-python-api> │ See https://symbolica.io/docs/get_started.html#license │
34.04 s
gammaloop-nextest-python-api> └────────────────────────────────────────────────────────┘
34.04 s
gammaloop-nextest-python-api> ┌───────────────────────────────────────────────────────────────────────────────────────────────────────────┐
34.04 s
gammaloop-nextest-python-api> │ Cannot start new unlicensed Symbolica instance since there is already another one running on the machine. │
34.04 s
gammaloop-nextest-python-api> └───────────────────────────────────────────────────────────────────────────────────────────────────────────┘
34.04 s
gammaloop-nextest-python-api>
34.04 s
gammaloop-nextest-python-api> stderr:
34.04 s
gammaloop-nextest-python-api>
34.04 s
gammaloop-nextest-python-api> ┌───────────────────────────────────────────────────────────┐
34.04 s
gammaloop-nextest-python-api> │ Could not resolve the IP of the Symbolica license server. │
34.04 s
gammaloop-nextest-python-api> │ │
34.04 s
gammaloop-nextest-python-api> │ Please check your DNS configuration. │
34.04 s
gammaloop-nextest-python-api> └───────────────────────────────────────────────────────────┘
34.04 s
gammaloop-nextest-python-api> Error: failed to lookup address information: Temporary failure in name resolution
34.04 s
gammaloop-nextest-python-api>
34.04 s
gammaloop-nextest-python-api>
34.04 s
gammaloop-nextest-python-api> Location:
34.04 s
gammaloop-nextest-python-api> tests/tests/test_python_api.rs:156:20
34.04 s
gammaloop-nextest-python-api>
34.04 s
gammaloop-nextest-python-api> FAIL [ 0.126s] (3/5) gammaloop-integration-tests::test_python_api python_evaluate_sample_preserves_graph_grouping_and_incoming_pdgs
34.04 s
gammaloop-nextest-python-api> stdout ---
34.04 s
gammaloop-nextest-python-api>
34.04 s
gammaloop-nextest-python-api> running 1 test
34.04 s
gammaloop-nextest-python-api> test python_evaluate_sample_preserves_graph_grouping_and_incoming_pdgs ... FAILED
34.04 s
gammaloop-nextest-python-api>
34.04 s
gammaloop-nextest-python-api> failures:
34.04 s
gammaloop-nextest-python-api>
34.04 s
gammaloop-nextest-python-api> failures:
34.04 s
gammaloop-nextest-python-api> python_evaluate_sample_preserves_graph_grouping_and_incoming_pdgs
34.04 s
gammaloop-nextest-python-api>
34.04 s
gammaloop-nextest-python-api> test result: FAILED. 0 passed; 1 failed; 0 ignored; 0 measured; 4 filtered out; finished in 0.12s
34.04 s
gammaloop-nextest-python-api>
34.04 s
gammaloop-nextest-python-api> stderr ---
34.04 s
gammaloop-nextest-python-api> Error: Python API test subprocess failed.
34.04 s
gammaloop-nextest-python-api> stdout:
34.04 s
gammaloop-nextest-python-api> ┌────────────────────────────────────────────────────────┐
34.04 s
gammaloop-nextest-python-api> │ You are running a restricted Symbolica instance. │
34.04 s
gammaloop-nextest-python-api> │ │
34.04 s
gammaloop-nextest-python-api> │ This mode is only permitted for non-commercial use and │
34.04 s
gammaloop-nextest-python-api> │ is limited to one instance and core per machine. │
34.04 s
gammaloop-nextest-python-api> │ │
34.04 s
gammaloop-nextest-python-api> │ Hobbyists can easily acquire a free license key │
34.04 s
gammaloop-nextest-python-api> │ that unlocks all cores and removes this banner: │
34.04 s
gammaloop-nextest-python-api> │ │
34.04 s
gammaloop-nextest-python-api> │ from symbolica import * │
34.04 s
gammaloop-nextest-python-api> │ request_hobbyist_license('YOUR_NAME', 'YOUR_EMAIL') │
34.04 s
gammaloop-nextest-python-api> │ │
34.04 s
gammaloop-nextest-python-api> │ All other users can obtain a free 30-day trial key: │
34.04 s
gammaloop-nextest-python-api> │ │
34.04 s
gammaloop-nextest-python-api> │ from symbolica import * │
34.04 s
gammaloop-nextest-python-api> │ request_trial_license('NAME', 'EMAIL', 'EMPLOYER') │
34.04 s
gammaloop-nextest-python-api> │ │
34.04 s
gammaloop-nextest-python-api> │ See https://symbolica.io/docs/get_started.html#license │
34.04 s
gammaloop-nextest-python-api> └────────────────────────────────────────────────────────┘
34.04 s
gammaloop-nextest-python-api> ┌───────────────────────────────────────────────────────────────────────────────────────────────────────────┐
34.04 s
gammaloop-nextest-python-api> │ Cannot start new unlicensed Symbolica instance since there is already another one running on the machine. │
34.04 s
gammaloop-nextest-python-api> └───────────────────────────────────────────────────────────────────────────────────────────────────────────┘
34.04 s
gammaloop-nextest-python-api>
34.04 s
gammaloop-nextest-python-api> stderr:
34.04 s
gammaloop-nextest-python-api>
34.04 s
gammaloop-nextest-python-api> ┌───────────────────────────────────────────────────────────┐
34.04 s
gammaloop-nextest-python-api> │ Could not resolve the IP of the Symbolica license server. │
34.04 s
gammaloop-nextest-python-api> │ │
34.04 s
gammaloop-nextest-python-api> │ Please check your DNS configuration. │
34.04 s
gammaloop-nextest-python-api> └───────────────────────────────────────────────────────────┘
34.04 s
gammaloop-nextest-python-api> Error: failed to lookup address information: Temporary failure in name resolution
34.04 s
gammaloop-nextest-python-api>
34.04 s
gammaloop-nextest-python-api>
34.04 s
gammaloop-nextest-python-api> Location:
34.04 s
gammaloop-nextest-python-api> tests/tests/test_python_api.rs:156:20
34.04 s
gammaloop-nextest-python-api>
34.04 s
gammaloop-nextest-python-api> FAIL [ 0.211s] (4/5) gammaloop-integration-tests::test_python_api python_evaluate_samples_batch_and_momentum_space_have_expected_shape
34.04 s
gammaloop-nextest-python-api> stdout ---
34.04 s
gammaloop-nextest-python-api>
34.04 s
gammaloop-nextest-python-api> running 1 test
34.04 s
gammaloop-nextest-python-api> test python_evaluate_samples_batch_and_momentum_space_have_expected_shape ... FAILED
34.04 s
gammaloop-nextest-python-api>
34.04 s
gammaloop-nextest-python-api> failures:
34.04 s
gammaloop-nextest-python-api>
34.04 s
gammaloop-nextest-python-api> failures:
34.04 s
gammaloop-nextest-python-api> python_evaluate_samples_batch_and_momentum_space_have_expected_shape
34.04 s
gammaloop-nextest-python-api>
34.04 s
gammaloop-nextest-python-api> test result: FAILED. 0 passed; 1 failed; 0 ignored; 0 measured; 4 filtered out; finished in 0.21s
34.04 s
gammaloop-nextest-python-api>
34.04 s
gammaloop-nextest-python-api> stderr ---
34.04 s
gammaloop-nextest-python-api> Error: Python API test subprocess failed.
34.04 s
gammaloop-nextest-python-api> stdout:
34.04 s
gammaloop-nextest-python-api> ┌────────────────────────────────────────────────────────┐
34.04 s
gammaloop-nextest-python-api> │ You are running a restricted Symbolica instance. │
34.04 s
gammaloop-nextest-python-api> │ │
34.04 s
gammaloop-nextest-python-api> │ This mode is only permitted for non-commercial use and │
34.04 s
gammaloop-nextest-python-api> │ is limited to one instance and core per machine. │
34.04 s
gammaloop-nextest-python-api> │ │
34.04 s
gammaloop-nextest-python-api> │ Hobbyists can easily acquire a free license key │
34.04 s
gammaloop-nextest-python-api> │ that unlocks all cores and removes this banner: │
34.04 s
gammaloop-nextest-python-api> │ │
34.04 s
gammaloop-nextest-python-api> │ from symbolica import * │
34.04 s
gammaloop-nextest-python-api> │ request_hobbyist_license('YOUR_NAME', 'YOUR_EMAIL') │
34.04 s
gammaloop-nextest-python-api> │ │
34.04 s
gammaloop-nextest-python-api> │ All other users can obtain a free 30-day trial key: │
34.04 s
gammaloop-nextest-python-api> │ │
34.04 s
gammaloop-nextest-python-api> │ from symbolica import * │
34.04 s
gammaloop-nextest-python-api> │ request_trial_license('NAME', 'EMAIL', 'EMPLOYER') │
34.04 s
gammaloop-nextest-python-api> │ │
34.04 s
gammaloop-nextest-python-api> │ See https://symbolica.io/docs/get_started.html#license │
34.04 s
gammaloop-nextest-python-api> └────────────────────────────────────────────────────────┘
34.04 s
gammaloop-nextest-python-api> ┌───────────────────────────────────────────────────────────────────────────────────────────────────────────┐
34.04 s
gammaloop-nextest-python-api> │ Cannot start new unlicensed Symbolica instance since there is already another one running on the machine. │
34.04 s
gammaloop-nextest-python-api> └───────────────────────────────────────────────────────────────────────────────────────────────────────────┘
34.04 s
gammaloop-nextest-python-api>
34.04 s
gammaloop-nextest-python-api> stderr:
34.04 s
gammaloop-nextest-python-api>
34.04 s
gammaloop-nextest-python-api> ┌───────────────────────────────────────────────────────────┐
34.04 s
gammaloop-nextest-python-api> │ Could not resolve the IP of the Symbolica license server. │
34.04 s
gammaloop-nextest-python-api> │ │
34.04 s
gammaloop-nextest-python-api> │ Please check your DNS configuration. │
34.04 s
gammaloop-nextest-python-api> └───────────────────────────────────────────────────────────┘
34.04 s
gammaloop-nextest-python-api> Error: failed to lookup address information: Temporary failure in name resolution
34.04 s
gammaloop-nextest-python-api> [2026-09-14 22:20:37.313] @gammaloop_api::se... INFO : Running command import model sm-default
34.04 s
gammaloop-nextest-python-api> [2026-09-14 22:20:37.313] @import::model INFO : Loading built-in JSON model sm-default
34.04 s
gammaloop-nextest-python-api> [2026-09-14 22:20:37.348] @gammalooprs::model INFO : The following 11 external parameters were forced to zero by the restriction card:
34.04 s
gammaloop-nextest-python-api> lamWS, AWS, rhoWS, etaWS, ymc, yme, ymm, MC, Me, MM, WTau
34.04 s
gammaloop-nextest-python-api> [2026-09-14 22:20:37.348] @gammalooprs::model INFO : The following 34 vertex rules were removed by the restriction card:
34.04 s
gammaloop-nextest-python-api> V_82 -> (c~, d, G+) | V_83 -> (t~, d, G+) | V_84 -> (c~, s, G+) | V_85 -> (t~, s, G+) | V_86 -> (u~, b, G+) | V_87 -> (c~, b, G+) | V_90 -> (c~, d, W+) | V_91 -> (t~, d, W+) | V_92 -> (u~, s, W+) | V_94 -> (t~, s, W+) | V_95 -> (u~, b, W+) | V_96 -> (c~, b, W+) | V_101 -> (e+, e-, G0) | V_102 -> (mu+, mu-, G0) | V_104 -> (e+, e-, H) | V_105 -> (mu+, mu-, H) | V_110 -> (ve~, e-, G+) | V_111 -> (vm~, mu-, G+) | V_116 -> (b~, u, G-) | V_117 -> (d~, c, G-) | V_118 -> (s~, c, G-) | V_119 -> (b~, c, G-) | V_120 -> (d~, t, G-) | V_121 -> (s~, t, G-) | V_124 -> (s~, u, W-) | V_125 -> (b~, u, W-) | V_126 -> (d~, c, W-) | V_128 -> (b~, c, W-) | V_129 -> (d~, t, W-) | V_130 -> (s~, t, W-) | V_138 -> (c~, c, G0) | V_140 -> (c~, c, H) | V_145 -> (e+, ve, G-) | V_146 -> (mu+, vm, G-)
34.04 s
gammaloop-nextest-python-api> [2026-09-14 22:20:37.348] @gammalooprs::model INFO : The following 36 couplings were removed by the restriction card:
34.04 s
gammaloop-nextest-python-api> GC_13, GC_14, GC_16, GC_17, GC_18, GC_19, GC_20, GC_22, GC_23, GC_24, GC_25, GC_26, GC_28, GC_29, GC_42, GC_43, GC_44, GC_46, GC_47, GC_48, GC_84, GC_85, GC_86, GC_87, GC_88, GC_89, GC_90, GC_91, GC_92, GC_93, GC_101, GC_102, GC_103, GC_105, GC_106, GC_107
34.04 s
gammaloop-nextest-python-api> [2026-09-14 22:20:37.348] @gammaloop_api::se... INFO : Running command set default-runtime kv kinematics.externals='{"type":"constant","data":{"momenta":[[32.0,0.0,0.0,32.0],[32.0,0.0,0.0,-32.0]],"helicities":[1,1]}}'
34.04 s
gammaloop-nextest-python-api> [2026-09-14 22:20:37.349] @gammaloop_api::se... INFO : Running command set default-runtime kv subtraction.disable_threshold_subtraction=true
34.04 s
gammaloop-nextest-python-api> [2026-09-14 22:20:37.350] @gammaloop_api::se... INFO : Running command generate xs e+ e- > d d~ g | e- a d g QED^2==4 [{{2}} QCD=0] --numerator-grouping group_identical_graphs_up_to_sign --clear-existing-processes --only-diagrams
34.04 s
gammaloop-nextest-python-api> [2026-09-14 22:20:37.352] @feyngen::diagram_... INFO : 0s | Δ=0s | Starting Feynman graph generation with Symbolica...
34.04 s
gammaloop-nextest-python-api> [2026-09-14 22:20:37.355] @feyngen::diagram_... INFO : 0s | Δ=0s | Number of graphs resulting from Symbolica generation: 246
34.04 s
gammaloop-nextest-python-api> [2026-09-14 22:20:37.356] @feyngen::diagram_... INFO : 0s | Δ=0s | Number of graphs retained after enforcing supergraph particle content: 8
34.04 s
gammaloop-nextest-python-api> [2026-09-14 22:20:37.356] @feyngen::diagram_... INFO : 0s | Δ=0s | Number of graphs retained after removal of vetoed topologies: 8
34.04 s
gammaloop-nextest-python-api> [2026-09-14 22:20:37.356] @feyngen::diagram_... INFO : 0s | Δ=0s | Number of graphs after vertex info assignment: 8
34.04 s
gammaloop-nextest-python-api> [2026-09-14 22:20:37.356] @feyngen::diagram_... INFO : 0s | Δ=0s | Number of graphs after all complete graphs filters are applied: 8
34.04 s
gammaloop-nextest-python-api>
34.04 s
gammaloop-nextest-python-api>
34.04 s
gammaloop-nextest-python-api> Location:
34.04 s
gammaloop-nextest-python-api> tests/tests/test_python_api.rs:156:20
34.04 s
gammaloop-nextest-python-api>
34.04 s
gammaloop-nextest-python-api> FAIL [ 0.225s] (5/5) gammaloop-integration-tests::test_python_api python_settings_wrappers_expose_nested_runtime_and_global_settings
34.04 s
gammaloop-nextest-python-api> stdout ---
34.04 s
gammaloop-nextest-python-api>
34.04 s
gammaloop-nextest-python-api> running 1 test
34.04 s
gammaloop-nextest-python-api> test python_settings_wrappers_expose_nested_runtime_and_global_settings ... FAILED
34.04 s
gammaloop-nextest-python-api>
34.04 s
gammaloop-nextest-python-api> failures:
34.04 s
gammaloop-nextest-python-api>
34.04 s
gammaloop-nextest-python-api> failures:
34.04 s
gammaloop-nextest-python-api> python_settings_wrappers_expose_nested_runtime_and_global_settings
34.04 s
gammaloop-nextest-python-api>
34.04 s
gammaloop-nextest-python-api> test result: FAILED. 0 passed; 1 failed; 0 ignored; 0 measured; 4 filtered out; finished in 0.22s
34.04 s
gammaloop-nextest-python-api>
34.04 s
gammaloop-nextest-python-api> stderr ---
34.04 s
gammaloop-nextest-python-api> Error: Python API test subprocess failed.
34.04 s
gammaloop-nextest-python-api> stdout:
34.04 s
gammaloop-nextest-python-api> ┌────────────────────────────────────────────────────────┐
34.04 s
gammaloop-nextest-python-api> │ You are running a restricted Symbolica instance. │
34.04 s
gammaloop-nextest-python-api> │ │
34.04 s
gammaloop-nextest-python-api> │ This mode is only permitted for non-commercial use and │
34.04 s
gammaloop-nextest-python-api> │ is limited to one instance and core per machine. │
34.04 s
gammaloop-nextest-python-api> │ │
34.04 s
gammaloop-nextest-python-api> │ Hobbyists can easily acquire a free license key │
34.04 s
gammaloop-nextest-python-api> │ that unlocks all cores and removes this banner: │
34.04 s
gammaloop-nextest-python-api> │ │
34.04 s
gammaloop-nextest-python-api> │ from symbolica import * │
34.04 s
gammaloop-nextest-python-api> │ request_hobbyist_license('YOUR_NAME', 'YOUR_EMAIL') │
34.04 s
gammaloop-nextest-python-api> │ │
34.04 s
gammaloop-nextest-python-api> │ All other users can obtain a free 30-day trial key: │
34.04 s
gammaloop-nextest-python-api> │ │
34.04 s
gammaloop-nextest-python-api> │ from symbolica import * │
34.04 s
gammaloop-nextest-python-api> │ request_trial_license('NAME', 'EMAIL', 'EMPLOYER') │
34.04 s
gammaloop-nextest-python-api> │ │
34.04 s
gammaloop-nextest-python-api> │ See https://symbolica.io/docs/get_started.html#license │
34.04 s
gammaloop-nextest-python-api> └────────────────────────────────────────────────────────┘
34.04 s
gammaloop-nextest-python-api> ┌───────────────────────────────────────────────────────────────────────────────────────────────────────────┐
34.04 s
gammaloop-nextest-python-api> │ Cannot start new unlicensed Symbolica instance since there is already another one running on the machine. │
34.04 s
gammaloop-nextest-python-api> └───────────────────────────────────────────────────────────────────────────────────────────────────────────┘
34.04 s
gammaloop-nextest-python-api>
34.04 s
gammaloop-nextest-python-api> stderr:
34.04 s
gammaloop-nextest-python-api>
34.04 s
gammaloop-nextest-python-api> ┌───────────────────────────────────────────────────────────┐
34.04 s
gammaloop-nextest-python-api> │ Could not resolve the IP of the Symbolica license server. │
34.04 s
gammaloop-nextest-python-api> │ │
34.04 s
gammaloop-nextest-python-api> │ Please check your DNS configuration. │
34.04 s
gammaloop-nextest-python-api> └───────────────────────────────────────────────────────────┘
34.04 s
gammaloop-nextest-python-api> Error: failed to lookup address information: Temporary failure in name resolution
34.04 s
gammaloop-nextest-python-api>
34.04 s
gammaloop-nextest-python-api>
34.04 s
gammaloop-nextest-python-api> Location:
34.04 s
gammaloop-nextest-python-api> tests/tests/test_python_api.rs:156:20
34.04 s
gammaloop-nextest-python-api>
34.05 s
gammaloop-nextest-python-api> error : test run failed
34.07 s
gammaloop-nextest-python-api>
34.07 s
gammaloop-nextest-python-api> ========== nextest test summary ==========
34.07 s
gammaloop-nextest-python-api> report: target/nextest/ci_gammaloop/junit.xml
34.07 s
gammaloop-nextest-python-api> tests: 5, failures: 5, errors: 0
34.07 s
gammaloop-nextest-python-api>
34.07 s
gammaloop-nextest-python-api> 1. gammaloop-integration-tests::test_python_api::python_evaluate_sample_honors_generate_events_and_observable_snapshots
34.07 s
gammaloop-nextest-python-api> failure: test failure with exit code 101
34.07 s
gammaloop-nextest-python-api> Error: Python API test subprocess failed.
34.07 s
gammaloop-nextest-python-api> stdout:
34.07 s
gammaloop-nextest-python-api> ┌────────────────────────────────────────────────────────┐
34.07 s
gammaloop-nextest-python-api> │ You are running a restricted Symbolica instance. │
34.07 s
gammaloop-nextest-python-api> │ │
34.07 s
gammaloop-nextest-python-api> │ This mode is only permitted for non-commercial use and │
34.07 s
gammaloop-nextest-python-api> │ is limited to one instance and core per machine. │
34.07 s
gammaloop-nextest-python-api> │ │
34.07 s
gammaloop-nextest-python-api> │ Hobbyists can easily acquire a free license key │
34.07 s
gammaloop-nextest-python-api> │ that unlocks all cores and removes this banner: │
34.07 s
gammaloop-nextest-python-api> │ │
34.07 s
gammaloop-nextest-python-api> │ from symbolica import * │
34.07 s
gammaloop-nextest-python-api> │ request_hobbyist_license('YOUR_NAME', 'YOUR_EMAIL') │
34.07 s
gammaloop-nextest-python-api> │ │
34.07 s
gammaloop-nextest-python-api> │ All other users can obtain a free 30-day trial key: │
34.07 s
gammaloop-nextest-python-api> │ │
34.07 s
gammaloop-nextest-python-api> │ from symbolica import * │
34.07 s
gammaloop-nextest-python-api> │ request_trial_license('NAME', 'EMAIL', 'EMPLOYER') │
34.07 s
gammaloop-nextest-python-api> │ │
34.07 s
gammaloop-nextest-python-api> │ See https://symbolica.io/docs/get_started.html#license │
34.07 s
gammaloop-nextest-python-api> └────────────────────────────────────────────────────────┘
34.07 s
gammaloop-nextest-python-api> ┌───────────────────────────────────────────────────────────────────────────────────────────────────────────┐
34.07 s
gammaloop-nextest-python-api> │ Cannot start new unlicensed Symbolica instance since there is already another one running on the machine. │
34.07 s
gammaloop-nextest-python-api> └───────────────────────────────────────────────────────────────────────────────────────────────────────────┘
34.07 s
gammaloop-nextest-python-api>
34.07 s
gammaloop-nextest-python-api> stderr:
34.07 s
gammaloop-nextest-python-api>
34.07 s
gammaloop-nextest-python-api> ┌───────────────────────────────────────────────────────────┐
34.07 s
gammaloop-nextest-python-api> │ Could not resolve the IP of the Symbolica license server. │
34.07 s
gammaloop-nextest-python-api> │ │
34.07 s
gammaloop-nextest-python-api> │ Please check your DNS configuration. │
34.07 s
gammaloop-nextest-python-api> └───────────────────────────────────────────────────────────┘
34.07 s
gammaloop-nextest-python-api> Error: failed to lookup address information: Temporary failure in name resolution
34.07 s
gammaloop-nextest-python-api>
34.07 s
gammaloop-nextest-python-api>
34.07 s
gammaloop-nextest-python-api> Location:
34.07 s
gammaloop-nextest-python-api> tests/tests/test_python_api.rs:156:20
34.07 s
gammaloop-nextest-python-api> system-out
34.07 s
gammaloop-nextest-python-api> running 1 test
34.07 s
gammaloop-nextest-python-api> test python_evaluate_sample_honors_generate_events_and_observable_snapshots ... FAILED
34.07 s
gammaloop-nextest-python-api>
34.07 s
gammaloop-nextest-python-api> failures:
34.07 s
gammaloop-nextest-python-api>
34.07 s
gammaloop-nextest-python-api> failures:
34.07 s
gammaloop-nextest-python-api> python_evaluate_sample_honors_generate_events_and_observable_snapshots
34.07 s
gammaloop-nextest-python-api>
34.07 s
gammaloop-nextest-python-api> test result: FAILED. 0 passed; 1 failed; 0 ignored; 0 measured; 4 filtered out; finished in 0.11s
34.07 s
gammaloop-nextest-python-api> system-err
34.07 s
gammaloop-nextest-python-api> Error: Python API test subprocess failed.
34.07 s
gammaloop-nextest-python-api> stdout:
34.07 s
gammaloop-nextest-python-api> ┌────────────────────────────────────────────────────────┐
34.07 s
gammaloop-nextest-python-api> │ You are running a restricted Symbolica instance. │
34.07 s
gammaloop-nextest-python-api> │ │
34.07 s
gammaloop-nextest-python-api> │ This mode is only permitted for non-commercial use and │
34.07 s
gammaloop-nextest-python-api> │ is limited to one instance and core per machine. │
34.07 s
gammaloop-nextest-python-api> │ │
34.07 s
gammaloop-nextest-python-api> │ Hobbyists can easily acquire a free license key │
34.07 s
gammaloop-nextest-python-api> │ that unlocks all cores and removes this banner: │
34.07 s
gammaloop-nextest-python-api> │ │
34.07 s
gammaloop-nextest-python-api> │ from symbolica import * │
34.07 s
gammaloop-nextest-python-api> │ request_hobbyist_license('YOUR_NAME', 'YOUR_EMAIL') │
34.07 s
gammaloop-nextest-python-api> │ │
34.07 s
gammaloop-nextest-python-api> │ All other users can obtain a free 30-day trial key: │
34.07 s
gammaloop-nextest-python-api> │ │
34.07 s
gammaloop-nextest-python-api> │ from symbolica import * │
34.07 s
gammaloop-nextest-python-api> │ request_trial_license('NAME', 'EMAIL', 'EMPLOYER') │
34.07 s
gammaloop-nextest-python-api> │ │
34.07 s
gammaloop-nextest-python-api> │ See https://symbolica.io/docs/get_started.html#license │
34.07 s
gammaloop-nextest-python-api> └────────────────────────────────────────────────────────┘
34.07 s
gammaloop-nextest-python-api> ┌───────────────────────────────────────────────────────────────────────────────────────────────────────────┐
34.07 s
gammaloop-nextest-python-api> │ Cannot start new unlicensed Symbolica instance since there is already another one running on the machine. │
34.07 s
gammaloop-nextest-python-api> └───────────────────────────────────────────────────────────────────────────────────────────────────────────┘
34.07 s
gammaloop-nextest-python-api>
34.07 s
gammaloop-nextest-python-api> stderr:
34.07 s
gammaloop-nextest-python-api>
34.07 s
gammaloop-nextest-python-api> ┌───────────────────────────────────────────────────────────┐
34.07 s
gammaloop-nextest-python-api> │ Could not resolve the IP of the Symbolica license server. │
34.07 s
gammaloop-nextest-python-api> │ │
34.07 s
gammaloop-nextest-python-api> │ Please check your DNS configuration. │
34.07 s
gammaloop-nextest-python-api> └───────────────────────────────────────────────────────────┘
34.07 s
gammaloop-nextest-python-api> Error: failed to lookup address information: Temporary failure in name resolution
34.07 s
gammaloop-nextest-python-api>
34.07 s
gammaloop-nextest-python-api>
34.07 s
gammaloop-nextest-python-api> Location:
34.07 s
gammaloop-nextest-python-api> tests/tests/test_python_api.rs:156:20
34.07 s
gammaloop-nextest-python-api>
34.07 s
gammaloop-nextest-python-api> 2. gammaloop-integration-tests::test_python_api::python_session_getters_return_live_toml_and_command_blocks
34.07 s
gammaloop-nextest-python-api> failure: test failure with exit code 101
34.07 s
gammaloop-nextest-python-api> Error: Python API test subprocess failed.
34.07 s
gammaloop-nextest-python-api> stdout:
34.07 s
gammaloop-nextest-python-api> ┌────────────────────────────────────────────────────────┐
34.07 s
gammaloop-nextest-python-api> │ You are running a restricted Symbolica instance. │
34.07 s
gammaloop-nextest-python-api> │ │
34.07 s
gammaloop-nextest-python-api> │ This mode is only permitted for non-commercial use and │
34.07 s
gammaloop-nextest-python-api> │ is limited to one instance and core per machine. │
34.07 s
gammaloop-nextest-python-api> │ │
34.07 s
gammaloop-nextest-python-api> │ Hobbyists can easily acquire a free license key │
34.07 s
gammaloop-nextest-python-api> │ that unlocks all cores and removes this banner: │
34.07 s
gammaloop-nextest-python-api> │ │
34.07 s
gammaloop-nextest-python-api> │ from symbolica import * │
34.07 s
gammaloop-nextest-python-api> │ request_hobbyist_license('YOUR_NAME', 'YOUR_EMAIL') │
34.07 s
gammaloop-nextest-python-api> │ │
34.07 s
gammaloop-nextest-python-api> │ All other users can obtain a free 30-day trial key: │
34.07 s
gammaloop-nextest-python-api> │ │
34.07 s
gammaloop-nextest-python-api> │ from symbolica import * │
34.07 s
gammaloop-nextest-python-api> │ request_trial_license('NAME', 'EMAIL', 'EMPLOYER') │
34.07 s
gammaloop-nextest-python-api> │ │
34.07 s
gammaloop-nextest-python-api> │ See https://symbolica.io/docs/get_started.html#license │
34.07 s
gammaloop-nextest-python-api> └────────────────────────────────────────────────────────┘
34.07 s
gammaloop-nextest-python-api> ┌───────────────────────────────────────────────────────────────────────────────────────────────────────────┐
34.07 s
gammaloop-nextest-python-api> │ Cannot start new unlicensed Symbolica instance since there is already another one running on the machine. │
34.07 s
gammaloop-nextest-python-api> └───────────────────────────────────────────────────────────────────────────────────────────────────────────┘
34.07 s
gammaloop-nextest-python-api>
34.07 s
gammaloop-nextest-python-api> stderr:
34.07 s
gammaloop-nextest-python-api>
34.07 s
gammaloop-nextest-python-api> ┌───────────────────────────────────────────────────────────┐
34.07 s
gammaloop-nextest-python-api> │ Could not resolve the IP of the Symbolica license server. │
34.07 s
gammaloop-nextest-python-api> │ │
34.07 s
gammaloop-nextest-python-api> │ Please check your DNS configuration. │
34.07 s
gammaloop-nextest-python-api> └───────────────────────────────────────────────────────────┘
34.07 s
gammaloop-nextest-python-api> Error: failed to lookup address information: Temporary failure in name resolution
34.07 s
gammaloop-nextest-python-api>
34.07 s
gammaloop-nextest-python-api>
34.07 s
gammaloop-nextest-python-api> Location:
34.07 s
gammaloop-nextest-python-api> tests/tests/test_python_api.rs:156:20
34.07 s
gammaloop-nextest-python-api> system-out
34.07 s
gammaloop-nextest-python-api> running 1 test
34.07 s
gammaloop-nextest-python-api> test python_session_getters_return_live_toml_and_command_blocks ... FAILED
34.07 s
gammaloop-nextest-python-api>
34.07 s
gammaloop-nextest-python-api> failures:
34.07 s
gammaloop-nextest-python-api>
34.07 s
gammaloop-nextest-python-api> failures:
34.07 s
gammaloop-nextest-python-api> python_session_getters_return_live_toml_and_command_blocks
34.07 s
gammaloop-nextest-python-api>
34.07 s
gammaloop-nextest-python-api> test result: FAILED. 0 passed; 1 failed; 0 ignored; 0 measured; 4 filtered out; finished in 0.11s
34.07 s
gammaloop-nextest-python-api> system-err
34.07 s
gammaloop-nextest-python-api> Error: Python API test subprocess failed.
34.08 s
gammaloop-nextest-python-api> stdout:
34.08 s
gammaloop-nextest-python-api> ┌────────────────────────────────────────────────────────┐
34.08 s
gammaloop-nextest-python-api> │ You are running a restricted Symbolica instance. │
34.08 s
gammaloop-nextest-python-api> │ │
34.08 s
gammaloop-nextest-python-api> │ This mode is only permitted for non-commercial use and │
34.08 s
gammaloop-nextest-python-api> │ is limited to one instance and core per machine. │
34.08 s
gammaloop-nextest-python-api> │ │
34.08 s
gammaloop-nextest-python-api> │ Hobbyists can easily acquire a free license key │
34.08 s
gammaloop-nextest-python-api> │ that unlocks all cores and removes this banner: │
34.08 s
gammaloop-nextest-python-api> │ │
34.08 s
gammaloop-nextest-python-api> │ from symbolica import * │
34.08 s
gammaloop-nextest-python-api> │ request_hobbyist_license('YOUR_NAME', 'YOUR_EMAIL') │
34.08 s
gammaloop-nextest-python-api> │ │
34.08 s
gammaloop-nextest-python-api> │ All other users can obtain a free 30-day trial key: │
34.08 s
gammaloop-nextest-python-api> │ │
34.08 s
gammaloop-nextest-python-api> │ from symbolica import * │
34.08 s
gammaloop-nextest-python-api> │ request_trial_license('NAME', 'EMAIL', 'EMPLOYER') │
34.08 s
gammaloop-nextest-python-api> │ │
34.08 s
gammaloop-nextest-python-api> │ See https://symbolica.io/docs/get_started.html#license │
34.08 s
gammaloop-nextest-python-api> └────────────────────────────────────────────────────────┘
34.08 s
gammaloop-nextest-python-api> ┌───────────────────────────────────────────────────────────────────────────────────────────────────────────┐
34.08 s
gammaloop-nextest-python-api> │ Cannot start new unlicensed Symbolica instance since there is already another one running on the machine. │
34.08 s
gammaloop-nextest-python-api> └───────────────────────────────────────────────────────────────────────────────────────────────────────────┘
34.08 s
gammaloop-nextest-python-api>
34.08 s
gammaloop-nextest-python-api> stderr:
34.08 s
gammaloop-nextest-python-api>
34.08 s
gammaloop-nextest-python-api> ┌───────────────────────────────────────────────────────────┐
34.08 s
gammaloop-nextest-python-api> │ Could not resolve the IP of the Symbolica license server. │
34.08 s
gammaloop-nextest-python-api> │ │
34.08 s
gammaloop-nextest-python-api> │ Please check your DNS configuration. │
34.08 s
gammaloop-nextest-python-api> └───────────────────────────────────────────────────────────┘
34.08 s
gammaloop-nextest-python-api> Error: failed to lookup address information: Temporary failure in name resolution
34.08 s
gammaloop-nextest-python-api>
34.08 s
gammaloop-nextest-python-api>
34.08 s
gammaloop-nextest-python-api> Location:
34.08 s
gammaloop-nextest-python-api> tests/tests/test_python_api.rs:156:20
34.08 s
gammaloop-nextest-python-api>
34.08 s
gammaloop-nextest-python-api> 3. gammaloop-integration-tests::test_python_api::python_evaluate_sample_preserves_graph_grouping_and_incoming_pdgs
34.08 s
gammaloop-nextest-python-api> failure: test failure with exit code 101
34.08 s
gammaloop-nextest-python-api> Error: Python API test subprocess failed.
34.08 s
gammaloop-nextest-python-api> stdout:
34.08 s
gammaloop-nextest-python-api> ┌────────────────────────────────────────────────────────┐
34.08 s
gammaloop-nextest-python-api> │ You are running a restricted Symbolica instance. │
34.08 s
gammaloop-nextest-python-api> │ │
34.08 s
gammaloop-nextest-python-api> │ This mode is only permitted for non-commercial use and │
34.08 s
gammaloop-nextest-python-api> │ is limited to one instance and core per machine. │
34.08 s
gammaloop-nextest-python-api> │ │
34.08 s
gammaloop-nextest-python-api> │ Hobbyists can easily acquire a free license key │
34.08 s
gammaloop-nextest-python-api> │ that unlocks all cores and removes this banner: │
34.08 s
gammaloop-nextest-python-api> │ │
34.08 s
gammaloop-nextest-python-api> │ from symbolica import * │
34.08 s
gammaloop-nextest-python-api> │ request_hobbyist_license('YOUR_NAME', 'YOUR_EMAIL') │
34.08 s
gammaloop-nextest-python-api> │ │
34.08 s
gammaloop-nextest-python-api> │ All other users can obtain a free 30-day trial key: │
34.08 s
gammaloop-nextest-python-api> │ │
34.08 s
gammaloop-nextest-python-api> │ from symbolica import * │
34.08 s
gammaloop-nextest-python-api> │ request_trial_license('NAME', 'EMAIL', 'EMPLOYER') │
34.08 s
gammaloop-nextest-python-api> │ │
34.08 s
gammaloop-nextest-python-api> │ See https://symbolica.io/docs/get_started.html#license │
34.08 s
gammaloop-nextest-python-api> └────────────────────────────────────────────────────────┘
34.08 s
gammaloop-nextest-python-api> ┌───────────────────────────────────────────────────────────────────────────────────────────────────────────┐
34.08 s
gammaloop-nextest-python-api> │ Cannot start new unlicensed Symbolica instance since there is already another one running on the machine. │
34.08 s
gammaloop-nextest-python-api> └───────────────────────────────────────────────────────────────────────────────────────────────────────────┘
34.08 s
gammaloop-nextest-python-api>
34.08 s
gammaloop-nextest-python-api> stderr:
34.08 s
gammaloop-nextest-python-api>
34.08 s
gammaloop-nextest-python-api> ┌───────────────────────────────────────────────────────────┐
34.08 s
gammaloop-nextest-python-api> │ Could not resolve the IP of the Symbolica license server. │
34.08 s
gammaloop-nextest-python-api> │ │
34.08 s
gammaloop-nextest-python-api> │ Please check your DNS configuration. │
34.08 s
gammaloop-nextest-python-api> └───────────────────────────────────────────────────────────┘
34.08 s
gammaloop-nextest-python-api> Error: failed to lookup address information: Temporary failure in name resolution
34.08 s
gammaloop-nextest-python-api>
34.08 s
gammaloop-nextest-python-api>
34.08 s
gammaloop-nextest-python-api> Location:
34.08 s
gammaloop-nextest-python-api> tests/tests/test_python_api.rs:156:20
34.08 s
gammaloop-nextest-python-api> system-out
34.08 s
gammaloop-nextest-python-api> running 1 test
34.08 s
gammaloop-nextest-python-api> test python_evaluate_sample_preserves_graph_grouping_and_incoming_pdgs ... FAILED
34.08 s
gammaloop-nextest-python-api>
34.08 s
gammaloop-nextest-python-api> failures:
34.08 s
gammaloop-nextest-python-api>
34.08 s
gammaloop-nextest-python-api> failures:
34.08 s
gammaloop-nextest-python-api> python_evaluate_sample_preserves_graph_grouping_and_incoming_pdgs
34.08 s
gammaloop-nextest-python-api>
34.08 s
gammaloop-nextest-python-api> test result: FAILED. 0 passed; 1 failed; 0 ignored; 0 measured; 4 filtered out; finished in 0.12s
34.08 s
gammaloop-nextest-python-api> system-err
34.08 s
gammaloop-nextest-python-api> Error: Python API test subprocess failed.
34.08 s
gammaloop-nextest-python-api> stdout:
34.08 s
gammaloop-nextest-python-api> ┌────────────────────────────────────────────────────────┐
34.08 s
gammaloop-nextest-python-api> │ You are running a restricted Symbolica instance. │
34.08 s
gammaloop-nextest-python-api> │ │
34.08 s
gammaloop-nextest-python-api> │ This mode is only permitted for non-commercial use and │
34.08 s
gammaloop-nextest-python-api> │ is limited to one instance and core per machine. │
34.08 s
gammaloop-nextest-python-api> │ │
34.08 s
gammaloop-nextest-python-api> │ Hobbyists can easily acquire a free license key │
34.08 s
gammaloop-nextest-python-api> │ that unlocks all cores and removes this banner: │
34.08 s
gammaloop-nextest-python-api> │ │
34.08 s
gammaloop-nextest-python-api> │ from symbolica import * │
34.08 s
gammaloop-nextest-python-api> │ request_hobbyist_license('YOUR_NAME', 'YOUR_EMAIL') │
34.08 s
gammaloop-nextest-python-api> │ │
34.08 s
gammaloop-nextest-python-api> │ All other users can obtain a free 30-day trial key: │
34.08 s
gammaloop-nextest-python-api> │ │
34.08 s
gammaloop-nextest-python-api> │ from symbolica import * │
34.08 s
gammaloop-nextest-python-api> │ request_trial_license('NAME', 'EMAIL', 'EMPLOYER') │
34.08 s
gammaloop-nextest-python-api> │ │
34.08 s
gammaloop-nextest-python-api> │ See https://symbolica.io/docs/get_started.html#license │
34.08 s
gammaloop-nextest-python-api> └────────────────────────────────────────────────────────┘
34.08 s
gammaloop-nextest-python-api> ┌───────────────────────────────────────────────────────────────────────────────────────────────────────────┐
34.08 s
gammaloop-nextest-python-api> │ Cannot start new unlicensed Symbolica instance since there is already another one running on the machine. │
34.08 s
gammaloop-nextest-python-api> └───────────────────────────────────────────────────────────────────────────────────────────────────────────┘
34.08 s
gammaloop-nextest-python-api>
34.08 s
gammaloop-nextest-python-api> stderr:
34.08 s
gammaloop-nextest-python-api>
34.08 s
gammaloop-nextest-python-api> ┌───────────────────────────────────────────────────────────┐
34.08 s
gammaloop-nextest-python-api> │ Could not resolve the IP of the Symbolica license server. │
34.08 s
gammaloop-nextest-python-api> │ │
34.08 s
gammaloop-nextest-python-api> │ Please check your DNS configuration. │
34.08 s
gammaloop-nextest-python-api> └───────────────────────────────────────────────────────────┘
34.08 s
gammaloop-nextest-python-api> Error: failed to lookup address information: Temporary failure in name resolution
34.08 s
gammaloop-nextest-python-api>
34.08 s
gammaloop-nextest-python-api>
34.08 s
gammaloop-nextest-python-api> Location:
34.08 s
gammaloop-nextest-python-api> tests/tests/test_python_api.rs:156:20
34.08 s
gammaloop-nextest-python-api>
34.08 s
gammaloop-nextest-python-api> 4. gammaloop-integration-tests::test_python_api::python_evaluate_samples_batch_and_momentum_space_have_expected_shape
34.08 s
gammaloop-nextest-python-api> failure: test failure with exit code 101
34.08 s
gammaloop-nextest-python-api> Error: Python API test subprocess failed.
34.08 s
gammaloop-nextest-python-api> stdout:
34.08 s
gammaloop-nextest-python-api> ┌────────────────────────────────────────────────────────┐
34.08 s
gammaloop-nextest-python-api> │ You are running a restricted Symbolica instance. │
34.08 s
gammaloop-nextest-python-api> │ │
34.08 s
gammaloop-nextest-python-api> │ This mode is only permitted for non-commercial use and │
34.08 s
gammaloop-nextest-python-api> │ is limited to one instance and core per machine. │
34.08 s
gammaloop-nextest-python-api> │ │
34.08 s
gammaloop-nextest-python-api> │ Hobbyists can easily acquire a free license key │
34.08 s
gammaloop-nextest-python-api> │ that unlocks all cores and removes this banner: │
34.08 s
gammaloop-nextest-python-api> │ │
34.08 s
gammaloop-nextest-python-api> │ from symbolica import * │
34.08 s
gammaloop-nextest-python-api> │ request_hobbyist_license('YOUR_NAME', 'YOUR_EMAIL') │
34.08 s
gammaloop-nextest-python-api> │ │
34.08 s
gammaloop-nextest-python-api> │ All other users can obtain a free 30-day trial key: │
34.08 s
gammaloop-nextest-python-api> │ │
34.08 s
gammaloop-nextest-python-api> │ from symbolica import * │
34.08 s
gammaloop-nextest-python-api> │ request_trial_license('NAME', 'EMAIL', 'EMPLOYER') │
34.08 s
gammaloop-nextest-python-api> │ │
34.08 s
gammaloop-nextest-python-api> │ See https://symbolica.io/docs/get_started.html#license │
34.08 s
gammaloop-nextest-python-api> └────────────────────────────────────────────────────────┘
34.08 s
gammaloop-nextest-python-api> ┌───────────────────────────────────────────────────────────────────────────────────────────────────────────┐
34.08 s
gammaloop-nextest-python-api> │ Cannot start new unlicensed Symbolica instance since there is already another one running on the machine. │
34.08 s
gammaloop-nextest-python-api> └───────────────────────────────────────────────────────────────────────────────────────────────────────────┘
34.08 s
gammaloop-nextest-python-api>
34.08 s
gammaloop-nextest-python-api> stderr:
34.08 s
gammaloop-nextest-python-api>
34.08 s
gammaloop-nextest-python-api> ┌───────────────────────────────────────────────────────────┐
34.08 s
gammaloop-nextest-python-api> │ Could not resolve the IP of the Symbolica license server. │
34.08 s
gammaloop-nextest-python-api> │ │
34.08 s
gammaloop-nextest-python-api> │ Please check your DNS configuration. │
34.08 s
gammaloop-nextest-python-api> └───────────────────────────────────────────────────────────┘
34.08 s
gammaloop-nextest-python-api> Error: failed to lookup address information: Temporary failure in name resolution
34.08 s
gammaloop-nextest-python-api> [2026-09-14 22:20:37.313] @gammaloop_api::se... INFO : Running command import model sm-default
34.08 s
gammaloop-nextest-python-api> [2026-09-14 22:20:37.313] @import::model INFO : Loading built-in JSON model sm-default
34.08 s
gammaloop-nextest-python-api> [2026-09-14 22:20:37.348] @gammalooprs::model INFO : The following 11 external parameters were forced to zero by the restriction card:
34.08 s
gammaloop-nextest-python-api> lamWS, AWS, rhoWS, etaWS, ymc, yme, ymm, MC, Me, MM, WTau
34.08 s
gammaloop-nextest-python-api> [2026-09-14 22:20:37.348] @gammalooprs::model INFO : The following 34 vertex rules were removed by the restriction card:
34.08 s
gammaloop-nextest-python-api> V_82 -> (c~, d, G+) | V_83 -> (t~, d, G+) | V_84 -> (c~, s, G+) | V_85 -> (t~, s, G+) | V_86 -> (u~, b, G+) | V_87 -> (c~, b, G+) | V_90 -> (c~, d, W+) | V_91 -> (t~, d, W+) | V_92 -> (u~, s, W+) | V_94 -> (t~, s, W+) | V_95 -> (u~, b, W+) | V_96 -> (c~, b, W+) | V_101 -> (e+, e-, G0) | V_102 -> (mu+, mu-, G0) | V_104 -> (e+, e-, H) | V_105 -> (mu+, mu-, H) | V_110 -> (ve~, e-, G+) | V_111 -> (vm~, mu-, G+) | V_116 -> (b~, u, G-) | V_117 -> (d~, c, G-) | V_118 -> (s~, c, G-) | V_119 -> (b~, c, G-) | V_120 -> (d~, t, G-) | V_121 -> (s~, t, G-) | V_124 -> (s~, u, W-) | V_125 -> (b~, u, W-) | V_126 -> (d~, c, W-) | V_128 -> (b~, c, W-) | V_129 -> (d~, t, W-) | V_130 -> (s~, t, W-) | V_138 -> (c~, c, G0) | V_140 -> (c~, c, H) | V_145 -> (e+, ve, G-) | V_146 -> (mu+, vm, G-)
34.08 s
gammaloop-nextest-python-api> [2026-09-14 22:20:37.348] @gammalooprs::model INFO : The following 36 couplings were removed by the restriction card:
34.08 s
gammaloop-nextest-python-api> GC_13, GC_14, GC_16, GC_17, GC_18, GC_19, GC_20, GC_22, GC_23, GC_24, GC_25, GC_26, GC_28, GC_29, GC_42, GC_43, GC_44, GC_46, GC_47, GC_48, GC_84, GC_85, GC_86, GC_87, GC_88, GC_89, GC_90, GC_91, GC_92, GC_93, GC_101, GC_102, GC_103, GC_105, GC_106, GC_107
34.08 s
gammaloop-nextest-python-api> [2026-09-14 22:20:37.348] @gammaloop_api::se... INFO : Running command set default-runtime kv kinematics.externals='{"type":"constant","data":{"momenta":[[32.0,0.0,0.0,32.0],[32.0,0.0,0.0,-32.0]],"helicities":[1,1]}}'
34.08 s
gammaloop-nextest-python-api> [2026-09-14 22:20:37.349] @gammaloop_api::se... INFO : Running command set default-runtime kv subtraction.disable_threshold_subtraction=true
34.08 s
gammaloop-nextest-python-api> [2026-09-14 22:20:37.350] @gammaloop_api::se... INFO : Running command generate xs e+ e- > d d~ g | e- a d g QED^2==4 [{{2}} QCD=0] --numerator-grouping group_identical_graphs_up_to_sign --clear-existing-processes --only-diagrams
34.08 s
gammaloop-nextest-python-api> [2026-09-14 22:20:37.352] @feyngen::diagram_... INFO : 0s | Δ=0s | Starting Feynman graph generation with Symbolica...
34.08 s
gammaloop-nextest-python-api> [2026-09-14 22:20:37.355] @feyngen::diagram_... INFO : 0s | Δ=0s | Number of graphs resulting from Symbolica generation: 246
34.08 s
gammaloop-nextest-python-api> [2026-09-14 22:20:37.356] @feyngen::diagram_... INFO : 0s | Δ=0s | Number of graphs retained after enforcing supergraph particle content: 8
34.08 s
gammaloop-nextest-python-api> [2026-09-14 22:20:37.356] @feyngen::diagram_... INFO : 0s | Δ=0s | Number of graphs retained after removal of vetoed topologies: 8
34.08 s
gammaloop-nextest-python-api> [2026-09-14 22:20:37.356] @feyngen::diagram_... INFO : 0s | Δ=0s | Number of graphs after vertex info assignment: 8
34.08 s
gammaloop-nextest-python-api> [2026-09-14 22:20:37.356] @feyngen::diagram_... INFO : 0s | Δ=0s | Number of graphs after all complete graphs filters are applied: 8
34.08 s
gammaloop-nextest-python-api>
34.08 s
gammaloop-nextest-python-api>
34.08 s
gammaloop-nextest-python-api> Location:
34.08 s
gammaloop-nextest-python-api> tests/tests/test_python_api.rs:156:20
34.08 s
gammaloop-nextest-python-api> system-out
34.08 s
gammaloop-nextest-python-api> running 1 test
34.08 s
gammaloop-nextest-python-api> test python_evaluate_samples_batch_and_momentum_space_have_expected_shape ... FAILED
34.08 s
gammaloop-nextest-python-api>
34.08 s
gammaloop-nextest-python-api> failures:
34.08 s
gammaloop-nextest-python-api>
34.08 s
gammaloop-nextest-python-api> failures:
34.08 s
gammaloop-nextest-python-api> python_evaluate_samples_batch_and_momentum_space_have_expected_shape
34.08 s
gammaloop-nextest-python-api>
34.08 s
gammaloop-nextest-python-api> test result: FAILED. 0 passed; 1 failed; 0 ignored; 0 measured; 4 filtered out; finished in 0.21s
34.08 s
gammaloop-nextest-python-api> system-err
34.08 s
gammaloop-nextest-python-api> Error: Python API test subprocess failed.
34.08 s
gammaloop-nextest-python-api> stdout:
34.08 s
gammaloop-nextest-python-api> ┌────────────────────────────────────────────────────────┐
34.08 s
gammaloop-nextest-python-api> │ You are running a restricted Symbolica instance. │
34.08 s
gammaloop-nextest-python-api> │ │
34.08 s
gammaloop-nextest-python-api> │ This mode is only permitted for non-commercial use and │
34.08 s
gammaloop-nextest-python-api> │ is limited to one instance and core per machine. │
34.08 s
gammaloop-nextest-python-api> │ │
34.08 s
gammaloop-nextest-python-api> │ Hobbyists can easily acquire a free license key │
34.08 s
gammaloop-nextest-python-api> │ that unlocks all cores and removes this banner: │
34.08 s
gammaloop-nextest-python-api> │ │
34.08 s
gammaloop-nextest-python-api> │ from symbolica import * │
34.08 s
gammaloop-nextest-python-api> │ request_hobbyist_license('YOUR_NAME', 'YOUR_EMAIL') │
34.08 s
gammaloop-nextest-python-api> │ │
34.08 s
gammaloop-nextest-python-api> │ All other users can obtain a free 30-day trial key: │
34.08 s
gammaloop-nextest-python-api> │ │
34.08 s
gammaloop-nextest-python-api> │ from symbolica import * │
34.08 s
gammaloop-nextest-python-api> │ request_trial_license('NAME', 'EMAIL', 'EMPLOYER') │
34.08 s
gammaloop-nextest-python-api> │ │
34.08 s
gammaloop-nextest-python-api> │ See https://symbolica.io/docs/get_started.html#license │
34.08 s
gammaloop-nextest-python-api> └────────────────────────────────────────────────────────┘
34.08 s
gammaloop-nextest-python-api> ┌───────────────────────────────────────────────────────────────────────────────────────────────────────────┐
34.08 s
gammaloop-nextest-python-api> │ Cannot start new unlicensed Symbolica instance since there is already another one running on the machine. │
34.08 s
gammaloop-nextest-python-api> └───────────────────────────────────────────────────────────────────────────────────────────────────────────┘
34.08 s
gammaloop-nextest-python-api>
34.08 s
gammaloop-nextest-python-api> stderr:
34.08 s
gammaloop-nextest-python-api>
34.08 s
gammaloop-nextest-python-api> ┌───────────────────────────────────────────────────────────┐
34.08 s
gammaloop-nextest-python-api> │ Could not resolve the IP of the Symbolica license server. │
34.08 s
gammaloop-nextest-python-api> │ │
34.08 s
gammaloop-nextest-python-api> │ Please check your DNS configuration. │
34.08 s
gammaloop-nextest-python-api> └───────────────────────────────────────────────────────────┘
34.08 s
gammaloop-nextest-python-api> Error: failed to lookup address information: Temporary failure in name resolution
34.08 s
gammaloop-nextest-python-api> [2026-09-14 22:20:37.313] @gammaloop_api::se... INFO : Running command import model sm-default
34.08 s
gammaloop-nextest-python-api> [2026-09-14 22:20:37.313] @import::model INFO : Loading built-in JSON model sm-default
34.08 s
gammaloop-nextest-python-api> [2026-09-14 22:20:37.348] @gammalooprs::model INFO : The following 11 external parameters were forced to zero by the restriction card:
34.08 s
gammaloop-nextest-python-api> lamWS, AWS, rhoWS, etaWS, ymc, yme, ymm, MC, Me, MM, WTau
34.08 s
gammaloop-nextest-python-api> [2026-09-14 22:20:37.348] @gammalooprs::model INFO : The following 34 vertex rules were removed by the restriction card:
34.08 s
gammaloop-nextest-python-api> V_82 -> (c~, d, G+) | V_83 -> (t~, d, G+) | V_84 -> (c~, s, G+) | V_85 -> (t~, s, G+) | V_86 -> (u~, b, G+) | V_87 -> (c~, b, G+) | V_90 -> (c~, d, W+) | V_91 -> (t~, d, W+) | V_92 -> (u~, s, W+) | V_94 -> (t~, s, W+) | V_95 -> (u~, b, W+) | V_96 -> (c~, b, W+) | V_101 -> (e+, e-, G0) | V_102 -> (mu+, mu-, G0) | V_104 -> (e+, e-, H) | V_105 -> (mu+, mu-, H) | V_110 -> (ve~, e-, G+) | V_111 -> (vm~, mu-, G+) | V_116 -> (b~, u, G-) | V_117 -> (d~, c, G-) | V_118 -> (s~, c, G-) | V_119 -> (b~, c, G-) | V_120 -> (d~, t, G-) | V_121 -> (s~, t, G-) | V_124 -> (s~, u, W-) | V_125 -> (b~, u, W-) | V_126 -> (d~, c, W-) | V_128 -> (b~, c, W-) | V_129 -> (d~, t, W-) | V_130 -> (s~, t, W-) | V_138 -> (c~, c, G0) | V_140 -> (c~, c, H) | V_145 -> (e+, ve, G-) | V_146 -> (mu+, vm, G-)
34.08 s
gammaloop-nextest-python-api> [2026-09-14 22:20:37.348] @gammalooprs::model INFO : The following 36 couplings were removed by the restriction card:
34.08 s
gammaloop-nextest-python-api> GC_13, GC_14, GC_16, GC_17, GC_18, GC_19, GC_20, GC_22, GC_23, GC_24, GC_25, GC_26, GC_28, GC_29, GC_42, GC_43, GC_44, GC_46, GC_47, GC_48, GC_84, GC_85, GC_86, GC_87, GC_88, GC_89, GC_90, GC_91, GC_92, GC_93, GC_101, GC_102, GC_103, GC_105, GC_106, GC_107
34.08 s
gammaloop-nextest-python-api> [2026-09-14 22:20:37.348] @gammaloop_api::se... INFO : Running command set default-runtime kv kinematics.externals='{"type":"constant","data":{"momenta":[[32.0,0.0,0.0,32.0],[32.0,0.0,0.0,-32.0]],"helicities":[1,1]}}'
34.08 s
gammaloop-nextest-python-api> [2026-09-14 22:20:37.349] @gammaloop_api::se... INFO : Running command set default-runtime kv subtraction.disable_threshold_subtraction=true
34.08 s
gammaloop-nextest-python-api> [2026-09-14 22:20:37.350] @gammaloop_api::se... INFO : Running command generate xs e+ e- > d d~ g | e- a d g QED^2==4 [{{2}} QCD=0] --numerator-grouping group_identical_graphs_up_to_sign --clear-existing-processes --only-diagrams
34.08 s
gammaloop-nextest-python-api> [2026-09-14 22:20:37.352] @feyngen::diagram_... INFO : 0s | Δ=0s | Starting Feynman graph generation with Symbolica...
34.08 s
gammaloop-nextest-python-api> [2026-09-14 22:20:37.355] @feyngen::diagram_... INFO : 0s | Δ=0s | Number of graphs resulting from Symbolica generation: 246
34.08 s
gammaloop-nextest-python-api> [2026-09-14 22:20:37.356] @feyngen::diagram_... INFO : 0s | Δ=0s | Number of graphs retained after enforcing supergraph particle content: 8
34.08 s
gammaloop-nextest-python-api> [2026-09-14 22:20:37.356] @feyngen::diagram_... INFO : 0s | Δ=0s | Number of graphs retained after removal of vetoed topologies: 8
34.08 s
gammaloop-nextest-python-api> [2026-09-14 22:20:37.356] @feyngen::diagram_... INFO : 0s | Δ=0s | Number of graphs after vertex info assignment: 8
34.08 s
gammaloop-nextest-python-api> [2026-09-14 22:20:37.356] @feyngen::diagram_... INFO : 0s | Δ=0s | Number of graphs after all complete graphs filters are applied: 8
34.08 s
gammaloop-nextest-python-api>
34.08 s
gammaloop-nextest-python-api>
34.08 s
gammaloop-nextest-python-api> Location:
34.08 s
gammaloop-nextest-python-api> tests/tests/test_python_api.rs:156:20
34.08 s
gammaloop-nextest-python-api>
34.08 s
gammaloop-nextest-python-api> 5. gammaloop-integration-tests::test_python_api::python_settings_wrappers_expose_nested_runtime_and_global_settings
34.08 s
gammaloop-nextest-python-api> failure: test failure with exit code 101
34.08 s
gammaloop-nextest-python-api> Error: Python API test subprocess failed.
34.08 s
gammaloop-nextest-python-api> stdout:
34.08 s
gammaloop-nextest-python-api> ┌────────────────────────────────────────────────────────┐
34.08 s
gammaloop-nextest-python-api> │ You are running a restricted Symbolica instance. │
34.08 s
gammaloop-nextest-python-api> │ │
34.08 s
gammaloop-nextest-python-api> │ This mode is only permitted for non-commercial use and │
34.08 s
gammaloop-nextest-python-api> │ is limited to one instance and core per machine. │
34.08 s
gammaloop-nextest-python-api> │ │
34.08 s
gammaloop-nextest-python-api> │ Hobbyists can easily acquire a free license key │
34.08 s
gammaloop-nextest-python-api> │ that unlocks all cores and removes this banner: │
34.08 s
gammaloop-nextest-python-api> │ │
34.08 s
gammaloop-nextest-python-api> │ from symbolica import * │
34.08 s
gammaloop-nextest-python-api> │ request_hobbyist_license('YOUR_NAME', 'YOUR_EMAIL') │
34.08 s
gammaloop-nextest-python-api> │ │
34.08 s
gammaloop-nextest-python-api> │ All other users can obtain a free 30-day trial key: │
34.08 s
gammaloop-nextest-python-api> │ │
34.08 s
gammaloop-nextest-python-api> │ from symbolica import * │
34.08 s
gammaloop-nextest-python-api> │ request_trial_license('NAME', 'EMAIL', 'EMPLOYER') │
34.08 s
gammaloop-nextest-python-api> │ │
34.08 s
gammaloop-nextest-python-api> │ See https://symbolica.io/docs/get_started.html#license │
34.08 s
gammaloop-nextest-python-api> └────────────────────────────────────────────────────────┘
34.08 s
gammaloop-nextest-python-api> ┌───────────────────────────────────────────────────────────────────────────────────────────────────────────┐
34.08 s
gammaloop-nextest-python-api> │ Cannot start new unlicensed Symbolica instance since there is already another one running on the machine. │
34.08 s
gammaloop-nextest-python-api> └───────────────────────────────────────────────────────────────────────────────────────────────────────────┘
34.08 s
gammaloop-nextest-python-api>
34.08 s
gammaloop-nextest-python-api> stderr:
34.08 s
gammaloop-nextest-python-api>
34.08 s
gammaloop-nextest-python-api> ┌───────────────────────────────────────────────────────────┐
34.08 s
gammaloop-nextest-python-api> │ Could not resolve the IP of the Symbolica license server. │
34.08 s
gammaloop-nextest-python-api> │ │
34.08 s
gammaloop-nextest-python-api> │ Please check your DNS configuration. │
34.08 s
gammaloop-nextest-python-api> └───────────────────────────────────────────────────────────┘
34.08 s
gammaloop-nextest-python-api> Error: failed to lookup address information: Temporary failure in name resolution
34.08 s
gammaloop-nextest-python-api>
34.08 s
gammaloop-nextest-python-api>
34.08 s
gammaloop-nextest-python-api> Location:
34.08 s
gammaloop-nextest-python-api> tests/tests/test_python_api.rs:156:20
34.08 s
gammaloop-nextest-python-api> system-out
34.08 s
gammaloop-nextest-python-api> running 1 test
34.08 s
gammaloop-nextest-python-api> test python_settings_wrappers_expose_nested_runtime_and_global_settings ... FAILED
34.08 s
gammaloop-nextest-python-api>
34.08 s
gammaloop-nextest-python-api> failures:
34.08 s
gammaloop-nextest-python-api>
34.08 s
gammaloop-nextest-python-api> failures:
34.08 s
gammaloop-nextest-python-api> python_settings_wrappers_expose_nested_runtime_and_global_settings
34.08 s
gammaloop-nextest-python-api>
34.08 s
gammaloop-nextest-python-api> test result: FAILED. 0 passed; 1 failed; 0 ignored; 0 measured; 4 filtered out; finished in 0.22s
34.08 s
gammaloop-nextest-python-api> system-err
34.08 s
gammaloop-nextest-python-api> Error: Python API test subprocess failed.
34.08 s
gammaloop-nextest-python-api> stdout:
34.08 s
gammaloop-nextest-python-api> ┌────────────────────────────────────────────────────────┐
34.08 s
gammaloop-nextest-python-api> │ You are running a restricted Symbolica instance. │
34.08 s
gammaloop-nextest-python-api> │ │
34.08 s
gammaloop-nextest-python-api> │ This mode is only permitted for non-commercial use and │
34.08 s
gammaloop-nextest-python-api> │ is limited to one instance and core per machine. │
34.08 s
gammaloop-nextest-python-api> │ │
34.08 s
gammaloop-nextest-python-api> │ Hobbyists can easily acquire a free license key │
34.08 s
gammaloop-nextest-python-api> │ that unlocks all cores and removes this banner: │
34.08 s
gammaloop-nextest-python-api> │ │
34.08 s
gammaloop-nextest-python-api> │ from symbolica import * │
34.08 s
gammaloop-nextest-python-api> │ request_hobbyist_license('YOUR_NAME', 'YOUR_EMAIL') │
34.08 s
gammaloop-nextest-python-api> │ │
34.08 s
gammaloop-nextest-python-api> │ All other users can obtain a free 30-day trial key: │
34.08 s
gammaloop-nextest-python-api> │ │
34.08 s
gammaloop-nextest-python-api> │ from symbolica import * │
34.08 s
gammaloop-nextest-python-api> │ request_trial_license('NAME', 'EMAIL', 'EMPLOYER') │
34.08 s
gammaloop-nextest-python-api> │ │
34.08 s
gammaloop-nextest-python-api> │ See https://symbolica.io/docs/get_started.html#license │
34.08 s
gammaloop-nextest-python-api> └────────────────────────────────────────────────────────┘
34.08 s
gammaloop-nextest-python-api> ┌───────────────────────────────────────────────────────────────────────────────────────────────────────────┐
34.08 s
gammaloop-nextest-python-api> │ Cannot start new unlicensed Symbolica instance since there is already another one running on the machine. │
34.08 s
gammaloop-nextest-python-api> └───────────────────────────────────────────────────────────────────────────────────────────────────────────┘
34.08 s
gammaloop-nextest-python-api>
34.08 s
gammaloop-nextest-python-api> stderr:
34.08 s
gammaloop-nextest-python-api>
34.08 s
gammaloop-nextest-python-api> ┌───────────────────────────────────────────────────────────┐
34.08 s
gammaloop-nextest-python-api> │ Could not resolve the IP of the Symbolica license server. │
34.08 s
gammaloop-nextest-python-api> │ │
34.08 s
gammaloop-nextest-python-api> │ Please check your DNS configuration. │
34.08 s
gammaloop-nextest-python-api> └───────────────────────────────────────────────────────────┘
34.08 s
gammaloop-nextest-python-api> Error: failed to lookup address information: Temporary failure in name resolution
34.08 s
gammaloop-nextest-python-api>
34.08 s
gammaloop-nextest-python-api>
34.08 s
gammaloop-nextest-python-api> Location:
34.08 s
gammaloop-nextest-python-api> tests/tests/test_python_api.rs:156:20
34.08 s
gammaloop-nextest-python-api> =========================================
34.12 s
error: Cannot build '/nix/store/0y85356skfl9xg7hqjngmsb9xh03dwf2-gammaloop-nextest-python-api.drv '.
34.12 s
Reason: builder failed with exit code 100 .
34.12 s
Output paths:
34.12 s
/nix/store/qv9gx72pb7v8mx997s1xlipkhg6cf7s1-gammaloop-nextest-python-api
34.12 s
Last 1041 log lines:
34.12 s
> Extracting 1 binary, 1 build script output directory, and 3 linked paths to /build/nextest-archive-J5dUI3
34.12 s
> Extracted 18 files to /build/nextest-archive-J5dUI3 in 0.07s
34.12 s
> ------------
34.12 s
> Nextest run ID 1991f1e6-a793-428e-a18d-828fc205d70b with nextest profile: ci_gammaloop
34.12 s
> Starting 5 tests across 1 binary
34.12 s
> FAIL [ 0.118s] (1/5) gammaloop-integration-tests::test_python_api python_evaluate_sample_honors_generate_events_and_observable_snapshots
34.12 s
> stdout ---
34.12 s
>
34.12 s
> running 1 test
34.12 s
> test python_evaluate_sample_honors_generate_events_and_observable_snapshots ... FAILED
34.12 s
>
34.12 s
> failures:
34.12 s
>
34.12 s
> failures:
34.12 s
> python_evaluate_sample_honors_generate_events_and_observable_snapshots
34.12 s
>
34.12 s
> test result: FAILED. 0 passed; 1 failed; 0 ignored; 0 measured; 4 filtered out; finished in 0.11s
34.12 s
>
34.12 s
> stderr ---
34.12 s
> Error: Python API test subprocess failed.
34.12 s
> stdout:
34.12 s
> ┌────────────────────────────────────────────────────────┐
34.12 s
> │ You are running a restricted Symbolica instance. │
34.12 s
> │ │
34.12 s
> │ This mode is only permitted for non-commercial use and │
34.12 s
> │ is limited to one instance and core per machine. │
34.12 s
> │ │
34.12 s
> │ Hobbyists can easily acquire a free license key │
34.12 s
> │ that unlocks all cores and removes this banner: │
34.12 s
> │ │
34.12 s
> │ from symbolica import * │
34.12 s
> │ request_hobbyist_license('YOUR_NAME', 'YOUR_EMAIL') │
34.12 s
> │ │
34.12 s
> │ All other users can obtain a free 30-day trial key: │
34.12 s
> │ │
34.12 s
> │ from symbolica import * │
34.12 s
> │ request_trial_license('NAME', 'EMAIL', 'EMPLOYER') │
34.12 s
> │ │
34.12 s
> │ See https://symbolica.io/docs/get_started.html#license │
34.12 s
> └────────────────────────────────────────────────────────┘
34.12 s
> ┌───────────────────────────────────────────────────────────────────────────────────────────────────────────┐
34.12 s
> │ Cannot start new unlicensed Symbolica instance since there is already another one running on the machine. │
34.12 s
> └───────────────────────────────────────────────────────────────────────────────────────────────────────────┘
34.12 s
>
34.12 s
> stderr:
34.12 s
>
34.12 s
> ┌───────────────────────────────────────────────────────────┐
34.12 s
> │ Could not resolve the IP of the Symbolica license server. │
34.12 s
> │ │
34.12 s
> │ Please check your DNS configuration. │
34.12 s
> └───────────────────────────────────────────────────────────┘
34.12 s
> Error: failed to lookup address information: Temporary failure in name resolution
34.12 s
>
34.12 s
>
34.12 s
> Location:
34.12 s
> tests/tests/test_python_api.rs:156:20
34.12 s
>
34.12 s
> FAIL [ 0.118s] (2/5) gammaloop-integration-tests::test_python_api python_session_getters_return_live_toml_and_command_blocks
34.12 s
> stdout ---
34.12 s
>
34.12 s
> running 1 test
34.12 s
> test python_session_getters_return_live_toml_and_command_blocks ... FAILED
34.12 s
>
34.12 s
> failures:
34.12 s
>
34.12 s
> failures:
34.12 s
> python_session_getters_return_live_toml_and_command_blocks
34.12 s
>
34.12 s
> test result: FAILED. 0 passed; 1 failed; 0 ignored; 0 measured; 4 filtered out; finished in 0.11s
34.12 s
>
34.12 s
> stderr ---
34.12 s
> Error: Python API test subprocess failed.
34.12 s
> stdout:
34.12 s
> ┌────────────────────────────────────────────────────────┐
34.12 s
> │ You are running a restricted Symbolica instance. │
34.12 s
> │ │
34.12 s
> │ This mode is only permitted for non-commercial use and │
34.12 s
> │ is limited to one instance and core per machine. │
34.12 s
> │ │
34.12 s
> │ Hobbyists can easily acquire a free license key │
34.12 s
> │ that unlocks all cores and removes this banner: │
34.12 s
> │ │
34.12 s
> │ from symbolica import * │
34.12 s
> │ request_hobbyist_license('YOUR_NAME', 'YOUR_EMAIL') │
34.12 s
> │ │
34.12 s
> │ All other users can obtain a free 30-day trial key: │
34.12 s
> │ │
34.12 s
> │ from symbolica import * │
34.12 s
> │ request_trial_license('NAME', 'EMAIL', 'EMPLOYER') │
34.12 s
> │ │
34.12 s
> │ See https://symbolica.io/docs/get_started.html#license │
34.12 s
> └────────────────────────────────────────────────────────┘
34.12 s
> ┌───────────────────────────────────────────────────────────────────────────────────────────────────────────┐
34.12 s
> │ Cannot start new unlicensed Symbolica instance since there is already another one running on the machine. │
34.12 s
> └───────────────────────────────────────────────────────────────────────────────────────────────────────────┘
34.12 s
>
34.12 s
> stderr:
34.12 s
>
34.12 s
> ┌───────────────────────────────────────────────────────────┐
34.12 s
> │ Could not resolve the IP of the Symbolica license server. │
34.12 s
> │ │
34.12 s
> │ Please check your DNS configuration. │
34.12 s
> └───────────────────────────────────────────────────────────┘
34.12 s
> Error: failed to lookup address information: Temporary failure in name resolution
34.12 s
>
34.12 s
>
34.12 s
> Location:
34.12 s
> tests/tests/test_python_api.rs:156:20
34.12 s
>
34.12 s
> FAIL [ 0.126s] (3/5) gammaloop-integration-tests::test_python_api python_evaluate_sample_preserves_graph_grouping_and_incoming_pdgs
34.12 s
> stdout ---
34.12 s
>
34.12 s
> running 1 test
34.12 s
> test python_evaluate_sample_preserves_graph_grouping_and_incoming_pdgs ... FAILED
34.12 s
>
34.12 s
> failures:
34.12 s
>
34.12 s
> failures:
34.12 s
> python_evaluate_sample_preserves_graph_grouping_and_incoming_pdgs
34.12 s
>
34.12 s
> test result: FAILED. 0 passed; 1 failed; 0 ignored; 0 measured; 4 filtered out; finished in 0.12s
34.12 s
>
34.12 s
> stderr ---
34.12 s
> Error: Python API test subprocess failed.
34.12 s
> stdout:
34.12 s
> ┌────────────────────────────────────────────────────────┐
34.12 s
> │ You are running a restricted Symbolica instance. │
34.12 s
> │ │
34.12 s
> │ This mode is only permitted for non-commercial use and │
34.12 s
> │ is limited to one instance and core per machine. │
34.12 s
> │ │
34.12 s
> │ Hobbyists can easily acquire a free license key │
34.12 s
> │ that unlocks all cores and removes this banner: │
34.12 s
> │ │
34.12 s
> │ from symbolica import * │
34.12 s
> │ request_hobbyist_license('YOUR_NAME', 'YOUR_EMAIL') │
34.12 s
> │ │
34.12 s
> │ All other users can obtain a free 30-day trial key: │
34.12 s
> │ │
34.12 s
> │ from symbolica import * │
34.12 s
> │ request_trial_license('NAME', 'EMAIL', 'EMPLOYER') │
34.12 s
> │ │
34.12 s
> │ See https://symbolica.io/docs/get_started.html#license │
34.12 s
> └────────────────────────────────────────────────────────┘
34.12 s
> ┌───────────────────────────────────────────────────────────────────────────────────────────────────────────┐
34.12 s
> │ Cannot start new unlicensed Symbolica instance since there is already another one running on the machine. │
34.12 s
> └───────────────────────────────────────────────────────────────────────────────────────────────────────────┘
34.12 s
>
34.12 s
> stderr:
34.12 s
>
34.12 s
> ┌───────────────────────────────────────────────────────────┐
34.12 s
> │ Could not resolve the IP of the Symbolica license server. │
34.12 s
> │ │
34.12 s
> │ Please check your DNS configuration. │
34.12 s
> └───────────────────────────────────────────────────────────┘
34.12 s
> Error: failed to lookup address information: Temporary failure in name resolution
34.12 s
>
34.12 s
>
34.12 s
> Location:
34.12 s
> tests/tests/test_python_api.rs:156:20
34.12 s
>
34.12 s
> FAIL [ 0.211s] (4/5) gammaloop-integration-tests::test_python_api python_evaluate_samples_batch_and_momentum_space_have_expected_shape
34.12 s
> stdout ---
34.12 s
>
34.12 s
> running 1 test
34.12 s
> test python_evaluate_samples_batch_and_momentum_space_have_expected_shape ... FAILED
34.12 s
>
34.12 s
> failures:
34.12 s
>
34.12 s
> failures:
34.12 s
> python_evaluate_samples_batch_and_momentum_space_have_expected_shape
34.12 s
>
34.12 s
> test result: FAILED. 0 passed; 1 failed; 0 ignored; 0 measured; 4 filtered out; finished in 0.21s
34.12 s
>
34.12 s
> stderr ---
34.12 s
> Error: Python API test subprocess failed.
34.12 s
> stdout:
34.12 s
> ┌────────────────────────────────────────────────────────┐
34.12 s
> │ You are running a restricted Symbolica instance. │
34.12 s
> │ │
34.12 s
> │ This mode is only permitted for non-commercial use and │
34.12 s
> │ is limited to one instance and core per machine. │
34.12 s
> │ │
34.12 s
> │ Hobbyists can easily acquire a free license key │
34.12 s
> │ that unlocks all cores and removes this banner: │
34.12 s
> │ │
34.12 s
> │ from symbolica import * │
34.12 s
> │ request_hobbyist_license('YOUR_NAME', 'YOUR_EMAIL') │
34.12 s
> │ │
34.12 s
> │ All other users can obtain a free 30-day trial key: │
34.12 s
> │ │
34.12 s
> │ from symbolica import * │
34.12 s
> │ request_trial_license('NAME', 'EMAIL', 'EMPLOYER') │
34.12 s
> │ │
34.12 s
> │ See https://symbolica.io/docs/get_started.html#license │
34.12 s
> └────────────────────────────────────────────────────────┘
34.12 s
> ┌───────────────────────────────────────────────────────────────────────────────────────────────────────────┐
34.12 s
> │ Cannot start new unlicensed Symbolica instance since there is already another one running on the machine. │
34.12 s
> └───────────────────────────────────────────────────────────────────────────────────────────────────────────┘
34.12 s
>
34.12 s
> stderr:
34.12 s
>
34.12 s
> ┌───────────────────────────────────────────────────────────┐
34.12 s
> │ Could not resolve the IP of the Symbolica license server. │
34.12 s
> │ │
34.12 s
> │ Please check your DNS configuration. │
34.12 s
> └───────────────────────────────────────────────────────────┘
34.12 s
> Error: failed to lookup address information: Temporary failure in name resolution
34.12 s
> [2026-09-14 22:20:37.313] @gammaloop_api::se... INFO : Running command import model sm-default
34.12 s
> [2026-09-14 22:20:37.313] @import::model INFO : Loading built-in JSON model sm-default
34.12 s
> [2026-09-14 22:20:37.348] @gammalooprs::model INFO : The following 11 external parameters were forced to zero by the restriction card:
34.12 s
> lamWS, AWS, rhoWS, etaWS, ymc, yme, ymm, MC, Me, MM, WTau
34.12 s
> [2026-09-14 22:20:37.348] @gammalooprs::model INFO : The following 34 vertex rules were removed by the restriction card:
34.12 s
> V_82 -> (c~, d, G+) | V_83 -> (t~, d, G+) | V_84 -> (c~, s, G+) | V_85 -> (t~, s, G+) | V_86 -> (u~, b, G+) | V_87 -> (c~, b, G+) | V_90 -> (c~, d, W+) | V_91 -> (t~, d, W+) | V_92 -> (u~, s, W+) | V_94 -> (t~, s, W+) | V_95 -> (u~, b, W+) | V_96 -> (c~, b, W+) | V_101 -> (e+, e-, G0) | V_102 -> (mu+, mu-, G0) | V_104 -> (e+, e-, H) | V_105 -> (mu+, mu-, H) | V_110 -> (ve~, e-, G+) | V_111 -> (vm~, mu-, G+) | V_116 -> (b~, u, G-) | V_117 -> (d~, c, G-) | V_118 -> (s~, c, G-) | V_119 -> (b~, c, G-) | V_120 -> (d~, t, G-) | V_121 -> (s~, t, G-) | V_124 -> (s~, u, W-) | V_125 -> (b~, u, W-) | V_126 -> (d~, c, W-) | V_128 -> (b~, c, W-) | V_129 -> (d~, t, W-) | V_130 -> (s~, t, W-) | V_138 -> (c~, c, G0) | V_140 -> (c~, c, H) | V_145 -> (e+, ve, G-) | V_146 -> (mu+, vm, G-)
34.12 s
> [2026-09-14 22:20:37.348] @gammalooprs::model INFO : The following 36 couplings were removed by the restriction card:
34.12 s
> GC_13, GC_14, GC_16, GC_17, GC_18, GC_19, GC_20, GC_22, GC_23, GC_24, GC_25, GC_26, GC_28, GC_29, GC_42, GC_43, GC_44, GC_46, GC_47, GC_48, GC_84, GC_85, GC_86, GC_87, GC_88, GC_89, GC_90, GC_91, GC_92, GC_93, GC_101, GC_102, GC_103, GC_105, GC_106, GC_107
34.12 s
> [2026-09-14 22:20:37.348] @gammaloop_api::se... INFO : Running command set default-runtime kv kinematics.externals='{"type":"constant","data":{"momenta":[[32.0,0.0,0.0,32.0],[32.0,0.0,0.0,-32.0]],"helicities":[1,1]}}'
34.12 s
> [2026-09-14 22:20:37.349] @gammaloop_api::se... INFO : Running command set default-runtime kv subtraction.disable_threshold_subtraction=true
34.12 s
> [2026-09-14 22:20:37.350] @gammaloop_api::se... INFO : Running command generate xs e+ e- > d d~ g | e- a d g QED^2==4 [{{2}} QCD=0] --numerator-grouping group_identical_graphs_up_to_sign --clear-existing-processes --only-diagrams
34.12 s
> [2026-09-14 22:20:37.352] @feyngen::diagram_... INFO : 0s | Δ=0s | Starting Feynman graph generation with Symbolica...
34.12 s
> [2026-09-14 22:20:37.355] @feyngen::diagram_... INFO : 0s | Δ=0s | Number of graphs resulting from Symbolica generation: 246
34.12 s
> [2026-09-14 22:20:37.356] @feyngen::diagram_... INFO : 0s | Δ=0s | Number of graphs retained after enforcing supergraph particle content: 8
34.12 s
> [2026-09-14 22:20:37.356] @feyngen::diagram_... INFO : 0s | Δ=0s | Number of graphs retained after removal of vetoed topologies: 8
34.12 s
> [2026-09-14 22:20:37.356] @feyngen::diagram_... INFO : 0s | Δ=0s | Number of graphs after vertex info assignment: 8
34.12 s
> [2026-09-14 22:20:37.356] @feyngen::diagram_... INFO : 0s | Δ=0s | Number of graphs after all complete graphs filters are applied: 8
34.12 s
>
34.12 s
>
34.12 s
> Location:
34.12 s
> tests/tests/test_python_api.rs:156:20
34.12 s
>
34.12 s
> FAIL [ 0.225s] (5/5) gammaloop-integration-tests::test_python_api python_settings_wrappers_expose_nested_runtime_and_global_settings
34.12 s
> stdout ---
34.12 s
>
34.12 s
> running 1 test
34.12 s
> test python_settings_wrappers_expose_nested_runtime_and_global_settings ... FAILED
34.12 s
>
34.12 s
> failures:
34.12 s
>
34.12 s
> failures:
34.12 s
> python_settings_wrappers_expose_nested_runtime_and_global_settings
34.12 s
>
34.12 s
> test result: FAILED. 0 passed; 1 failed; 0 ignored; 0 measured; 4 filtered out; finished in 0.22s
34.12 s
>
34.12 s
> stderr ---
34.12 s
> Error: Python API test subprocess failed.
34.12 s
> stdout:
34.12 s
> ┌────────────────────────────────────────────────────────┐
34.12 s
> │ You are running a restricted Symbolica instance. │
34.12 s
> │ │
34.12 s
> │ This mode is only permitted for non-commercial use and │
34.12 s
> │ is limited to one instance and core per machine. │
34.12 s
> │ │
34.12 s
> │ Hobbyists can easily acquire a free license key │
34.12 s
> │ that unlocks all cores and removes this banner: │
34.12 s
> │ │
34.12 s
> │ from symbolica import * │
34.12 s
> │ request_hobbyist_license('YOUR_NAME', 'YOUR_EMAIL') │
34.12 s
> │ │
34.12 s
> │ All other users can obtain a free 30-day trial key: │
34.12 s
> │ │
34.12 s
> │ from symbolica import * │
34.12 s
> │ request_trial_license('NAME', 'EMAIL', 'EMPLOYER') │
34.12 s
> │ │
34.12 s
> │ See https://symbolica.io/docs/get_started.html#license │
34.12 s
> └────────────────────────────────────────────────────────┘
34.12 s
> ┌───────────────────────────────────────────────────────────────────────────────────────────────────────────┐
34.12 s
> │ Cannot start new unlicensed Symbolica instance since there is already another one running on the machine. │
34.12 s
> └───────────────────────────────────────────────────────────────────────────────────────────────────────────┘
34.12 s
>
34.12 s
> stderr:
34.12 s
>
34.12 s
> ┌───────────────────────────────────────────────────────────┐
34.12 s
> │ Could not resolve the IP of the Symbolica license server. │
34.12 s
> │ │
34.12 s
> │ Please check your DNS configuration. │
34.12 s
> └───────────────────────────────────────────────────────────┘
34.12 s
> Error: failed to lookup address information: Temporary failure in name resolution
34.12 s
>
34.12 s
>
34.12 s
> Location:
34.12 s
> tests/tests/test_python_api.rs:156:20
34.12 s
>
34.12 s
> ------------
34.12 s
> Summary [ 0.226s] 5 tests run: 0 passed , 5 failed , 0 skipped
34.12 s
> FAIL [ 0.118s] (1/5) gammaloop-integration-tests::test_python_api python_evaluate_sample_honors_generate_events_and_observable_snapshots
34.12 s
> stdout ---
34.12 s
>
34.12 s
> running 1 test
34.12 s
> test python_evaluate_sample_honors_generate_events_and_observable_snapshots ... FAILED
34.12 s
>
34.12 s
> failures:
34.12 s
>
34.12 s
> failures:
34.12 s
> python_evaluate_sample_honors_generate_events_and_observable_snapshots
34.12 s
>
34.12 s
> test result: FAILED. 0 passed; 1 failed; 0 ignored; 0 measured; 4 filtered out; finished in 0.11s
34.12 s
>
34.12 s
> stderr ---
34.12 s
> Error: Python API test subprocess failed.
34.12 s
> stdout:
34.12 s
> ┌────────────────────────────────────────────────────────┐
34.12 s
> │ You are running a restricted Symbolica instance. │
34.12 s
> │ │
34.12 s
> │ This mode is only permitted for non-commercial use and │
34.12 s
> │ is limited to one instance and core per machine. │
34.12 s
> │ │
34.12 s
> │ Hobbyists can easily acquire a free license key │
34.12 s
> │ that unlocks all cores and removes this banner: │
34.12 s
> │ │
34.12 s
> │ from symbolica import * │
34.12 s
> │ request_hobbyist_license('YOUR_NAME', 'YOUR_EMAIL') │
34.12 s
> │ │
34.12 s
> │ All other users can obtain a free 30-day trial key: │
34.12 s
> │ │
34.12 s
> │ from symbolica import * │
34.12 s
> │ request_trial_license('NAME', 'EMAIL', 'EMPLOYER') │
34.12 s
> │ │
34.12 s
> │ See https://symbolica.io/docs/get_started.html#license │
34.12 s
> └────────────────────────────────────────────────────────┘
34.12 s
> ┌───────────────────────────────────────────────────────────────────────────────────────────────────────────┐
34.12 s
> │ Cannot start new unlicensed Symbolica instance since there is already another one running on the machine. │
34.12 s
> └───────────────────────────────────────────────────────────────────────────────────────────────────────────┘
34.12 s
>
34.12 s
> stderr:
34.12 s
>
34.13 s
> ┌───────────────────────────────────────────────────────────┐
34.13 s
> │ Could not resolve the IP of the Symbolica license server. │
34.13 s
> │ │
34.13 s
> │ Please check your DNS configuration. │
34.13 s
> └───────────────────────────────────────────────────────────┘
34.13 s
> Error: failed to lookup address information: Temporary failure in name resolution
34.13 s
>
34.13 s
>
34.13 s
> Location:
34.13 s
> tests/tests/test_python_api.rs:156:20
34.13 s
>
34.13 s
> FAIL [ 0.118s] (2/5) gammaloop-integration-tests::test_python_api python_session_getters_return_live_toml_and_command_blocks
34.13 s
> stdout ---
34.13 s
>
34.13 s
> running 1 test
34.13 s
> test python_session_getters_return_live_toml_and_command_blocks ... FAILED
34.13 s
>
34.13 s
> failures:
34.13 s
>
34.13 s
> failures:
34.13 s
> python_session_getters_return_live_toml_and_command_blocks
34.13 s
>
34.13 s
> test result: FAILED. 0 passed; 1 failed; 0 ignored; 0 measured; 4 filtered out; finished in 0.11s
34.13 s
>
34.13 s
> stderr ---
34.13 s
> Error: Python API test subprocess failed.
34.13 s
> stdout:
34.13 s
> ┌────────────────────────────────────────────────────────┐
34.13 s
> │ You are running a restricted Symbolica instance. │
34.13 s
> │ │
34.13 s
> │ This mode is only permitted for non-commercial use and │
34.13 s
> │ is limited to one instance and core per machine. │
34.13 s
> │ │
34.13 s
> │ Hobbyists can easily acquire a free license key │
34.13 s
> │ that unlocks all cores and removes this banner: │
34.13 s
> │ │
34.13 s
> │ from symbolica import * │
34.13 s
> │ request_hobbyist_license('YOUR_NAME', 'YOUR_EMAIL') │
34.13 s
> │ │
34.13 s
> │ All other users can obtain a free 30-day trial key: │
34.13 s
> │ │
34.13 s
> │ from symbolica import * │
34.13 s
> │ request_trial_license('NAME', 'EMAIL', 'EMPLOYER') │
34.13 s
> │ │
34.13 s
> │ See https://symbolica.io/docs/get_started.html#license │
34.13 s
> └────────────────────────────────────────────────────────┘
34.13 s
> ┌───────────────────────────────────────────────────────────────────────────────────────────────────────────┐
34.13 s
> │ Cannot start new unlicensed Symbolica instance since there is already another one running on the machine. │
34.13 s
> └───────────────────────────────────────────────────────────────────────────────────────────────────────────┘
34.13 s
>
34.13 s
> stderr:
34.13 s
>
34.13 s
> ┌───────────────────────────────────────────────────────────┐
34.13 s
> │ Could not resolve the IP of the Symbolica license server. │
34.13 s
> │ │
34.13 s
> │ Please check your DNS configuration. │
34.13 s
> └───────────────────────────────────────────────────────────┘
34.13 s
> Error: failed to lookup address information: Temporary failure in name resolution
34.13 s
>
34.13 s
>
34.13 s
> Location:
34.13 s
> tests/tests/test_python_api.rs:156:20
34.13 s
>
34.13 s
> FAIL [ 0.126s] (3/5) gammaloop-integration-tests::test_python_api python_evaluate_sample_preserves_graph_grouping_and_incoming_pdgs
34.13 s
> stdout ---
34.13 s
>
34.13 s
> running 1 test
34.13 s
> test python_evaluate_sample_preserves_graph_grouping_and_incoming_pdgs ... FAILED
34.13 s
>
34.13 s
> failures:
34.13 s
>
34.13 s
> failures:
34.13 s
> python_evaluate_sample_preserves_graph_grouping_and_incoming_pdgs
34.13 s
>
34.13 s
> test result: FAILED. 0 passed; 1 failed; 0 ignored; 0 measured; 4 filtered out; finished in 0.12s
34.13 s
>
34.13 s
> stderr ---
34.13 s
> Error: Python API test subprocess failed.
34.13 s
> stdout:
34.13 s
> ┌────────────────────────────────────────────────────────┐
34.13 s
> │ You are running a restricted Symbolica instance. │
34.13 s
> │ │
34.13 s
> │ This mode is only permitted for non-commercial use and │
34.13 s
> │ is limited to one instance and core per machine. │
34.13 s
> │ │
34.13 s
> │ Hobbyists can easily acquire a free license key │
34.13 s
> │ that unlocks all cores and removes this banner: │
34.13 s
> │ │
34.13 s
> │ from symbolica import * │
34.13 s
> │ request_hobbyist_license('YOUR_NAME', 'YOUR_EMAIL') │
34.13 s
> │ │
34.13 s
> │ All other users can obtain a free 30-day trial key: │
34.13 s
> │ │
34.13 s
> │ from symbolica import * │
34.13 s
> │ request_trial_license('NAME', 'EMAIL', 'EMPLOYER') │
34.13 s
> │ │
34.13 s
> │ See https://symbolica.io/docs/get_started.html#license │
34.13 s
> └────────────────────────────────────────────────────────┘
34.13 s
> ┌───────────────────────────────────────────────────────────────────────────────────────────────────────────┐
34.13 s
> │ Cannot start new unlicensed Symbolica instance since there is already another one running on the machine. │
34.13 s
> └───────────────────────────────────────────────────────────────────────────────────────────────────────────┘
34.13 s
>
34.13 s
> stderr:
34.13 s
>
34.13 s
> ┌───────────────────────────────────────────────────────────┐
34.13 s
> │ Could not resolve the IP of the Symbolica license server. │
34.13 s
> │ │
34.13 s
> │ Please check your DNS configuration. │
34.13 s
> └───────────────────────────────────────────────────────────┘
34.13 s
> Error: failed to lookup address information: Temporary failure in name resolution
34.13 s
>
34.13 s
>
34.13 s
> Location:
34.13 s
> tests/tests/test_python_api.rs:156:20
34.13 s
>
34.13 s
> FAIL [ 0.211s] (4/5) gammaloop-integration-tests::test_python_api python_evaluate_samples_batch_and_momentum_space_have_expected_shape
34.13 s
> stdout ---
34.13 s
>
34.13 s
> running 1 test
34.13 s
> test python_evaluate_samples_batch_and_momentum_space_have_expected_shape ... FAILED
34.13 s
>
34.13 s
> failures:
34.13 s
>
34.13 s
> failures:
34.13 s
> python_evaluate_samples_batch_and_momentum_space_have_expected_shape
34.13 s
>
34.13 s
> test result: FAILED. 0 passed; 1 failed; 0 ignored; 0 measured; 4 filtered out; finished in 0.21s
34.13 s
>
34.13 s
> stderr ---
34.13 s
> Error: Python API test subprocess failed.
34.13 s
> stdout:
34.13 s
> ┌────────────────────────────────────────────────────────┐
34.13 s
> │ You are running a restricted Symbolica instance. │
34.13 s
> │ │
34.13 s
> │ This mode is only permitted for non-commercial use and │
34.13 s
> │ is limited to one instance and core per machine. │
34.13 s
> │ │
34.13 s
> │ Hobbyists can easily acquire a free license key │
34.13 s
> │ that unlocks all cores and removes this banner: │
34.13 s
> │ │
34.13 s
> │ from symbolica import * │
34.13 s
> │ request_hobbyist_license('YOUR_NAME', 'YOUR_EMAIL') │
34.13 s
> │ │
34.13 s
> │ All other users can obtain a free 30-day trial key: │
34.13 s
> │ │
34.13 s
> │ from symbolica import * │
34.13 s
> │ request_trial_license('NAME', 'EMAIL', 'EMPLOYER') │
34.13 s
> │ │
34.13 s
> │ See https://symbolica.io/docs/get_started.html#license │
34.13 s
> └────────────────────────────────────────────────────────┘
34.13 s
> ┌───────────────────────────────────────────────────────────────────────────────────────────────────────────┐
34.13 s
> │ Cannot start new unlicensed Symbolica instance since there is already another one running on the machine. │
34.13 s
> └───────────────────────────────────────────────────────────────────────────────────────────────────────────┘
34.13 s
>
34.13 s
> stderr:
34.13 s
>
34.13 s
> ┌───────────────────────────────────────────────────────────┐
34.13 s
> │ Could not resolve the IP of the Symbolica license server. │
34.13 s
> │ │
34.13 s
> │ Please check your DNS configuration. │
34.13 s
> └───────────────────────────────────────────────────────────┘
34.13 s
> Error: failed to lookup address information: Temporary failure in name resolution
34.13 s
> [2026-09-14 22:20:37.313] @gammaloop_api::se... INFO : Running command import model sm-default
34.13 s
> [2026-09-14 22:20:37.313] @import::model INFO : Loading built-in JSON model sm-default
34.13 s
> [2026-09-14 22:20:37.348] @gammalooprs::model INFO : The following 11 external parameters were forced to zero by the restriction card:
34.13 s
> lamWS, AWS, rhoWS, etaWS, ymc, yme, ymm, MC, Me, MM, WTau
34.13 s
> [2026-09-14 22:20:37.348] @gammalooprs::model INFO : The following 34 vertex rules were removed by the restriction card:
34.13 s
> V_82 -> (c~, d, G+) | V_83 -> (t~, d, G+) | V_84 -> (c~, s, G+) | V_85 -> (t~, s, G+) | V_86 -> (u~, b, G+) | V_87 -> (c~, b, G+) | V_90 -> (c~, d, W+) | V_91 -> (t~, d, W+) | V_92 -> (u~, s, W+) | V_94 -> (t~, s, W+) | V_95 -> (u~, b, W+) | V_96 -> (c~, b, W+) | V_101 -> (e+, e-, G0) | V_102 -> (mu+, mu-, G0) | V_104 -> (e+, e-, H) | V_105 -> (mu+, mu-, H) | V_110 -> (ve~, e-, G+) | V_111 -> (vm~, mu-, G+) | V_116 -> (b~, u, G-) | V_117 -> (d~, c, G-) | V_118 -> (s~, c, G-) | V_119 -> (b~, c, G-) | V_120 -> (d~, t, G-) | V_121 -> (s~, t, G-) | V_124 -> (s~, u, W-) | V_125 -> (b~, u, W-) | V_126 -> (d~, c, W-) | V_128 -> (b~, c, W-) | V_129 -> (d~, t, W-) | V_130 -> (s~, t, W-) | V_138 -> (c~, c, G0) | V_140 -> (c~, c, H) | V_145 -> (e+, ve, G-) | V_146 -> (mu+, vm, G-)
34.13 s
> [2026-09-14 22:20:37.348] @gammalooprs::model INFO : The following 36 couplings were removed by the restriction card:
34.13 s
> GC_13, GC_14, GC_16, GC_17, GC_18, GC_19, GC_20, GC_22, GC_23, GC_24, GC_25, GC_26, GC_28, GC_29, GC_42, GC_43, GC_44, GC_46, GC_47, GC_48, GC_84, GC_85, GC_86, GC_87, GC_88, GC_89, GC_90, GC_91, GC_92, GC_93, GC_101, GC_102, GC_103, GC_105, GC_106, GC_107
34.13 s
> [2026-09-14 22:20:37.348] @gammaloop_api::se... INFO : Running command set default-runtime kv kinematics.externals='{"type":"constant","data":{"momenta":[[32.0,0.0,0.0,32.0],[32.0,0.0,0.0,-32.0]],"helicities":[1,1]}}'
34.13 s
> [2026-09-14 22:20:37.349] @gammaloop_api::se... INFO : Running command set default-runtime kv subtraction.disable_threshold_subtraction=true
34.13 s
> [2026-09-14 22:20:37.350] @gammaloop_api::se... INFO : Running command generate xs e+ e- > d d~ g | e- a d g QED^2==4 [{{2}} QCD=0] --numerator-grouping group_identical_graphs_up_to_sign --clear-existing-processes --only-diagrams
34.13 s
> [2026-09-14 22:20:37.352] @feyngen::diagram_... INFO : 0s | Δ=0s | Starting Feynman graph generation with Symbolica...
34.13 s
> [2026-09-14 22:20:37.355] @feyngen::diagram_... INFO : 0s | Δ=0s | Number of graphs resulting from Symbolica generation: 246
34.13 s
> [2026-09-14 22:20:37.356] @feyngen::diagram_... INFO : 0s | Δ=0s | Number of graphs retained after enforcing supergraph particle content: 8
34.13 s
> [2026-09-14 22:20:37.356] @feyngen::diagram_... INFO : 0s | Δ=0s | Number of graphs retained after removal of vetoed topologies: 8
34.13 s
> [2026-09-14 22:20:37.356] @feyngen::diagram_... INFO : 0s | Δ=0s | Number of graphs after vertex info assignment: 8
34.13 s
> [2026-09-14 22:20:37.356] @feyngen::diagram_... INFO : 0s | Δ=0s | Number of graphs after all complete graphs filters are applied: 8
34.13 s
>
34.13 s
>
34.13 s
> Location:
34.13 s
> tests/tests/test_python_api.rs:156:20
34.13 s
>
34.13 s
> FAIL [ 0.225s] (5/5) gammaloop-integration-tests::test_python_api python_settings_wrappers_expose_nested_runtime_and_global_settings
34.13 s
> stdout ---
34.13 s
>
34.13 s
> running 1 test
34.13 s
> test python_settings_wrappers_expose_nested_runtime_and_global_settings ... FAILED
34.13 s
>
34.13 s
> failures:
34.13 s
>
34.13 s
> failures:
34.13 s
> python_settings_wrappers_expose_nested_runtime_and_global_settings
34.13 s
>
34.13 s
> test result: FAILED. 0 passed; 1 failed; 0 ignored; 0 measured; 4 filtered out; finished in 0.22s
34.13 s
>
34.13 s
> stderr ---
34.13 s
> Error: Python API test subprocess failed.
34.13 s
> stdout:
34.13 s
> ┌────────────────────────────────────────────────────────┐
34.13 s
> │ You are running a restricted Symbolica instance. │
34.13 s
> │ │
34.13 s
> │ This mode is only permitted for non-commercial use and │
34.13 s
> │ is limited to one instance and core per machine. │
34.13 s
> │ │
34.13 s
> │ Hobbyists can easily acquire a free license key │
34.13 s
> │ that unlocks all cores and removes this banner: │
34.13 s
> │ │
34.13 s
> │ from symbolica import * │
34.13 s
> │ request_hobbyist_license('YOUR_NAME', 'YOUR_EMAIL') │
34.13 s
> │ │
34.13 s
> │ All other users can obtain a free 30-day trial key: │
34.13 s
> │ │
34.13 s
> │ from symbolica import * │
34.13 s
> │ request_trial_license('NAME', 'EMAIL', 'EMPLOYER') │
34.13 s
> │ │
34.13 s
> │ See https://symbolica.io/docs/get_started.html#license │
34.13 s
> └────────────────────────────────────────────────────────┘
34.13 s
> ┌───────────────────────────────────────────────────────────────────────────────────────────────────────────┐
34.13 s
> │ Cannot start new unlicensed Symbolica instance since there is already another one running on the machine. │
34.13 s
> └───────────────────────────────────────────────────────────────────────────────────────────────────────────┘
34.13 s
>
34.13 s
> stderr:
34.13 s
>
34.13 s
> ┌───────────────────────────────────────────────────────────┐
34.13 s
> │ Could not resolve the IP of the Symbolica license server. │
34.13 s
> │ │
34.13 s
> │ Please check your DNS configuration. │
34.13 s
> └───────────────────────────────────────────────────────────┘
34.13 s
> Error: failed to lookup address information: Temporary failure in name resolution
34.13 s
>
34.13 s
>
34.13 s
> Location:
34.13 s
> tests/tests/test_python_api.rs:156:20
34.13 s
>
34.13 s
> error : test run failed
34.13 s
>
34.13 s
> ========== nextest test summary ==========
34.13 s
> report: target/nextest/ci_gammaloop/junit.xml
34.13 s
> tests: 5, failures: 5, errors: 0
34.13 s
>
34.13 s
> 1. gammaloop-integration-tests::test_python_api::python_evaluate_sample_honors_generate_events_and_observable_snapshots
34.13 s
> failure: test failure with exit code 101
34.13 s
> Error: Python API test subprocess failed.
34.13 s
> stdout:
34.13 s
> ┌────────────────────────────────────────────────────────┐
34.13 s
> │ You are running a restricted Symbolica instance. │
34.13 s
> │ │
34.13 s
> │ This mode is only permitted for non-commercial use and │
34.13 s
> │ is limited to one instance and core per machine. │
34.13 s
> │ │
34.13 s
> │ Hobbyists can easily acquire a free license key │
34.13 s
> │ that unlocks all cores and removes this banner: │
34.13 s
> │ │
34.13 s
> │ from symbolica import * │
34.13 s
> │ request_hobbyist_license('YOUR_NAME', 'YOUR_EMAIL') │
34.13 s
> │ │
34.13 s
> │ All other users can obtain a free 30-day trial key: │
34.13 s
> │ │
34.13 s
> │ from symbolica import * │
34.13 s
> │ request_trial_license('NAME', 'EMAIL', 'EMPLOYER') │
34.13 s
> │ │
34.13 s
> │ See https://symbolica.io/docs/get_started.html#license │
34.13 s
> └────────────────────────────────────────────────────────┘
34.13 s
> ┌───────────────────────────────────────────────────────────────────────────────────────────────────────────┐
34.13 s
> │ Cannot start new unlicensed Symbolica instance since there is already another one running on the machine. │
34.13 s
> └───────────────────────────────────────────────────────────────────────────────────────────────────────────┘
34.13 s
>
34.13 s
> stderr:
34.13 s
>
34.13 s
> ┌───────────────────────────────────────────────────────────┐
34.13 s
> │ Could not resolve the IP of the Symbolica license server. │
34.13 s
> │ │
34.13 s
> │ Please check your DNS configuration. │
34.13 s
> └───────────────────────────────────────────────────────────┘
34.13 s
> Error: failed to lookup address information: Temporary failure in name resolution
34.13 s
>
34.13 s
>
34.13 s
> Location:
34.13 s
> tests/tests/test_python_api.rs:156:20
34.13 s
> system-out
34.13 s
> running 1 test
34.13 s
> test python_evaluate_sample_honors_generate_events_and_observable_snapshots ... FAILED
34.13 s
>
34.13 s
> failures:
34.13 s
>
34.13 s
> failures:
34.13 s
> python_evaluate_sample_honors_generate_events_and_observable_snapshots
34.13 s
>
34.13 s
> test result: FAILED. 0 passed; 1 failed; 0 ignored; 0 measured; 4 filtered out; finished in 0.11s
34.13 s
> system-err
34.13 s
> Error: Python API test subprocess failed.
34.13 s
> stdout:
34.13 s
> ┌────────────────────────────────────────────────────────┐
34.13 s
> │ You are running a restricted Symbolica instance. │
34.13 s
> │ │
34.13 s
> │ This mode is only permitted for non-commercial use and │
34.13 s
> │ is limited to one instance and core per machine. │
34.13 s
> │ │
34.13 s
> │ Hobbyists can easily acquire a free license key │
34.13 s
> │ that unlocks all cores and removes this banner: │
34.13 s
> │ │
34.13 s
> │ from symbolica import * │
34.13 s
> │ request_hobbyist_license('YOUR_NAME', 'YOUR_EMAIL') │
34.13 s
> │ │
34.13 s
> │ All other users can obtain a free 30-day trial key: │
34.13 s
> │ │
34.13 s
> │ from symbolica import * │
34.13 s
> │ request_trial_license('NAME', 'EMAIL', 'EMPLOYER') │
34.13 s
> │ │
34.13 s
> │ See https://symbolica.io/docs/get_started.html#license │
34.13 s
> └────────────────────────────────────────────────────────┘
34.13 s
> ┌───────────────────────────────────────────────────────────────────────────────────────────────────────────┐
34.13 s
> │ Cannot start new unlicensed Symbolica instance since there is already another one running on the machine. │
34.13 s
> └───────────────────────────────────────────────────────────────────────────────────────────────────────────┘
34.13 s
>
34.13 s
> stderr:
34.13 s
>
34.13 s
> ┌───────────────────────────────────────────────────────────┐
34.13 s
> │ Could not resolve the IP of the Symbolica license server. │
34.13 s
> │ │
34.13 s
> │ Please check your DNS configuration. │
34.13 s
> └───────────────────────────────────────────────────────────┘
34.13 s
> Error: failed to lookup address information: Temporary failure in name resolution
34.13 s
>
34.13 s
>
34.13 s
> Location:
34.13 s
> tests/tests/test_python_api.rs:156:20
34.13 s
>
34.13 s
> 2. gammaloop-integration-tests::test_python_api::python_session_getters_return_live_toml_and_command_blocks
34.13 s
> failure: test failure with exit code 101
34.13 s
> Error: Python API test subprocess failed.
34.13 s
> stdout:
34.13 s
> ┌────────────────────────────────────────────────────────┐
34.13 s
> │ You are running a restricted Symbolica instance. │
34.13 s
> │ │
34.13 s
> │ This mode is only permitted for non-commercial use and │
34.13 s
> │ is limited to one instance and core per machine. │
34.13 s
> │ │
34.13 s
> │ Hobbyists can easily acquire a free license key │
34.13 s
> │ that unlocks all cores and removes this banner: │
34.13 s
> │ │
34.13 s
> │ from symbolica import * │
34.13 s
> │ request_hobbyist_license('YOUR_NAME', 'YOUR_EMAIL') │
34.13 s
> │ │
34.13 s
> │ All other users can obtain a free 30-day trial key: │
34.13 s
> │ │
34.13 s
> │ from symbolica import * │
34.13 s
> │ request_trial_license('NAME', 'EMAIL', 'EMPLOYER') │
34.13 s
> │ │
34.13 s
> │ See https://symbolica.io/docs/get_started.html#license │
34.13 s
> └────────────────────────────────────────────────────────┘
34.13 s
> ┌───────────────────────────────────────────────────────────────────────────────────────────────────────────┐
34.13 s
> │ Cannot start new unlicensed Symbolica instance since there is already another one running on the machine. │
34.13 s
> └───────────────────────────────────────────────────────────────────────────────────────────────────────────┘
34.13 s
>
34.13 s
> stderr:
34.13 s
>
34.13 s
> ┌───────────────────────────────────────────────────────────┐
34.13 s
> │ Could not resolve the IP of the Symbolica license server. │
34.13 s
> │ │
34.13 s
> │ Please check your DNS configuration. │
34.13 s
> └───────────────────────────────────────────────────────────┘
34.13 s
> Error: failed to lookup address information: Temporary failure in name resolution
34.13 s
>
34.13 s
>
34.13 s
> Location:
34.13 s
> tests/tests/test_python_api.rs:156:20
34.13 s
> system-out
34.13 s
> running 1 test
34.13 s
> test python_session_getters_return_live_toml_and_command_blocks ... FAILED
34.13 s
>
34.13 s
> failures:
34.13 s
>
34.13 s
> failures:
34.13 s
> python_session_getters_return_live_toml_and_command_blocks
34.13 s
>
34.13 s
> test result: FAILED. 0 passed; 1 failed; 0 ignored; 0 measured; 4 filtered out; finished in 0.11s
34.13 s
> system-err
34.13 s
> Error: Python API test subprocess failed.
34.13 s
> stdout:
34.13 s
> ┌────────────────────────────────────────────────────────┐
34.13 s
> │ You are running a restricted Symbolica instance. │
34.13 s
> │ │
34.13 s
> │ This mode is only permitted for non-commercial use and │
34.13 s
> │ is limited to one instance and core per machine. │
34.13 s
> │ │
34.13 s
> │ Hobbyists can easily acquire a free license key │
34.13 s
> │ that unlocks all cores and removes this banner: │
34.13 s
> │ │
34.13 s
> │ from symbolica import * │
34.13 s
> │ request_hobbyist_license('YOUR_NAME', 'YOUR_EMAIL') │
34.13 s
> │ │
34.13 s
> │ All other users can obtain a free 30-day trial key: │
34.13 s
> │ │
34.13 s
> │ from symbolica import * │
34.13 s
> │ request_trial_license('NAME', 'EMAIL', 'EMPLOYER') │
34.13 s
> │ │
34.13 s
> │ See https://symbolica.io/docs/get_started.html#license │
34.13 s
> └────────────────────────────────────────────────────────┘
34.13 s
> ┌───────────────────────────────────────────────────────────────────────────────────────────────────────────┐
34.13 s
> │ Cannot start new unlicensed Symbolica instance since there is already another one running on the machine. │
34.13 s
> └───────────────────────────────────────────────────────────────────────────────────────────────────────────┘
34.13 s
>
34.13 s
> stderr:
34.13 s
>
34.13 s
> ┌───────────────────────────────────────────────────────────┐
34.13 s
> │ Could not resolve the IP of the Symbolica license server. │
34.13 s
> │ │
34.13 s
> │ Please check your DNS configuration. │
34.13 s
> └───────────────────────────────────────────────────────────┘
34.13 s
> Error: failed to lookup address information: Temporary failure in name resolution
34.13 s
>
34.13 s
>
34.13 s
> Location:
34.13 s
> tests/tests/test_python_api.rs:156:20
34.13 s
>
34.13 s
> 3. gammaloop-integration-tests::test_python_api::python_evaluate_sample_preserves_graph_grouping_and_incoming_pdgs
34.13 s
> failure: test failure with exit code 101
34.13 s
> Error: Python API test subprocess failed.
34.13 s
> stdout:
34.13 s
> ┌────────────────────────────────────────────────────────┐
34.13 s
> │ You are running a restricted Symbolica instance. │
34.13 s
> │ │
34.13 s
> │ This mode is only permitted for non-commercial use and │
34.13 s
> │ is limited to one instance and core per machine. │
34.13 s
> │ │
34.13 s
> │ Hobbyists can easily acquire a free license key │
34.13 s
> │ that unlocks all cores and removes this banner: │
34.13 s
> │ │
34.13 s
> │ from symbolica import * │
34.13 s
> │ request_hobbyist_license('YOUR_NAME', 'YOUR_EMAIL') │
34.13 s
> │ │
34.13 s
> │ All other users can obtain a free 30-day trial key: │
34.13 s
> │ │
34.13 s
> │ from symbolica import * │
34.13 s
> │ request_trial_license('NAME', 'EMAIL', 'EMPLOYER') │
34.13 s
> │ │
34.13 s
> │ See https://symbolica.io/docs/get_started.html#license │
34.13 s
> └────────────────────────────────────────────────────────┘
34.13 s
> ┌───────────────────────────────────────────────────────────────────────────────────────────────────────────┐
34.13 s
> │ Cannot start new unlicensed Symbolica instance since there is already another one running on the machine. │
34.13 s
> └───────────────────────────────────────────────────────────────────────────────────────────────────────────┘
34.13 s
>
34.13 s
> stderr:
34.13 s
>
34.13 s
> ┌───────────────────────────────────────────────────────────┐
34.13 s
> │ Could not resolve the IP of the Symbolica license server. │
34.13 s
> │ │
34.13 s
> │ Please check your DNS configuration. │
34.13 s
> └───────────────────────────────────────────────────────────┘
34.13 s
> Error: failed to lookup address information: Temporary failure in name resolution
34.13 s
>
34.13 s
>
34.13 s
> Location:
34.13 s
> tests/tests/test_python_api.rs:156:20
34.13 s
> system-out
34.13 s
> running 1 test
34.13 s
> test python_evaluate_sample_preserves_graph_grouping_and_incoming_pdgs ... FAILED
34.13 s
>
34.13 s
> failures:
34.13 s
>
34.13 s
> failures:
34.13 s
> python_evaluate_sample_preserves_graph_grouping_and_incoming_pdgs
34.13 s
>
34.13 s
> test result: FAILED. 0 passed; 1 failed; 0 ignored; 0 measured; 4 filtered out; finished in 0.12s
34.13 s
> system-err
34.13 s
> Error: Python API test subprocess failed.
34.13 s
> stdout:
34.13 s
> ┌────────────────────────────────────────────────────────┐
34.13 s
> │ You are running a restricted Symbolica instance. │
34.13 s
> │ │
34.13 s
> │ This mode is only permitted for non-commercial use and │
34.13 s
> │ is limited to one instance and core per machine. │
34.13 s
> │ │
34.13 s
> │ Hobbyists can easily acquire a free license key │
34.13 s
> │ that unlocks all cores and removes this banner: │
34.13 s
> │ │
34.13 s
> │ from symbolica import * │
34.13 s
> │ request_hobbyist_license('YOUR_NAME', 'YOUR_EMAIL') │
34.13 s
> │ │
34.13 s
> │ All other users can obtain a free 30-day trial key: │
34.13 s
> │ │
34.13 s
> │ from symbolica import * │
34.13 s
> │ request_trial_license('NAME', 'EMAIL', 'EMPLOYER') │
34.13 s
> │ │
34.13 s
> │ See https://symbolica.io/docs/get_started.html#license │
34.13 s
> └────────────────────────────────────────────────────────┘
34.13 s
> ┌───────────────────────────────────────────────────────────────────────────────────────────────────────────┐
34.13 s
> │ Cannot start new unlicensed Symbolica instance since there is already another one running on the machine. │
34.13 s
> └───────────────────────────────────────────────────────────────────────────────────────────────────────────┘
34.13 s
>
34.13 s
> stderr:
34.13 s
>
34.13 s
> ┌───────────────────────────────────────────────────────────┐
34.13 s
> │ Could not resolve the IP of the Symbolica license server. │
34.13 s
> │ │
34.13 s
> │ Please check your DNS configuration. │
34.13 s
> └───────────────────────────────────────────────────────────┘
34.13 s
> Error: failed to lookup address information: Temporary failure in name resolution
34.13 s
>
34.13 s
>
34.13 s
> Location:
34.13 s
> tests/tests/test_python_api.rs:156:20
34.13 s
>
34.13 s
> 4. gammaloop-integration-tests::test_python_api::python_evaluate_samples_batch_and_momentum_space_have_expected_shape
34.13 s
> failure: test failure with exit code 101
34.13 s
> Error: Python API test subprocess failed.
34.13 s
> stdout:
34.13 s
> ┌────────────────────────────────────────────────────────┐
34.13 s
> │ You are running a restricted Symbolica instance. │
34.13 s
> │ │
34.13 s
> │ This mode is only permitted for non-commercial use and │
34.13 s
> │ is limited to one instance and core per machine. │
34.13 s
> │ │
34.13 s
> │ Hobbyists can easily acquire a free license key │
34.13 s
> │ that unlocks all cores and removes this banner: │
34.13 s
> │ │
34.13 s
> │ from symbolica import * │
34.13 s
> │ request_hobbyist_license('YOUR_NAME', 'YOUR_EMAIL') │
34.13 s
> │ │
34.13 s
> │ All other users can obtain a free 30-day trial key: │
34.13 s
> │ │
34.13 s
> │ from symbolica import * │
34.13 s
> │ request_trial_license('NAME', 'EMAIL', 'EMPLOYER') │
34.13 s
> │ │
34.13 s
> │ See https://symbolica.io/docs/get_started.html#license │
34.13 s
> └────────────────────────────────────────────────────────┘
34.13 s
> ┌───────────────────────────────────────────────────────────────────────────────────────────────────────────┐
34.13 s
> │ Cannot start new unlicensed Symbolica instance since there is already another one running on the machine. │
34.13 s
> └───────────────────────────────────────────────────────────────────────────────────────────────────────────┘
34.13 s
>
34.13 s
> stderr:
34.13 s
>
34.13 s
> ┌───────────────────────────────────────────────────────────┐
34.13 s
> │ Could not resolve the IP of the Symbolica license server. │
34.13 s
> │ │
34.13 s
> │ Please check your DNS configuration. │
34.13 s
> └───────────────────────────────────────────────────────────┘
34.13 s
> Error: failed to lookup address information: Temporary failure in name resolution
34.13 s
> [2026-09-14 22:20:37.313] @gammaloop_api::se... INFO : Running command import model sm-default
34.13 s
> [2026-09-14 22:20:37.313] @import::model INFO : Loading built-in JSON model sm-default
34.13 s
> [2026-09-14 22:20:37.348] @gammalooprs::model INFO : The following 11 external parameters were forced to zero by the restriction card:
34.13 s
> lamWS, AWS, rhoWS, etaWS, ymc, yme, ymm, MC, Me, MM, WTau
34.13 s
> [2026-09-14 22:20:37.348] @gammalooprs::model INFO : The following 34 vertex rules were removed by the restriction card:
34.13 s
> V_82 -> (c~, d, G+) | V_83 -> (t~, d, G+) | V_84 -> (c~, s, G+) | V_85 -> (t~, s, G+) | V_86 -> (u~, b, G+) | V_87 -> (c~, b, G+) | V_90 -> (c~, d, W+) | V_91 -> (t~, d, W+) | V_92 -> (u~, s, W+) | V_94 -> (t~, s, W+) | V_95 -> (u~, b, W+) | V_96 -> (c~, b, W+) | V_101 -> (e+, e-, G0) | V_102 -> (mu+, mu-, G0) | V_104 -> (e+, e-, H) | V_105 -> (mu+, mu-, H) | V_110 -> (ve~, e-, G+) | V_111 -> (vm~, mu-, G+) | V_116 -> (b~, u, G-) | V_117 -> (d~, c, G-) | V_118 -> (s~, c, G-) | V_119 -> (b~, c, G-) | V_120 -> (d~, t, G-) | V_121 -> (s~, t, G-) | V_124 -> (s~, u, W-) | V_125 -> (b~, u, W-) | V_126 -> (d~, c, W-) | V_128 -> (b~, c, W-) | V_129 -> (d~, t, W-) | V_130 -> (s~, t, W-) | V_138 -> (c~, c, G0) | V_140 -> (c~, c, H) | V_145 -> (e+, ve, G-) | V_146 -> (mu+, vm, G-)
34.13 s
> [2026-09-14 22:20:37.348] @gammalooprs::model INFO : The following 36 couplings were removed by the restriction card:
34.13 s
> GC_13, GC_14, GC_16, GC_17, GC_18, GC_19, GC_20, GC_22, GC_23, GC_24, GC_25, GC_26, GC_28, GC_29, GC_42, GC_43, GC_44, GC_46, GC_47, GC_48, GC_84, GC_85, GC_86, GC_87, GC_88, GC_89, GC_90, GC_91, GC_92, GC_93, GC_101, GC_102, GC_103, GC_105, GC_106, GC_107
34.13 s
> [2026-09-14 22:20:37.348] @gammaloop_api::se... INFO : Running command set default-runtime kv kinematics.externals='{"type":"constant","data":{"momenta":[[32.0,0.0,0.0,32.0],[32.0,0.0,0.0,-32.0]],"helicities":[1,1]}}'
34.13 s
> [2026-09-14 22:20:37.349] @gammaloop_api::se... INFO : Running command set default-runtime kv subtraction.disable_threshold_subtraction=true
34.13 s
> [2026-09-14 22:20:37.350] @gammaloop_api::se... INFO : Running command generate xs e+ e- > d d~ g | e- a d g QED^2==4 [{{2}} QCD=0] --numerator-grouping group_identical_graphs_up_to_sign --clear-existing-processes --only-diagrams
34.13 s
> [2026-09-14 22:20:37.352] @feyngen::diagram_... INFO : 0s | Δ=0s | Starting Feynman graph generation with Symbolica...
34.13 s
> [2026-09-14 22:20:37.355] @feyngen::diagram_... INFO : 0s | Δ=0s | Number of graphs resulting from Symbolica generation: 246
34.13 s
> [2026-09-14 22:20:37.356] @feyngen::diagram_... INFO : 0s | Δ=0s | Number of graphs retained after enforcing supergraph particle content: 8
34.13 s
> [2026-09-14 22:20:37.356] @feyngen::diagram_... INFO : 0s | Δ=0s | Number of graphs retained after removal of vetoed topologies: 8
34.13 s
> [2026-09-14 22:20:37.356] @feyngen::diagram_... INFO : 0s | Δ=0s | Number of graphs after vertex info assignment: 8
34.13 s
> [2026-09-14 22:20:37.356] @feyngen::diagram_... INFO : 0s | Δ=0s | Number of graphs after all complete graphs filters are applied: 8
34.13 s
>
34.13 s
>
34.13 s
> Location:
34.13 s
> tests/tests/test_python_api.rs:156:20
34.13 s
> system-out
34.13 s
> running 1 test
34.13 s
> test python_evaluate_samples_batch_and_momentum_space_have_expected_shape ... FAILED
34.13 s
>
34.13 s
> failures:
34.13 s
>
34.13 s
> failures:
34.13 s
> python_evaluate_samples_batch_and_momentum_space_have_expected_shape
34.13 s
>
34.13 s
> test result: FAILED. 0 passed; 1 failed; 0 ignored; 0 measured; 4 filtered out; finished in 0.21s
34.13 s
> system-err
34.13 s
> Error: Python API test subprocess failed.
34.13 s
> stdout:
34.13 s
> ┌────────────────────────────────────────────────────────┐
34.13 s
> │ You are running a restricted Symbolica instance. │
34.13 s
> │ │
34.13 s
> │ This mode is only permitted for non-commercial use and │
34.13 s
> │ is limited to one instance and core per machine. │
34.13 s
> │ │
34.13 s
> │ Hobbyists can easily acquire a free license key │
34.13 s
> │ that unlocks all cores and removes this banner: │
34.13 s
> │ │
34.13 s
> │ from symbolica import * │
34.13 s
> │ request_hobbyist_license('YOUR_NAME', 'YOUR_EMAIL') │
34.13 s
> │ │
34.13 s
> │ All other users can obtain a free 30-day trial key: │
34.13 s
> │ │
34.13 s
> │ from symbolica import * │
34.13 s
> │ request_trial_license('NAME', 'EMAIL', 'EMPLOYER') │
34.13 s
> │ │
34.13 s
> │ See https://symbolica.io/docs/get_started.html#license │
34.13 s
> └────────────────────────────────────────────────────────┘
34.13 s
> ┌───────────────────────────────────────────────────────────────────────────────────────────────────────────┐
34.13 s
> │ Cannot start new unlicensed Symbolica instance since there is already another one running on the machine. │
34.13 s
> └───────────────────────────────────────────────────────────────────────────────────────────────────────────┘
34.13 s
>
34.13 s
> stderr:
34.13 s
>
34.13 s
> ┌───────────────────────────────────────────────────────────┐
34.13 s
> │ Could not resolve the IP of the Symbolica license server. │
34.13 s
> │ │
34.13 s
> │ Please check your DNS configuration. │
34.13 s
> └───────────────────────────────────────────────────────────┘
34.13 s
> Error: failed to lookup address information: Temporary failure in name resolution
34.13 s
> [2026-09-14 22:20:37.313] @gammaloop_api::se... INFO : Running command import model sm-default
34.13 s
> [2026-09-14 22:20:37.313] @import::model INFO : Loading built-in JSON model sm-default
34.13 s
> [2026-09-14 22:20:37.348] @gammalooprs::model INFO : The following 11 external parameters were forced to zero by the restriction card:
34.13 s
> lamWS, AWS, rhoWS, etaWS, ymc, yme, ymm, MC, Me, MM, WTau
34.13 s
> [2026-09-14 22:20:37.348] @gammalooprs::model INFO : The following 34 vertex rules were removed by the restriction card:
34.13 s
> V_82 -> (c~, d, G+) | V_83 -> (t~, d, G+) | V_84 -> (c~, s, G+) | V_85 -> (t~, s, G+) | V_86 -> (u~, b, G+) | V_87 -> (c~, b, G+) | V_90 -> (c~, d, W+) | V_91 -> (t~, d, W+) | V_92 -> (u~, s, W+) | V_94 -> (t~, s, W+) | V_95 -> (u~, b, W+) | V_96 -> (c~, b, W+) | V_101 -> (e+, e-, G0) | V_102 -> (mu+, mu-, G0) | V_104 -> (e+, e-, H) | V_105 -> (mu+, mu-, H) | V_110 -> (ve~, e-, G+) | V_111 -> (vm~, mu-, G+) | V_116 -> (b~, u, G-) | V_117 -> (d~, c, G-) | V_118 -> (s~, c, G-) | V_119 -> (b~, c, G-) | V_120 -> (d~, t, G-) | V_121 -> (s~, t, G-) | V_124 -> (s~, u, W-) | V_125 -> (b~, u, W-) | V_126 -> (d~, c, W-) | V_128 -> (b~, c, W-) | V_129 -> (d~, t, W-) | V_130 -> (s~, t, W-) | V_138 -> (c~, c, G0) | V_140 -> (c~, c, H) | V_145 -> (e+, ve, G-) | V_146 -> (mu+, vm, G-)
34.13 s
> [2026-09-14 22:20:37.348] @gammalooprs::model INFO : The following 36 couplings were removed by the restriction card:
34.13 s
> GC_13, GC_14, GC_16, GC_17, GC_18, GC_19, GC_20, GC_22, GC_23, GC_24, GC_25, GC_26, GC_28, GC_29, GC_42, GC_43, GC_44, GC_46, GC_47, GC_48, GC_84, GC_85, GC_86, GC_87, GC_88, GC_89, GC_90, GC_91, GC_92, GC_93, GC_101, GC_102, GC_103, GC_105, GC_106, GC_107
34.13 s
> [2026-09-14 22:20:37.348] @gammaloop_api::se... INFO : Running command set default-runtime kv kinematics.externals='{"type":"constant","data":{"momenta":[[32.0,0.0,0.0,32.0],[32.0,0.0,0.0,-32.0]],"helicities":[1,1]}}'
34.13 s
> [2026-09-14 22:20:37.349] @gammaloop_api::se... INFO : Running command set default-runtime kv subtraction.disable_threshold_subtraction=true
34.13 s
> [2026-09-14 22:20:37.350] @gammaloop_api::se... INFO : Running command generate xs e+ e- > d d~ g | e- a d g QED^2==4 [{{2}} QCD=0] --numerator-grouping group_identical_graphs_up_to_sign --clear-existing-processes --only-diagrams
34.13 s
> [2026-09-14 22:20:37.352] @feyngen::diagram_... INFO : 0s | Δ=0s | Starting Feynman graph generation with Symbolica...
34.13 s
> [2026-09-14 22:20:37.355] @feyngen::diagram_... INFO : 0s | Δ=0s | Number of graphs resulting from Symbolica generation: 246
34.13 s
> [2026-09-14 22:20:37.356] @feyngen::diagram_... INFO : 0s | Δ=0s | Number of graphs retained after enforcing supergraph particle content: 8
34.13 s
> [2026-09-14 22:20:37.356] @feyngen::diagram_... INFO : 0s | Δ=0s | Number of graphs retained after removal of vetoed topologies: 8
34.13 s
> [2026-09-14 22:20:37.356] @feyngen::diagram_... INFO : 0s | Δ=0s | Number of graphs after vertex info assignment: 8
34.13 s
> [2026-09-14 22:20:37.356] @feyngen::diagram_... INFO : 0s | Δ=0s | Number of graphs after all complete graphs filters are applied: 8
34.13 s
>
34.13 s
>
34.13 s
> Location:
34.13 s
> tests/tests/test_python_api.rs:156:20
34.13 s
>
34.13 s
> 5. gammaloop-integration-tests::test_python_api::python_settings_wrappers_expose_nested_runtime_and_global_settings
34.13 s
> failure: test failure with exit code 101
34.13 s
> Error: Python API test subprocess failed.
34.13 s
> stdout:
34.13 s
> ┌────────────────────────────────────────────────────────┐
34.13 s
> │ You are running a restricted Symbolica instance. │
34.13 s
> │ │
34.13 s
> │ This mode is only permitted for non-commercial use and │
34.13 s
> │ is limited to one instance and core per machine. │
34.13 s
> │ │
34.13 s
> │ Hobbyists can easily acquire a free license key │
34.13 s
> │ that unlocks all cores and removes this banner: │
34.13 s
> │ │
34.13 s
> │ from symbolica import * │
34.13 s
> │ request_hobbyist_license('YOUR_NAME', 'YOUR_EMAIL') │
34.13 s
> │ │
34.13 s
> │ All other users can obtain a free 30-day trial key: │
34.13 s
> │ │
34.13 s
> │ from symbolica import * │
34.13 s
> │ request_trial_license('NAME', 'EMAIL', 'EMPLOYER') │
34.13 s
> │ │
34.13 s
> │ See https://symbolica.io/docs/get_started.html#license │
34.13 s
> └────────────────────────────────────────────────────────┘
34.13 s
> ┌───────────────────────────────────────────────────────────────────────────────────────────────────────────┐
34.13 s
> │ Cannot start new unlicensed Symbolica instance since there is already another one running on the machine. │
34.13 s
> └───────────────────────────────────────────────────────────────────────────────────────────────────────────┘
34.13 s
>
34.13 s
> stderr:
34.13 s
>
34.13 s
> ┌───────────────────────────────────────────────────────────┐
34.13 s
> │ Could not resolve the IP of the Symbolica license server. │
34.13 s
> │ │
34.13 s
> │ Please check your DNS configuration. │
34.13 s
> └───────────────────────────────────────────────────────────┘
34.13 s
> Error: failed to lookup address information: Temporary failure in name resolution
34.13 s
>
34.13 s
>
34.13 s
> Location:
34.13 s
> tests/tests/test_python_api.rs:156:20
34.13 s
> system-out
34.13 s
> running 1 test
34.13 s
> test python_settings_wrappers_expose_nested_runtime_and_global_settings ... FAILED
34.13 s
>
34.13 s
> failures:
34.13 s
>
34.13 s
> failures:
34.13 s
> python_settings_wrappers_expose_nested_runtime_and_global_settings
34.13 s
>
34.13 s
> test result: FAILED. 0 passed; 1 failed; 0 ignored; 0 measured; 4 filtered out; finished in 0.22s
34.13 s
> system-err
34.13 s
> Error: Python API test subprocess failed.
34.13 s
> stdout:
34.13 s
> ┌────────────────────────────────────────────────────────┐
34.13 s
> │ You are running a restricted Symbolica instance. │
34.13 s
> │ │
34.13 s
> │ This mode is only permitted for non-commercial use and │
34.13 s
> │ is limited to one instance and core per machine. │
34.13 s
> │ │
34.13 s
> │ Hobbyists can easily acquire a free license key │
34.13 s
> │ that unlocks all cores and removes this banner: │
34.13 s
> │ │
34.13 s
> │ from symbolica import * │
34.13 s
> │ request_hobbyist_license('YOUR_NAME', 'YOUR_EMAIL') │
34.13 s
> │ │
34.13 s
> │ All other users can obtain a free 30-day trial key: │
34.13 s
> │ │
34.13 s
> │ from symbolica import * │
34.13 s
> │ request_trial_license('NAME', 'EMAIL', 'EMPLOYER') │
34.13 s
> │ │
34.13 s
> │ See https://symbolica.io/docs/get_started.html#license │
34.13 s
> └────────────────────────────────────────────────────────┘
34.13 s
> ┌───────────────────────────────────────────────────────────────────────────────────────────────────────────┐
34.13 s
> │ Cannot start new unlicensed Symbolica instance since there is already another one running on the machine. │
34.13 s
> └───────────────────────────────────────────────────────────────────────────────────────────────────────────┘
34.13 s
>
34.13 s
> stderr:
34.13 s
>
34.13 s
> ┌───────────────────────────────────────────────────────────┐
34.13 s
> │ Could not resolve the IP of the Symbolica license server. │
34.13 s
> │ │
34.13 s
> │ Please check your DNS configuration. │
34.13 s
> └───────────────────────────────────────────────────────────┘
34.13 s
> Error: failed to lookup address information: Temporary failure in name resolution
34.13 s
>
34.13 s
>
34.13 s
> Location:
34.13 s
> tests/tests/test_python_api.rs:156:20
34.13 s
> =========================================
34.13 s
For full logs, run:
34.13 s
nix log /nix/store/0y85356skfl9xg7hqjngmsb9xh03dwf2-gammaloop-nextest-python-api.drv
34.31 s
[2 built (1 failed ), 12 Run failed.